##TITLE=1H_NCS-2
 CDCl3
 8 sc, 
 4.10.2023
##JCAMPDX= 6.0         $$ Bruker NMR JCAMP-DX V2.0
##DATA TYPE= NMR FID
##DATA CLASS= NTUPLES
##ORIGIN= UXNMR, Bruker Analytische Messtechnik GmbH
##OWNER= root
$$ XWIN-NMR		Version 3.5
$$ Wed Oct  4 15:41:55 2023 Russian Standard Time (UT+4h)  she@DPX200
##.OBSERVE FREQUENCY= 200.13135
##.OBSERVE NUCLEUS= ^1H
##.DELAY= (6, 6)
##.ACQUISITION MODE= SIMULTANEOUS
##.ACQUISITION SCHEME= undefined
##.AVERAGES= 8
##.DIGITISER RES= 18
##SPECTROMETER/DATA SYSTEM= spect
##.PULSE SEQUENCE= zg30
##.SOLVENT NAME= D2O
##.SHIFT REFERENCE= (INTERNAL, D2O, 0, 15.7039)
##AUDIT TRAIL= $$ (NUMBER, WHEN, WHO, WHERE, WHAT)
$$ ##TITLE= Audit trail, XWIN-NMR		Version 3.5
$$ ##JCAMPDX= 5.01
$$ ##ORIGIN= Bruker BioSpin GmbH
$$ ##OWNER= she
$$ F:/spectra/data/she/nmr/H-F/1/audita.txt
$$ ##AUDIT TRAIL=  $$ (NUMBER, WHEN, WHO, WHERE, WHAT)
(   1,<2023-10-04 15:41:05.56 +0400>,<she>,<DPX200>,
      <created by zg, POWCHK disabled, PULCHK disabled
       configuration hash MD5:
       00 E9 B6 7A A2 85 ED C7 34 08 36 98 17 FE 4E 26
       data hash MD5: 16K
       D2 54 CB D3 A3 E7 66 41 3E 33 F2 A2 0E 8A 44 77>)
$$ ##END=
$$ 
$$ hash MD5
$$ 51 7E 8B FD 0E DF 9B 15 9F 8F B0 88 5A 9B 65 4B
##$RELAX= 
##$RELAX= 
##$RELAX= 
##$RELAX= 
##$RELAX= 
##$RELAX= 
$$ Bruker specific parameters
$$ --------------------------
##$DU= <F:/spectra>
##$EXPNO= 1
##$NAME= <H-F>
##$PROCNO= 1
##$TYPE= <nmr>
##$USER= <she>
##$AMP= (0..31)
100 100 100 100 100 100 100 100 100 100 100 100 100 100 100 100 100 100 
100 100 100 100 100 100 100 100 100 100 100 100 100 100 
##$AQSEQ= 0
##$AQ_mod= 1
##$AUNM= <au_zg>
##$AUTOPOS= <>
##$BF1= 200.13
##$BF2= 200.13
##$BF3= 200.13
##$BF4= 200.13
##$BF5= 200.13
##$BF6= 200.13
##$BF7= 200.13
##$BF8= 200.13
##$BYTORDA= 1
##$CFDGTYP= 0
##$CFRGTYP= 5
##$CHEMSTR= <none>
##$CNST= (0..31)
1 1 145 1 1 1 1 1 1 1 1 1 1 1 1 1 1 1 1 1 1 1 1 1 1 1 1 1 1 1 1 1 
##$CPDPRG= <>
##$CPDPRG1= <>
##$CPDPRG2= <>
##$CPDPRG3= <>
##$CPDPRG4= <mlev>
##$CPDPRG5= <mlev>
##$CPDPRG6= <mlev>
##$CPDPRG7= <mlev>
##$CPDPRG8= <mlev>
##$CPDPRGB= <>
##$CPDPRGT= <>
##$D= (0..31)
0 1.2 0 0 0 0 0 0 0 0.06 0 0.03 0 0 0 0 0.0002 0 0 0 0 0 0 0 0 0 0 0 0 
0 0 0 
##$DATE= 1696419664
##$DBL= (0..7)
120 120 120 120 120 120 120 120 
##$DBP= (0..7)
150 150 150 150 150 150 150 150 
##$DBP07= 0
##$DBPNAM0= <>
##$DBPNAM1= <>
##$DBPNAM2= <>
##$DBPNAM3= <>
##$DBPNAM4= <>
##$DBPNAM5= <>
##$DBPNAM6= <>
##$DBPNAM7= <>
##$DBPOAL= (0..7)
0.5 0.5 0.5 0.5 0.5 0.5 0.5 0.5 
##$DBPOFFS= (0..7)
0 0 0 0 0 0 0 0 
##$DE= 6
##$DECBNUC= <off>
##$DECIM= 32
##$DECNUC= <off>
##$DECSTAT= 4
##$DIGMOD= 1
##$DIGTYP= 9
##$DL= (0..7)
0 120 120 120 120 120 120 120 
##$DP= (0..7)
150 150 150 150 150 150 150 150 
##$DP07= 0
##$DPNAME0= <>
##$DPNAME1= <>
##$DPNAME2= <>
##$DPNAME3= <>
##$DPNAME4= <>
##$DPNAME5= <>
##$DPNAME6= <>
##$DPNAME7= <>
##$DPOAL= (0..7)
0.5 0.5 0.5 0.5 0.5 0.5 0.5 0.5 
##$DPOFFS= (0..7)
0 0 0 0 0 0 0 0 
##$DQDMODE= 0
##$DR= 18
##$DS= 0
##$DSLIST= <SSSSSSSSSSSSSSS>
##$DSPFIRM= 0
$$ [...]
##$SUBNAM2= <"">
##$SUBNAM3= <"">
##$SUBNAM4= <"">
##$SUBNAM5= <"">
##$SUBNAM6= <"">
##$SUBNAM7= <"">
##$SUBNAM8= <"">
##$SUBNAM9= <"">
##$SW= 18.05172834244
##$SWIBOX= (0..15)
0 0 2 0 0 0 0 0 0 0 0 0 0 0 0 0 
##$SW_h= 3612.71676300578
##$TD= 16384
##$TD0= 1
##$TE= 0
##$TE2= 300
##$TE3= 300
##$TEG= 300
##$TL= (0..7)
0 120 120 120 120 120 120 120 
##$TP= (0..7)
150 150 150 150 150 150 150 150 
##$TP07= 0
##$TPNAME0= <>
##$TPNAME1= <>
##$TPNAME2= <>
##$TPNAME3= <>
##$TPNAME4= <>
##$TPNAME5= <>
##$TPNAME6= <>
##$TPNAME7= <>
##$TPOAL= (0..7)
0.5 0.5 0.5 0.5 0.5 0.5 0.5 0.5 
##$TPOFFS= (0..7)
0 0 0 0 0 0 0 0 
##$TUNHIN= 0
##$TUNHOUT= 0
##$TUNXOUT= 0
##$USERA1= <user>
##$USERA2= <user>
##$USERA3= <user>
##$USERA4= <user>
##$USERA5= <user>
##$V9= 5
##$VALIST= <valist>
##$VCLIST= <CCCCCCCCCCCCCCC>
##$VD= 0
##$VDLIST= <DDDDDDDDDDDDDDD>
##$VPLIST= <PPPPPPPPPPPPPPP>
##$VTLIST= <TTTTTTTTTTTTTTT>
##$WBST= 1024
##$WBSW= 4
##$XGAIN= (0..3)
0 0 0 0 
##$XL= 0
##$YL= 0
##$YMAX_a= 862959
##$YMIN_a= -898252
##$ZGOPTNS= <>
##$ZL1= 120
##$ZL2= 120
##$ZL3= 120
##$ZL4= 120
##$ABSF1= 10
##$ABSF2= 0
##$ABSG= 5
##$ABSL= 3
##$ALPHA= 0
##$AQORDER= 0
##$ASSFAC= 0
##$ASSFACI= 0
##$ASSFACX= 0
##$ASSWID= 0
##$AUNMP= <proc_1d>
##$AZFE= 0.1
##$AZFW= 0.1
##$BCFW= 1
##$BC_mod= 2
##$BYTORDP= 1
##$COROFFS= 0
##$CY= 11.3945322036743
##$DATMOD= 1
##$DC= 2
##$DFILT= <>
##$DTYPP= 0
##$F1P= 15.7292609196834
##$F2P= 12.9074282941183
##$FCOR= 0.5
##$FTSIZE= 0
##$FT_mod= 4
##$GAMMA= 1
##$GB= 0.15
##$INTBC= 1
##$INTSCL= 1
##$ISEN= 128
##$LB= 0.24
##$LEV0= 0
##$LPBIN= 0
##$MAXI= 10000
##$MC2= 0
##$MEAN= 0
##$ME_mod= 0
##$MI= 1.114404
##$NCOEF= 0
##$NC_proc= 0
##$NLEV= 6
##$NOISF1= 3.799351
##$NOISF2= 2.8
##$NSP= 1
##$NTH_PI= 0
##$NZP= 0
##$OFFSET= 15.70392
##$PC= 1
##$PHC0= -21711.86
##$PHC1= 13.05271
##$PH_mod= 1
##$PKNL= yes
##$PPARMOD= 0
##$PSCAL= 0
##$PSIGN= 0
##$REVERSE= no
##$SF= 200.130013532006
##$SI= 16384
##$SIGF1= 3
##$SIGF2= 2
##$SINO= 400
##$SIOLD= 16384
##$SREGLST= <1H.CDCl3>
##$SSB= 0
##$STSI= 0
##$STSR= 0
##$SW_p= 3612.71676300578
##$SYMM= 0
##$S_DEV= 0
##$TDeff= 0
##$TDoff= 0
##$TI= <>
##$TILT= no
##$TM1= 0
##$TM2= 0
##$TOPLEV= 0
##$USERP1= <user>
##$USERP2= <user>
##$USERP3= <user>
##$USERP4= <user>
##$USERP5= <user>
##$WDW= 1
##$XDIM= 8192
##$YMAX_p= 0
##$YMIN_p= 0
$$ End of Bruker specific parameters
$$ ---------------------------------
##NTUPLES= NMR FID
##VAR_NAME=  TIME,          FID/REAL,        FID/IMAG
##SYMBOL=    X,             R,               I
##VAR_TYPE=  INDEPENDENT,   DEPENDENT,       DEPENDENT
##VAR_FORM=  AFFN,          ASDF,            ASDF
##VAR_DIM=   8192,          8192,            8192
##UNITS=     SECONDS,       ARBITRARY UNITS, ARBITRARY UNITS
##FACTOR=    0.0002768,     1,               1
##FIRST=     0,             0,               0
##LAST=      2.2672688,     0,               0
##MIN=       0,             -898252,         0
##MAX=       2.2672688,     862959,          0
$$ Real data points
##PAGE= N=1
##DATA TABLE= (X++(R..R)), XYDATA
$$ [...]
$$ plain form
1833 -761 -451 21 -138 -412 -229 465 49 -92 -146 133 -231 -149 99 -174 126 719 475 -35 416 804 -101
1854 -101 -375 404 -23 -917 -393 149 -164 -678 209 447 -673 -805 245 227 -1190 -1205 331 287 -906
1873 -906 -383 1020 679 -330 -96 902 -205 -941 481 702 -346 -300 786 705 -92 -18 661 421 -507
1892 -507 -591 5 -275 -642 -498 85 168 -398 -4 230 59 -384 219 18 -271 -131 -119 307 448 211 194
1913 194 734 652 51 -145 116 265 -483 -369 324 191 -262 48 459 -157 -679 -241 99 -448 -1082 -225
1933 -225 336 -408 -764 393 941 -138 -318 421 481 -355 -367 913 416 -146 270 732 -9 -170 274 739
1953 739 -95 -370 -406 128 -301 -628 -364 1 84 -101 76 263 -403 -255 49 -491 -355 -139 39 468 248
1974 248 132 496 380 431 217 265 398 55 -262 87 114 -18 -19 467 69 -287 -162 -187 -291 -545 -377 102
$$ packed form
1833g61L10M72j59k74J83O94m16j41n4K79l64Q2K48k73L00N93k44n10M51L88r05
1854a01k74P79m27q94N24N42l13n14Q87K38j120j32J050j8j417j5J536m4j193
1873i06N23J403l41j009K34R98j107p36J422K21j048M6J086q1p97P4O79k40r28
1892e07q4N96k80l67J44N83Q3n66L94K34j71m43O03k01k89J40J2M26J41k37j7
1913A94N40q2o01j96K61J49p48J14O93j33m53L10M11o16n22M38L40n47o34Q57
1933b25N61p44l56J157N48j079j80P39O0q36j2J280m97n62M16M62p41j61M44M65
1953G39q34k75l6N34m29l27K64L65Q3j85J77J87o66J48L04n40J36K16J78M29k20
1974B48j16L64j16N1k14M8J33l43l17L49K7j32jM86l98l56J25k5j04k54J68M79
$$ plain form
1996 102 -152 -297 -285 191 186 169 -81 291 -15 -416 -64 430 -175 -172 381 942 175 -29 380 647 -218 -610
2018 -610 -38 -83 -279 -481 172 109 -326 -222 180 33 -501 -165 -3 -457 -957 19 426 -130 -223 739 590
2039 590 42 7 333 -98 -60 516 147 -249 -4 368 95 208 158 84 -202 -191 -351 -537 -441 -148 -188 -403
2061 -403 -173 437 244 -224 -503 295 186 -422 -155 534 280 -188 580 771 -345 -214 974 626 -304
2080 -304 -131 456 -497 -732 331 446 -397 -11 369 -117 -788 -327 63 -173 -623 -135 243 -299 -459 214
2100 214 458 219 200 596 72 -871 -235 639 -99 -575 692 751 -362 -205 722 -229 -945 176 117 -904
2120 -904 -431 615 -444 -1100 266 312 -356 -346 529 237 -675 -398 231 288 -245 71 796 624 -390 22
2140 22 981 -137 -559 445 1001 -720 -612 791 -53 -739 182 838 -537 -659 80 -143 -1165 -250
$$ packed form
1996A02k54j45J2M76nj7k50L72l06m01L52M94o05LN53N61p67k04M09K67q65l92
2018f10N72m5j96k02O53o3m35J04M02j47n34L36J62m54n00R76M07n56r3R62j49
2039E90n48l5L26m31L8N76l69l96K45L72k73J13n0p4k86J1j60j86R6K93m0k15
2061d03K30O10j93m68k79P98j09o08K67O89k54m68P68J91j116J31J188l48r30
2080c04J73N87r53k35J063J15q43L86L80m86o71M61L90k36m50M88L78n42j60O73
2100B14K44k39j9L96n24r43O36Q74p38m76J267N9j113J57R27r51p16J121n9j021
2120i04M73J046j059o56J366M6o68J0Q75k92r12K77O29N7n33L16P25j72j014M12
2140B2R59j118m22J004N56j721J08J403q44o86R21O56j375j22P39k23j022R15
$$ plain form
2158 -250 246 -284 -200 286 334 -130 22 352 410 -6 -102 410 68 -32 448 451 82 -87 556 177 -461 -352
2180 -352 568 -445 -1138 275 631 -655 -397 822 38 -1365 -191 686 -284 -744 231 484 -488 -510
2198 -510 720 608 -153 505 1102 335 -869 -186 552 -190 -359 318 665 -253 -454 358 404 -466 -499 417
2218 417 -628 -898 -122 197 -581 -318 363 -203 -128 273 212 -531 -181 518 -123 -286 377 656 74 136 834
2239 834 757 -411 -353 576 -11 -1120 -268 458 -62 -794 141 555 -240 -932 144 -5 -1154 -510 499
2258 499 92 -522 372 724 146 -217 721 413 -157 -309 641 126 -494 15 710 2 -136 267 437 -486
2278 -486 -214 16 -262 -772 -261 118 -273 -413 130 233 -560 59 598 -425 -623 159 531 -626 -159
2297 -159 846 850 -193 105 1011 342 -594 340 429 -286 -714 164 302 -582 -495 501 52 -713 -145 252 -493
$$ packed form
2158b50M96n30Q4M86M8m64J52L30N8m16r6N12l42j00M80Ll69j69O43l79o38J09
2180c52R20j013o93J413L56j286K58J219p84j403J174Q77r70m60R75K53r72k2
2198e10J230j12p61O58N97p67j204O83P38p42j69O77L47r18k01Q12M6q70l3R16
2218D17j045k70P76L19p78K63O81n66P5M01o1p43L50O99o41j63O63K79n82O2O98
2239H34p7j168N8R29n87j109Q52P26n20p32R35M14p95o92J076j49j149O44J009
2258D99m07o14Q94L52n78l63R38l08n70j52R50n15o20N09O95p08j38M03J70r23
2278d86K72K30k78n10N11L79l91j40N43J03p93O19N39j023j98P82L72j157M67
2297a59J005Mj043K98R06o69r36R34Q9p15m28Q78J38q84Q7R96m49p65N68L97p45
$$ plain form
2318 -493 -801 -251 8 -184 -390 370 175 116 476 604 -193 -108 3 248 49 73 451 88 -139 587 473
2339 473 -1 -231 344 19 -753 -95 305 -385 -708 331 455 -551 -588 394 -59 -885 -528 474 112
2358 112 -700 180 813 176 -109 459 811 -133 -404 619 114 -762 -146 602 102 -257 6 580 -148 -155
2378 -155 133 -125 -550 -219 -77 -316 -115 259 194 -372 290 197 -78 -143 249 308 -339 -238 319 348 -72 151
2400 151 493 22 -201 139 164 -497 -565 -28 -55 -479 -299 603 -272 -800 206 405 -494 -418 9 -119 -374
2421 -374 -52 478 540 -72 234 428 162 -110 83 290 -245 -432 413 409 -82 113 641 -5 -399 40 -279
2442 -279 -398 -364 -157 -377 -277 -309 365 175 -129 269 86 -117 -11 26 -267 52 198 234 276 117 378 468
2464 468 -3 81 302 -278 -155 -89 -93 -91 -127 243 28 -288 105 237 -261 -388 75 -273 -506 -236 280 14
$$ packed form
2318d93l08N50K59j92k06P60j95n9L60J28p97Q5J11K45j99K4L78l63k27P26j14
2339D73m74k30N75l25p72O58M00o90l23J039J24j006l7R82m53q26L57J002l62
2358A12q12Q80O33o37k85N68L52r44k71J023n05q76O16P48n00l59K63N74p28p
2378a55K88k58m25L31J42k39K01L74o5n66O62r3k75o5L92N9o47J01N57K9m20K23
2400A51L42m71k23L40K5o61o8N37k7m24J80R02q75n28J006J99q99P6M27j28k55
2421c74L22N30O2o12L06J94k66k72J93K07n35j87Q45mm91J95N28o46l94M39l19
2442b79j19L4K07k20J00l2O74j90l04L98j83k03J06L7k93L19J46L6M2j59K61R0
2464D68m71Q4K21n80J23O6mKl6L70k15l16L93J32m98j27M63l48k33K70N16k66
$$ plain form
2486 14 -266 234 261 304 -6 68 171 -122 -138 122 503 81 81 400 200 -125 -212 220 49 -218 -300 -209 29
2509 29 -378 251 15 -82 -66 108 -119 -307 -43 -218 61 100 388 111 277 325 27 209 318 -32 -76 -220
2531 -220 -150 -47 137 224 -140 -2 -33 -29 -59 -300 -233 61 -112 -413 -296 313 79 -226 218 453 277 -130
2553 -130 461 112 -50 -80 289 61 30 -70 501 130 -233 86 220 30 -133 -290 137 -389 -505 44 324
2574 324 109 -435 260 -18 -461 -399 -343 -156 -25 -115 377 152 273 57 242 214 119 200 387 258 -285 5
2596 5 283 141 214 99 333 187 -17 -239 -219 -209 -183 0 81 -186 -52 125 253 -116 -280 -10 132 120 162
2619 162 524 94 48 1 172 359 303 68 -13 -140 -286 -497 -182 -20 -275 -162 291 98 -236 -167 191 -20
2641 -20 -217 -275 -83 -198 -255 82 246 147 32 187 226 425 -99 84 214 140 -68 173 240 -203 115 117 -119
$$ packed form
2486A4k80N00K7M3l10P4J03k93j6K60L81m22%L19k00l25q7M32j71k67q2R1K38
2509B9m07O29k36r7J6J74k27j88K64j75K79L9K88k77J66M8k98J82J09l50m4j44
2531b20P0J03J84Q7l64J38l1Ml0k41O7K94j73l01J17O09k34l05M44K35j76m07
2553a30N91l49j62l0L69k28l1j00N71l71l63L19J34j90j63j57M27n26j16N49K80
2574C24k15n44O95k78m43O2N6J87J31r0M92k25J21k16J85k8r5Q1J87j29n43K90
2596EK78j42P3j15K34j46k04k22K0J0K6J83Q1k67J34J77J28l69j64K70J42j2M2
2619A62L62m30m6m7J71J87n6k35q1j27j46k11L15J62k55J13M53j93l34O9L58k11
2641b0j97n8J92j15n7L37J64r9j15J55L9J99n24J83J30p4k08K41O7m43L18Kk36
$$ plain form
2664 -119 -313 -123 -210 -167 -174 -247 -101 -91 -384 -100 1 -100 -80 -2 59 -200 -359 -121 312 -80 -13 53 289 43
2688 43 79 267 53 281 -131 -47 -24 -265 -72 22 -31 -186 -284 35 -144 -300 -237 81 -131 -279 -4 -67 212
2711 212 51 150 239 128 -158 117 106 -23 -220 144 481 234 178 247 366 -65 -409 242 86 -191 -256 -27
2733 -27 -94 -464 -404 30 133 -327 -145 278 -371 -341 -11 182 -99 -314 473 572 226 138 0 74 -153 -15
2755 -15 76 -54 -245 -215 189 -47 -329 -110 89 -193 -272 -139 -199 -301 -451 -20 -98 -161 -8 97 212 -109
2777 -109 -179 164 304 -170 0 323 445 68 14 -11 383 124 -65 122 -108 -175 -651 -87 46 -52 -292 256
2799 256 137 41 -234 110 258 -396 -324 35 -94 -216 -126 433 297 173 77 301 327 -255 -58 326 -99 -198
2821 -198 -7 179 -55 -220 -50 29 -329 -233 -153 150 -228 -64 -149 85 -86 86 240 2 -137 -50 -96 -8
$$ packed form
2664a19j94J90q7M3pp3J46J0k93K84J01j01K0P8O1k59j59K38M33l92O7O6K36k46
2688D3L6J88k14K28m12Q4K3k41J93R4n3j55r8L19j79j56O3L18k12j48K75o3K79
2711B12j61R9Q9j11k86K75j1j29j97L64L37k47n6O9J19m31l44O51j56k77o5K29
2733b7o7l70O0M34J03m60J82M23o49L0L30J93k81k15P87R9l46q8j38P4k27J38
2755a5R1j30j91L0M04k36k82K19J99k82p9J33o0j02j50M31p8o3J53J05J15l21
2777a09p0L43J40m74J70L23J22l77n4k5L94k59j89J87k30o7m76N64J33r8k40N48
2799B56j19r6k75L44J48o54P2L59j29j22R0N59j36j24r6K24K6n82J97L84m25r9
2821a98J91J86k34j65J70P9l58R6Q0L03l78J64q5K34j71J72J54k38j39Q7m6Q8
$$ plain form
2843 -8 -175 85 86 375 212 151 356 273 204 148 15 109 -38 -132 254 103 -152 -130 279 198 -202 -102 88 -142
2867 -142 -421 -157 114 -181 -212 353 425 148 229 129 187 -146 -126 355 278 -85 -35 504 390 38 349 181
2889 181 141 -94 -260 -63 -242 -278 -221 -76 66 -177 -217 172 140 -116 -295 484 -39 -416 -101 183 286 -96
2911 -96 183 524 321 -48 -95 148 168 -187 65 80 -92 -96 204 144 -134 -72 63 -213 -273 -441 4 17 -96
2934 -96 227 264 -16 -5 146 209 -49 -155 241 170 -34 -170 4 193 141 363 -98 156 55 -221 -123 125
2956 125 -490 -312 261 -87 -393 -149 16 -220 -274 -167 -82 -231 45 -83 33 226 167 -36 498 492 90 66
2978 66 150 37 -294 -25 224 174 -179 -143 -45 -21 -113 -97 -28 -483 -120 -19 -214 -356 103 91 153 -120 -75 68
3002 68 -318 -300 -171 317 -207 43 190 489 128 -82 295 -130 -58 272 -130 -16 -148 -370 -146 -62 -296
$$ packed form
2843hj67K60JK89j63o1K05q3o9n6j33R4j47r4L86j51k55K2M09q1m00J00J90k30
2867a42k79K64K71k95l1N65P2k77Q1j00N8l33K0M81p7l63N0N39j14l52L11j68
2889A81m0k35j66J97j79l6N7J45J42k43m0L89l2k56j79P79n23l77L15K84J03l82
2911i6K79L41k03l69m7K43K0l55K52J5j72mL00o0k78O2J35k76o0j68M45J3j13
2934i6L23L7k80J1J51O3k58j06L96p1k04j36J74J89n2K22m61K54j01k76R8K48
2956A25o15J78N73l48l06K44J65k36n4J07Q5j49K76j28J16J93n9k03N34om02k4
2978F6Q4j13l31K69K49n0l53L6R8K4r2J6O9m55L63J01j95j42M59j2O2k73M5J43
3002F8l86J8J29M88n24K50J47K99l61k10L77m25P2L30m02J14j32k22K24Q4k34
$$ plain form
3023 -296 179 115 -20 -341 -133 12 -312 -295 104 189 -178 -197 222 296 97 -75 -70 37 -132 -37 -24 116 186
3046 186 50 3 32 -33 173 97 109 -271 -76 -54 -43 -49 76 -195 -39 -27 -183 32 -174 10 -230 282 114
3069 114 72 -168 320 229 -108 257 357 229 -289 228 -317 -358 -161 248 286 -86 113 38 -158 -94 -140 -250
3091 -250 -38 -217 -213 -222 -105 -57 152 381 304 77 81 61 -151 64 246 -188 176 172 210 121 117 12 33 291 -313
3116 -313 -295 -243 -77 -157 -79 66 -15 -208 -65 60 -253 -150 -62 -426 50 -157 -368 -99 144 313 117 425
3138 425 236 120 73 247 -48 -27 -77 25 87 89 7 86 82 -192 -75 -29 -235 -198 286 149 29 -56 99 12 19
3163 19 -171 162 -8 -52 175 113 -105 -57 329 365 118 102 208 115 -86 187 30 -42 -116 -233 -102 16 57
3186 57 57 -45 -104 -25 193 41 -247 -96 99 -45 112 -29 -8 104 75 172 167 62 116 77 -194 228 167 -178
$$ packed form
3023b96M75o4j35l21K08J45l24J7L99Q5l67j9M19P4j99j72NJ07j69R5J3J40P0
3046A86j36m7K9o5K06p6J2l80J95K2J1oJ25k71J56J2j56K15k06J84k40N12j68
3069A14m2k40M88r1l37L65J00j28n18N17n45m1J97M09L8l72J99p5j96O4m6j10
3091b50K12j79MrJ17M8K09K29p7k27Mk0k12K15J82m34L64mL8q9mj05K1K58o04
3116c13J8N2J66q0P8J45q1j93J43J25l13J03Q8l64M76k07k11K69K43J69j96L08
3138D25j89j16m7J74k95K1n0J02O2Kq2P9mk74J17M6k06L7M84j37j20q5J55q7P
3163A9j90L33j70m4K27o2k18M8L86L6k47j6J06r3k01K73j57p2p4j17J31J18M1
3186E7%j02n9P9K18j52k88J51J95j44J57j41K1J12k9R7nj05N4l9k71M22o1l45
$$ plain form
3210 -178 33 40 156 -252 -212 102 -233 -356 1 114 -41 -146 179 53 143 13 86 -153 -105 112 38 10 -187
3233 -187 -143 377 -200 -44 313 343 -97 83 175 -165 -392 39 259 -96 8 198 -119 -229 -219 23 -23 -296
3255 -296 -131 153 37 -151 -157 192 299 -192 113 258 -113 138 149 -182 -99 89 267 242 44 221 -190 -370
3277 -370 95 -71 -112 -135 -111 107 13 -126 -45 36 -193 -95 103 -88 132 122 241 -396 -253 232 -67 -13 119
3300 119 393 -37 -120 47 -60 -118 187 290 28 -228 34 210 -29 -355 -85 -93 -397 -238 -67 -116 100 172
3322 172 57 69 -397 240 52 162 -12 -225 22 92 117 23 -56 126 77 52 305 -84 -89 -184 -101 -133 23 -259
3346 -259 -110 440 -47 -263 -102 -174 15 -281 140 263 -6 -190 397 184 -124 -248 337 129 152 128 -9
3367 -9 -154 -209 -10 293 217 -179 290 2 -144 -275 -147 154 -16 -236 -189 185 -22 168 42 -3 27 -135
$$ packed form
3210a78K11PJ16m08M0L14l35j23L57J13j55j05L25j26R0j30P3k39M8K17p4k8j97
3233a87M4N20n77J56L57L0m40J80R2l40k27M31K20l55J04J90l17j10J0K42m6k73
3255b96J65K84j16j88oL49J07m91L05J45l71K51J1l31Q3J88J78k5j98J77m11j80
3277c70M65j66m1k3K4K18r4j39Q1Q1k29R8J98j91K20j0J19o37J43M85k99N4J32
3300A19K74m30q3J67j07n8L05J03k62k56K62J76k39l26K70ql04J59J71m9K16P2
3322A72j15J2m66O37j88J10j74k13K47P0K5r4p9J82m9k5K53l89nr5Q3l2J56k82
3346b59J49N50m87k16J61p2J89k96M21J23k69j84N87k13l08j24N85k08K3k4j37
3367ij45n5J99L03p6l96M69k88j46j31J28L01j70k20M7L74k07J90j26m5L0j62
$$ plain form
3389 -135 -52 254 -163 128 -64 9 247 -170 144 143 272 -96 24 246 29 -231 168 257 -174 -44 -18 296
3411 296 -144 -245 24 -95 -151 -91 181 6 -255 221 185 -115 -26 -105 167 -214 -216 169 100 -245 -141 155 56
3434 56 151 216 95 11 -210 -146 -266 -200 -211 -253 -101 32 -15 114 -70 5 14 -144 105 -25 -88 -50 -22 78 122
3459 122 48 237 419 96 -55 316 14 -24 -10 358 -158 -2 70 130 -108 -207 -12 -23 60 -237 -62 55 -164
3482 -164 -50 303 130 -246 -16 417 60 -290 -48 145 52 -204 -65 223 -128 -34 249 310 -11 21 -156
3503 -156 -95 -68 -151 -132 161 -136 -115 91 117 237 -107 -252 -22 127 71 -299 125 310 -84 355 7 -78 -95
3526 -95 78 128 -48 0 16 -200 -143 -21 85 -155 122 39 -116 -215 -184 -209 86 38 30 -57 21 -258 75 135 -29
3551 -29 -49 149 -70 44 42 105 195 29 -74 76 380 292 11 -35 72 -225 31 -294 185 23 -152 -99 128
$$ packed form
3389a35Q3L06m17K91j92P3K38m17L14jJ29l68J20K22k17k60L99Q9m31J30K6L14
3411B96m40j01K69j19n6O0K72j75k61M76l6l00Q9p9K72l81kL85o9l45J04K96r9
3434E6R5O5j21q4k21O4j20O6j1m2J52J33m7J29j84P5Rj58K49j30o3L8K8J00M4
3459A22p4J89J82l23j51L71l02l8J4L68n16J56P2O0k38r9J95j1Q3k97J75J17k19
3482a64J14L53j73l76K30M33l57l50K42J93r3k56J39K88l51R4K83O1l21L2j77
3503a56O1K7q3J9K93k97K1K06K6J20l44j45K30J49n6l70M24J85l94M39l48q5j7
3526i5J73N0j76M8J6k16N7J22J06k40K77q3j55r9L1k5K95m8qq7P8k79L33O0j64
3551b9k0J98k19J14kO3R0j66j03J50L04q8k81m6J07k97K56l25M79j62j75N3K27
$$ plain form
3574 128 -129 -17 -64 -309 -167 54 113 -118 126 29 16 142 198 190 58 150 -7 118 139 117 58 89 283 -178
3598 -178 144 -123 30 -292 -144 -8 86 -65 114 -213 1 199 -198 -212 85 79 -149 52 95 -150 -81 294
3620 294 -22 166 119 202 -59 62 -65 -291 -243 -107 -80 -6 83 164 -111 86 -117 -319 -168 47 -62 -404
3642 -404 -171 296 -93 -77 231 286 246 111 -76 -76 15 -120 49 131 20 59 23 -75 -94 -57 -207 -173 -218 257 3
3667 3 -270 -142 62 171 28 -32 -118 75 -147 -251 94 -287 -95 212 -29 308 142 30 256 26 -33 31
3689 31 45 -8 -111 70 76 -57 -38 -387 186 33 -3 -234 -33 22 -109 -36 126 -16 -47 21 45 61 -178 138
3713 138 -24 105 114 -44 -72 39 -245 113 195 -44 156 146 -9 -285 -66 -90 -297 -105 -210 211 71 -10
3735 -10 74 22 -47 104 -235 -28 105 97 -280 -84 285 82 64 31 139 -109 -181 35 -280 -9 88 -127 -41 74
$$ packed form
3574A28k57J12m7k45J42K21N9k31K44r7j3J26N6qj32R2j57J25K1k2n9L1J94m61
3598a78L22k67J53l22J48J36R4j51J79l27K14J98l97j4K97ok28K01M3k45O9L75
3620B94l16J88m7Q3k61J21j27k26M8J36K7P4Q9Q1k75J97k03k02J51K15j09l42
3642d04K33M67l89J6L08N5m0j35j87%R1j35J69Q2j11L9l6r8j9L7j50L4m5M75k54
3667Ck73J28K04J09j43o0q6J93k22j04L45l81J92L07k41L37j66j12K26k30n9O4
3689C1J4n3j03J81Oj33J9l49N73j53l6k31K01N5j31P3J62j42l1O8K4J6k39L16
3713A38j62J29Rj58k8J11k84L58Q2k39K00j0j55k76K19k4k07J92j05M21j40q1
3735a0Q4n2o9J51l39K07J33ql77J96L69k03j8l3J08k48p2K16l15K71R7k15Q6J15
$$ plain form
3759 74 142 72 172 -5 -82 35 -122 -12 -29 -46 -35 83 -98 14 -72 -84 -106 16 -110 99 -73 -146 165 80
3783 80 -19 -188 119 196 -105 -13 105 -90 -275 -58 -192 108 -154 73 -38 48 -149 -53 -184 -144 106 146 -2
3806 -2 157 28 208 339 20 -103 242 240 146 19 129 -151 46 81 207 -33 -75 162 -283 -100 1 -75 -202
3829 -202 -131 152 -177 8 -127 70 280 -12 109 9 284 -105 25 -103 -120 270 193 26 99 96 131 -16
3851 -16 -99 -186 -135 -52 -116 -21 -69 -86 37 -156 39 -151 -218 -111 233 -152 -6 205 -56 88 61 66 276 -86
3875 -86 189 261 211 -43 -77 -118 -18 -10 98 288 104 -10 43 116 -32 -147 38 215 -233 -3 -23 19 176 4
3899 4 -7 -47 -27 -97 -52 -45 8 139 235 22 151 88 234 120 16 89 96 113 -78 166 156 -132 106 -148 -86 -174
3925 -174 -239 20 33 -1 203 74 107 9 89 277 120 -84 -121 -166 -120 -47 15 51 159 195 42 130 99 301 -197
$$ packed form
3759G4O8p0J00j77p7J17j57J10j7j7J1J18j81J12q6j2k2J22j26K09j72p3L11q5
3783H0r9j69L07P7l01R2J18j95j85K17j34L00k62K27j11Q6j97R6j31M0K50M0j48
3806bJ59j29J80J31l19j23L45kr4j27J10k80J97L5J26k40m2K37m45J83J01p6j27
3829b02P1K83l29J85j35J97K10k92J21j00K75l89J30j28j7L90p7j67P3lL5j47
3851a6q3q7N1Q3o4R5m8j7J23j93J95j90o7J07L44l85J46K11k61J44k7NK10l62
3875h6K75P2n0k54l4m1J00QJ08J90j84j14N3P3j48j15J85J77m48K30k0M2J57j72
3899Dj1m0K0p0M5PN3J31R6k13J29o3J46j14j04P3PJ7j91K44j0k88K38k54O2q8
3925a74o5K59J3l4K04j29L3r8Q0J88j57k04l7m5M6P3O2L6J08L6j53Q8l1K02m98
$$ plain form
3950 -197 222 94 67 -227 -157 3 1 -202 -50 -30 -61 -120 -114 -22 -225 -87 -122 -57 -77 -54 38 273 -231 155 104
3975 104 125 -36 186 99 -148 -5 255 -124 42 -8 -40 135 -51 111 -76 -122 -112 -118 79 -194 85 103 -45
3998 -45 6 -154 -59 -92 71 13 -163 21 -102 42 -21 252 -78 -195 -113 -268 77 -136 -91 -55 26 -3 2 32 117
4023 117 68 137 -107 71 26 44 23 253 86 88 60 181 294 81 93 273 -11 -77 -49 -123 -128 -86 109 -139 58
4048 58 124 -105 -326 87 -200 -91 -122 -134 28 296 63 144 -107 265 -205 -35 136 -17 266 146 34 -123
4070 -123 -51 -18 242 -99 67 -70 78 -50 89 218 -219 -171 -66 -131 -111 95 122 140 71 109 -30 -211 -37
4093 -37 -219 5 21 138 -61 -35 67 96 98 171 231 -7 -229 -59 234 110 -65 159 -491 -219 116 -274 -310
4116 -310 -289 -72 104 -113 232 100 -156 -62 294 188 -3 39 -41 -125 -60 -70 12 37 -82 -360 195 83 -76
$$ packed form
3950a97M19j28k7k94P0J60kk03J52K0l1n9OR2k03J38l5O5k0K3R2K35n04L86n1
3975A04K1j61K22q7k47J43K60l79J66n0l2J75j86J62j87m6J0oJ97k73K79J8j48
3998d5N1j60R5l3J63n8j76J84j23J44o3K73l30j17Q2j55L45k13M5L6Q1k9NL0Q5
4023A17m9O9k44J78m5J8k1K30j67Kk8J21J13k13J2J80k84o6K8p4nM2J95k48J97
4048E8O6k29k21M13k87J09l1j2J62K68k33Q1k51L72m70J70J71j53K83j20j12j57
4070a23P2L3K60l41J66j37J48j28J39J29m37M8J05o5K0K06K7J8o9L8j39j81J74
4093c7j82K24J6J17j99K6J02K9KP3O0k38k22J70K93j24j75K24o50K72L35l90l6
4116c10K1K17J76k17L45j32k56R4L56j06j91M2q0q4O5j0Q2K5j19k78N55j12j59
$$ plain form
4139 -76 -88 -174 -89 -159 -29 -54 -72 352 184 33 -94 -192 28 -124 -73 67 101 251 10 -25 68 82 -262 -43
4163 -43 -39 15 140 101 -181 -54 -172 -241 12 85 12 -66 106 -90 -23 151 -52 -99 -81 70 -163 -80 -73 -351 -104
4188 -104 251 -46 -119 157 -51 -180 226 123 218 2 83 15 -131 -131 -8 226 -60 55 264 -101 193 -59
4210 -59 54 -65 -232 -37 -232 16 -224 -320 -245 52 -101 -7 140 -13 -253 25 191 46 -115 80 169 -206
4232 -206 0 -85 86 -61 7 126 -110 -6 171 -65 119 34 -473 -16 105 -30 103 58 20 -399 -9 -215
4254 -215 147 -180 20 72 177 -103 -236 -66 137 25 0 -22 -190 -43 -200 -183 -62 49 108 24 167 -127
4276 -127 -192 -118 -144 -398 9 -249 -238 -135 -261 -133 118 97 59 -189 9 5 -31 342 129 45 86 90 161 5 -37
4301 -37 -41 144 -118 -35 74 -67 100 22 -288 -198 158 -168 -172 -182 -244 -235 9 -43 -133 73 -50 60 -9 49 50 -19
$$ packed form
4139g6j2q6Q5p0J30k5j8M24j68j51j27r8K20j52N1J40L4J50k41l5R3J4l44K19
4163d3MN4J25l9k82J27j18o9K53P3p3p8J72j96O7J74k03m7J8J51k33Q3Pk78K47
4188a04L55k97p3K76k08j29M06j03R5k16Q1o8j46%J23K34k86J15K09l65K94k52
4210e9J13j19j67J95j95K48k40r6P5K97j53R4J47j53k40K78J66j45j61J95Q9l75
4232b06K06q5J71j47O8J19k36J04J77k36J84q5n07M57J21j35J33m5l8m19L90k06
4254b15L62l27K00N2J05k80j33J70K03j12k5k2j68J47j57J7J21J11N9q4J43k94
4276a27o5P4k6k54M07k58J1J03j26J28K51k1l8k48J98ml6L73k13q4M1MP1j56m2
4301c7mJ85k62Q3J09j41J67p8l10R0L56l26mj0o2RK44n2r0K06j23J10o9N8Jo9
$$ plain form
4327 -19 -75 218 91 41 -58 66 73 -262 -147 20 -35 -86 -61 -65 -177 104 141 -253 -47 -24 -8 -163 71 75 4 4
4353 4 12 30 -215 -70 61 17 6 130 96 117 -69 -77 30 -177 -151 141 -19 130 -193 -108 -180 -19 60 78 -86
4378 -86 27 -28 44 -155 -33 -32 -122 -78 -55 -100 -8 32 164 250 -110 11 -144 132 181 71 -217 102 65 142 -146
4403 -146 -351 -191 128 -393 -78 -48 -132 -36 124 -153 -181 -95 71 -392 82 -158 67 26 239 188 -231 -30
4425 -30 -44 149 -406 14 -54 144 169 11 -47 -49 136 153 -131 39 25 -112 38 152 -282 -281 61 151 -76 -14
4449 -14 202 -35 38 -83 76 113 142 253 33 2 190 250 73 -47 169 -161 -160 251 -341 -33 90 -25 -81
4472 -81 232 7 -37 36 -110 -17 -28 -137 -90 46 -54 72 -102 -228 153 69 199 -202 70 84 21 83 162 48
4496 48 234 71 -34 62 -18 84 109 96 -176 -205 -89 111 -262 34 -143 363 -88 -16 53 -110 70 8 -52
$$ packed form
4327a9n6K93j27n0r9J24Pl35J15J67n5n1K5mj12K81L7l94K06K3J6j55K34Mp1%
4353DQJ8k45J45J31m4j1J24l4K1j86qJ07k07K6K92j60J49l23Q5p2J61P9J8j64
4378h6J13n5P2j99J22Jr0M4K3m5R2M0J32Q6l60J21j55K76M9j10k88L19l7P7k88
4403a46k05J60L19n21L15L0q4R6J60k77k8Q6J66m63M74k40K25m1K13n1m19K01
4425c0j4J93n55M20o8J98K5j58n8kJ85J7k84J70j4j37J50J14m34JL42R0k27O2
4449a4K16k37P3j21J59L7K9J11k20l1J88O0j77j20K16l30JM11n92L08J23j15n6
4472h1L13k25m4P3j46R3j1j09M7J36j00J26j74j26L81q4J30m01K72J4o3O2P9j14
4496D8J86j63j05R6q0J02K5j3k72k9J16K00l73K96j77N06m51P2O9j63J80o2o0
$$ plain form
4519 -52 128 86 150 172 98 -21 42 -116 2 317 -223 154 -83 -28 115 27 -88 -76 -144 20 -200 -154 -34 228
4543 228 24 -26 -10 39 -127 29 73 146 -91 83 -109 262 -56 70 -313 95 -298 -228 -173 -304 313 -68
4565 -68 235 104 -183 -124 -31 -33 60 64 -40 -56 4 -39 10 -111 95 96 -192 -63 37 106 -142 80 18 108 -106 259
4591 259 -163 -21 132 -26 133 155 221 -35 130 57 86 84 -107 83 -68 -69 10 -263 -111 0 -27 54 119 -3
4615 -3 -94 -107 -68 28 176 93 -121 217 113 -58 -98 -24 21 4 104 -137 131 31 -54 -9 111 16 -218 -36 78
4640 78 -285 162 21 129 -185 89 311 62 184 -81 106 -135 3 -53 -20 -58 -34 -91 168 -134 -200 -82
4662 -82 -39 -188 -283 128 -158 76 -68 29 -110 -82 31 -222 50 24 45 -11 -191 23 83 103 15 58 -27 -45 -73
4687 -73 209 26 226 -306 -20 -133 22 90 54 226 -58 21 116 -61 -207 129 -76 150 -61 -110 51 20
$$ packed form
4519e2J80m2O4K2p4j19O3j58J18L15n40L77k37N5J43q8j15J2o8J64k20M6J20K62
4543B28k04n0J6M9j66J56M4P3k37J74j92L71l18J26l83M08l93P0N5j31O17l81
4565f8L03j31k87N9R3kR3Mj04j6O0m3M9j21K06Jk88J29J00O9k48K22o2R0k14L65
4591B59m22J42J53j58J59K2O6k56J65p3K9kj91J90j51jP9k73J52J11k7Q1O5j22
4615cr1j3L9R6J48q3k14L38j04j71m0P4M5j7J00k41K68j00q5M5J20r5k34J82J14
4640G8l63M47j41J08l14K74K22k49J22k65J87k41J38n6L3l8K4n7K59l02o6J18
4662h2M3j49r5M11k86K34j44R7j39K8J13k53K72k6K1n6j80K14O0K0q8M3q5j8k8
4687g3K82j83K00n32K86j13J55O8l6J72k84P9R5j77j46L36k05K26k11m9J61l1
$$ plain form
4709 20 9 -134 274 165 -132 -82 -48 142 -52 46 -119 26 -33 49 38 202 -210 -127 161 103 6 37 221 213 -247
4734 -247 -203 -161 21 328 -50 114 -91 -322 -216 -27 26 19 157 163 -14 256 76 -35 130 141 -181 199 -28
4757 -28 141 2 -68 -52 29 -23 -111 -86 8 -49 -29 -226 169 -130 42 25 55 71 128 58 -93 -79 16 156 -71 -39
4783 -39 335 158 133 277 -162 -80 81 29 -166 129 -43 66 196 -25 -6 74 99 -20 59 136 -243 76 -110
4806 -110 58 142 148 242 136 -206 -1 -84 -94 226 -12 -179 -272 -57 -115 -91 -111 -32 -254 -41 -56 151 191 -216
4830 -216 -24 -37 82 -29 132 264 98 -46 128 207 -125 -187 -85 -85 -137 -15 8 -32 75 241 109 -255 22
4853 22 -181 -117 -199 52 -53 144 -249 -114 -128 62 -123 -2 64 41 -168 -250 46 94 26 -158 -140 36 -99
4876 -99 101 222 29 76 86 -295 128 242 -34 138 33 -19 92 203 43 -12 -103 -221 165 -90 61 114
$$ packed form
4709B0j1j43M08j09k97N0L4J90j94R8j65J45n9Q2j1J64m12Q3K88n8r7L1J84qm60
4734b47M4M2J82L07l78J64k05k31J06J89N3pJ38Oj77K70j80j11J65J1l22L80k27
4757b8J69j39p0J6Q1n2q8K5R4n7K0j97L95k99J72j7L0J6N7p0j51J4R5J40k27L2
4783c9L74j77k5J44m39Q2J61n2j95K95j72J09J30k21J9Q0K5j19P9P7l79L19j86
4806a10J68Q4OR4j06l42K05q3j0L20k38j67r3K15n8K4k0P9k22K13j5K07M0m07
4830b16J92j3J19j11J61J32j66j44J74P9l32o2J02%n2J22K3m0J07J66j32l64K77
4853B2k03O4q2K51j05J97l93J35j4J90j85J21O6k3k09q2K96M8o8j84J8J76j35
4876i9K00J21j93M7J0l81M23J14k76J72j05n2J11J11j60n5r1j18L86k55J51N3
$$ plain form
4898 114 -192 58 -63 6 -129 -110 -103 -134 -34 -26 103 33 61 -113 56 24 41 -189 -48 -57 -93 -202 -133 -46 0 118
4924 118 253 -45 38 131 -87 -108 32 -25 -7 160 -271 158 127 90 193 56 335 194 147 202 -252 -46 183
4947 183 23 87 102 73 -155 -120 59 5 -228 111 -122 117 -230 -59 -134 -67 5 11 12 80 -105 -83 110 143 -5
4972 -5 -101 46 54 -263 -14 -168 -26 -146 109 190 303 -1 43 81 14 -11 41 -104 -207 -167 9 291 -22 -23 205
4997 205 197 -37 159 -89 -186 -116 -74 -23 -32 50 3 -15 -7 -1 58 -23 19 -194 -152 -189 128 -243 -206 -195 -194 -176 23 251
5025 251 -69 -22 41 -47 65 51 63 88 66 -31 104 45 -195 -83 -232 13 -141 -360 -56 32 178 239 -141 -115
5049 -115 162 15 45 84 -129 169 122 -83 63 6 -2 222 82 193 0 14 42 -89 -148 -326 14 -94 -38
5072 -38 51 189 -132 46 94 -241 -98 -193 -150 -109 137 13 77 94 -194 -227 -131 -55 -9 -102 28 -18 418 47 -121
$$ packed form
4898A14l06K50j21O9j35J9Pl1J00QJ29p0K8j74J69l2J7k30J41rl6j09O9Q7M6J18
4924A18J35k98Q3R3k18k1J40n7J8J67m31M29l1l7J03j37K79j41m7N5m54K06K29
4947A83j60O4J5k9k28L5J79n4k33L39k33K39l47J71p5O7P2OJO8j85K2J93L3j48
4972er6J47Ql17K49j54J42j20K55Q1J13l04M4L8o7k5N2j45j03M0J76K82l13jK28
4997B05qk34J96k48r7P0M2N1rQ2m7j8QON9q1M2k13M2l7L17l71L7J1JJ8J99K28
5025B51l20M7O3q8J12j4J2K5k2r7J35n9k40J12j49K45j54k19L04Q8J46O1l80K6
5049a15K77j47L0L9k13K98m7k05J46n7qK24j40J11j93J4K8j31n9j78L40j08N6
5072c8Q9J38l21J78M8l35J43r5M3M1K46j24O4J7k88l3R6P6M6r3J30m6M36l71j68
$$ plain form
5097 -121 -47 -165 -127 -247 251 -10 130 -2 -12 66 -107 19 -213 -91 -58 37 -3 99 -26 -207 -68 131
5119 131 110 148 273 -76 -56 83 14 -222 79 102 -110 92 -163 -283 -36 148 50 -30 27 103 -11 93 -43
5142 -43 -14 -185 144 -219 -98 156 -56 137 265 17 -16 -168 7 -2 -169 150 1 85 42 -87 142 53 -35
5165 -35 176 23 -78 -73 1 -95 -101 -102 71 2 -174 -324 -18 43 -44 -128 -125 -27 116 68 155 63 -137 109 239 -71
5191 -71 47 -18 140 -170 236 -1 53 -52 -232 284 -241 16 1 -5 43 13 39 -76 -49 13 -27 201 11 -192
5215 -192 -186 -143 59 77 78 90 -271 249 122 -29 -46 -145 -232 264 -45 -88 -157 -3 148 -51 12 -163 175 111 186
5240 186 51 17 51 42 -48 4 -36 39 442 -102 162 -54 25 -238 -138 67 45 -56 2 170 70 -10 7 -34 -137
5265 -137 -245 62 183 -59 3 41 -269 -24 140 -13 -225 54 -114 -94 4 -109 -287 -331 -118 -101 117 128
$$ packed form
5097a21P4j18L8j20M98k61J40j32j0P8j73J26k32J22L3R5m0J02j25j81J39J99
5119A31k1L8J25l49K0J39o9k36L01K3k12K02k55j20K47J84r8q0N7P6j14J04j36
5142d3K9j71L29l63J21K54k12J93J28k48l3j52J75rj67L19j49Q4m3j29K29q9q8
5165c5K11j53j01NP4r6ojJ73o9j76j50L06O1q7q4LR8J43m8Q7r2k00K46J30l10
5191g1J18o5J58l10M06k37N4j05j80N16n25K57j5oM8l0K6j15K7O2m0K28j90k03
5215a92OM3K02J8JJ2l61N20j27j51j7r9q7M96l09m3o9J54J51j99O3j75L38o4P5
5240A86j35l4L4rr0N2m0P5M03n44K64k16P9k63J00K05k2j01N8J68j00q0J7m1j03
5265a37j08L07J21k42O2L8l10K45J64j53k12K79j68K0R8j13j78m4K13J7K18J1
$$ plain form
5287 128 147 106 -37 80 83 143 -8 221 -6 -154 80 35 -46 -187 -263 10 -158 -59 99 -161 68 28 -175
5310 -175 -83 -178 24 43 107 -158 -95 -98 -50 -8 -175 86 -43 11 -101 -7 268 -77 34 79 91 32 19 -46 12 67
5336 67 118 -85 -183 180 -301 104 215 100 -17 22 337 132 57 -120 -230 -345 27 -3 177 140 -100 13
5358 13 55 44 -53 -252 85 159 -4 -71 427 125 222 -149 -64 -275 10 -4 31 30 223 -60 -90 307 68 12 -36
5383 -36 -47 100 21 -21 5 -31 -100 -43 -127 -1 32 -147 202 62 42 68 45 119 126 -3 -80 -91 108 132 102 -33 -340
5410 -340 -33 -49 290 -186 81 -96 119 83 138 -55 35 -47 0 -9 171 32 -144 71 -110 230 126 -2 -91
5433 -91 -112 116 -20 -22 134 58 -32 -228 67 -5 -37 -99 69 46 -22 -375 -49 -195 -88 20 -66 6 -187 -83
5457 -83 -225 -94 -39 10 -8 83 142 -54 -62 -144 -47 68 -126 197 -32 32 310 -15 75 -33 56 157 89 -101 -21
$$ packed form
5287A28J9m1j43J17LO0j51K29k27j48K34m5q1j41p6K73j68R9J58k60K29m0k03
5310a75R2r5K02J9O4k65O3lM8M2j67K61j29N4j12R4K75l45J11M5J2n9j3o5N8N5
5336F7N1k03r8L63m81M05J11j15j17L9L15k05p5j77j10j15L72l0J80l7k40J13
5358A3M2j1r7j99L37P4j63o7M98l02R7l71Q5k11K85j4L5jJ93k83l0L97k39n6m8
5383c6j1J47p9m2K6l6o9N7q4J26L3j79L49j40k0K6k3P4Pj29p7j1J99K4l0j35l07
5410c40L07j6L39m76K67j77K15l6N5j93R0q2M7rJ80j39j76K15j81L40j04j28q9
5433i1k1K28j36kJ56p6r0j96K95p2l2o2J68k3o8l53L26j46J07J08q6P2j93J04
5457h3j42J31N5M9j8R1N9j96qq2R7J15j94L23k29O4K78l25R0j08Q9J01o8j90Q0
$$ plain form
5482 -21 -38 -115 50 162 -121 -176 54 330 -51 -62 -168 46 215 133 -183 125 -5 -50 13 -170 58 -181 48
5505 48 8 118 -200 -103 179 81 82 -124 -123 -49 29 -139 295 18 -86 -110 -36 59 -279 -139 -80 -96 56 -42 93
5530 93 -39 44 11 -47 166 6 -68 -115 32 226 137 -81 -47 93 131 17 189 -86 -142 67 -26 -206 157 -104
5554 -104 -172 -122 6 -91 33 156 110 76 85 231 136 114 51 69 -159 -77 34 111 -10 -31 226 -125 -241 -73 -109
5579 -109 -49 -16 125 86 82 95 -5 -12 66 201 -140 167 -156 203 35 -212 272 108 -225 -23 -13 1 -423 -119
5603 -119 -192 87 -158 125 -147 -119 69 -164 185 -70 42 -20 -262 -55 -114 -42 -107 10 21 -112 -211 -12 -17
5626 -17 53 -43 65 -130 270 -82 -287 37 -15 126 -93 -92 181 -54 -59 -36 -12 79 46 -41 -215 -185 -29 116 81
5651 81 -80 11 -132 113 -49 87 -52 -87 102 184 185 19 66 -220 1 120 161 69 140 -142 116 -121 -88 152
$$ packed form
5482b1j7p7J65J12k83n5K30K76l81j1j06K14J69q2l16L08j30m5O3j83K28k39K29
5505D8m0J10l18R7K82r8Jk06JP4P8j68M34k77j04k4P4R5l38J40N9j6J52r8J35
5530I3j32Q3l3n8K13j60p4m7J47J94q9k18L4J40L8j14J72k75n6K09r3j80L63k61
5554a04o8N0J28r7J24J23m6l4RJ46r5k2o3J8k28Q2J11P7j21k1K57l51j16J68l6
5579a09O0L3J41l9mJ3j00pP8J35l41L07l23L59j68k47M84j64l33K02J0J4m24L04
5603a19p3K79k45K83k72K8J88k33L49k55J12o2k42K07n9P2o5J17J1j33r9J99n
5626a7P0r6J08j95M00l52k05L24n2J41k19JK73k35nK3K4R1l3q7j74L0J56J45l5
5651H1j61R1j43K45j62J36j39l5J89Q2Jj66M7k86K21J19M1r2P1k82K58k37L3K40
$$ plain form
5675 152 91 43 -135 -78 141 87 -130 85 93 26 -82 -170 -200 195 107 152 -169 78 177 61 -58 -253 -175 -92 178
5700 178 -138 69 -158 -99 -138 9 105 98 -261 56 -19 12 94 15 269 120 92 -8 15 -71 15 93 -18 -55 -26
5725 -26 -173 -227 89 -254 -123 -189 55 94 69 73 -80 92 -26 -3 -23 29 -42 -77 -97 76 -62 45 -126 -244
5749 -244 122 97 -209 -20 -120 119 -49 100 151 0 115 113 -182 -299 -261 -161 -72 37 92 74 -182 11 -361
5772 -361 -110 -162 -399 -146 18 -72 142 45 -39 -77 33 56 -17 -40 81 -30 32 3 24 73 -142 52 108 -16
5796 -16 28 69 84 -200 160 225 -151 -151 -113 48 122 -85 -41 -62 41 13 27 151 127 -45 -87 -123 47 122 -1 -28
5822 -28 -141 -158 -84 38 106 -486 46 122 165 87 1 -103 209 -176 38 -22 -5 120 86 186 -73 -88 -227 136
5846 136 25 183 60 -147 -164 9 -76 -94 -19 106 -18 -207 -45 -74 138 -9 -60 -100 -31 -109 10 -111 42
$$ packed form
5675A52o1m8j78N7K19n4k17K15Qo7j08q8l0L95q8M5l21K47R9j16j19j95P8Q3K70
5700A78l16K07k27N9l9J47R6pl59L17p5L1Q2p9K54j49k8j00K3q6Q6P8j11l7K9
5725b6j47n4L16l43J31o6K44L9k5Mj53J72j18K3k0N2p1l5k0J73j38J07j71j18
5749b44L66k5l06J89j00K39j68J49N1j51J15kk95j17L8J00Q9J09N5j8k56J93l72
5772c61K51n2k37K53J64r0K14r7q4l8J10K3p3k3J21j11O2k9K1M9k15J94N6j24
5796a6M4M1J5k84L60O5l76%L8J61P4k07M4k1J03k8J4J24k4j72m2l6J70P5j23k7
5822b8j13j7P4J22O8n92N32P6M3p8q6j04L12l85K14o0J7J25l4J00k59j5j39L63
5846A36j11J58j23k07j7J73q5j8P5J25j24j89J62k9K12j47n1m0O9p8J19j21J53
$$ plain form
5869 42 38 183 -121 203 -67 -257 12 -42 -112 127 93 105 -13 75 106 139 85 -104 -66 56 -242 51 180 57
5893 57 -10 -113 55 134 257 20 -54 180 377 5 330 104 248 113 33 -354 361 74 159 446 7 206
5915 206 -172 -160 95 135 250 75 87 -36 -74 -12 -14 94 50 -148 -28 113 -159 -73 4 -66 -112 -98 12 -305
5939 -305 42 23 -24 -158 207 106 18 48 -86 112 48 -78 58 -140 65 -93 -113 120 118 194 -214 133 12
5962 12 -182 -154 24 -84 20 -22 252 66 -25 42 99 38 18 12 29 139 -102 -17 285 191 -26 -164 -200 129 -33
5987 -33 -27 -20 97 -102 -271 -35 -189 160 129 -23 -181 -56 172 91 -109 86 -125 -28 -206 239 -58 -20 -22 -149
6011 -149 -39 71 -235 -52 -344 69 -45 -121 -77 -67 41 55 187 -71 58 42 38 -49 248 52 161 -38 214
6034 214 37 -70 54 -264 231 122 12 198 151 139 -138 -272 -17 -9 118 46 -91 -31 9 -35 -31 -159 -323
$$ packed form
5869D2mJ45l04L24k70j90K69n4p0K39l4J2j18Q8L1L3n4j89L8J22k98K93J29j23
5893E7o7j03J68P9J23k37p4K34J97l72L25k26J44j35q0l87P15k87Q5K87m39J99
5915B06l78J2K55M0J15j75J2j23l8O2kJ08m4j98J20J41k72Q6P7p0m6J4J10l17
5939c05L47j9m7j34L65j01q8L0j34J98o4j26J36j98K05j58k0K33kP6m08L47j21
5962A2j94K8J78j08J04m2K74j86r1O7N7o1k0oJ7J10k41Q5L02r4k17j38l6L29j62
5987c3OPJ17j99j69K36j54L49l1j52j58J25K28q1k00J95k11R7j78M45k97L8kj27
6011a49J10J10l06J83k92M13j14p6M4J0J08J4J32k58J29j6mq7K97j96J09j99K52
6034B14j77j07J24l18M95j09j10J86m7j2k77j34K55QJ27p2j37O0M0m4Mj28j64
$$ plain form
6057 -323 11 -259 -128 23 147 41 -14 -90 -212 -9 116 -112 -12 71 61 -172 97 18 -25 -200 -152 122
6079 122 -63 142 154 -75 177 -35 159 -52 -246 92 132 12 51 -199 -325 212 149 -22 88 8 85 4
6101 4 72 67 -67 38 -67 -184 -233 -176 30 76 78 -177 268 11 -16 -238 -139 -32 97 62 150 -114 0 -183 53
6126 53 -258 67 -61 154 35 60 -130 -79 -176 -23 -21 130 63 -110 -72 -87 307 -83 250 -82 -58 102 196 51
6150 51 34 60 49 -6 -158 -249 317 -87 -100 21 -269 124 2 -50 -56 190 -271 -59 -31 -53 108 -202 -7 -28
6174 -28 249 -3 21 -279 -154 101 -136 -73 97 -13 7 255 115 -91 -109 35 184 -232 15 -7 251 81
6196 81 -120 -98 -239 -10 117 -9 34 117 7 -83 -104 -78 -82 -193 32 -18 41 130 224 -103 216 116 36 -142 188
6221 188 150 57 77 -117 91 -264 -22 3 -62 -69 169 100 94 -2 -55 116 -186 -35 -150 18 5 -171 -163 128 96
$$ packed form
6057c23L34k70J31J51J24j06n5p6j22K03J25k28J00Q3j0k33K69p9m3j75M8K74
6079A22j85K05J2k29K52k12J94k11j94L38M0j20L9k50j26N37o3j71J10q0P7q1
6101DO8nj34J05j05j17m9N7K06M6Kk55M45k57k7k22R9J07J29l5Q8k64J14j83K36
6126E3l11L25j28K15j19K5j90N1r7J53KJ51o7j73L8j5L94l90L33l32K4J60R4j45
6150E1j7K6j1n5j52r1N66m04j3J21k90L93j22n2oK46m61K12K8k2J61l10J95k1
6174b8K77k52K4l00J25K55k37O3J70j10K0K48j40k06j8J44J49m16K47k2K58j70
6196H1k01K2j41K29J27j26M3Q3j10r0k1K6mj11K25n0N9Q9R4l27L19j00q0j78L30
6221A88l8r3K0j94K08l55K42K5o5pK38o9or6n3J71l02J51j15J68j3j76QK91l2
$$ plain form
6246 96 -51 61 -377 -84 2 150 19 -113 16 -157 -129 -14 -25 -37 -18 -124 161 -5 -96 -13 23 -23 -271
6269 -271 -39 73 133 48 1 140 -124 105 126 -131 -176 -113 101 -166 -1 192 -91 101 -41 49 -80 -76 140
6292 140 -155 174 -235 145 -71 -5 65 288 91 -48 13 -83 317 -13 -65 3 51 41 112 181 169 11 169 30
6316 30 64 -95 -26 -185 -19 -64 -299 136 18 226 -73 -57 126 55 97 315 -134 171 -50 164 28 1 39
6339 39 95 188 -232 -193 -119 -33 34 7 -113 53 66 123 -96 44 61 69 -65 -268 6 -9 64 18 -157 -174 232 -127
6365 -127 -50 49 -208 34 33 78 -74 -259 -123 -78 256 -23 -44 -33 233 260 27 -24 10 -250 -32 163 -34 -23
6389 -23 97 251 21 -46 -9 -286 75 75 -305 335 27 106 34 141 368 89 -9 -78 42 -175 160 -47 262
6412 262 -86 81 68 -19 -38 -55 -80 -59 -2 -53 23 26 100 72 -76 -65 45 71 84 -294 -24 -99 72 -133 8 -162
$$ packed form
6246I6j47J12m38K93Q6J48j31j32J29j73K8J15j1j2J9j06K85j66r1Q3L6m6k48
6269b71K32J12O0q5m7J39k64K29K1k57m5O3K14k67J65J93k83J92j42R0j29MK16
6292A40k95L29m09L80k16O6P0K23j97j39O1r6M00l30n2O8M8j0P1O9j2j58J58j39
6316C0L4j59O9j59J66m5k35M35j18K08k99J6J83p1M2K18m49L05k21K14j36k7L8
6339C9N6R3m20L9P4Q6O7k7j20J66J3N7k19J40J7Qj34k03K74j5P3m6j75j7M06l59
6365a27P7R9k57K42jM5j52j85J36M5L34k79k1J1K66K7k33n1L4k60K18J95j97J1
6389b3J20J54k30o7L7k77L61%l80O40l08P9p2J07K27k79r8o9J20k17L35k07L09
6412B62l48J67j3q7j9j7k5K1N7n1P6LP4k8j48J1J10K6J3l78K70p5J71k05J41j70
$$ plain form
6438 -162 122 -57 -63 -3 -91 174 175 236 151 80 -2 -322 -69 0 275 149 -26 -180 71 121 24 31 -10 52 201 38
6464 38 -56 23 -196 171 -92 -196 0 -101 -267 -25 42 -102 -30 46 175 -215 10 168 -243 156 -130 68
6486 68 -6 170 -30 31 -23 -128 -1 -114 146 -60 94 204 64 81 -95 142 92 -21 -163 187 -110 163
6508 163 -49 125 -132 114 -116 33 -84 183 279 247 0 -380 27 131 -89 39 -23 -67 94 -238 -84
6529 -84 23 95 260 104 100 -137 -29 -1 218 152 -96 55 185 -82 254 207 -34 -58 116 -28 -84 -58 -78 55
6553 55 -82 -23 370 -136 51 33 -98 -85 -128 125 191 162 -35 -10 -190 83 35 -85 -206 229 -125 -3 51
6576 51 -32 -116 -6 -38 39 -375 2 204 212 195 118 35 -39 -26 -36 -160 -69 -74 -322 -115 87 -196 5 -35 -115 13
6602 13 -37 -30 -175 34 -59 158 -83 -16 -98 38 177 55 28 -71 157 202 -51 -28 40 104 169 -24 -58 83 79 -18
$$ packed form
6438a62K84j79oO0q8K65JO1q5p1q2l20K53O9K75j26j75j54K51N0r7Pm1O2J49j63
6464C8r4P9k19L67k63j04J96j01j66K42O7j44P2P6J29l90K25J58m11L99k86J98
6486F8p4J76k00O1n4j05J27j13K60k06J54J10j40J7j76K37n0j13j42L50k97K73
6508A63k12J74k57K46k30J49j17K67R6l2k47l80M07J04k20J28o2m4J61l32J54
6529h4J07P2J65j56mk37J08K8K19o6k48J51J30k67L36m7k41k4J74j44n6K6k0J33
6553E5j37N9L93n06J87j8j31J3m3K53O6k9j97K5j80K73m8j20j21M35l54J22N4
6576E1q3q4J10l2P7m14L77K02Qj7p7q3p4J3j0j24R1nk48K07K02k83K01m0q0J28
6602A3n0Pj45K09r3K17k41O7q2J36J39j22k7r9K28M5k53K3O8O4O5j93l4J41mr7
$$ plain form
6628 -18 232 65 -196 -143 6 68 132 71 -125 79 38 114 -40 -10 16 80 212 107 211 48 -87 -227 134
6651 134 -80 -78 75 3 32 -142 13 67 -17 -103 -11 -8 109 25 -123 173 330 294 132 -138 167 130 7 -211
6675 -211 43 -36 -16 -110 -398 44 33 115 -86 -61 -63 -47 100 -64 -166 -99 35 -77 38 -44 -228 -194 -119 100
6699 100 32 198 37 170 -36 141 -160 -206 -101 32 -61 166 49 88 -25 -52 -50 65 206 56 181 -98
6721 -98 59 -41 -147 -21 -226 -34 -265 77 237 25 64 0 271 -171 -91 89 80 -195 10 -73 372 131
6743 131 42 -125 -88 60 1 29 96 11 -71 -107 106 -166 -182 -88 215 54 65 -80 58 -3 -21 -182 -19 -28 90
6768 90 9 -240 235 15 -39 -96 153 -46 -66 43 160 219 120 10 121 -11 89 -159 3 -40 76 72 181
6791 181 -263 -24 159 88 -54 53 -7 -224 -32 -94 -47 234 -48 252 -173 -279 1 108 -93 42 -126
$$ packed form
6628a8K50j67k61N3J49O2O4o1j96K04m1P6j54L0K6O4J32j05J04j63j35j40L61
6651A34k14KJ53p2K9j74J55N4q4q6R2LJ17q4j48K96J57l6j62k70L05l7j23k18
6675b11K54p9K0r4k88M42j1Q2k01K5kJ6J47j64j02O7J34j12J15q2j84L4P5K19
6699A00o8J66j61J33k06J77l01m6J05J33r3K27j17L9j13k7KJ15J41j50J25k79
6721i8J57j00j06J26k05J92k31L42J60k12L9o4K71m42Q0J80rk75K05q3M45k41
6743A31q9j67L7J48n9K8O7q5q2l6K13k72j6R4L03j61J1j45J38o1j8j61J63rJ18
6768I0q1k49M75k20n4n7K49j99k0J09J17N9r9j10J11j32J00k48J62m3J16mJ09
6791A81m44K39J83p1j42J07o0k17J92o2M7K81k82L00m25j06K80J07k01J35j68
$$ plain form
6812 -126 -194 -92 -20 169 -45 -88 5 81 -253 -211 162 11 227 6 112 -54 30 103 124 -69 237 79 -150
6835 -150 47 42 -129 -290 93 -28 195 -50 -58 -305 19 64 34 -39 -130 132 -35 -61 -10 -61 121 23 28 32 101 47
6861 47 -83 71 138 -2 91 220 -95 87 46 -232 -66 18 -110 -1 -137 -79 -108 77 -90 -14 134 51 -273
6884 -273 152 251 -88 56 39 -53 17 13 -141 -83 4 -111 -25 99 145 176 -245 118 197 -227 -50 -295 -72 172
6908 172 -56 62 -159 24 -72 181 -53 171 120 86 -149 -123 60 -139 -183 -40 -105 -139 5 5 -54 -122 -48 -128
6932 -128 -26 145 -65 155 163 -34 -149 -30 174 -119 168 -184 56 -41 86 53 115 -162 -37 53 80 -7 -12
6955 -12 5 -22 -231 187 -126 30 256 -103 -91 -70 51 -210 -73 -239 -133 -157 -129 -102 3 81 31 59 138 168
6979 168 -213 -41 87 78 -52 43 -292 349 -54 -114 202 33 142 -225 78 2 -37 35 61 -265 5 81 -26
$$ packed form
6812a26o8J02P2J89k14m3R3P6l34M2L73j51K16k21J06j66Q4P3K1j93L06j58k29
6835a50J97nj71j61L83j21K23k45qk47L24M5l0p3r1K62j67k6N1n1J82r8NMO9n4
6861D7j30J54O7j40R3J29l15J82m1k78J66Q4j28J09j36N8k9J85j67P6J48q3l24
6884b73M25R9l39J44j7r2P0mj54N8Q7j15Q6J24M6L1m21L63P9m24J77k45K23K44
6908A72k28J18k21J83r6K53k34K24n1l4k35K6J83j99m4J43o5l4J44%n9o8P4q0
6932a28J02J71k10K20Qj97j15J19K04k93K87l52K40r7J27l3O2k77J25R0K7q7n
6955a2J7k7k09M18l13J56K26l59J2K1J21k61J37j66J06k4K8K7J05P8n0K8P9L0
6979A68l81J72J28rj30R5l35O41m03o0L16j69J09l67L03p6l9P2K6l26K70P6j07
$$ plain form
7002 -26 -142 -47 -89 -74 -323 -16 -112 62 1 181 -262 150 119 -129 38 -97 -17 139 47 -20 -94 -121 256 -18
7026 -18 -70 1 -163 -154 -79 -165 -74 164 -37 -55 94 -84 38 40 49 69 51 254 110 -100 -219 111 -50 76 -157
7051 -157 -227 132 -239 -45 101 390 -144 152 13 32 -10 -197 -78 24 44 59 30 450 -98 -46 28 -209 -18
7074 -18 -95 4 -40 33 -38 118 -80 130 46 105 95 2 -116 -199 -19 118 -13 -131 134 -26 -2 -8 -119 -230 5
7099 5 -96 -111 53 -301 137 -2 77 -271 198 57 -150 15 16 34 -215 -165 66 -24 -19 29 -246 -18 195 85
7123 85 5 14 108 44 -190 63 229 181 -106 5 -253 189 99 -242 190 30 -3 -3 -86 91 -1 -77 -55 -9 -24 127
7149 127 -45 -67 91 77 42 84 -64 -108 36 -26 -53 -115 225 84 183 195 -280 42 -10 71 -237 -103 18 50
7173 50 178 100 65 99 66 -17 278 13 124 91 -197 81 -141 13 93 199 -107 -238 -110 -120 195 -155 44
$$ packed form
7002b6j16R5m2J5k49L07r6J74o1J80m43M12l1k48J67j35Q0J56r2o7p4k7L77k74
7026a8n2P1j64RP5q6R1K38k01j8J49j78J22KRK0j8K03j44k10j19L30j61J26k33
7051a57p0L59l71J94J46K89n34K96j39J9m2j87J19J02K0J5k9M20n48N2P4k37J91
7074a8p7R9m4P3p1J56j98K10q4N9j0r3j18q3J80J37j31j18K65j60K4oj11j11K35
7099Ej01j5J64l54M38j39P9l48M69j41k07J65JJ8k49N0K31r0NM8k75K28K13j10
7123H5q0RR4o4k34K53J66m8k87J11k58M42r0l41M32j60l3%q3J77r2p6K2M6j5J51
7149A27j72k2J58j4l5M2j48m4J44o2k7o2L40j41R9J2m75L22n2Q1l08J34J21L2
7173E0J28p8l5L4l3q3K95k65J11l3k88K78k22J54Q0J06l06j31J28j0L15l50J99
$$ plain form
7196 44 -164 -130 -61 18 82 -195 -63 -38 -5 -163 -110 90 -39 -45 -75 48 -2 25 -96 55 80 76 -12 42 107 -48
7222 -48 -45 263 -178 -88 40 39 44 -273 -58 183 160 -3 -117 -150 -213 -20 -86 -235 12 180 -172 35 204 -33
7246 -33 -99 130 -51 -19 -291 17 155 -72 194 10 161 -12 -73 176 101 -82 -147 -75 -21 -211 -123 -166 -112 -181
7270 -181 100 35 -9 280 -132 41 -114 -122 32 29 -153 -38 -96 -1 60 -7 -3 2 94 -179 75 42 -29 323 60 43
7296 43 -29 -29 -32 -209 -180 117 68 -65 9 -67 -193 298 74 -178 131 303 244 -218 147 -113 46 -90 -99 -50 116
7321 116 144 2 87 268 22 4 -11 -275 -190 235 -39 75 5 -37 -266 -111 84 80 210 -53 90 173 -160
7344 -160 43 -54 -69 66 -37 -259 -20 -198 -23 -30 -27 77 -84 105 -114 120 -155 -62 140 -17 -48 -34 -117
7367 -117 -80 -37 -66 -124 83 -167 38 224 -117 -8 19 191 -199 -8 23 200 -17 30 31 26 35 165 163 -194 -107
$$ packed form
7196D4k08L4O9P9O4k77J32K5L3j58N3K00j29ol0J23n0K7j21J51K5mq8N4O5j55
7222d8LL08m41R0J28jNl17K15K41k3j63j14l3o3J93o6j49K47J68l52K07J69k37
7246c3o6K29j81L2k72L08J38k27K66j84J51j73o1K49p5j83o5P2N4j90Q8m3N4o9
7270a81K81o5m4K89m12J73j55qJ54lj82J15n8R5O1o7MNR2k73K54l3p1L52k63j7
7296D3p2%lj77K9K97m9j33P4p6j26M91k24k52L09J72n9m62L65k60J59j36rM9J66
7321A16K8j42Q5J81k46j8j5k64Q5M25k74J14p0m2k29J55J95mJ30k63J43Q3l33
7344a60K03r7j5J35j03k22K39j78J75pLJ04j61J89k19K34k75R3K02j57l1J4q3
7367a17L7M3k9n8K07k50K05J86l41J09K7J72l90J91L1J77k17M7JnRJ30kl57Q7
$$ plain form
7392 -107 -383 -104 -55 86 103 -28 -29 163 -85 -21 68 155 7 -158 74 124 99 130 67 -32 21 309 66 16 -81
7417 -81 24 11 -305 -31 204 13 76 408 14 -257 -31 171 45 136 94 -17 23 -50 -210 -23 197 34
7439 34 163 -17 -231 -64 15 39 -102 -147 129 -23 43 -33 244 -259 -24 -208 -41 20 35 254 83 -8 -93
7462 -93 -150 33 1 -87 -22 299 316 -21 -115 -97 132 -139 117 159 116 -217 52 -134 -275 28 -163 -29 -127 -109
7486 -109 -74 -171 -40 42 -18 15 -21 108 21 37 -40 206 -178 274 52 -27 -131 131 -99 -74 -100 -198 345 49
7510 49 47 313 170 -148 -69 -61 248 226 0 -91 108 81 -67 25 150 260 -107 21 35 -49 65 189 127 9
7534 9 54 56 -98 72 -128 48 -165 -227 -64 -10 -138 20 -95 -54 19 -115 96 133 150 255 90 -15 -51 -96
7558 -96 45 -9 -149 48 99 38 -30 -62 -69 -80 125 -43 4 142 50 137 -98 84 -97 151 -133 -104 173 -10
$$ packed form
7392a07k76K79M9J41J7j31jJ92k48O4Q9Q7j48j65K32N0k5L1o3r9N3K88k43n0r7
7417h1J05j3l16K74K35j91O3L32l94k71K26K02j26R1m2j11M0p3j60J87K20j63
7439C4J29j80k14J67P9K4j41m5K76j52O6p6K77n03K35j84J67O1J5K19j71r1q5
7462i3n7J83l2q8O5L21J7l37r4J8K29k71K56M2m3l33K69j86j41L03j91J34r8J8
7486a09L5r7J31Q2o0L3l6J29q7J6p7K46l84M52k22p9j04K62k30K5k6r8N43k96
7510D9kK66j43l18P9QL09k2k26r1J99k7j48R2J25J10l67J28J4q4J14J24o2j18
7534IM5Kj54J70k00J76k13o2J63N4j28J58j15M1P3j34K11L7J7J05j65j05l6m5
7558i6J41n4j40J97N1o1o8l2pj1K05j68M7J38r2Q7k35J82j81K48k84K9K77j83
$$ plain form
7582 -10 -111 -103 102 247 101 -360 -161 -61 21 -199 214 135 -30 80 -14 54 8 -203 -41 -187 -48 -115 9
7605 9 -130 175 7 -21 -67 -95 -120 124 -141 33 10 -37 292 188 -105 -210 -30 52 71 113 -68 -123 25 54
7629 54 66 126 -171 -108 87 309 48 -259 -32 -169 -56 -121 16 146 -19 91 2 -157 19 -134 -67 65
7651 65 -115 -78 -37 -75 -114 -74 -327 -167 -54 113 80 131 -136 73 299 -56 77 73 -99 133 158 156 -89 86
7675 86 -253 -4 124 -134 -83 2 95 -66 -265 -44 82 45 -158 -145 -180 -23 -89 -246 -15 -285 -20 16 -17
7698 -17 55 -27 -235 66 -104 77 83 -93 -16 -127 67 89 85 -116 247 185 43 60 -182 2 95 -53 67 -21
7722 -21 -242 67 -65 1 94 -79 -95 40 198 -269 -198 162 -280 128 311 39 154 37 -132 254 -101 69
7744 69 170 82 6 -19 273 154 83 73 -86 -155 -24 -58 -265 -144 -108 -161 -179 -220 165 -182 140 -70 -26 50 -354
$$ packed form
7582a0j01QK05J45j46m61J99J00Q2k20M13p9j65J10r4O8m6k11J62j46J39o7J24
7605Ij39L05j68k8m6k8k5K44k65J74k3m7L29j04k93j05J80Q2J9M2j81n5J48K9
7629E4J2O0k97O3J95K22k61l07K27j37J13o5J37J30j65J10q9j59J76j53O7J32
7651F5j80L7M1l8l9M0k53J60J13J67l3N1k67K09K26l55J33mj72K32K5kk45J75
7675H6l39K49J28k58N1Q5R3j61j99K21J26l7k03J3l5J57o6j57K31k70K65L6l3
7698a7P2q2k08L01j70J81Oj76P7j11J94K2mk01L63o2j42J7k42J84R3j48J20q8
7722b1k21L09j32O6R3j73j6J35J58m67P1L60m42M08J83k72J15j17j69L86l55J70
7744F9J01q8p6k5K92j19p1j0j59o9J31l4k07J21L6n3j8m1L85l47L22k10M4P6m04
$$ plain form
7769 -354 -112 70 195 127 -13 -84 145 197 87 142 0 -93 -220 -338 190 -337 289 -193 -143 16 38 -201
7791 -201 15 88 31 123 -245 14 -8 -3 -120 80 -196 117 -87 -40 -131 148 -25 103 72 -3 256 -17 -66 120
7815 120 24 -208 215 -83 54 14 137 -182 -68 -233 -74 146 34 -231 109 -147 14 58 -16 -49 -88 216
7837 216 -34 123 74 91 325 5 44 -103 -123 -141 93 -103 -113 -29 -162 -110 -44 -159 -86 99 -217 75 135 219
7861 219 35 -90 39 242 -45 -100 66 52 -70 111 -110 -180 7 -246 141 316 -194 -244 316 -4 298
7882 298 -123 -47 -16 -93 32 -72 -5 -92 323 -100 33 -75 -35 143 215 -73 -28 -221 -333 47 166 -158 261
7905 261 302 -14 90 107 -43 -178 -25 -22 -147 3 89 -203 -325 -210 -101 -258 81 -55 -249 -208 -72 -9
7927 -9 26 -147 -23 267 -129 -235 -64 169 224 19 226 -58 -63 -220 -14 -142 -70 -319 -158 -21 -236 199
$$ packed form
7769c54K42J82J25o8j40p1K29N2j10N5j42r3j27j18N28n27O26m82N0J59K2k39
7791b01K16P3n7R2l68K59k2Nj17K00k76L13k04M7r1K79j73J28l1p5K59k73m9J86
7815A20r6k32M23k98J37m0J23l19J14j65J59K20j12k65L40k56J61M4p4l3l9L04
7837B16k50J57m9J7K34l20L9j47k0j8K34j96j0Q4j33N2O6j15P3J85l16K92O0Q4
7861B19j84j25J29K03k87n5J66j4j22J81k21p0J87k53L87J75n10n0N60l20L02
7882B98m21P6L1p7J25j04O7q7M15m23J33j08M0J78P2k88M5j93j12L80J19l24M19
7905B61M1l16J04J7j50j35J53Lj25J50Q6k92j22J15J09j57L39j36j94M1J36O3
7927iL5j73J24K90l96j06J71K33N5k05K07k84nj57K06j28P2k49J61J37k15M35
$$ plain form
7949 199 -27 4 -42 58 -149 -56 114 86 -168 94 -245 225 53 32 58 19 85 -175 -173 -76 -171 -304 -353 76
7973 76 -99 143 47 -50 76 111 115 -34 -26 187 -23 55 168 -32 -249 -44 -10 197 58 -237 -7 216 20
7996 20 -52 -17 68 -86 -131 -101 -191 -210 -97 93 -52 -131 156 -157 113 286 71 186 -9 12 -257 -20 -9 7
8020 7 -246 122 72 154 34 27 -71 -68 195 37 30 -182 -263 203 -46 -35 80 165 -188 -15 -100 29 -200 74 92
8045 92 -99 -23 -37 -247 34 -96 -5 214 -84 59 -255 87 -116 116 93 -145 -196 -53 160 52 219 -47
8067 -47 -146 130 -2 13 -103 -112 59 -24 -35 104 96 111 46 86 14 -165 -176 75 85 -30 2 -224 47 109 -128 51
8093 51 80 -58 -253 -116 86 95 64 146 58 -298 -182 69 -141 -70 -102 89 -60 -46 -100 54 -129 38 48 107
8117 107 -273 -118 52 -73 -180 27 192 -1 -14 36 78 27 108 -89 -325 123 59 -98 -19 -68 -6 103 -98
$$ packed form
7949A99k26L1m6J00k07R3J70k8k54K62l39M70j72k1K6l9O6k60KR7r5j33m9M29
7973G6j75K42r6r7J26L5Mj49QK13k10P8J13k00k17K05L4K07j39k95K30K23j96
7996B0p2L5Q5j54m5L0r0j9J13J90j45p9K87l13K70J73k15J15j95K1k69K37J1J6
8020Gk53L68n0Q2j20pr8LK63j58pk12q1M66k49J1J15Q5l53J73q5J29k29K74J8
8045I2j91P6j4k10K81j30R1K19k98J43l14L42k03K32k3k38n1J43K13j08J67k66
8067d7r9K76j32J5j16rJ71q3j1J39qJ5o5M0p2j79j1K51J0j15L2k26K71O2k37J79
8093E1K9j38j95J37K02Rl1Q2q8l56J16K51k10P1l2J91j49J4n4J54j83J67J0N9
8117A07l80J55J70j25j07K07J65j93j3N0M2n1Q1j97k36M48o4j57P9m9O2J09k01
$$ plain form
8140 -98 192 -50 -78 117 206 -83 -224 -142 -32 139 15 -58 -94 130 -11 75 -47 11 -30 226 37 -249 -34
8163 -34 -188 -25 136 -41 184 -75 -132 -61 -136 -76 73 -20 18 -86 47 -59 70 -68 93 88 -166 -28 -4
8186 -4 103 -226 -240 92 -207
$$ packed form
8140i8K90k42k8J95Q9k89j41Q2J10J71j24p3l6K24j41Q6j22N8m1K56j89k86K15
8163c4j54J63J61j77K25k59n7P1p5O0J49r3L8j04J33j06J29j38J61nk54J38K4
8186dJ07l29j4L32k99
8191b07
$$ Imaginary data points
##PAGE= N=2
##DATA TABLE= (X++(I..I)), XYDATA
$$ plain form
0 0 0 0 0 0 0 0 0 -8 8 -8 8 -16 16 -24 32 -40 48 -56 72 -83 104 -120 144 -168 200 -233 272 -313 361 -417
30 -417 473 -541 616 -697 786 -886 994 -1114 1247 -1389 1546 -1720 1906 -2112 2336 -2580
46 -2580 2847 -3140 3461 -3813 4199 -4626 5101 -5626 6216 -6883 7639 -8508 9516 -10706
60 -10706 12134 -13883 16082 -18948 22856 -28514 37477 -53887 93626 -395640 -90892 862959
72 862959 54906 -557385 -108858 412056 33434 -236563 -74254 103823 85214 142670
82 142670 -29614 -310817 -157628 351254 281626 -248861 -290948 183823 216920 -153884 -169957
93 -169957 138471 142895 -43936 -81104 -76664 -80626 122962 231342 -72487 -282676 19071
104 19071 219264 -46303 -167957 92983 146084 -86491 -116173 20466 13156 20954 123344
$$ packed form
0@%%%%%%%qJ6j6J6k4L2m0N6p2Q8j04J28j55J87k24K64l12L68m33N05n85O74p78
30d17Q90j014J157j313J483j672J880k108K361k636K935l266L626m018M448m916
46b580N427n987O601p274Q012q825R727j0727J1842j3099J4522j6147J8024k0222
60a0706K2840k6017K9965l5030M1804n1370O5991r1364J47513m89266L04748R53851
72H62959q08053o12291M48527N20914l78622k69997J62309J78077j8609N7456
82A42670j72284k81203J53189N08882o9628n30487m2087M74771L3097l70804j6073
93a69957L08428M424j86831l7168M440l962K03588J08380l03829k10189L01747
104A9071K00193k65567j21654K60940N3101k32575k9682J36639p310P798J02390
$$ plain form
115 123344 25607 -179273 -72256 158955 56465 -131717 19690 161041 -71676 -200211
125 -200211 86377 198271 -97025 -140461 162123 96309 -255664 -114811 286983 136199
135 136199 -252902 -114506 193295 42440 -170478 12390 165208 -12445 -117607 -1340
145 -1340 21412 -31203 55628 95774 -58864 -109977 48961 80253 -60779 -35872 111634
156 111634 38071 -134796 -56634 103973 34749 -64140 26230 59065 -74246 -76830 70521
167 70521 61939 -51186 -15239 44568 -43406 -74996 52908 85355 -29651 -44375 31142 -3750
179 -3750 -58951 22827 77852 -11978 -48356 24248 3269 -69308 19549 122268 -198 -125800
191 -125800 -3045 104817 -30519 -104752 60538 120195 -64195 -128652 33939 91588 -20038
$$ packed form
115A23344r7737k04880J07017K31211j02490j88182J51407J41351k32717j28535
125b00211K86588J11894k95296m3436L02584o5814l51973J40853M01794j50784
135A36199l89101J38396L07801j50855k12918J82868J52818j77653j05162J16267
145a340K2752n2615Q6831M0146j54638n1113J58938L1292j41032K4907J47506
156A11634p3563j72867P8162J60607o9224r8889R0370L2835j33311k584J47351
167G0521q582j13125L5947N9807q7974l1590J27904L2447j15006j4724P5517l4892
179c750n5201Q1778N5025q9830l6378P2604k0979p2577Q8857J02719j22466j25602
191a25800J22755J07862j35336p4233J65290N9657j84390o4457J62591N7649j11626
$$ plain form
202 -20038 -38910 33272 6238 -50694 -8765 29955 -240 5963 35315 -20436 -69621 12610
214 12610 80758 2150 -55315 20089 42073 -52803 -53153 61342 62542 -41408 -38864 28311
226 28311 -2458 -40291 25473 54858 -25386 -51965 13906 17370 -34231 -2676 55249 11158
238 11158 -51788 -20434 24235 9164 1395 20163 -3461 -35145 -845 30522 -8772 -19415
250 -19415 42202 37798 -55014 -57361 46322 57847 -31045 -36766 27787 10583 -41431 -8542
262 -8542 39001 11786 -16125 -690 -7841 -28286 4472 38685 4721 -31026 -5035 15738
274 15738 -9289 -10316 26469 23221 -17924 -18190 8442 -2433 -11210 24863 30131 -26513 -38739
287 -38739 20619 31188 -19647 -15462 31292 10429 -41644 -23335 24173 18653 -5164 -3579 -5554
$$ packed form
202b0038j8872P2182k7034n6932M1929L8720l0195O203K9352n5751m9185Q2231
214A2610O8148p8608n7465P5404K1984r4876l50J14495J200j03950K544O7175
226B8311l0769l7833O5764K9385q0244k6579O5871L464n1601L1555N7925m4091
238A1158o2946L1354M4669j5071p769J8768k3624l1684L4300L1367l9294j0643
250a9415O1617m404r2812k347J03683J1525q8892n721O4553j7204n2014L2889
262h542M7543k7215k7911J5435p151k0445L2758L4213l3964l5747K5991K0773
274A5738k5027j027L6785l248m1145k66K6632j0875q777L6073N268n6644j2226
287c8739N9358J0569n0835M185M6754k0863n2073J8309M7508n520k3817J585j975
$$ plain form
300 -5554 -13459 1791 15158 -483 -6670 12778 6386 -27512 -19242 28301 32175 -11553 -20994
313 -20994 9448 9500 -13541 -240 22783 4037 -18155 -5188 1673 -10360 3689 25268 2862
326 2862 -26926 -10124 13618 860 -8411 6779 7708 -12204 -14157 2078 7496 6369 9773 3443
340 3443 -13745 -12179 9679 13750 -3611 -3671 10148 375 -18766 -2644 23086 11583 -11596
353 -11596 -6965 1735 -7194 -6087 8343 6736 -5299 -4776 -3215 -7971 -355 14220 8164 -10372
367 -10372 -11357 368 2677 -1458 3136 8614 2591 -6783 -4062 3434 4910 6275 8225 -3376 -16600
382 -16600 -5284 13718 7657 -7299 -2608 6479 -774 -10101 -5258 5772 9807 1891 -13970 -17437
396 -17437 2346 17368 4618 -10971 -3028 10190 2837 -11965 -5807 14306 14693 -6430 -16079
$$ packed form
300e554p905J5250J3367j5641o187J9448o392l3898Q270M7543L874m3728r441
313b0994L0442N2k3041J3301K3023j8746k2192J2967O861j2033J4049K1579k2406
326B862k9788J6802K3742j2758r271J5190R29j9912j953J6235N418j127L404o330
340C443j7188J566K1858M071j7361o0J3819r773j9141J6122K5730j1503k3179
353a1596M631Q700q929J107J4430j607j2035N23J561m756P616J4575o056j8536
367a0372r85J1725K309m135M594N478o023r374K721P496J476J365J950j1601j3224
382a6600J1316J9002o061j4956M691R087p253r327M843J1030M035p916j5861l467
396a7437J9783J5022j2750j5589P943J3218p353j4802O158K0113L87k1123r649
$$ plain form
409 -16079 -2274 10856 9364 2333 -2492 -3190 1839 1771 -6423 -4961 8530 9182 -9182 -16067 -719
424 -719 11797 5395 -4849 -4150 877 -1668 -7148 -2513 7738 6961 -3192 -6431 -1021 3436 5570
439 5570 5714 2084 -1585 -2040 -2048 -2208 1834 6207 4345 -2776 -7133 -1884 6544 4207 -5522 -3872 4287
456 4287 -3285 -13726 -1068 14784 3299 -14241 -4084 12521 2847 -13965 -837 19754 5684
469 5684 -22329 -12926 19456 17223 -10807 -10858 11804 11552 -7854 -9974 1473 7593 7483 -375 -15968
484 -15968 -13910 13401 22775 -8418 -28149 779 30250 4807 -35380 -16976 32345 25448 -28104
497 -28104 -34491 16796 38011 921 -26971 -10128 16859 17092 -4558 -18490 -5019 19860 18386
510 18386 -12760 -28815 -419 35750 20411 -30616 -34495 20222 37919 -16783 -43970 7999
$$ packed form
409a6079J3805J3130j492p031m825o98N029o8q194J462J3491O52j8364o885J5348
424g19J2516o402j0244O99N027k545n480M635J0251p77j0153l239N410M457K134
439E570J44l630l669m55qj60M042M373j862p121m357N249Q428k337r729J650Q159
456D287p572j0441J2658J5852j1485j7540J0157J6605r674j6812J3128K0591j4070
469E684k8013R403L2382k233k8030n1K2662k52j9406k120J1447O120j10p858j5593
484a5968K058K7311R374l1193j9731K8928K9471k5443m0187J8404M9321o897n3552
497b8104o387N1287K1215l7090k7892J6843K6987K33k1650j3932J3471K4879j474
510A8386l1146j6055K8396L6169j5339n1027l879N4717J7697n4702k7187N1969
$$ plain form
522 7999 41691 -1931 -37304 -4946 26369 6493 -14126 -2119 4941 -8074 -3065 17092 6805
535 6805 -20482 -7779 26807 12731 -26391 -12345 28944 16444 -23960 -17269 11311 7218 -2060
548 -2060 7102 1197 -18253 -4668 22202 5815 -28793 -13697 29794 21372 -30429 -35537 19766
561 19766 41482 -4394 -36639 -4673 29574 13699 -17653 -17280 4342 18296 10911 -11654 -20742
574 -20742 3476 30444 13731 -28291 -29368 17496 38639 -7218 -45829 -5763 44925 12243
586 12243 -45449 -21462 38812 26908 -26424 -24623 11835 13055 -6313 -3605 4377 -2785 -1579
599 -1579 12770 5600 -16924 -7473 22775 14857 -21470 -18116 17583 17166 -13024 -12930 9271 6951
613 6951 -6140 165 4811 -7798 -8176 8431 6236 -13729 -11213 12574 14756 -7015 -15528 757
$$ packed form
522G999L3692m3622l5373L2358L1315j9876k0619J2007P060j3015N009K0157j0287
535F805k7287J2703L4586j4076l9122J4046M1289j2500m0404O691K8580m093r278
548b060R162n905j9450J3585K6870j6387l4608J5096M3491q422n1801n108N5303
561A9766K1716m5876l2245L1966L4247j5875l1352L73K1622J3954p385k2565r088
574b0742K4218K6968j6713m2022j077M6864K1143m5857l8611M0066N0688l2682
586A2243n7692K3987O0274j1904n3332J801L6458J220j9368K708P982p162J206
599a579J4349p170k2524R451L0248p918l6327L354L5699m17l0190R4K2201k320
613F951j3091O305M646j2609l78J6607k195j9965K516K3787K182k1771q513J6285
$$ plain form
627 757 14033 5443 -8802 -6945 5318 8379 -188 -7114 -3156 6871 11094 1928 -10287 -7163
641 -7163 8177 11972 -4623 -17690 -3772 17471 8178 -17880 -13685 16163 16876 -15114 -21429
654 -21429 8833 20032 -5055 -17627 829 11410 641 -5242 1450 4597 2497 2738 -1527
667 -1527 -7242 -431 9760 3463 -8062 -3053 7608 3553 -6528 -3165 5436 2908 -4833 -5180
681 -5180 -949 538 230 -162 -2079 -2525 2277 4294 -2054 -4269 2878 5061 -4261 -6562 3286 7391
697 7391 848 -2435 623 2261 1814 610 -2046 -356 3817 217 -6143 -3067 4170 2676 -3197
712 -3197 -1726 2218 -98 -3292 -1053 836 -783 -2475 2 1615 -1642 -1715 4009 5180 -1871 -4123
728 -4123 2393 4390 -1612 -2616 1391 2394 886 -261 -1566 983 5206 1900 -6640 -4180 4204
$$ packed form
627G57J3276q590j4245J857J2263L061q567o926L958J0027M223r166j2215L124
641g163J5340L795j6595j3067J3918K1243r293k6058M195K9848P13l1990o315
654b1429L0262J1199k5087j2572J8456J0581j0769n883O692L147k100K41m265
667a527n715O811J0191o297j1525N009J0661m055j0081L363Q601k528p741l47
681e180M231J487l08l92j917m46M802K017o348k215P147K183r322k301R848M105
697G391o543l283L058J638m47j204k656J690M173l600o360L076P237j494n873
712c197J471L944k316l194K239J889j619j692K477J613l257p3N724J171p051k252
728d123O516J997o002j004M007J003j508j147j305K549M223l306q540K460Q384
$$ plain form
743 4204 2240 -5627 -4287 2941 2889 -2616 -4530 725 4772 693 -4420 -2256 1818 1051 -891 -473
759 -473 912 1713 2794 684 -1683 1631 4031 240 -3137 -1193 888 345 648 -383 -1426 172
775 172 2350 -946 -3894 -160 2911 -1530 -4615 -2098 2053 1741 -1102 -1108 1927 2426 -695 -1150 1295
792 1295 1512 -393 13 110 -101 1591 2486 515 -243 1473 125 -2084 -571 621 -1701 -2707 362
809 362 618 -2024 -1341 1750 1748 -1837 -2606 134 1383 -1048 -2254 776 2453 176 -944 1576 2594
826 2594 1703 972 -1063 -1193 1751 1964 -2141 -2033 3191 2888 -2535 -2806 2211 2670 -1767 -3607 -1505
843 -1505 200 -405 -1253 -1059 -348 1073 1777 -600 -2563 598 4397 985 -4346 -1521 4130 2399
859 2399 -1513 -290 2636 1864 945 -74 -2067 -422 3056 289 -4738 -2704 3332 2001 -3435 -1834
$$ packed form
743D204j964p867J340P228n2n505j914N255M047m079n113K164M074p67j942M18
759d73J385Q01J081k110k367L314K400l791l377J944K081n43L03j031j043J598
775A72K178l296k948L734L071m441l085K517M151l12k843oL035M99l121m55K445
792A295K17j905M06R7k11J692Q95j971p58J716j348k209J513J192k322j006L069
809C62K56k642O83L091kl585p69K740J249k431j206L030J677k277j120K520J018
826B594q91p31k035j30K944K13m105J08N224l03n423k71N017M59m437j840K102
843a505J705o05q48J94P11J421P04k377j963L161L799l412n331K825N651j731
859B399l912J223K926p72r19j019j993J645L478k767n027K034O036j331n436J601
$$ plain form
875 -1834 1969 839 -2160 -1527 -485 -889 -703 1144 -114 -2884 496 5059 1929 -3157 -86 4035
891 4035 604 -2640 224 1825 -386 640 2066 -1184 -2139 3323 3713 -3706 -5592 1766 3753 -3405
907 -3405 -5061 772 3174 -985 -2137 -117 897 1327 1146 -1605 -3352 702 4422 -824 -4252 2518
923 2518 6597 -228 -4002 2213 3804 -1238 -2065 1214 -546 -2499 1775 2204 -3492 -2322 4919 2065
939 2065 -6552 -3219 5569 1086 -7903 -2153 6061 321 -5445 1649 6075 -1629 -3578 3742 3017
954 3017 -3932 -1271 5141 878 -4502 351 5047 -65 -3101 1584 2793 -2083 -2851 1198 -71
969 -71 -4092 -1025 2989 38 -3477 -178 2505 -300 -2197 -1437 2 2243 2572 -3427 -4956 4993
985 4993 8123 -3838 -7411 6709 9982 -4923 -8683 3690 6097 -3186 -3494 2394 299 -2198
$$ packed form
875a834L803j130k999O33J042m04J86J847j258k770L380M563l130n086L071M121
891D035l431l244K864J601k211J026J426l250r55N462L90p419j886P358J987p158
907c405j656N833K402m159j152K020J014M30j81k751j747M054L720n246l428O770
923B518M079o825l774O215J591n042q27L279j760j953M274M29n696J170P241k854
939B065q617L333Q788m483q989N750Q214n740n766P094M426p704j949P320p25
954C017o949K661O412m263n380M853M696n112l036M685J209m876p68M049j269
969g1m021L067M014k951l515L299K683k805j897P60J439K241L29n999j529R949
985D993L130j1961l573J4120L273j4905l760J2373K407r283l08N888k095k497
$$ plain form
999 -2198 3044 2626 -7339 -4776 9435 5278 -13440 -9154 12503 9324 -13248 -9491 12389 8798
1013 8798 -9156 -5105 7480 2524 -5177 1228 2313 -4374 14 9074 1932 -8982 -1374 9528
1027 9528 2581 -8725 -3193 6935 2873 -6397 -4886 2175 2863 -399 -1376 -909 -384 607 -674 -3019
1043 -3019 -655 1736 -897 -103 3729 -352 -4859 3284 9302 -2807 -9639 4068 10578 -4342
1057 -4342 -9577 4760 7737 -4539 -4499 5420 2189 -5770 1046 5704 -5907 -10557 6096 10607
1071 10607 -7941 -11977 8566 12298 -9305 -11703 8802 9700 -6648 -5477 5813 1182 -4890
1084 -4890 3167 5062 -4214 -1965 8260 3008 -9657 -3815 8293 2723 -7407 -3062 5386 2269
1098 2269 -3784 -1895 928 -5 284 327 -3012 -2093 3216 1251 -4891 -879 5745 1065 -4320 2151
$$ packed form
999b198N242m18r965K563J4211m157j8718M286K1657l179k2572L757K1880l591
1013H798j7954M051J2585m956p701O405J085o687M388R060p142j0914P608J0902
1027I528o947j1306N532J0128m062r270J511P061O88l262r77M67N25R91j281k345
1043c019K364K391k633P94L832m081m507Q143O018j2109o832J3707O510j4920
1057d342n235J4337K977j2276M0R919l231p959O816M658j1611m650J6653M511
1071A0607j8548m036K0543L732k1603k398K0505Q98j6348J171J1290m631o072
1084d890Q057J895r276K249J0225n252j2665N842J2108n570j0130M345Q448l117
1098B269o053J889K823r33K89M3l339R19N309j965o142M012O624m680n385O471
$$ plain form
1114 2151 5090 -3408 -3827 4850 2815 -5894 -494 7447 599 -6302 1892 5644 -3291 -4969 4351
1129 4351 3121 -6995 -3639 6163 228 -8201 577 9092 -1427 -8107 2604 6446 -4634 -5314
1143 -5314 5207 3335 -5094 -256 6607 -846 -5101 4249 6463 -4142 -4657 5421 3151 -6300
1157 -6300 -2669 5883 1262 -4799 582 4053 -2247 -3723 2555 1251 -5270 -1567 4668 -716 -4756
1172 -4756 2399 4700 -3041 -3069 4990 2537 -4730 -422 4979 -831 -4763 2467 5066 -1758 -2281 4039
1188 4039 1904 -4075 -1226 3193 -1369 -4301 1851 3149 -3961 -3536 4367 2174 -5371 -1077 5066
1203 5066 -777 -5744 1191 4467 -2964 -3041 4964 2774 -4338 26 6416 -402 -5460 2018 5075
1218 5075 -2811 -4218 3241 3373 -3280 -1747 3633 242 -4152 65 3124 -3159 -4603 2576 2430
$$ packed form
1114B151K939q498m19Q677k035q709N400P941o848o901Q194L752q935j678R320
1129D351j230j0116L356R802n935q429Q778Q515j0519o680J0711L842j1080o80
1143e314J0521j872q429M838O863p453m255R350K214j0605n15J0078k270r451
1157f300L631Q552m621o061N381L471o300j476O278j304o521L703O235n384m040
1172d756P155K301p741k8Q059k453p267M308N401n810l932P230K599o824n23O320
1188D039k135n979K849M419m562k932O152J298p110M25P903k193p545M294O143
1203E066n843m967O935L276p431p7Q005k190p112M364O390o818n058P478L057
1218E075p886j407P459J32o653J533N380l391m394M217L059o283j444P179j46
$$ plain form
1233 2430 -4276 -2092 4645 1430 -4213 385 4008 -1383 -3050 2785 2338 -3216 -595 4581 773
1248 773 -3400 1672 4408 -1350 -3474 1914 2030 -3156 -2237 2398 102 -3058 520 2708 -2289 -2857
1264 -2857 2367 1617 -4055 -2062 3918 303 -4034 669 4383 -864 -2492 2851 3120 -2825 -1207
1279 -1207 3419 495 -3331 612 3538 -932 -2286 2378 2306 -2972 -1979 2398 93 -3774 -817 2457
1295 2457 -1112 -3245 1768 2571 -2069 -1696 3051 754 -3505 -128 2897 -688 -2344 2246 3259
1310 3259 -1275 -1034 3213 1583 -2257 -289 2287 -526 -2387 381 1640 -1613 -1589 1591 866 -2138
1326 -2138 -822 1283 -1020 -2376 652 945 -1941 -764 2599 901 -2082 761 2849 -566 -1966
1341 -1966 1603 1541 -1382 -624 1799 732 -1070 952 1920 -1115 -1707 1237 904 -2675 -1931 1533 472
$$ packed form
1233B430o706K184O737l215n643M598L623n391j667N835m47n554K621N176l808
1248G73m173N072K736n758k124N388J16n186R19M635k296l160L578K188m997n68
1264b857N224p50n672J993N980l615m337M703L714n247j628N343K69n945J618
1279a207M626k924l826L943K926m470j354M664p2n278R93M377k305l867K957L274
1295B457l569k133N013Q03m640L73M747k297m259L377L025l585j656M590J013
1310C259m534K41M247j630l840J968K576k813j861K768J259l253K4L180p25l004
1326b138J316K105k303j356L028K93k886J177L363j698k983K843K088l415j400
1341a966L569o2k923P58K423j067j802K022R68l035n92K944l33l579P44L464j061
$$ plain form
1358 472 -2831 -563 2341 417 -2330 373 1554 -1467 -1612 1197 610 -1763 -3 2613 711 -1300
1374 -1300 916 2083 225 -1030 459 634 -1037 -405 588 -14 -643 454 634 -583 -1103 236 -4
1391 -4 -1414 -1093 -147 -212 -579 472 517 -321 595 1394 -275 -900 504 1414 -317 -862 657 1184 277
1410 277 127 1146 896 -293 -68 -78 -743 -1330 293 635 -1104 -1193 992 929 -1270 -1052 761 41 -1502
1429 -1502 -706 400 293 -165 135 730 796 588 642 274 410 52 -212 11 -56 -429 624 1065 -147 -437
1449 -437 425 321 -740 -1117 -428 -176 -647 -1188 -795 230 173 -442 280 1297 -20 -768 241 541 -426
1468 -426 -688 960 1116 -427 268 1321 678 -446 -284 318 322 -739 -1070 -66 187 -614 -1255 498
1486 498 503 -1133 -614 840 -684 -1910 -398 1226 -479 -1264 604 2010 140 -1232 339 1992
$$ packed form
1358D72l303K268K904j924k747K703J181l021j45K809n87k373J760K616j902k011
1374a300K216J167j858j255J489J75j671O32R93o02o29J097J80j217n20J339k40
1391dj410L21R46o5l67J051M5q38R16P99j669o25J404R10j731n45J519N27r07
1410B77j50J019k50j189K25j0o65n87J623L42j739q9K185o3k199K18J813p20j543
1429a502P96J106j07m58L00N95O6k08N4l68J36l58k64K23o7l73J053M41j212k90
1449d37Q62j04j061l77O89K52m71n41L93J025n7o15P22J017j317p48J009L00r67
1468d26k62J648J56j543O95J053o43j124J62O02Mj061l31J004K53q01o41J753
1486D98Nj636N19J454j524j226J512J624j705p85J868J406j870j372J571J653
$$ plain form
1502 1992 781 -1355 -172 1519 -50 -1533 406 1630 -307 -297 2039 419 -2372 -1002 1234
1517 1234 -770 -2298 -271 1456 170 -2134 -669 1468 761 -1071 -998 989 377 -1361 26 1500
1533 1500 154 -530 1425 1724 -672 -225 1656 520 -1698 -938 483 512 -143 -409 3 889 -300
1550 -300 -1472 -120 807 -896 -1213 460 -127 -1998 -540 2129 1075 -872 425 1505 131 -1507
1566 -1507 -558 1391 1246 -596 -565 1449 748 -1042 142 1802 -201 -1977 765 702 -2240 -1524 1586
1583 1586 606 -1828 -374 1922 230 -1276 -858 593 222 -779 -723 655 839 141 338 1305 333
1600 333 -753 1015 1314 -737 -965 831 214 -1193 -226 772 391 137 -155 -566 -782 -266 -845 -821 55
1619 55 204 -741 -82 841 4 -659 805 1162 -553 -953 576 400 -518 -48 896 1240 366 -110 902
$$ packed form
1502A992j211k136J183J691j569j483J939J224j937J0K336j620k791J370K236
1517A234k004j528K027J727j286k304J465K137p07j832P3J987o12j738J387J474
1533A500j346o84J955K99k396M47J881j136k218P60J421K9o55k66M12Q86j189
1550c00j172J352R27j703l17J673n87j871J458K669j054j947J297J080j374j638
1566a507R49J949j45j842L1K014p01j790J184J660k003j776K742o3k942P16L110
1583A586r80k434J454K296j692j506M18J451l71j001N6J378J84o98J97R67r72
1600C33j086J768K99k051k28J796o17j407R67R98l81k54k92m11k16N16n79K4Q76
1619E5J49r45O59R23q37o63J464L57j715m00J529j76r18M70R44L44q74m76J012
$$ plain form
1638 902 796 -1029 -762 650 -320 -1371 -172 1549 -438 -1572 244 833 -1071 -1115 675 177 -1217
1655 -1217 -659 730 -19 -192 809 1417 395 65 478 280 -446 -288 220 400 5 -21 119 72 -107
1674 -107 455 327 -244 -153 -334 -694 -916 -133 334 -480 -367 543 -5 -777 176 748 -610 -566 901 709
1694 709 -860 297 1581 653 -512 833 887 -152 -390 161 429 -1046 -813 656 541 -616 -330
1711 -330 858 392 -1668 -929 662 -385 -1061 -121 746 -297 -642 1120 634 -176 466 982 9 -500
1729 -500 304 554 21 52 786 427 180 254 -39 -263 -226 -107 -444 -830 -355 30 -254 -471 149 594 -231
1750 -231 -415 307 424 -781 -322 752 204 -762 586 1579 57 -368 1084 849 -509 -536 474 306
1768 306 -786 -314 442 150 -489 -257 503 -244 -920 -503 -195 -603 -922 144 192 -200 124 656 -40 -374
$$ packed form
1638I02j06j825K67J412r70j051J199J721j987j134J816N89j904m4J790m98j394
1655a217N58J389p49j73J001O08j022l30M13j98p26J58N08J80l95k6J40m7j79
1674a07N62j28n71R1j81l60k22P83M67q14J13R10n48p72R53N72j358M4J467j92
1694G09j569J157J284r28j165J345N4j039k38N51K68j475K33J469j15j157K86
1711c30J188m66k060P39J591j047o76R40Q67j043l45J762m86q10O42N16r73n09
1729e00Q04K50n33L1P34l59k47P4k93k24L7J19l37l86M75L85k84k17O20M45q25
1750b31j84P22J17j205M59J074n48r66J348R93j522m25J452k35j358k7J010j68
1768C06j092M72P56k92o39K32P60p47o76M17L08m08l19J066M8l92L24N32o96l34
$$ plain form
1788 -374 429 489 -623 -12 447 142 -179 864 876 -268 334 813 -49 -436 -277 337 -175 -1026 -210 624
1808 624 -248 -859 329 643 -599 -893 172 -34 -1052 -518 745 601 -790 250 1391 386 -270
1825 -270 870 681 -332 -515 420 159 -352 156 721 364 -397 -293 252 -338 -884 -445 -323 -379 -485 -75
1845 -75 -83 29 284 28 -206 287 412 -358 -253 622 430 -69 76 867 406 -303 528 807 -342 -734 -49
1866 -49 504 -943 -854 485 653 -995 -516 816 263 -1010 -748 771 -239 -1175 -100 645 -320 -552
1884 -552 803 1057 -94 -217 817 640 -484 -353 436 281 -61 75 488 261 -97 108 57 -446 -516
1903 -516 -420 -101 -343 -431 -322 121 88 -107 -206 82 330 -120 -558 -103 263 -242 -150 665 781 204 294 590
1925 590 215 -421 73 354 -121 -818 -123 348 -2 -386 -152 375 -338 -945 -259 61 -848 -723 487 175
$$ packed form
1788c74Q03O0j112O11M59l05l21J043J2j144O02M79q62l87J59O14n12q51Q16Q34
1808F24q72o11J188L14j242k94J065k06j018N34J263j44j391J040J141j005o56
1825b70J140j89j013j83R35k61n11N08N65l57p61J04N45n90n46M39J22n6j06M10
1845g5qJ12K55k56k34M93J25p70J05Q75j92m99J45P91m61p09Q31K79j149l92O85
1866d9N53j447Q9J339J68j648M79J332n53j273K62J519j010r36J075P45r65k32
1884e52J355K54j151j23J034j77j124J31P89j55l42J36M13k27l58K05n1n03p0
1903e16R6L19k42q8J09M43l3j95r9K88K48m50m38M55L66n05R2Q15J16n77R0K96
1925E90l75o36M94K81m75o97O95M71l50l84K34N27p13o07O86L20r09J25J210l12
$$ plain form
1945 175 -386 -10 832 467 -463 373 766 -142 -242 168 144 289 167 484 595 145 -184 412 -57 -425
1965 -425 -375 -290 -233 -537 -423 19 153 -58 -219 -94 -210 64 -440 -237 156 -136 55 125 488 305 286 461
1987 461 255 -234 -269 276 -32 -227 1 360 456 -250 9 154 220 -345 -280 -284 -502 -651 -513 200 -98 -377
2009 -377 374 582 48 -278 487 591 -146 -468 437 357 -23 287 428 708 32 0 369 140 -561 -230 134
2030 134 -637 -747 -7 438 -152 -180 386 -140 -452 -512 147 -28 -189 496 254 -83 -170 582 100 199 604
2051 604 243 19 101 -11 -148 12 476 259 285 -95 -16 4 -304 -657 -218 -140 -662 -555 280 255 -611 164
2073 164 240 -26 -411 600 478 -656 -291 812 -29 -410 551 1161 -98 -136 225 -128 -647 -134 411
2092 411 -176 -347 -82 233 -333 -291 217 264 -408 -453 38 -247 -941 -320 613 155 -327 490 680 -176 232
$$ packed form
1945A75n61L76Q42l65r30Q36L93r08j00M10k4J45j22L17J11m50l29N96m69l68
1965d25N0Q5N7l04J14M42J34k11j61J25j16K74n04K03L93k92J91P0L63j83j9J75
1987D61k06m89l5N45l08j95K28L59R6p06K59J45O6n65O5mk18j49J38P13k98k79
2009c77P51K08n34l26P65J04p37l22R05q0l80L10J41K80o76l2L69k29p01L31L64
2030A34p71j10P40M45n90k8N66n26l12o0O59j75j61O85k42l37q7P52m82R9M05
2051F04l61k24Q2j12j37J60M64k17K6l80P9K0l08l53M39P8n22J07Q35k5q66P75
2073A64P6k66l85J011j22j134L65J103q41l81R61O10j259l8L61l53n19N13N45
2092D11n87j71K65L15n66M2N08M7o72m5M91k85o94O21R33m58m82Q17J90q56M08
$$ plain form
2113 232 760 165 -648 308 786 -494 98 948 420 -450 383 693 -285 -661 162 130 -809 -588 -151 417
2133 417 -352 76 721 220 -988 -531 619 -116 -696 358 1044 -622 -377 945 639 -323 412 776
2151 776 -403 -998 246 214 -700 -335 901 -61 -446 235 176 -391 -410 156 -297 -389 -370 -288 27 -269 -19
2172 -19 358 62 -233 165 225 -474 -211 553 -63 -242 551 1156 -139 -517 675 367 -1113 -416 699
2191 699 -314 -971 172 660 -724 -567 769 345 -547 -300 502 -140 -861 -171 702 91 -348 365 664
2210 664 -79 -224 369 510 -561 -129 333 -79 -984 173 314 -318 -331 222 -223 -684 -232 140 -882
2229 -882 -565 -49 -19 -330 12 548 -212 -360 325 438 -439 -538 529 632 -286 66 945 163 -348 -35
2249 -35 904 -345 -884 134 299 -597 -914 498 10 -756 196 409 -396 -565 254 154 -781 -538 277
$$ packed form
2113B32N28n95q13R56M78j280N92Q50n28q70Q33L10r78l76Q23l2r39K21M37N68
2133D17p69M28O45n01j208M57J150p35n80J054O86j666K45J322l06r62P35L64
2151G76j179n95J244l2r14L65J236r62l85O81n9n67j9N66m53r2J9Q2L15k96K50
2172a9L77k96k95L98O0o99K63P64o16j79P93O05j295l78J192l08j480O97J115
2191F99j013o57J143M88j384J57J336m24q92K47Q02o42p21O90Q73o11m39P13K99
2210F64p43j45N93J41j071M32M62m12r05J157J41o32j3N53m45m61M52L72j022
2229h82L17N16L0l11L42N36p60j48O85J13q77r9J067J03r18L52Q79p82n11L13
2249c5R39j249n39J018J65q96l17J412m88p66R52K13q05j69Q19j00r35K43Q15
$$ plain form
2268 277 320 -492 347 749 -76 -257 192 104 -254 -206 415 88 -361 54 391 -1 -149 465 215 -548 -51
2289 -51 235 -402 -794 -267 387 -313 -527 615 407 -573 -183 413 -195 -599 121 805 31 -333 571 556
2309 556 -321 52 803 105 -239 -102 386 -136 -555 -102 288 -270 -352 165 -146 -585 -230 44 -352 -601
2329 -601 116 -153 -339 85 464 277 20 212 717 -229 -138 360 -8 -539 -36 978 197 -437 484 519
2349 519 -370 -683 107 -79 -803 -524 383 -5 -599 -34 510 -122 -794 152 292 -300 -582 325 344 -427
2369 -427 55 709 311 191 424 752 99 -109 99 233 -567 37 -32 -150 22 298 -101 -497 -45 -295
2389 -295 -601 -316 -85 -237 -349 125 585 156 -95 -74 563 71 -482 198 376 -193 12 725 267 -365
2409 -365 287 596 197 -240 280 201 -442 -754 -16 -11 -610 -400 491 -20 -405 36 189 -447 -524 -445 250 -94
$$ packed form
2268B77M3q12Q39M02q25j81M49q8l58M8O21l27m49M15L37l92j48O14k50p63M97
2289e1K86o37l92N27O54p00k14J142k08r80L90N96o08m04P20O84p74l64R04j5
2309E56q77L73P51o98l44J37M88n22m19M53L90n58q2N17l11m39L55K74l96k49
2329f01P17k69j86M24L79j87k57J92N05r46R1M98l68n31N03J014p81o34R21L5
2349E19q89l13P90j86p24K79R07l88n94N65N44o32o72R46J40n92k82R07J9p71
2369d27M82O54l98j20K33L28o53k08K08J34q00O04o9j18J72K76l99l96M52k50
2389b95l06K85K31j52j12M74M60m29k51K1O37m92n53O80J78n69K05P13m58o32
2409c65O52L09l99m37N20p9o43l12P38Nn99K10Q91n11l85M41J53o36p7P9O95l44
$$ plain form
2431 -94 -32 371 297 -130 -69 517 308 -351 -22 152 -196 -141 358 125 -299 83 -187 -334 -146 -145 -340 -521
2453 -521 -313 -200 -209 200 403 -211 67 60 310 -305 5 156 -62 -45 26 269 386 81 -32 454 360 -97
2475 -97 140 9 -415 -512 -19 130 -284 -300 214 168 -310 -54 242 -162 -506 -125 77 -228 53 165 279
2496 279 -61 95 305 407 132 -242 314 86 -148 150 312 194 0 484 230 -229 -100 -111 -204 -609 -80
2517 -80 -38 -345 -58 61 -113 -52 -15 69 -69 321 -98 -506 47 117 -15 247 325 234 -86 53 278 236 12
2540 12 -61 -60 -118 -221 -160 294 22 -438 -121 -1 -282 -421 -255 -176 -368 -354 15 188 100 271 382 -246 -145
2563 -145 -258 279 71 239 -197 149 194 -151 258 144 33 -193 -118 -29 -645 -415 -253 119 -237 59 -112
2584 -112 -30 -99 -67 -272 40 8 -486 37 118 -142 -287 366 367 -46 188 480 -7 -151 -161 -106 127 6 101
$$ packed form
2431i4O2M03p4m27O1N86k09o59L29J74l48N5M99k33m24L82k70j47J88Jj95j81
2453e21K08J13rM09K03o14K78pK50o15L10J51k18J7P1K43J17l05j13M86r4m57
2475i7K37j31m24r7M93J49m14j6N14m6m78K56K96m04l44L81K02l05K81J12J14
2496B79l40J56K10J02k75l74N56k28k34K98J62j18j94M84k54m59J29j1r3m05N29
2517h0M2l07K87J19j74O1L7Q4j38L90m19m08N53P0j32K62P8r1l20J39K25m2k24
2540A2p3Jn8j03O1M54k72m60L17J20k81j39J66P9j92J4L69J73q8J71J11o28J01
2563a45j13N37k08J68m36L46M5l45M09j14j11k26P5Q9o16K30J62L72l56K96j71
2584a12Q2o9L2k05L12l2m94N23Q1k60j45O53Jm13K34K92m87j44j0N5K33j21R5
$$ plain form
2607 101 391 -4 -81 61 -190 96 -352 -277 116 -174 -203 119 286 49 145 228 411 123 9 161 78 -154
2629 -154 -230 449 281 58 459 155 131 -136 174 57 23 -62 199 -277 -18 -343 105 -32 -323 -65 -139 1
2651 1 -14 -251 -67 126 47 -173 449 405 -31 48 38 267 -202 78 23 19 -16 105 25 -3 -10 159 192 18 -134
2676 -134 -103 -63 -316 -313 -60 290 -219 -188 139 164 -142 -154 160 183 105 -155 139 240 132 461 229 258 27
2699 27 9 35 -138 -279 -127 -239 74 -3 -1 -160 134 -263 -240 -167 -435 -200 109 -143 -4 -133 254 263 -29
2722 -29 -121 173 511 -268 -164 190 490 -42 -254 277 336 -79 16 254 103 -457 -191 38 -89 -381 -142
2743 -142 441 -152 -356 85 341 9 -236 62 92 37 -290 311 189 16 -274 373 353 -38 61 91 151 -58
2765 -58 -193 28 29 -107 65 44 40 -103 -155 46 -158 -325 -303 108 -189 -149 -203 214 180 -167 228 170 -23 -144
$$ packed form
2607A01K90l95p7J42k51K86m48P5L93k90k9L22J67k37R6Q3J83k88j14J52q3k32
2629a54p6O79j68k23M01l04k4k67L10j17l4q5K61m76K59l25M48j37k91K58p4J40
2651Aj5k37J84J93p9k20O22m4m36P9j0K29m69K80n5ml5J21q0k8pJ69L3j74j52
2676a34L1M0k53LK53L50n09L1L27K5l06j2L14K3p8k60K94J01j08L29k32K9k31
2699B7j8K6j73j41J52j12L13p7Kj59K94l97K3P3k68K35L09k52J39j29L87Rk92
2722b9r2K94L38p79J04L54L00n32k12N31N9m15R5K38j51n60K66K29j27k92K39
2743a42N83n93k04M41K56l32k45K98L0n5l27O01j22j73k90O47k0l91R9L0O0k09
2765e8j35K21Jj36J72k1mj43n2K01k04j67K2M11k97M0n4M17l4l47L95n8j93j21
$$ plain form
2789 -144 146 254 293 -485 118 308 -181 -225 31 269 -234 -307 325 150 -342 -329 155 135 -347 -399 377 19
2811 19 -405 -139 124 -256 -138 -58 405 161 -49 131 364 167 -107 307 248 175 -69 -117 344 -6 -93 411
2833 411 -35 -12 -69 -142 -50 -126 -555 58 3 -326 -124 86 -98 106 185 140 270 186 -252 45 141 25 -109
2856 -109 109 502 107 -87 395 12 -375 -155 104 85 -480 -19 373 68 -231 25 87 127 -183 -37 77
2877 77 -442 -97 259 19 -263 -3 227 373 -88 -81 176 80 64 -49 133 -9 -91 83 584 342 342 -35 -272
2900 -272 -217 -256 -53 -173 -220 -168 12 213 26 -239 -22 257 -63 -288 -118 -38 190 138 220 479 170 88 352
2923 352 354 -40 38 211 -115 -213 92 -32 132 -166 -268 371 -56 -445 -79 -51 -124 -565 113 377 -57 33
2945 33 184 294 105 -196 281 370 -15 -252 3 196 -77 210 404 285 51 201 145 -100 27 -211 -24
$$ packed form
2789a44K90J08L9p78O03J90m89m4K56K38n03p3O32j75m92J3M84k0m82n2P76l58
2811A9m24K66K63l80J18Q0M63k44k10J80K33j97k74M14n9p3k44m8M61l50q7N04
2833D11m46K3n7p3R2p6m29O13n5l29K02K10j84K04P9m5J30q4m38K97R6j16j34
2856a09K18L93l95j94M82l83l87K20K59j9n65M61L92l05k99K56O2M0l10J46J14
2877G7n19L45L56k40k82K60K30J46m61PK57r6j6j13J82j42q2J74N01k42%l77k37
2900b72N5l9K03j20m7N2J80K01j87k65K17K79l20k25J70Q0K28n2Q2K59l09q2K64
2923C52Kl94P8J73l26r8L05j24J64k98j02O39m27l89L66K8p3m41O78K64m34R0
2945C3J51J10j89l01M77Q9l85k37K55J93k73K87J94j19k34J50n6k45J27k38J87
$$ plain form
2966 -24 -177 -122 168 -104 91 -268 -177 17 -421 -288 -170 -187 -63 -331 233 253 485 285 285 96 54 7 -1 165
2990 165 -260 -85 -41 255 -143 -52 293 209 -262 -167 108 -108 -480 -24 -82 -101 -95 146 243 -46 -70 175 92 -91
3014 -91 -62 -29 69 225 250 117 388 246 131 266 -219 -319 78 125 -253 -303 25 72 78 -145 173 34 -322
3037 -322 -173 -276 -95 157 67 78 265 128 109 372 277 75 -24 236 -166 -44 -271 22 182 -57 295 118
3059 118 -37 85 7 -67 -14 -96 -352 -176 -166 -20 -240 259 245 54 183 277 -145 -83 39 83 -47 205 500
3082 500 38 151 -102 -17 130 33 -229 -138 236 60 -127 254 -230 79 -292 216 84 -175 -335 -64 -317
3103 -317 -95 229 -99 -24 -44 296 146 -90 11 104 6 141 -6 70 62 27 -33 85 117 75 121 -1 -123 -252
3127 -252 47 -220 -157 128 -380 -42 -9 -60 -11 -213 55 65 10 42 114 -171 66 274 142 -110 160 264 30
$$ packed form
2966b4j53N5K90k72J95l59R1J94m38J33J18j7J24k68N64K0K32k00%j89m2m7qJ66
2990A65m25J75M4K96l98R1L45q4m71R5K75k16l72M56n8j9OK41R7k89k4K45q3j83
3014i1K9L3R8J56K5j33K71j42j15J35m85j00L97M7l78n0L28M7Ok23L18j39l56
3037c22J49j03J81K52r0J1J87j37j9K63r5k02r9K60m02J22k27K93J60k39L52j77
3059A18j55J22p8p4N3q2k56J76J0J46k20M99j4j91J29R4m22O2J22M4j30K52K95
3082E00m62J13k53Q5J47r7k62R1L74j76j87L81m84L09l71N08j32k59j60K71k53
3103c17K22L24l28P5k0L40j50k36J01R3r8J35j47P6ql5o0J18L2m2M6j22j22j29
3127b52K99k67O3K85n08L38L3n1M9k02K68J0n5L2P2k85K37K08j32k52K70J04k34
$$ plain form
3150 30 63 -150 101 207 12 -11 -24 169 -360 -17 7 -63 -158 -79 -188 -202 -178 -146 218 -253 188 100 0 216
3174 216 252 138 -53 97 71 -178 -201 58 218 120 -118 -10 -131 -22 -283 -270 -68 -23 43 107 -51 -1 93
3197 93 -15 -224 4 -88 -60 -112 54 -178 167 213 250 -12 -150 -23 -30 -56 -73 8 -125 -57 113 154 162 -111 48
3222 48 197 -133 -157 -224 -217 -95 -102 281 213 -95 -257 157 -28 -199 333 134 -92 -32 299 352 173 -72 256
3245 256 47 49 331 -15 -108 -15 407 -347 -340 -301 24 -165 45 70 172 -42 -177 -101 -22 -133 173 -29 85
3268 85 -43 223 93 89 -45 399 20 202 -63 -36 -44 -216 267 136 -119 58 149 -124 -179 86 -179 -119 -83
3291 -83 -113 -39 -389 -84 63 120 92 148 242 -57 -426 52 99 69 -73 307 45 136 -103 262 -22 -190 -6
3314 -6 12 -52 -117 -8 103 -160 -234 67 -135 42 -73 -72 -83 -70 -41 -264 68 -11 -48 -37 225 182 78 67 114 -78
$$ packed form
3150C0L3k13K51J06j95k3j3J93n29L43K4p0r5P9j09j4K4L2L64m71M41q8j00K16
3174B16L6j14j91J50k6k49k3K59J60r8k38J08j21J09k61J3K02M5O6O4j58N0R4
3197I3j08k09K28r2K8n2J66k32L45M6L7k62j38J27pk6j7Q1j33O8J70M1Qk73J59
3222D8J49l30k4o7PJ22pL83o8l08j62M14j85j71N32j99k26O0L31N3j79k45L28
3245B56k09KK82l46r3R3M22p54PL9L25j89K10K5J02k14j35P6P9j11L06k02J14
3268H5j28K66j30mj34M44l79J82k65K7qj72M83j31k55J77R1k73n5K65k65O0L6
3291h3l0P4l50L05J47N7k8N6R4k99l69M78M7l0j42L80k62R1k39L65k84j68J84
3314fJ8o4o5J09J11k63p4L01k02J77j15Jj1J3K9k23L32p9l7J1K62m3j04j1M7j92
$$ plain form
3340 -78 -117 34 268 245 290 -102 -140 268 -145 219 -37 -347 -454 -26 146 9 -162 330 279 -145 -106 -5
3362 -5 421 -25 -93 232 45 -231 360 519 123 99 -8 -11 122 -237 147 12 96 -160 104 -34 -163 -43
3384 -43 -8 -82 3 -75 -76 -45 -170 143 177 -130 9 158 52 157 110 -256 -454 205 189 -126 100 59 99 -162
3408 -162 208 323 -98 6 304 23 -231 -106 13 -210 -194 -40 289 -149 -385 -214 27 -179 -305 -142
3428 -142 384 -228 146 256 65 89 295 218 -77 -36 37 214 132 -16 168 63 66 19 276 -162 13 5 -91 -177
3452 -177 -230 4 41 -316 -29 -63 -27 64 75 -45 -96 -52 -73 97 41 106 -52 -240 109 257 40 -23 194 109
3476 109 7 -103 -241 -52 -168 40 245 -209 -55 -220 -64 -166 -254 -26 19 -104 98 215 389 -16 169
3497 169 86 190 -126 -83 -35 126 -92 36 -43 95 47 66 -96 -101 -97 -180 -4 -156 -319 -170 -107 -56 114 17 190
$$ packed form
3340g8l9J51K34k3M5l92l8M08m13L64k56l10j07M28J72j37j71M92n1m24L9J01
3362eM26m46o8L25j87k76N91J59l96k4j07lJ33l59L84j35Q4k56K64j38j29J20
3384d3L5p4Q5p8jL1j25L13L4l07J39J49j06J05m7l66j98O59j6l15K26m1M0k61
3408a62L70J15m21J04K98k81k54J25J19k23J6J54L29m38k36J71K41k06j26J63
3428a42N26o12L74J10j91K4K06p7k95M1P3J77q2j48J84j05Lm7K57m38J75qr6q6
3452a77n3K34L7l57K87l4L6R1J1j20n1M4k1J70n6O5j58j88L49J48k17o3K17q5
3476A09j02j10j38J89j16K08K05m54J54j65J56j02q8K28M5j23K02J17J74m05J85
3497A69q3J04l16M3M8J61k18J28p9J38m8J9j62nMq3J76j52j63J49O3N1J70r7J73
$$ plain form
3522 190 65 -14 215 46 156 -113 48 69 27 390 189 153 171 46 8 -125 199 -158 -10 119 145 62 40
3545 40 144 -33 -158 51 72 -344 -58 149 -35 -245 119 296 120 92 -98 5 8 -104 -46 -228 213 94
3567 94 -75 75 171 -51 111 153 -202 -139 -151 -153 -335 107 22 69 16 125 336 196 66 -128 101 85 147 -277
3591 -277 168 -59 129 104 248 171 -158 100 -62 12 -112 8 135 122 76 -19 246 -90 -34 5 -62 -282 -383
3614 -383 -200 100 -248 -202 185 429 -51 -8 111 -98 -120 -77 -137 14 122 175 218 295 172 7 -15 34 -163
3637 -163 -169 207 -18 -164 -11 314 -171 -117 -24 38 -225 -114 72 31 94 -111 -64 -94 138 296 226 4 60 104
3661 104 248 -90 -139 -58 260 -192 -182 73 9 27 -148 225 -28 -53 -193 -250 33 136 -125 154 -9 56 19
3684 19 -18 300 169 13 15 121 20 -334 -50 -17 227 157 130 59 -217 37 -131 230 111 -23 34 -195 -299
$$ packed form
3522A90j25p9K29j69J10k69J61K1m2L63k01l6J8j25l8j33L24l57J48J29K6q3k2
3545D0J04j77j25K09K1m16K86K07j84k10L64J77j76k8j90J03Lj12N8j82M41j19
3567I4j69J50R6k22J62M2l55O3j2kj82M42q5M7n3J09K11j40j30j94K29j6O2m24
3591b77M45k27J88k5J44p7l29K58j62P4j24J20J27j3m6r5K65l36N6L9o7k20j01
3614c83J83L00l48M6L87K44m80M3J19k09k2M3o0J51J08N3M3P7j23j65k2M9j97
3637a63oL76k25j46J53L25m85N4R3O2k63J11J86m1O3k05M7l0K32J58p0k22N6M4
3661A04J44l38m9Q1L18m52J0K55o4J8j75L73k53k5j40n7K83J03k61K79j63O5l7
3684A9l7L18j31j56KJ06j01l54K84L3K44p0k7p1k76K54j68L61j19j34N7k29j04
$$ plain form
3707 -299 246 -116 35 -146 31 432 -184 -134 176 171 -51 129 206 108 73 -6 98 74 57 49 39 94 215 54
3731 54 76 -166 6 -98 340 183 -111 -6 92 40 -210 -134 -142 -180 107 78 34 -41 -228 0 122 9 265 61
3755 61 -29 200 241 -56 171 27 -153 58 -60 19 48 49 -83 83 179 -168 178 -226 -153 91 89 -124 -218 74
3779 74 81 118 184 187 -11 -138 282 139 -92 78 158 45 7 123 155 61 117 68 158 -394 -140 -42 -82 -485 -108
3804 -108 103 -222 -112 7 95 62 109 -33 -45 -214 -9 -16 -39 341 91 157 221 458 -157 85 -98 -4 -7 -42
3828 -42 146 89 111 265 -113 26 32 -232 -88 -12 -348 -360 -60 88 53 -170 83 -183 -56 107 -108 -118 -194
3851 -194 -37 8 -70 192 -182 312 53 12 193 -54 -106 -145 31 95 22 78 -44 57 -33 -117 -16 -59 59 -144
3875 -144 -236 116 -98 29 110 -36 277 53 -162 -31 271 75 285 -83 -231 248 274 118 223 309 214 129
$$ packed form
3707b99N45l62J51j81J77M01o16N0L10nk22J80P7r8l5p9J04k4j7qj0N5J21j61
3731E4K2k42J72j04M38j57k94J05R8n2k50P6ql8K87k9m4p5j87K28J22j13K56k04
3755F1r0K29M1k97K27j44j80K11j18P9K9Jj32J66R6l47L46m04P3K44kk13r4K92
3779G4PL7O6Lj98j27M20j43k31J70Q0j13l8J16L2r4N6m9R0n52K54R8m0m03L77
3804a08K11l25J10J19Q8l3M7j42j2j69K05pk3L80k50O6O4K37o15K42j83R4ll5
3828d2J88n7K2J54l78J39Ok64J44P6l36j2L00J48l5k23K53k66J27J63k15j0p6
3851a94J57M5p8K62l74M94k59m1J81k47n2l9J76O4p3N6j22J01r0q4J01m3J18k03
3875a44r2L52k14J27Q1j46L13k24k15J31L02j96K10l68j48M79K6j56J05Q6r5q5
$$ plain form
3897 129 214 -180 -234 -55 -257 -6 172 -19 -83 66 7 33 131 98 -336 72 -11 -96 80 151 -9 187 -28
3920 -28 9 10 71 179 79 -59 4 -185 -183 -185 -81 82 -20 -228 -3 224 -138 95 -270 91 -287 70 -63
3943 -63 75 -92 -17 6 -163 -149 -97 14 51 -142 496 57 91 -26 23 199 -59 -68 74 78 -227 170 -30 -46
3967 -46 127 35 232 -77 -158 23 -50 52 -132 -51 126 -46 104 -24 84 -8 -88 -22 36 -208 21 244 -152
3990 -152 30 -157 -129 56 -300 82 -98 -144 -188 -107 19 -261 -2 -35 137 -10 43 33 152 -91 2 -135 132
4013 132 78 -112 -31 202 20 13 51 77 179 -30 -106 -2 -229 -270 110 163 73 -150 119 34 -325 -167 75 88
4037 88 143 -87 -32 41 36 42 -22 46 72 120 62 -176 -154 242 -264 -159 89 58 83 -171 -118 191 48 -355 -89 112
4063 112 27 12 -9 3 56 50 -177 180 112 187 -92 -144 -30 97 -47 224 -39 236 -92 112 -104 -7 -52 -223
$$ packed form
3897A29Q5l94n4J79k02K51J78j91o4J49n9K6R8l3m34M08q3q5J76P1j60J96k15
3920b8L7JO1J08j00j38O3j89KkJ04J63j02k08K25K27l62K33l65L61l78L57j33
3943f3J38j67P5K3j69J4N2J11L7j93O38m39L4j17M9J76k58rJ42Ml05L97k00j6
3967d6J73r2J97l09q1J81p3J02j84Q1J77j72J50j28J08r2q0O6N8k44K29K23l96
3990a52J82j87K8J85l56L82j80m6m4Q1J26k80K59l3J72j47N3j0J19k43R3j37K67
4013A32n4j90Q1K33j82pL8K6J02k09p6J04k27m1L80N3r0k23K69q5l59J58K42J3
4037H8N5k30N5P3nOo4O8K6M8n8k38K2L96n06J05K48l1K5k54N3L09j43m03K66K01
4063A12q5j5k1J2N3ok27L57o8P5k79n2J14J27j44K71k63K75l28K04k16R7m5j71
$$ plain form
4087 -223 36 19 53 -196 -51 41 -61 -106 -114 16 -100 -58 -51 21 -50 -2 8 -207 44 42 121 -37 52 102 143 -91
4113 -91 393 -47 -231 69 37 -231 71 -32 -177 -163 -49 125 -253 -260 -55 -132 -272 -228 134 197 40 42 20 77
4137 77 -412 -223 -38 80 35 -209 130 253 58 -100 -118 -143 22 174 -90 73 -58 204 32 -58 -13 -137
4159 -137 103 -310 -181 173 -113 -119 -35 -171 -98 123 -152 41 -83 -73 3 115 -109 -59 -6 107 201 21 -185
4182 -185 164 -88 -288 -155 -16 -122 -153 88 -126 -47 -187 58 33 -176 102 -7 -3 -13 -180 21 154 21
4204 21 331 162 18 182 93 -175 -284 315 129 8 39 27 31 -86 35 48 -78 126 -65 -24 184 95 -46
4227 -46 -118 -48 -13 -171 -108 -114 101 29 -10 90 -201 78 75 71 -38 16 140 404 -52 -56 25 80 16 35 62 -17 47 205
4255 205 19 19 132 49 -48 -188 35 -12 122 71 27 -137 23 141 157 -65 -254 -144 135 -317 -365 40 -65
$$ packed form
4087b23K59j7L4k49J45R2j02m5qJ30j16M2PP2p1M8J0k15K51kP9j58Q9N0M1k34
4113i1M84m40j84L00l2k68L02j03j45J4J14J74l78pK05p7j40M4L62O3j57Kk2N7
4137G7m89J89J85J18m5k44L39J23j95j58j8k5J65J52k64J63j31K62j72r0M5j24
4159a37K40m13J29L54k86oQ4j36P3K21k75J93j24J0P6J12k24N0N3J13R4j80k06
4182a85L49k52k00J33J39j06l1K41k14P9j40K45k5k09K78j09Mj0j67K01J33j33
4204B1L10j69j44J64q9k68j09N99j86j21L1j2Mj17J21J3j26K04j91M1K08q9j41
4227d6p2P0L5j58O3oK15p2l9J00k91K79lmj09N4J24K64m56mQ1N5o4J9K7p9O4J58
4255B05j86%J13q3r7j40K23m7J34n1m4j64J60J18J6k22j89J10K79m52m8M05j05
$$ plain form
4278 -65 34 -248 -157 20 -75 255 27 -87 -102 -151 -273 -156 61 272 12 132 322 82 -70 -72 187 -132 -30
4301 -30 -174 22 130 -5 -13 219 -117 216 135 24 -210 -255 15 -103 -50 250 -190 105 88 -27 -413 -55
4323 -55 -124 200 -58 -134 84 -166 -48 132 111 37 198 -99 13 -160 -152 -81 -93 25 -69 35 85 1 67 88 -57
4348 -57 174 -93 -58 -57 -349 -6 -86 255 -6 -153 314 -61 144 -226 -108 257 -92 -126 42 -37 -71 -38 -35 66
4372 66 -176 125 6 23 -100 66 22 -154 74 -51 205 -138 -71 2 -33 -215 9 25 -76 170 230 -64 -104
4395 -104 169 179 158 86 110 121 29 30 107 321 80 -20 -38 -86 -187 94 -136 -130 21 -72 -198 -193 -456 -125 -165 -9
4421 -9 -136 71 -181 -79 -23 98 -156 158 -27 -51 -57 20 215 -50 -1 36 244 -129 137 -24 60 -219 9
4444 9 58 85 -56 26 -126 -222 -9 61 -54 -205 -136 181 -98 -72 -242 -43 8 14 11 -95 43 -105 -32 92 99 35
$$ packed form
4278f5R9k82R1J77r5L30k28j14j5m9j22J17K17K11k60J20J90k40j52kK59l19J02
4301c0j44J96J08j35qK32l36L33q1j11k34m5K70j18N3L00m40K95j7j15l86L58
4323e5o9L24k58p6K18k50J18J80k1p4J61k97J12j73QP1j2J18r4J04N0q4O6K1j45
4348e7K31k67L5Jk92L43q0L41k61j47M67l75K05l70J18L65l49l4J68p9l4L3LJ01
4372F6k42L01j19J7j23J66m4j76K28j25K56l43O7P3l5j82K24J6j01K46O0k94m0
4395a04K73J0k1p2K4J1r2JP7K14k41j00j8m8j01K81k30OJ51r3j26Nk63L31m0J56
4421ij27K07k52J02N6J21k54L14j85k4oP7J95k65M9L7K08l73K66j61Q4k79K28
4444IM9K7j41Q2j52r6K13P0j15j51O9L17k79K6j70J99N1Olj06J38j48P3J24Po4
$$ plain form
4470 35 183 21 135 176 -22 -21 -134 60 169 -75 34 -2 54 81 193 -206 346 -101 83 -56 88 238
4492 238 222 168 -62 -10 -126 26 200 50 -165 108 162 138 -64 -54 -124 -100 -63 23 95 97 -120 -197 -66 83 76
4517 76 60 187 103 141 69 -229 -110 -113 -64 87 -50 115 -185 69 -23 162 28 65 71 247 42 -126 -12 22
4541 22 109 183 81 -41 -42 -158 229 -29 -217 -131 46 74 -18 -30 23 -8 205 48 -21 49 -62 241 -15 62 270
4566 270 156 -245 -74 -218 -67 33 -206 148 -21 -169 -152 -7 110 51 -168 144 -115 47 -3 126 -92
4587 -92 -194 -142 -79 -28 -341 152 290 39 92 178 275 -21 174 -84 111 -29 90 -65 239 109 -73 229
4609 229 163 -256 -181 -204 -18 16 111 -93 -74 70 143 68 231 -4 -141 -76 41 110 27 -153 -115 -37 -25 221 -58
4634 -58 4 92 142 46 -23 -198 -102 159 -2 15 -18 47 108 -134 87 -272 -36 -288 -57 101 -116 -82 376 207
$$ packed form
4470C5J48j62J14M1j98Jj13J94J09k44J09l6N6K7J12l99N52m47J84j39J44J50
4492B38j6n4k30N2j16J52J74j50k15K73N4k4k02J0p0K4L7Q6P2Kk17p7J31J49p
4517G6j6J27q4L8p2k98J19lM9J51j37J65l00K54r2J85j34L7OJ76k05j68J14L4
4541B2Q7P4j02j22jj16L87k58j88Q6J77K8r2j2N3l1K13j57o9P0j11L03k56P7K08
4566B70j14m01J71j44J51J00k39L54j69j48J7J45J17n9k19L12k59J62n0J29k18
4587i2j02N2O3N1l13M93J38k51N3Q6R7k96J95k58J95j40J19j55L04j30j82L02
4609B29o6m19P5k3J86L4R5k04J9J44P3p5J63k35j37O5J17O9q3j80L8P8J2K46k79
4634e8O2Q8N0r6o9j75R6K61j61J7l3O5O1k42K21l59K36k52K31J58k17L4M58j69
$$ plain form
4658 207 69 83 -21 -69 -16 -24 -3 -212 59 221 -11 -60 -106 -93 140 -154 118 -119 -17 -49 76 -27 122
4681 122 66 -52 17 16 -113 9 50 79 21 -33 -83 -184 122 156 240 -14 -23 73 -147 -85 -17 -5 268 -184 175 112
4707 112 -66 182 130 275 155 -98 -18 -189 -60 118 -13 49 -48 -96 54 166 22 162 -65 166 -214 25
4729 25 -235 9 296 155 -138 -33 -166 150 -73 -94 -119 -91 -55 63 17 197 -62 153 -13 -99 274 265 104
4752 104 -117 133 -91 23 19 63 4 -246 100 20 265 -32 -88 71 -154 -107 28 -34 -162 -18 -177 -96 -107
4775 -107 305 -10 -79 -102 -31 -110 -101 49 -104 -10 2 -18 -111 -29 -20 -23 -35 -197 469 -15 192 16 -195 -241 285 -9
4801 -9 -140 131 56 -30 164 -16 69 -10 33 74 196 -33 24 47 107 -180 -316 -167 -64 -36 74 -88 103 -117
4825 -117 110 18 -195 148 129 -13 30 -98 -3 211 147 188 -85 -116 54 56 -130 51 58 112 -80 54 75 59 -237
$$ packed form
4658B07j38J4j04m8N3qK1k09K71J62k32m9m6J3K33k94K72k37J02l2J25j03J49
4681A22n6j18O9jj29J22M1K9n8n4n0j01L06L4Q4k54rR6k20O2O8J2K73m52L59o3
4707A12j78K48n2J45j20k53Q0j71J29J78j31O2r7m8J50J12j44J40k27K31l80K39
4729B5k60K44K87j41k93J05j33L16k23k1k5K8L6J18m6J80k59K15j66q6L73rj61
4752A04k21K50k24J14mM4n9k50L46q0K45k97n6J59k25M7J35o2j28J44j59Q1j1
4775a07M12l15o9k3P1p9RJ50j53R4J2k0r3Q2Rlj2j62O66m84K07j76k11m6N26k94
4801ij31K71p5q6J94j80Q5p9M3M1J22k29N7K3O0k87j36J49J03K8J10j62J91k20
4825a17K27r2k13L43j9j42M3j28R5K14o4M1k73l1J70Kj86J81PN4j92J34K1j6k96
$$ plain form
4850 -237 -188 -300 359 -113 242 -150 -1 -24 -87 -117 -161 208 111 -51 -90 -60 59 132 23 -45 62 20 -220 -364
4874 -364 78 229 -57 62 -261 165 42 77 -46 -67 -202 -141 -58 34 -269 90 41 -27 -166 58 -11 -82 124
4897 124 110 19 -76 -103 123 -20 -213 119 -232 99 202 -92 -188 10 77 -49 128 204 76 143 84 32 16 -116
4921 -116 312 6 -28 171 -190 -149 150 24 146 145 170 39 77 -57 85 235 -178 -59 -86 29 -142 -52 254
4944 254 219 -179 196 21 78 -95 44 -124 47 189 314 127 251 160 -137 -121 -275 169 -42 -173 -124 163
4966 163 -53 -60 -220 77 -43 -193 -41 -157 -30 127 -54 -94 -279 215 24 2 126 77 -89 233 -81 -138
4988 -138 -119 -129 -88 106 -241 24 -113 -109 -76 10 249 11 -34 -69 47 -44 208 -4 198 144 -145 -38 -59 -50 52
5013 52 -111 -32 49 -139 185 -138 -84 33 42 96 -48 -156 112 -170 -53 125 42 -15 -94 -211 -20 -199 286
$$ packed form
4850b37M9j12O59m72L55l92J49k3o3l0m4L69r7j62l9L0J19P3j09o8J07m2k40j44
4874c64M42J51k86J19l23M26j23L5j23k1j35O1Q3R2l03L59m9o8j39K24o9p1K06
4897A24j4r1r5k7K26j43j93L32l51L31J03k94r6J98O7j26J77P6j28O7n9n2j6j32
4921a16M28l06l4J99l61M1K99j26J22jK5j31L8j34J42J50m13J19k7J15j71R0L06
4944B54l5l98L75j75N7j73J39j68J71J42J25j87J24r1k97J6j54M44k11j31M9K87
4966A63k16pj60K97j20j50J52j16J27J57j81m0j85M94j91k2J24m9j66L22l14n7
4988a38J9j0M1J94l47K65j37ML3Q6K39k38m5l5J16r1K52k12K02n4k89J07k1RJ02
5013E2j63P9Q1j88L24l23N4J17RN4j44j08K68k82J17J78q3n7p9j17J91j79M85
$$ plain form
5036 286 198 93 -84 -74 169 -158 79 154 33 -12 222 140 4 -119 91 -92 12 -71 122 76 223 195 -51
5059 -51 36 -86 -56 -40 161 102 -44 -90 23 -219 83 -191 -91 263 55 287 -19 291 -8 6 187 167 189
5082 189 -159 -148 50 -26 -75 -54 -121 184 -2 -182 -171 196 -32 -78 -24 80 5 -101 109 -26 -137 167 129
5105 129 80 -9 96 133 -63 -161 351 -12 65 -79 17 42 65 56 -71 161 -93 -162 -28 39 -204 -2 311 -61
5129 -61 -151 284 54 -56 127 14 68 -31 265 55 94 -130 -140 164 4 260 -125 -175 -59 -10 -90 11 -71
5152 -71 35 234 -48 383 -91 -392 -18 81 -70 -143 -25 -126 -18 149 -31 316 -7 -204 46 288 92
5173 92 172 -128 -209 -256 60 -14 -61 -146 -127 -207 -129 -219 -164 -114 -144 -261 -82 -151 -14 82 96 -141 34 -40 -179 -96
5199 -96 -173 -3 0 -118 182 158 270 -115 -164 195 -32 -66 -129 75 -283 -26 -138 56 206 56 -51 -58 58
$$ packed form
5036B86q8j05j77J0K43l27K37P5j21m5K34q2j36j23K10j83J04q3J93m6J47k8k46
5059e1Q7j22L0J6K01n9j46m6J13k42L02k74J00L54k08K32l06L10k99J4J81k0K2
5082A89l48J1J98p6m9K1o7L05j86j80J1L67k28m6N4J04p5j06K10j35j11L04l8
5105A29m9q9J05L7j96r8N12l63P7j44R6K5K3rj27K32k54o9J34O7k43K02L13l72
5129f1r0M35k30j10J83j13N4r9K96k10L9k24j0L04j60K56l85n0J16M9q0J01q2
5152g1J06J99k82M31m74l01L74R9j51p3J18j01J08J67j80L47l23j97K50K42j96
5173I2Q0l00q1m7L16p4m7q5J9q0P8r0N5N0l0j17J79o9J37R6J4k37J75p4j39Q3
5199i6p7J70Lj18L00k4J12l85m9L59k27l4o3K04l58K57j12J94J50j50j07pJ16
$$ plain form
5222 58 -98 1 -21 22 -86 152 -260 71 -70 -126 62 329 152 -136 -181 114 -81 -148 2 149 -75 -73 -6
5245 -6 -84 11 -179 7 -54 -383 -13 -167 -25 123 -169 -40 134 -292 -177 98 -261 87 -151 13 -153 177
5267 177 -38 174 106 100 -55 17 -1 -139 150 143 -77 145 -129 -69 -116 127 2 -135 37 39 121 133 49 -192 7
5292 7 -43 -30 173 -102 -235 54 60 155 5 68 155 -34 -126 32 -8 73 214 161 -5 -2 31 2 -163 -102 64 164
5318 164 100 -12 -105 -51 180 -74 81 -177 82 -108 128 -47 193 134 145 -233 -11 75 109 -22 210 -43
5340 -43 -28 175 -135 -206 42 151 40 35 200 -93 -125 -50 74 204 186 50 95 -27 151 -321 146 127 98 156
5364 156 127 101 -45 -5 62 90 366 -166 -237 186 93 95 13 76 -12 265 -187 74 190 -8 -124 130 -1 -92
5388 -92 -15 -130 -136 167 -81 -55 -36 -102 99 -220 149 149 -3 -49 -29 -251 -42 -41 -18 37 46 -127 -59 -46 248 22
$$ packed form
5222E8j56R9k2M3j08K38m12L31j41n6J88K67j77k88m5K95j95o7J50J47k24KO7
5245fp8R5j90J86o1l29L70j54J42J48k92J29J74m26J15K75l59L48k38J64j66L30
5267A77k15K12o8oj55P2j8j38K89pk20K22k74O0m7K43j25j37J72KQ2J2q4k41J99
5292Gn0J3K03k75j33K89OR5j50O3Q7j89r2J58m0Q1J41n3j66LL3k9j65O1J66J00
5318A64o4j12r3N4K31k54J55k58K59j90K36j75K40n9J1l78K22Q6L4j31K32k53
5340d3J5K03l10p1K48J09j11nJ65k93l2P5J24J30j8j36M5j22J78m72M67j9k9N8
5364A56k9k6j46M0O7K8K76n32p1M23r3Kq2O3q8K77m52K61J16j98j16K54j31r1
5388i2P7j15oL03k48K6J9o6K01l19L69%j52m6K0k22K09JK3N5Rj73O8J3K94k26
$$ plain form
5414 22 61 104 9 -119 -207 103 -98 -68 147 128 37 56 -79 57 223 98 54 -51 145 215 -269 -172 30 -72
5438 -72 75 73 -140 10 -48 185 145 73 -14 171 43 201 -131 47 232 246 -21 -43 -51 -39 24 252 29 260
5462 260 -155 -44 -109 95 -20 10 12 -42 -256 -197 104 -258 158 -71 -48 66 -29 -22 124 51 -6 60 265 76
5486 76 -85 212 0 -115 227 146 16 -50 228 -84 -70 129 177 -84 -238 184 -1 220 -82 -28 -29 -69 -23
5509 -23 -1 -48 118 -115 -110 -6 8 50 134 -139 27 137 71 -18 -34 -34 185 143 -13 1 49 146 413 17 -203 19
5535 19 -175 252 -177 101 27 7 -356 -312 8 26 -126 -69 202 -33 -141 -63 290 -26 11 102 30 -49 216 88
5559 88 -22 -120 -48 72 -72 76 -110 277 -10 93 -208 -109 -161 79 156 84 105 70 35 -56 130 -4 -158 -35
5583 -35 159 -4 20 8 101 -64 146 125 101 0 62 241 -98 -123 -4 -340 -25 -48 -45 -39 -126 210 50 121 -51
$$ packed form
5414B2L9M3r5j28q8L10k01L0K15j9r1J9j35J36J66j25m4j05J96P0m84R7K02j02
5438g2J47kk13J50n8K33m0p2q7J85j28J58l32J78J85J4k67k2qJ2O3K28k23K31
5462B60m15J11o5K04j15L0Kn4k14N9L01l62M16k29K3J14r5PJ46p3n7O6K05j89
5486G6j61K97k12j15L42q1j30o6K78l12J4J99M8k61j54M22j85K21l02N4jm0M6
5509b3K2m7J66k33NJ04J4M2Q4k73J66J10o6q9j6%K19m2j56J4M8R7K67l96k20K22
5535A9j94M27m29K78p4k0l63M4L20J8j52N7K71k35j08P8L53l16L7R1p2p9K65j28
5559H8j10r8P2J20j44J48j86L87k87J03l01R9n2K40P7p2K1l5l5r1J86j34j54J23
5583c5J94j63K4j2R3j65K10k1k4j01O2J79l39k5J19l36L15k3LOq7L36j60P1j72
$$ plain form
5608 -51 -126 45 -227 -32 85 -67 -152 121 1 -45 -281 55 15 317 -39 110 -179 92 61 84 13 -77 -73 -265
$$ packed form
5608e1p5J71k72J95J17j52q5K73j20m6k36L36m0L02l56J49k89K71l1K3p1r0Mj92
$$ [...]
8191c5
##END NTUPLES=NMR FID
##END=
