##TITLE=1H_NCS-112
 CDCl3
 8 sc, 
 3.06.2022
##JCAMPDX= 6.0         $$ Bruker NMR JCAMP-DX V2.0
##DATA TYPE= NMR FID
##DATA CLASS= NTUPLES
##ORIGIN= UXNMR, Bruker Analytische Messtechnik GmbH
##OWNER= root
$$ XWIN-NMR		Version 3.5
$$ Fri Jun  3 14:19:59 2022 Russian Standard Time (UT+4h)  she@DPX200
##.OBSERVE FREQUENCY= 200.13135
##.OBSERVE NUCLEUS= ^1H
##.DELAY= (6, 6)
##.ACQUISITION MODE= SIMULTANEOUS
##.ACQUISITION SCHEME= undefined
##.AVERAGES= 8
##.DIGITISER RES= 18
##SPECTROMETER/DATA SYSTEM= spect
##.PULSE SEQUENCE= zg30
##.SOLVENT NAME= CDCl3
##.SHIFT REFERENCE= (INTERNAL, CDCl3, 0, 15.7039)
##AUDIT TRAIL= $$ (NUMBER, WHEN, WHO, WHERE, WHAT)
$$ ##TITLE= Audit trail, XWIN-NMR		Version 3.5
$$ ##JCAMPDX= 5.01
$$ ##ORIGIN= Bruker BioSpin GmbH
$$ ##OWNER= she
$$ F:/spectra/data/she/nmr/H-F/1/audita.txt
$$ ##AUDIT TRAIL=  $$ (NUMBER, WHEN, WHO, WHERE, WHAT)
(   1,<2022-06-03 14:16:49.39 +0400>,<she>,<DPX200>,
      <created by zg, POWCHK disabled, PULCHK disabled
       configuration hash MD5:
       00 E9 B6 7A A2 85 ED C7 34 08 36 98 17 FE 4E 26
       data hash MD5: 16K
       72 09 06 DA 72 EA 4C 2F F6 59 C4 F2 7D 11 24 ED>)
$$ ##END=
$$ 
$$ hash MD5
$$ 5A 6A 71 3E 33 87 90 39 6E B3 86 17 DF 18 AE BC
##$RELAX= 
##$RELAX= 
##$RELAX= 
##$RELAX= 
##$RELAX= 
##$RELAX= 
$$ Bruker specific parameters
$$ --------------------------
##$DU= <F:/spectra>
##$EXPNO= 1
##$NAME= <H-F>
##$PROCNO= 1
##$TYPE= <nmr>
##$USER= <she>
##$AMP= (0..31)
100 100 100 100 100 100 100 100 100 100 100 100 100 100 100 100 100 100 
100 100 100 100 100 100 100 100 100 100 100 100 100 100 
##$AQSEQ= 0
##$AQ_mod= 1
##$AUNM= <au_zg>
##$AUTOPOS= <>
##$BF1= 200.13
##$BF2= 200.13
##$BF3= 200.13
##$BF4= 200.13
##$BF5= 200.13
##$BF6= 200.13
##$BF7= 200.13
##$BF8= 200.13
##$BYTORDA= 1
##$CFDGTYP= 0
##$CFRGTYP= 5
##$CHEMSTR= <none>
##$CNST= (0..31)
1 1 145 1 1 1 1 1 1 1 1 1 1 1 1 1 1 1 1 1 1 1 1 1 1 1 1 1 1 1 1 1 
##$CPDPRG= <>
##$CPDPRG1= <>
##$CPDPRG2= <>
##$CPDPRG3= <>
##$CPDPRG4= <mlev>
##$CPDPRG5= <mlev>
##$CPDPRG6= <mlev>
##$CPDPRG7= <mlev>
##$CPDPRG8= <mlev>
##$CPDPRGB= <>
##$CPDPRGT= <>
##$D= (0..31)
0 1.2 0 0 0 0 0 0 0 0.06 0 0.03 0 0 0 0 0.0002 0 0 0 0 0 0 0 0 0 0 0 0 
0 0 0 
##$DATE= 1654251409
##$DBL= (0..7)
120 120 120 120 120 120 120 120 
##$DBP= (0..7)
150 150 150 150 150 150 150 150 
##$DBP07= 0
##$DBPNAM0= <>
##$DBPNAM1= <>
##$DBPNAM2= <>
##$DBPNAM3= <>
##$DBPNAM4= <>
##$DBPNAM5= <>
##$DBPNAM6= <>
##$DBPNAM7= <>
##$DBPOAL= (0..7)
0.5 0.5 0.5 0.5 0.5 0.5 0.5 0.5 
##$DBPOFFS= (0..7)
0 0 0 0 0 0 0 0 
##$DE= 6
##$DECBNUC= <off>
##$DECIM= 32
##$DECNUC= <off>
##$DECSTAT= 4
##$DIGMOD= 1
##$DIGTYP= 9
##$DL= (0..7)
0 120 120 120 120 120 120 120 
##$DP= (0..7)
150 150 150 150 150 150 150 150 
##$DP07= 0
##$DPNAME0= <>
##$DPNAME1= <>
##$DPNAME2= <>
##$DPNAME3= <>
##$DPNAME4= <>
##$DPNAME5= <>
##$DPNAME6= <>
##$DPNAME7= <>
##$DPOAL= (0..7)
0.5 0.5 0.5 0.5 0.5 0.5 0.5 0.5 
##$DPOFFS= (0..7)
0 0 0 0 0 0 0 0 
##$DQDMODE= 0
##$DR= 18
##$DS= 0
##$DSLIST= <SSSSSSSSSSSSSSS>
$$ [...]
##$SUBNAM2= <"">
##$SUBNAM3= <"">
##$SUBNAM4= <"">
##$SUBNAM5= <"">
##$SUBNAM6= <"">
##$SUBNAM7= <"">
##$SUBNAM8= <"">
##$SUBNAM9= <"">
##$SW= 18.05172834244
##$SWIBOX= (0..15)
0 0 2 0 0 0 0 0 0 0 0 0 0 0 0 0 
##$SW_h= 3612.71676300578
##$TD= 16384
##$TD0= 1
##$TE= 0
##$TE2= 300
##$TE3= 300
##$TEG= 300
##$TL= (0..7)
0 120 120 120 120 120 120 120 
##$TP= (0..7)
150 150 150 150 150 150 150 150 
##$TP07= 0
##$TPNAME0= <>
##$TPNAME1= <>
##$TPNAME2= <>
##$TPNAME3= <>
##$TPNAME4= <>
##$TPNAME5= <>
##$TPNAME6= <>
##$TPNAME7= <>
##$TPOAL= (0..7)
0.5 0.5 0.5 0.5 0.5 0.5 0.5 0.5 
##$TPOFFS= (0..7)
0 0 0 0 0 0 0 0 
##$TUNHIN= 0
##$TUNHOUT= 0
##$TUNXOUT= 0
##$USERA1= <user>
##$USERA2= <user>
##$USERA3= <user>
##$USERA4= <user>
##$USERA5= <user>
##$V9= 5
##$VALIST= <valist>
##$VCLIST= <CCCCCCCCCCCCCCC>
##$VD= 0
##$VDLIST= <DDDDDDDDDDDDDDD>
##$VPLIST= <PPPPPPPPPPPPPPP>
##$VTLIST= <TTTTTTTTTTTTTTT>
##$WBST= 1024
##$WBSW= 4
##$XGAIN= (0..3)
0 0 0 0 
##$XL= 0
##$YL= 0
##$YMAX_a= 848947
##$YMIN_a= -984420
##$ZGOPTNS= <>
##$ZL1= 120
##$ZL2= 120
##$ZL3= 120
##$ZL4= 120
##$ABSF1= 10
##$ABSF2= 0
##$ABSG= 5
##$ABSL= 3
##$ALPHA= 0
##$AQORDER= 0
##$ASSFAC= 0
##$ASSFACI= 0
##$ASSFACX= 0
##$ASSWID= 0
##$AUNMP= <proc_1d>
##$AZFE= 0.1
##$AZFW= 0.1
##$BCFW= 1
##$BC_mod= 2
##$BYTORDP= 1
##$COROFFS= 0
##$CY= 11.3945322036743
##$DATMOD= 1
##$DC= 2
##$DFILT= <>
##$DTYPP= 0
##$F1P= 2.36226072786647
##$F2P= -0.459571619588291
##$FCOR= 0.5
##$FTSIZE= 0
##$FT_mod= 4
##$GAMMA= 1
##$GB= 0.15
##$INTBC= 1
##$INTSCL= 1
##$ISEN= 128
##$LB= 0.24
##$LEV0= 0
##$LPBIN= 0
##$MAXI= 10000
##$MC2= 0
##$MEAN= 0
##$ME_mod= 0
##$MI= 1.114404
##$NCOEF= 0
##$NC_proc= 0
##$NLEV= 6
##$NOISF1= 3.799351
##$NOISF2= 2.8
##$NSP= 1
##$NTH_PI= 0
##$NZP= 0
##$OFFSET= 15.70392
##$PC= 1
##$PHC0= -18050.92
##$PHC1= 10.80074
##$PH_mod= 1
##$PKNL= yes
##$PPARMOD= 0
##$PSCAL= 0
##$PSIGN= 0
##$REVERSE= no
##$SF= 200.130013532006
##$SI= 16384
##$SIGF1= 3
##$SIGF2= 2
##$SINO= 400
##$SIOLD= 16384
##$SREGLST= <1H.CDCl3>
##$SSB= 0
##$STSI= 0
##$STSR= 0
##$SW_p= 3612.71676300578
##$SYMM= 0
##$S_DEV= 0
##$TDeff= 0
##$TDoff= 0
##$TI= <>
##$TILT= no
##$TM1= 0
##$TM2= 0
##$TOPLEV= 0
##$USERP1= <user>
##$USERP2= <user>
##$USERP3= <user>
##$USERP4= <user>
##$USERP5= <user>
##$WDW= 1
##$XDIM= 8192
##$YMAX_p= 0
##$YMIN_p= 0
$$ End of Bruker specific parameters
$$ ---------------------------------
##NTUPLES= NMR FID
##VAR_NAME=  TIME,          FID/REAL,        FID/IMAG
##SYMBOL=    X,             R,               I
##VAR_TYPE=  INDEPENDENT,   DEPENDENT,       DEPENDENT
##VAR_FORM=  AFFN,          ASDF,            ASDF
##VAR_DIM=   8192,          8192,            8192
##UNITS=     SECONDS,       ARBITRARY UNITS, ARBITRARY UNITS
##FACTOR=    0.0002768,     1,               1
##FIRST=     0,             0,               0
##LAST=      2.2672688,     0,               0
##MIN=       0,             -984420,         0
##MAX=       2.2672688,     848947,          0
$$ Real data points
##PAGE= N=1
##DATA TABLE= (X++(R..R)), XYDATA
0@%%%%%%%Qj6J6j6K4l2M0n6P2q8J04j28J52j84K27k67L12l68M37n09N88o82P85
30D19q97J027j171J325j500J694j905K137k394K676k982L317l684M086m524N001
46B625n522O091o714P399q150Q978r895J0911j2041J3309j4747J6386j8271K0474
60A0833k3085K6234l0124L5073m1613N0700o4270Q6943j33885L96489q33943m40470
72i61118J525247J96960r49504l50396N88571J78772q2441n9260l09128j58366
82c80663N96613L26751o33990n71407O40295O32420n19448o23904L56610N02969
92C26246j72744l16610K2039M8921J25093J73587j95294l66927K52422M57012
102C53745k87084m18802K79724K83598k33615j06870K04154j22912j49542L41791
$$ y = [0, 0, 0, 0, 0, 0, 0, 0, 8, -8, 8, -8, 16, -16, 24, -32, 40, -48, 56, -72, 80, -104, 123, -144, 168, -200, 237, -272, 316, -366, 419, -478, 549, -622, 703, -797, 897, -1008, 1129, -1265, 1411, -1571, 1746, -1938, 2148, -2376, 2625, -2897, 3194, -3520, 3879, -4271, 4707, -5188, 5723, -6318, 6991, -7756, 8630, -9641, 10833, -12252, 13982, -16142, 18931, -22682, 28018, -36252, 50691, -83194, 313295, -520648, -961118, 564129, 761089, -188415, -538811, 49760, 228532, 146091, 86831, -222297, -380663, 215950, 542701, -91289, -662696, -22401, 610019, 90571, -533333, -176723, 326246, 153502, -163108, -141069, -92148, 32945, 206532, 11238, -355689, -103267, 353745, 66661, -352141, -72417, 211181, -22434, -129304, 74850, -48062, -197604, 144187]
112A44187Q3818m86690m9440N64870M5098n88656j5234N46739l0966m46357R9051
123a33580L17106j90792j56898L09057J731m17268J35603M99231k30364n15912
133c82086K80643M78640k68801l94472K24846K65066j56505r3579P5800p1911
143d2359o419K04996l2491l03700M8453L54382n0931l47349L8527K90547k8713
154A24943k05367L3810R7460n1757J5122O6432j18934p0365J92219N0888k27494
165i3043p045K26361o0282k02363J36332J59219k09080j16865K59289Q2310k87541
176a12708o2387K75765L7593k27028j3163J45130k2000n4653O5764m2564j18278
187a28529J30458J67373j91524k03344K15323K21045k06160k07183J72021J62965
$$ y = [144187, 228005, -258685, -308125, 256745, 301843, -286813, -302047, 244692, 213726, -232631, -133580, 183526, -7266, -164164, 144893, 146624, -270644, -135041, 364190, 133826, -382086, -101443, 377197, 108396, -286076, -61230, 203836, 47331, -46248, 29552, -42359, -48778, 156218, 123727, -179973, -131520, 222862, 171931, -175418, -136891, 153656, 124943, -80424, -46614, 50846, -911, 14211, 80643, -38291, -108656, 83563, 134451, -93043, -100088, 126273, 65991, -136372, -40, 159179, -49901, -166766, 92523, 174833, -112708, -175095, 100670, 138263, -88765, -101928, 43202, 21202, -33451, 32313, -10251, -128529, 1929, 169302, -22222, -225566, -10243, 210802, 4642, -202541, -30520, 132445]
197A32445j11723r4064L9698J7384K8050O0660p4505j29994J02255J80640j09801
208D1045k01964R7163J97830o8791j72339M3477J24623k3492n2137M279k5081
219c5387J6848R4083k6537j45602L1387J81116l5223j85649M3749J60115m1833
230E7067j14945L7822O6712l8697j5782M4850l4293m5472O9173L9889q4497l8556
242e6729Q6391L3232q5527j5041P2721j6677m9911M4908K5716p0216q883R3365
254E3349r418j07688K9372R8462l9951p2433L5663M3259k9284j4163K5850k0978
266g960j9809N2555P666p0388l525P6225N959q3722n226Q3652n481p0447J3392
279b7109M6505j7144k4510K2960J406l1633K9191L1825n5693j9336O8232J0190
$$ y = [132445, 20722, -73342, -33644, -16260, 11790, 72450, -2055, -132049, -29794, 150846, 41045, -160919, -63756, 134074, 65283, -107056, -63579, 61044, 37552, -14585, -10306, -35387, -18539, 75544, 49007, -96595, -65208, 115908, 80685, -104964, -61215, 98900, 57067, -57878, -20056, 46656, 7959, -7823, 37027, 2734, -42738, 26435, 66324, -18173, -56729, 29662, 62894, -22633, -37674, 35047, 18370, -31541, 13367, 39083, -31133, -40016, 53349, 43931, -63757, -34385, 64077, 24126, -48307, -12644, 30615, 1331, -12832, 13018, -7960, -27769, 24786, 32452, -37936, -41461, 34764, 40723, -42999, -48225, 35427, 29946, -40501, -27109, 19396, 2252, -22258, 702, 2108, -29525, -334, 31491, -24202, -43538, 24694, 34884]
291C4884o7776m544O6516k287n6045J1941L7314j4225j4401J0709J67j1549J1621
304B325J8013k7744k1355M4019J7623n0120j5486N1407J4557n2580n604M6854
316B1909p318k8498J6239P359j5826Q729J6830k0435j7445L3282J3325l9118o083
329a7050L6003L240k9681m776K6690J171k3888M484J5403j0311p377J1777M81
342F166j6807O540J9651j8613j5968K6106P254k6964L97K3160n530j8450J1530
355a528J0832j5197j267J4529l973j2229M600J1674m173j2624M383J0170m225
368I72p213L503K523o319M671Q689j4877r153K2515P915k4953p193K3156O855
382A1091j6154m753O183M192O182l478j3141L120J6401K063j6335o592J4391J0078
$$ y = [34884, -32892, -37436, 29080, 26793, -29252, -17311, 20003, 5778, -8623, 2086, 2253, -9296, 2325, 20338, -7406, -28761, 15258, 32881, -17239, -32725, 18682, 33239, -19341, -24945, 21909, 14591, -13907, 2332, 9691, -6135, 2594, 19424, -1011, -18456, 14826, 28151, -10967, -17050, 18953, 22193, -7488, -12264, 14426, 15597, -8291, -3807, 11596, 1285, -6092, 5685, 6166, -10641, -4101, 15550, -3063, -19031, 7075, 14329, -12635, -12238, 10922, 5392, -13058, -1528, 9304, -5893, -7160, 7369, 3396, -8833, -4233, 7441, 3268, -9356, -4973, 5197, 972, -6241, -2738, -215, -6534, -1863, 6826, -8051, -17204, 5311, 13226, -11727, -18920, 4236, 11091, -5063, -9816, -3633, 559, 6741, 3263, -9878, -6758, 9643, 11706, -4629, -11221, 3170, 13248]
396A3248p642j3800Q86J5811L019j2798o514L723J1550M964j6138j1876J6674
409A107J7866j6758k0786J6610J8267j3202j0340N501M104K053K01l608n936M463
423d58J2888m501j7322J046J9337P288k4111j3825K6981J3077k3634j2725J5566
436c93J2042j0478q439M603p8K031N371n236o624r33R264J1777j4498j9586J7041
451d136K5499j3608l1373J1513L3191j0404k5192O111J4790m42r260J312O321
464D322j0117k657J8733k20k5874k408L4378M959m3690j821M3625k787l4978M830
478a3705K8729p157k5840J4830K1670j9812j5760K0664J8013k1357k3831K6014
490B458K4457k8366j8135K7104J0494k6512n032L0190m584l2728J2864L1711j4044
$$ y = [13248, 5606, -8194, -7308, 8503, 11522, -1276, -7790, -4067, 7483, 12447, -3691, -15567, 1107, 18973, 2215, -18571, -1961, 16306, 3104, -7236, -1735, 2369, 4422, 4623, 1015, -4921, -458, 12430, 7929, -9393, -8347, 10990, 18278, -5833, -19658, 7323, 20400, -3234, -15959, -393, 11649, 1171, -7268, -2665, -2743, -712, 4659, -577, -7201, -8134, 1130, 12907, -1591, -21177, -4136, 21363, 7755, -23618, -12105, 21086, 10682, -14510, -8399, 6391, 5949, -3311, -1999, 4322, -5795, -8452, 10281, 10061, -15813, -18221, 16157, 21116, -22574, -24395, 19230, 16443, -18535, -13705, 15024, 7867, -17973, -3143, 18527, -1285, -17045, 3619, 21632, 275, -23556, 2458, 26915, -1451, -19586, 7518, 18012, -8500, -13532, 16658, 12074, -20654, -7790, 23921, 9877]
503I877l3461O365M0444Pm5336l616M3482P878l9353r630L5570L742k6826P936
517b921J5033j8005n980K6471M715l6656n743M6137O618n0784j1399N1261J7079
530C5826n3411j8943N4480J3465n1657p408M4067Q91l6407Q181K8548j9377j9144
543b0889K6914J2383l0038r209L3391J0717l8010j1268M0589J3682l9829j6504
555b8071L8088J8252l6099j5924L1093J2046k4776r145J9311M172j7623L125J7672
568A2121r457k0334J1917K4325j1523k8738J2551L0107j2681k8605J2725K6724
580A9132j3594k0496J8267J1931k4828m044L1666P65l8450J580M2774l681m4822
593b3800K603M3021N52l7415l632K7039J499j5341K195O752p038k554J4064r8
$$ y = [9877, -23584, -17219, 23225, 23232, -22104, -25720, 17762, 25640, -13713, -23343, 12227, 15969, -10857, -2921, 12112, -5893, -11873, 14598, 19313, -17343, -23086, 23051, 29669, -21115, -32514, 18747, 35826, -17585, -36528, 17952, 31417, -20240, -27648, 16419, 17310, -19097, -10916, 17632, -1745, -20889, 6025, 18408, -11630, -20839, 12552, 23269, -14741, -26009, 14580, 28262, -11567, -28071, 10017, 28269, -7830, -23754, 7339, 19385, -5391, -14536, 4775, 8947, -8676, -5551, 12121, 2664, -17670, -5753, 18572, 7049, -21689, -9138, 20969, 8288, -20317, -7592, 19132, 5538, -14958, 3309, 15240, -9588, -13632, 18034, 18799, -19651, -18071, 24703, 21022, -23800, -21197, 21824, 22376, -15039, -18671, 8368, 9867, -5474, -3279, 3473, -3565, -6119, 7945, 7847]
607G847k2002J720K8094P3k8073n010K5376Q563j9398q133J1066P419l160p057
621b675k75L400p72L051K272q268o977R785J4384j1158k1335J1991K1762q803
635F382k0176L308J8388N70j4699j649P761L048N64j765m362m746P612J4764j2433
650B567k0726J5457K3635j3721k5976Q948K6240m768k0660j783J1636R276n140
663D985j5215R60J3749O573j0103j4705O093J7565J301j6161j0585J5940J6488
676A6885j4056j5895P871J4492P70j2844o614R577R317l132j2403j380J3947L0
690F565q870n86J121L232K396m480m309J419P073O7p611L18L809J046K46l894
706b458M33M677k012j699J315j57K85N78J454j806l370M706P31m281J465P85j420
$$ y = [7847, -14155, -12435, 15659, 15732, -12341, -17351, 8025, 16588, -2810, -10943, 123, 7542, 4382, -2675, -2950, 450, -322, 2729, 5001, -3267, -10244, -459, 13925, 2767, -18568, -6577, 15185, 6382, -13794, -10486, 7902, 8472, -6227, -7876, -115, 2933, 3497, 1732, -2630, -7376, 236, 15000, 2567, -18159, -2702, 20933, 7212, -18764, -9816, 16424, 11656, -9004, -10787, 849, 10125, 4985, -10230, -9270, 4479, 11052, 949, -13756, -7663, 9902, 11203, -4958, -15543, 397, 16885, 2829, -13066, -5195, 9297, 10067, -2777, -9391, 186, 9503, 6371, -6032, -7412, 6535, 6565, -2305, -2891, -1770, 1462, 3858, -622, -4931, -3512, 3561, 3628, -3983, -3665, 144, 1190, 1436, -2458, -2025, 2652, 640, -1059, 256, 99, 384, 962, 2416, 610, -2760, 1946, 2677, -1604, -139, 646, -774]
723g74J379m26j017j156J547K239l329n92J583o21K024j463k695M407Q19l837
739a912L21K745N10k542M70K273j427L00O8j844L143M37m167P47K717M79k986
756f68j764K447K050j408l341j121N767J581o465j636N019K572k733l156R24L934
772B002J360l087l868L823M979l794m138K046L349M46k780k693J604L843p53m896
788b557J96L941k93k082j387M85K774n4l329m27L259J114k930o98K015J76O77
805H80m91k235J973K647j841k523J529K823j950k001J439J39O13j02k725P88K359
822A322j137j747j82J595M87j445J42n69J435J129k712Q92J603j385R47N02j559
839f82N57J603R8k607M14L150k176j023K662k115r47K895l36k430j810L641K123
$$ y = [-774, 605, 179, -838, -1994, -447, 1792, -1537, -2129, -546, -1167, 857, -606, -3301, 1106, 1925, -1912, -1591, 1154, 1664, -878, -408, 1865, 438, 738, 806, -1038, 2105, 2542, -1625, -878, 1839, 2318, -668, -2432, 15, 2065, 657, -2684, -3805, 1962, 3543, -2922, -4558, 461, 3033, 300, -2856, -1932, 2002, 3362, 275, -3593, 230, 5209, 1415, -2723, -677, 2672, 3118, 338, -2355, -751, 3092, 2339, -2557, -2361, 1580, 1287, -795, -2182, -1697, 1077, 1023, -2306, -2733, 526, 1640, -1290, -1988, 27, 203, 880, 389, -1846, 127, 2774, 933, -1590, -61, 2762, 812, -1189, 250, 389, 1002, 900, -1825, -1037, 1322, 185, -1562, -1744, -149, 338, -1107, -965, -1534, -99, 1030, -1682, -790, 813, -572, 375, 877, -682, -125, 1478, 1576, -1031, -617, 2533, 357, -666, 1996, -119, -1066, 1829, 1493, -937, -2747, 894, 3017]
856C017m410j582K197K092J85m182K16L510k86K37j562l018M316L680l368n226
872d184K088Q308l383o894L310K858r24Q25k303k377J708M951k97q955n2R349
888D028P74p151m213N822O188n608m444L233Q40J845J005l706k933L479P386l517
904C028r906M191Q095j334m446m026L007O722r48o940l532O938O774p927n848
919f152M742M079n19l681j163R92O36M819q57j0063J136J3446J102j5796l703
934a0982J8758L858j8488j195J3936M36q973O75N054m457j292R258l150j2116
948h678M604J3773l890j6589K617J7805j878j5791J29J1168K301p407k109L643
962c02N91J249J154m403k165M624M082j329o546k568P737O674o599j2071N972
$$ y = [3017, -1393, -2975, -778, 1314, 1499, -2683, -2467, 1043, 757, 994, -568, -3586, 730, 4410, 1042, -4184, -2096, 6212, 2829, -4065, -755, 2103, 1179, 2004, -299, -2676, -968, 3983, 3686, -5269, -5321, 4028, 4802, -2349, -6562, -740, 5448, -160, -4604, -1371, -531, 1314, 2319, -1387, -4320, -841, 6545, 3028, -6878, -2687, 5408, 4074, -372, -4398, -1391, 5331, 4383, -2557, -6089, 849, 7623, -304, -6152, -1410, 2669, 2150, -1531, -2694, -1702, -1066, 3753, 2896, -7167, -6031, 7415, 8517, -7279, -10982, 7776, 11634, -6854, -8049, 5887, 6323, -2650, -1975, 3079, -1378, -2670, 6588, 3438, -8678, -4074, 9699, 5809, -10780, -8163, 9642, 7764, -8027, -7898, 3270, 5571, -1836, -3945, -302, 289, 1538, 2692, -1711, -3876, 748, 4830, 3501, -3045, -5613, 2124, 8798, 2199, -9872, -3900]
977c900J5223n282j6169L358J5041k305j2756K655Q407n363l046Q776j630j3218
991a0209M939J8694q075k2192J0637K3650j0631k2770R852J9332q333j3703Q685
1004a24O620q669o53R143m108j1427Q230J3370j1110j4232R982J4523q001j3357
1018i813N477J0592k949p158l90L913L511j312m507K18L124Q48j387O71p70l860
1034c792N189O544q505q254R804J0393j0105j3393J1203J3534j2356j1193J1503
1047E72Q030j1074m899J2641j084j3546P853J2539j3559j0837J6477J1562j9024
1060d349j0242J9576O634j6419k435J1435R63q002J150N359m749k399Q099m1r070
1075d490k36Q814J306r960n66Q498m02m236n75r56K510L869k417o342K591Q401
$$ y = [-3900, 11323, 6041, -10128, -6770, 8271, 5966, -6790, -4135, 4272, -1091, -4137, 4639, 3009, -10209, -5270, 13424, 5349, -16843, -6206, 17444, 6813, -15957, -6105, 13227, 4894, -8809, -124, 6496, -2173, -2826, 6317, 2209, -9218, -988, 12382, 1272, -12960, -2978, 11545, 3544, -9813, -4336, 6256, 3307, -3851, -4241, -328, 3183, 1871, -2636, -2418, 706, 1554, 167, 838, 68, -3792, 1397, 7941, -564, -8818, 986, 11379, 1274, -12119, -916, 12618, 262, -10931, 572, 8602, -2472, -7371, 5270, 4186, -9360, -1507, 11032, -2527, -13364, 3113, 14675, -4349, -14591, 4985, 11619, -4800, -7235, 4200, 5163, -2839, -1689, 3670, -1079, -3478, 4621, 4580, -4490, -4726, 4088, 5394, -4566, -5132, 3366, 2964, -1272, -1847, -2803, -293, 3576, 1159, -5183, -2592, 5809]
1091E809m431p600O836L591o159N89N135l025n291N964O042r814m805J1949K373
1106G163j1313k166J0709J722j2101J781J0794o138p316P717M393r161k477J1589
1120E196o0j2789M959J0046p109o271O825M622o736j997O825j373o139M691L976
1135D666n369k906N435K346o777q67P254k490n152M174K570n115r93O154j438
1150A492o783M865N641p260k624P238O12o590J069O431l064m726N445K369o555
1165b440k88O546r92o385K382O354m811n655O775L045o712j522O899j390p019
1180e213L983O105o720k954P875O04q212J194P794l185n818N284M000o292j784
1195c339O149N05n943J441N591l783m377M927K937n819j781O168o9o439K359M858
$$ y = [5809, 1378, -6222, 614, 4205, -1954, -1365, 3770, 745, -4546, 1418, 7460, -2354, -7159, 4790, 7163, -4150, -6316, 4393, 6115, -5986, -4205, 6589, 451, -6865, 852, 5245, -3916, -6393, 5196, 5136, -7653, -2694, 7352, 243, -6028, 797, 5419, -1317, -3314, 3511, 2138, -4001, 690, 4666, -703, -3609, 1826, 4172, -2605, -3472, 3782, 1292, -3860, 314, 2884, -2231, -3224, 2930, 1492, -5291, -426, 5215, -2045, -4669, 2569, 3181, -3409, -2340, 4091, 1027, -3699, 1746, 4115, -2440, -2728, 3818, 2826, -3559, -1177, 5177, 366, -5289, 1486, 4531, -2181, -3703, 3196, 1806, -5213, -1230, 4875, -1845, -4799, 3076, 3680, -4532, -3338, 4456, 1271, -4547, 737, 4737, -1555, -3339, 2810, 3315, -2628, -1187, 4404, 621, -3756, 1171, 4108, -1711, -3492, 2676, 2607, -3832, -1473, 3385]
1211C385m319k878N340R26n974J191O023l301m419M866K521n343k25M880n34m686
1227b547K130M142m227k487N270Q44n393J17N196j451n455L458M546n436k178
1242c471N266N51n853J272N871l299m715N363K346n570o34N220l17m931J783N012
1258C894l851k901M500R58m084j9L745m18m517K380L941m644j880M467N01m297
1274b225J2M427j646m075L676J974m026M00L103r89k773J550L406k995k385M215
1290A649M84l894J036K580o06k765J390L002l861q14M018j181l193J434K768j958
1306H9l435L874J958m827PM083j286k756J682K584k143k324L742O81l741R38K681
1323A807o60k258N23L101k142k314L025K98k082J59J359k22k115J056J862k671
$$ y = [3385, -934, -3812, 1528, 2454, -3520, -2329, 3694, 393, -4026, 840, 3361, -1982, -2207, 2673, 2139, -2547, -417, 3725, -502, -2989, 2281, 3125, -2268, -2151, 3045, 1594, -3861, -403, 4143, -1293, -3471, 1795, 2346, -3507, -2235, 3636, 337, -4378, 985, 3331, -2239, -2873, 2347, 2030, -2901, -1118, 3894, 43, -2858, 1642, 2600, -1484, -1503, 2242, 1824, -2693, -313, 3628, -1016, -2896, 1571, 2072, -2225, -2213, 2214, 568, -3507, 169, 2143, -1883, -1483, 1620, 631, -2142, -592, 2814, -181, -2566, 1649, 2133, -1761, -725, 1855, 1249, -1516, -126, 2876, -985, -1799, 2219, 1038, -2155, -721, 2047, 89, -3346, 528, 2486, -2341, -2334, 1749, 463, -2293, -611, 1973, -170, -2494, 1248, 1929, -1812, -874, 1807, 1147, -1111, -588, 2513, 371, -1943, 1082, 1380, -702, -543, 816, 594, -1521, -465, 1397, -1274]
1339a274j16K164j105q49O86R22q88n33J760j65j943J373J289j538l56P76R08
1356A111j183j071K310N4j956O26J326j171j088J120J507k491k11K274o41j635
1372a119O99Q98m91q57P21M15q28J83K08J40K69j66l9N68m08J69j81N3N42l48
1392D28n11Q4Q71m96j162Q58P85r51m71R30N2j031k64J538l71j601Q84J168o40
1411A00j388N45J584m05j668R75J526r44j250Q61J553j129j175J792L98j862l41
1428h28J577Q89k455o08K469j81k052o92K588M91l050M09K957j517k071J587K026
1445A539j319k312K374J521k446o31K029J013j646j823K432J517k685r85K528
1460A106J33j934o87K530M1k700L94J928m07j702r2K523j80l053Q87K990j363
$$ y = [-1274, -1390, 774, -331, -1180, -494, 428, -460, -993, 767, 602, -1341, 32, 1321, -217, -573, 203, 1111, -72, -1143, 1167, 1221, -735, -109, 1217, 46, -1042, 78, 1585, -906, -1117, 1157, 516, -1119, -420, 478, -13, -870, -149, 266, -562, -379, -171, -31, 238, 72, 33, 601, 193, 362, 181, 234, 776, 428, -83, 1, 872, 376, -786, 72, 857, -94, -565, 365, 417, -614, -878, 660, 289, -1312, -428, 740, 100, -1288, -743, 841, 436, -1232, -257, 1269, 325, -925, -64, 1489, 360, -815, 977, 1375, -487, -828, 749, 1638, -817, -1425, 1044, 863, -1189, -1881, 707, 1198, -1852, -1443, 1514, -3, -2074, -487, 1539, 220, -2092, 282, 1803, -643, -1274, 755, 1768, 122, -1701, 731, 2248, -437, -1422, 1106, 1239, -695, -1382, 1148, 1189, -1511, -1117, 811, 404, -1298, -1390, 1133, 953, -2100, -1213, 1777, 414]
1477D14k652J311L349j468l534K819K362k948j382K671J548l155j356M075l2l770
1493a748M89L146K8m511P01M774j926m032K477K635j966k559K204K447k973j078
1509a892L123P5j944l54J660J157k675p05K912L88k237p83K403R43l226j46K701
1526A400l36k022L66J306j15j930K07K407j069k157J030K667j173l365K401L164
1542B781l136k159L382J338l152q60L562N18m194J236K701j146k090R08K384j407
1558F66l006K197K236k445j543K062J469k594r93K721k04j641Q14J068p77q02
1574g72N69O72k46k24J6M5J97k41n94J331M28j309j1N21M24j155r2J301k98j340
1594g78k5J300M8j758P73J954j707j859K025J449k423m22L034o01k775J085K270
$$ y = [414, -2238, -927, 2422, 954, -2580, 239, 2601, -347, -1729, 942, 2490, -665, -2021, 2054, 2022, -1748, -1259, 1887, 1915, -2596, -1895, 2879, 953, -3079, -602, 2033, 67, -2492, -288, 2159, -814, -1892, 1231, 1306, -638, -992, 668, 1825, -850, -1555, 1357, 1745, -492, -1275, 1128, 2071, -1155, -1301, 1400, 1064, -958, -592, 714, 599, -1331, -1124, 1283, 214, -1943, -913, 1754, 581, -2784, -383, 2781, -355, -2514, 868, 2206, -946, -1806, 1756, 2274, -1920, -684, 2017, 871, -1219, -311, 2073, 666, -2340, -143, 2093, -352, -1895, 167, 1636, -958, -1951, 770, 566, -1075, -261, 807, 30, -772, -203, 469, 223, -1, 15, 60, 257, 16, -578, 753, 1181, -128, -139, 382, 806, -349, -441, 860, 562, -778, -803, 497, 545, -1213, -440, 1514, -193, -2052, -27, 1422, -1001, -1423, 1611, 1010, -1765, -680, 1590]
1611A590j357j176J639J040j852q28J624N81j814J02J448m69j460L56J940j560
1627a96j043J240Q81j690j29J334j45j537J189P70j593L97J142o52o29J130K19
1644F88r26k3J196p38o95J170j74r21J58P98K47j434K63J347j014j128J151R31
1662H96j519m97J480K25j949N80J755r96j369J741O58j724o27K357j65j801R02
1679e3J417j052j110J043R66j530m77J801n19j355O71P58q91r21J341P63j601
1696g49N8J077o08k73O75M6m56o13J221R0j330Q35J001j292O1P25L69j099r4J455
1716A099q10j132J249L08j152k09J066K54j567L83J236j033n65J248k13m83m79
1733h00J342j38j412Q35J127q49p40R52N16r12n73J549k69j268Q35Q17j150j43
$$ y = [1590, 233, -943, 696, 1736, -116, -944, 680, 1261, -553, -451, 997, 528, -932, -576, 1364, -196, -1239, 1, 882, -808, -937, 397, 252, -1285, -96, 674, -919, -522, 620, -32, -661, 469, 688, -238, -261, 935, 197, -498, 672, 498, -423, -265, 533, 780, -654, -391, 956, -58, -1186, -35, 896, -623, -1120, 360, 585, -1364, -784, 971, -25, -1394, 347, 1005, -719, -1346, 1011, 846, -955, -53, 1364, 312, -798, 245, 1211, -319, -796, 1005, 486, -869, -198, 560, -331, -1252, 89, 852, -749, -691, 386, -222, -495, 180, 226, -230, -843, 378, 468, -862, -27, 974, -318, -257, 468, 837, -262, -356, 1099, 289, -843, 406, 714, -438, -647, 419, 673, -894, -511, 725, -308, -873, 375, 162, -321, -800, 542, 404, -1008, -173, 954, 105, -635, 317, 833, -79, -652, 897, 628, -640, 195, 1012, -138, -281]
1751b81P84P6j122K16J071r75m89R85k01m88j49P70R1j021L40R30m23p88P86L98
1771E10l61l80Q11k32o99K58R01q60k97P73J24r23J89J090j133k04R92n16q24
1790g81N11P21m71r71Q03P72j068j4Q80L3r19K78O75k5j012Q94P14j082l39J193
1810G92K8j198K23J017m24j359J073M43j072j86J062J18r79J02R73q92n8K89K33
1829A85k73k88N92j00m48N57J47n02J52K22J42p11M39P21p50m19P60q2p02J09
1849b49R82n35j059R12N60j133q0J179l00r73M5J102q8j242P86O62p10k30M61
1868I0O72r00l29J389n05p84O09L49n99l30O69j17m59K05O51j085NQ13l74k22
1888b52J96K08n51r4P72j92o35N41P09o68q00Q38Q62j170l26J229M03j390L2J032
$$ y = [-281, 503, 579, -543, -327, 744, -231, -720, 265, 64, -424, -573, 197, 288, -733, -393, 537, 114, -674, 112, 510, 149, -231, 580, 348, -351, -93, 808, -52, -349, 424, 548, -375, -186, 904, -229, -433, 559, 43, -781, -270, 451, -20, -991, -188, 584, -484, -498, 382, 415, -504, -226, 449, 424, -588, 306, 1020, -62, -401, 792, 820, -378, -155, 862, 438, -921, 152, 595, -477, -663, 399, 517, -462, -360, 613, -279, -337, -48, 185, -88, -376, 216, 116, -332, 225, 372, -130, 22, 244, 386, -325, 114, 835, 85, -334, 426, 344, -358, -249, 733, 198, -861, 51, 611, -522, -602, 577, 277, -696, -651, 451, 363, -879, -93, 569, -141, -371, 90, 762, -138, -467, 922, 417, -367, 242, 591, -8, -338, 331, 214, -245, -40, 611, -474, -469, 344, -30, -252, -56, 152, -399, -493, 279, 87, -548, -7, 702, 34, -766, 72, 934, -236, -562, 667, 1070, -320, -288, 744]
1908G44j63j199M64J073r85n51R75J06n75n97N05O26o30o73J160l17m06K8M68
1927E3J28n59k77R58k05m1j18J34N71m27q8K16n0l75j68L14N87j059M2R11m58
1948H9o99K5R75k56j273Q36Q63r68n04J049L16o81o36J216M78j223l12J481m8
1967G28q87m54J183K89j411M97O20m68l52j7Q38l88r21O85P91r51n67P49O59q04
1987a81q29J216K59q34k46N04P05j059Q8J036k46r60N83P46k64j171N33R28p33
2006G5o72Q27M97q63l94O38K78o38l93O05L55n66j2K90J12m70k5M49Q9m90l39
2027f47R74L68q15k73P79L38r71k24J208l09r86L69J032q23p36R01O14j035o63
2046h99J270J44j200k4R60K76j384L50J180o13r55P96O49o04n92J012L60j198
$$ y = [744, 581, -618, -154, 919, -66, -617, 358, 464, -111, -708, -203, 423, -207, -880, 280, -37, -443, -415, 53, 181, -378, -655, 303, 98, 57, -61, 73, 644, 217, 129, 345, 295, -80, -248, 66, 653, -406, -364, 547, 89, -610, -585, 390, 134, -1139, -303, 560, -408, -912, 137, 453, -228, -864, 352, 830, -393, -705, 776, 728, -159, -613, 570, 859, -552, -55, 565, 97, -255, -272, 566, 178, -743, -58, 733, -218, -785, -36, 623, -181, -1010, 206, 465, -369, -615, -111, 594, -465, -377, 659, 413, -547, 36, 782, 518, -653, -120, 808, 75, -597, 230, 727, -136, -530, 108, 386, -252, -645, -40, 315, -251, -263, 27, 139, -331, -356, 93, 182, -308, -647, 327, 695, -120, -393, 386, 724, -247, -471, 737, 428, -558, -189, 843, 20, -716, 185, 799, -236, -899, 371, 515, -685, -709, 251, 527, -857, -507, 673, 60, -895, -99, 550, -54, -646, 366, 726, -472]
2064d72m4J078J37j151L50M64l04k81L01R9k27J98j09k29K62j29j31J1K59L7o86
2085e67M11O36q69J78K64J7k80l32Q71N53j291M5J124m48j030N48J060p94q70
2104g74J269J06j360M43Q74k26j055M76R56q94p13R39M09p72J84L15J98o72p0
2123c67Q86l41m22J98K03j26l36P46j17o98P58J35j096O16M72k73n04M07J39p07
2143d27j29R74k54o44O14M9n20p8L90O78j067j91J042l66o51N57O48m33o42P12
2163B62Q84j366j12R87j95q93J62Q64n73o87R95R0q49K21L15j83k59J75J49j82
2183a95p7N36L4n15L64K97m46p9R8L27o34J81P33n18m86N90K90q39J93N51l11
2204I4q68O19O39p35l66P89R6q16K38N62j67o76P01L34l87o17N34P00n24m50R57
$$ y = [-472, -516, 562, 699, -452, -102, 362, 58, -223, 78, 177, -50, 148, 39, -190, 72, -57, -188, -177, 82, 119, -567, -156, 480, -389, -211, 53, 70, -210, -542, 329, 882, -409, -364, 760, 312, -718, -170, 890, 96, -774, 495, 601, -759, -316, 558, 332, -723, -247, 709, -185, -898, 41, 450, -322, -138, 177, 375, -297, -367, 519, 178, -244, -46, 157, 31, -305, 441, 324, -374, 384, 519, -577, 39, 511, 238, -266, 141, 280, -427, -556, 418, 164, -480, 134, 183, -337, -415, -25, 653, -414, -605, 437, 71, -580, -23, 625, 192, -450, 262, 1146, -220, -332, 655, 460, -433, -271, 593, 20, -667, 328, 418, -431, -210, 105, -78, -337, -162, -13, -195, -272, 264, 298, -217, 147, 444, -2, -81, 17, 344, -290, -109, 624, 106, -380, 210, 500, -339, -146, 405, 94, -774, -155, 484, -251, -617, 172, 268, -548, -310, 252, 85, -591, 110, 444, 57, -560, -26, 674, 150, -300, 657]
2225F57p7o12P2L61j64n97N85K14q69M56L81m54l13L79L43q60K05N71m00l17M29
2246a0M13o40l07O14J00p47M55N52m23k21K69M35n08j16M39K40q82M36L46k05
2266B40n82L80L38o32L1P08l38p91P33J50m79qK21J48o31L93M57n53rL31J94k26
2288G5p9M12M0p48L35M90m68l58M54M36o18j62P49p47j0J06J44k42j45J93N05
2309C62q15K55K32j20m67O76n5r4j80L53K84o29L57K27l09lK08k75j2j82P25n41
2331cp9K29k49k37J24L55J11p73K40N60k49n01M72R1j87j31O32j43p42K89M38
2352B47q3k62M57k74j39K1M84N1p14M06p9j12k57J83l1L9k29L58J42m26K22q8
2374h4O4j11L57l44j72L08K22m61K81K85k44j83J76L07l83k55M97r8m92K91M26
$$ y = [657, 580, -32, 40, 401, 237, -360, 225, 439, -430, 26, 407, -47, -360, 19, 362, -498, -293, 278, -122, -439, -10, 403, -237, -544, 70, 170, -577, -122, 430, 7, -214, 55, 490, -18, -134, 305, 545, -337, 99, 445, 240, -342, 38, 376, -256, -225, 483, 145, -646, 87, 237, -242, -250, -29, 119, -512, -119, 338, -215, -224, 107, 301, 75, -4, 408, 448, -300, 35, 525, 57, -301, 153, 589, -29, -191, 558, -189, -199, -93, 51, -191, -336, -143, 362, -453, -198, 34, -86, -553, 123, 68, -26, -206, 147, 431, -198, 159, 386, 77, 74, 282, 7, -5, -187, 538, -3, -82, 147, -102, -339, -215, 140, 251, -522, -282, 278, 29, -472, 0, 91, -96, -227, 405, 262, -480, -191, 247, 164, -98, 359, 85, -54, -33, 451, 502, -212, 194, 115, 3, -254, -71, -102, -63, -292, 66, 208, -218, 4, -84, -20, -131, 226, -118, -290, 18, 240, -221, 60, 345, 101, -82, 94, 401, 18, -237, 260, 162, -330, -39, 387]
2395C87n13l75M93M46n47k62L98Lm15L8M45J1m60j29O92k53l07N41P5l18K9K41
2417B20L3k71J05K39j02j77r2k6J49n1L0K6K01k00l41J61L00m21l4Q0J87o9j69
2440b22K13J68l84q2M12J2m08K02L32l6n10K58L22j89j78K40L45l50k89J19M1
2461A6J28k73J66K26n02p0O26q3l91J29M3J10l98K44K34j95j67K52p3P1j81J6
2483g2L89l56lJ12K94o6n58L84J35l30j18L21Nk52j40L67Q2o05M13P1j67j2PK27
2507A28Q6m42L03R4n7j75m0L82j32k05L11k62N2M8j5K64k60k65J79J20j41k08
2529b35J13L06k95l58N62Q0o69L96L4K01m33J4O39k42j53KL60j37k61J7M30l06
2551F5l75O82r1k67l24K95K60k93N2J13l40J28j65J36K1j03Q0P0J12j31K6p3L43
$$ y = [387, -126, -501, -8, 438, -109, -371, 27, 30, -385, -347, 98, 109, -351, -480, 212, -41, -348, 193, 268, -50, -21, 220, 253, -18, 87, 326, 224, 47, -45, -71, 78, 27, 57, 83, 284, 84, -257, -96, 204, -217, -251, -171, 16, -53, -222, -9, 159, -225, -307, 105, 117, -291, -89, 243, 207, -303, -45, 277, 88, -90, 150, 495, 145, -144, -25, 16, 144, -129, 37, 263, -239, -309, 317, 234, -157, -28, 15, 125, -273, -29, 205, 10, -157, 95, 22, 93, -88, -72, 317, -39, -42, 70, 364, 298, -260, 124, 259, -71, -189, 132, 137, -115, -255, 112, 194, -411, 2, 73, -94, -106, -99, 128, 214, -228, 75, 169, 112, -63, -103, 279, 147, -58, 253, -9, 43, 91, 76, 340, 80, -185, -6, 114, -27, -235, -122, 184, -111, -469, 93, 173, -496, -100, -66, 135, -298, -284, 355, 113, -40, -38, 322, 185, -76, -59, 371, 65, -310, 372, 281, 14, -310, -15, 245, -48, 4, 117, -223, -95, -260, -124, -103, -206, -126, -56, 56, -75, -49, -122, 221]
2574B21m5o3J18n3N3l05M94j64l11P4J63q6k81J02J41r8l1K78j11l07j32N11r2
2597G6l40J00J23j9p4J9N1M0r8K07J07jj53J27j35l3J47J35k69O9R4K2k06l4K00
2622A55l32J31J06j88k34L76o4k75j6M43j2k75K42P7q1l33L11j37M4J14J24J4
2644A90k44J68K48l84r0L23K7k55M9J83j40K5j00J12n3p5P5P2l19n0J71J64k72
2667a75r5M65j94o3J85j74M0P8K26m35J19J63K13l55P5J53k18l7J18n9o8j31M33
2690B64j15k98K58P7k79j43J58L5k44MK76j5M0r9K08j37m0J99j6j83J95J79o2
2713B62l76KL81k51n6j18J27l8L2J69l12l1K80L8k97J17O6j6r5rJ00Q4k69K90
2737H0Oj47K58n9j14J34j19qn4J4K14j86Lj5K31l54N4n2K73k65l0J53j65J42j08
$$ y = [221, 176, 113, 231, 178, 231, -74, 420, 256, -55, 19, 182, 96, -185, -83, 58, -40, -71, 207, 96, -211, -343, 168, 76, -264, -164, -41, -60, -134, -115, -64, -24, -122, 85, 192, 191, 38, 165, 30, -3, 144, 279, 10, 79, 173, 195, -11, -45, 155, -177, -46, 60, -128, -362, 14, -50, -325, -341, 102, 90, -185, 57, 134, 53, -280, 31, -106, -62, 52, 176, 190, -54, 114, 362, -22, -112, 211, 238, -17, 32, 215, 75, 100, 0, 112, 59, -16, 59, 131, -188, -238, -67, 97, -175, -270, 195, 1, -62, 123, -51, -11, 67, 293, -142, -23, 140, 353, -2, 73, 226, 8, -29, 89, 30, -38, -169, 264, 149, -149, 109, 186, -93, -236, -78, -43, -287, -283, -7, -22, 18, -81, 127, -10, -50, 149, 133, -50, 145, 324, 262, -114, -112, 269, 18, -38, -156, -29, -67, -35, 134, -178, -209, 71, 109, -188, -71, -5, -21, -116, -125, -25, 59, -210, 80, 86, -61, 197, 138, 24, 158, 39, 31, -23, -9, 205, 19, 22, 7, 238, -116, -62, -114, 159, -106, -136, 17, -148, -6, -114]
2762a14L17j35l06L34q9j70L01J82l26Nn7J48j55N0K48j32k85L20K4k79Q3L02
2784B66k37l41K42J61l86N6J49oR4j13Q9l6k12K18K17k6m3J02l3q6l11K57N6M6
2808A23k2j03M7J6j37J19lk14J02K4j27K36k26o1K73l7J60l54K14J10j27n5j13
2831a55K35l62K58J63p7j81K16J94l66J32K6K10l49NJ80K27m75K27j81j2k1K23
2853A17J25l97n7J48J74l67K41J61j73k1K34m0k75L20o1k3k9o8oJ04k46K41j53
2876e1j02K52l9J11o0k99J53j43m1R3o0O1L54j87k26J60J43l96J50K6J68m5p1
2899d9J30N7j43Q7J13j53j03J60k2j05J73k9j21N0j39J61r0k48R1r5K06j73K04
2922c8k5J27l29L26q1O7k46J73J64J08l75K63RM6K0k94J79j1N8j04K60j60j90
$$ y = [-114, 203, 68, -238, 96, 7, -163, 138, 320, -6, -1, -58, 90, -65, -15, 233, 101, -184, 136, 160, -119, -36, 266, 29, -312, -70, 91, -295, -239, -90, -96, -2, -115, -26, -62, -274, -56, 161, 135, 92, 194, 161, 75, -236, 21, 77, 123, 101, -2, 45, 61, -76, 43, 40, -174, -72, -48, -175, 61, -165, -226, 47, 10, 170, -184, 30, 140, 13, -42, -155, 80, -282, -24, 139, 62, -119, 97, 291, -75, 57, 83, 293, -56, -51, 129, 356, -119, 108, -73, -85, -106, 117, 242, -155, -212, -64, 110, -257, -16, 145, -28, -49, 185, 145, -130, 190, 129, 106, 77, 9, 3, 107, -139, 102, -51, -153, 99, 60, 171, 111, -188, -35, -178, -219, -126, -186, -125, 229, 42, -184, -24, 119, -277, -127, -101, 67, 22, -49, 81, 138, -5, 82, 195, 42, -61, 99, 77, -28, 145, 116, -5, 45, -94, 67, -23, -271, -180, -275, -69, -242, -38, -63, 64, -265, 61, -20, 47, -199, -26, 138, 246, -129, 134, 143, 189, 209, -85, 94, 83, 141, 37, 297, 137, -53]
2945e3k7R2j50l6K91%j94j90J09J61r0o1J2O6K33k13j23J44M6o5l0N8j0K1J35
2970A26k3k2j15Q6j07m9K33kj66n8K09k14J00r6kJ91p0k86J70m3J83k19N9K11
2994I6r6l53N10j65J7q6K36r6l15J82M43j84k12J11j85O6Q4j81l5N8J04o7k3M5
3018d6k12J85J00k48K57nr9N4p6K24j10j72K22j31J7Q0l7J15Lk91P9L6J68k6j37
3043e0n6K31k50LL0m2j1k2J81Jq8o8J69Q9Rk44L2N5L1L84p3m72Q2m9K67j93r5
3070a49J42K15k40m17N93j95J64j10J07j31k55J53Q7k4r9O4J80Kk99K04J08q8
3092A2O7k6L2k90J69K77j23j84L5J93j31JL06l95R2M6j70M3O6r6o8n7J91q4J17
3117B3J89p2k25J23K1M0Lj37P1j2q9J94j69l0J21j1L50l37l7L2J73l4k32K73j35
$$ y = [-53, -80, 12, -138, -174, 117, 117, -77, -267, -158, 3, -87, -148, -136, -70, 163, -50, -173, -29, 17, -48, -78, -20, -30, -9, 126, 103, 81, -34, 52, -55, -104, 129, 127, -39, -97, 112, -102, -2, -98, -100, 91, 21, -265, -95, -138, 45, -174, -115, 96, 0, -353, 157, -8, 9, -77, 159, 63, -252, -70, 373, 189, -23, 88, -97, -31, 53, -128, -163, -105, -1, -68, -91, -46, -258, -73, 27, -221, 36, 31, -68, -14, -90, 134, 24, -148, 74, -57, -40, 40, 3, 118, 121, -170, -91, -55, 113, 87, -50, -106, 125, -125, -122, -92, -134, -145, -167, 14, 15, -73, -141, 28, 117, 126, -118, -86, -31, 0, 384, 311, -161, -79, -128, 139, -54, -149, -7, 208, -32, -449, 144, -51, 113, 3, 110, -21, -276, -123, -36, -60, -159, -95, 85, 87, -212, -8, 100, 12, 79, 53, 85, -205, -36, 241, 118, -66, -31, 162, 31, 32, 338, -57, 35, 81, -89, -46, 20, -76, -144, -201, -10, -94, 23, 212, 140, -85, 38, 59, 99, 102, -35, 36, 24, -65, 129, -40, -70, 51, 40, 390, 53, 16, 48, 221, 187, -45, 228, 93]
3142I3m6J7N0j06p0N2P2k34N1J54J34j39j60K87j28N4j7j75J01L31l06J58m72
3165b99K99O6j29J94j63J04J28k02K60l35k0M7O8j5k3N5k45P7J29J20q2QJ43l34
3189a49n3L05M5k13K8M8K6k26L58J43j94j06r5J03kl7N2q5J36l14K62R0k30k8
3213a36K22j7l9q7j89K46oN2M2j05J42pM4j8o2K3O4J11j26m30K92Q5j54L5lJ21
3239A00j63N6m2j5j18R2J21o1q8K00j69p1J88Q4j30j61J16M16k87j91J56Q2j86
3262g1J5P9O1k77K79J6j79j6P8J67k12o1J28r6q0J25l50J73J88J46j11j79J90
3285A3J23K9r7n6J30k9j12K07k48J42j20J19O8m9r8k8j43k4K63m4j41J14j02j05
3309a88K66O5r3j43K1m1P5l3J65j43j97K00L03j59J3j20J92k86j93J36N01m20
$$ y = [93, 47, 64, 114, 8, -62, -10, 62, -172, -121, 33, 167, 28, -132, 155, 27, 81, 64, -111, -10, 321, 15, 173, -299, 0, 66, -63, 131, -32, 72, 200, -2, 258, -77, -97, -50, 18, 3, -20, 35, -210, -133, -4, 116, 34, 42, 185, -149, -202, 103, 148, -65, -37, 11, 37, -189, 169, 312, 118, 12, -83, 20, 18, -19, 33, -52, 84, -230, 32, 122, -108, -136, 86, 69, 30, -57, -246, 0, -6, 46, 88, -17, 125, 118, 162, 144, 82, 105, 169, 280, 154, -276, 16, 101, -53, -18, -21, 100, -63, -7, -49, -64, -182, -90, 31, -30, -118, 82, -87, -158, 30, 114, -16, -177, -61, 355, 68, -123, 33, 115, -71, -56, 23, 84, -193, 86, 102, -77, -93, -15, 152, -60, -121, 7, -89, -169, -44, -394, -221, -33, 113, 2, -177, 13, 136, 165, 68, 12, 142, 113, 1, 208, -40, 102, -18, 101, 169, 120, 22, -6, -149, -173, 90, 46, -95, 19, -83, -188, 78, 143, 50, -93, -72, -113, -38, -71, 94, -49, -246, -46, 257, 98, 111, -9, 183, -103, -296, -160, 341, -79]
3331g9M7K67m07J07J63k23r3P2K75k65j69K62L8j69R6J25Km9o5J36N9k24J32R5
3355A33l64K35j01J96N7l83J73J44j97J00J7n0K8p6l7K05J94j94k62L16N5Ql31
3378a34J89j82J39J55k2m1m20N01M4M2j78K4j44o9K0L77j40k0k40rK13q1k62K83
3402D5j82j7O6k5k2J22O9k3j81L01j55q0O6L1J98q7J1L9l94M06M0j64m6J06j12
3427A2j5M2K2P9o7Km3j4k38L4J70ll8O4l5j74J90m8P8K12k06K87m27M4Q6J42l09
3454a53L54k27L5j13n1K81n4j61J13m4k6J90q6Q0j53Q0j83P1pj77J65R2j33K40
3478A33k15K15r8k12J3K7K07K1q3J13J16l86J05O23n25r8j83L33j22M7p8j82J73
3501e6L03j85j14P8k17J14m2R7N3RQ%RJ53k3j93K3N1j05J52j77J85k78J85k24
$$ y = [-79, -32, 235, -172, -65, 98, -125, -218, -146, 129, -136, -305, -43, -5, -174, -78, 47, 49, 0, -65, 71, 130, -94, 38, 133, -231, 4, -97, 99, 156, -227, -54, 90, -107, -7, 10, -40, -12, -88, -125, 80, 274, 80, -182, 134, 189, 197, -134, 55, -127, 12, 167, 145, 104, -316, 185, 229, 271, 93, 117, -27, -96, -76, 301, 161, 141, -99, -108, 105, 24, -238, 45, -137, -154, -88, -113, -135, -13, 56, 33, -148, 153, -2, -82, -16, 15, 213, 126, 137, 176, -218, 188, 228, 64, 18, 124, 12, -3, 39, 61, 140, 73, 75, 32, 18, -220, -186, -16, -19, -57, 7, -28, -202, -12, -60, 18, 230, 24, 311, -116, -72, 14, 156, -153, 201, -26, 9, -104, -155, 126, 72, -89, 24, -20, -46, 144, 58, 138, -15, 65, -118, -47, -54, -231, -66, 26, -107, 133, -82, 133, 35, -177, -164, -137, 70, 91, 8, 121, 237, -149, -44, 579, 54, -44, -227, 106, -16, 31, -47, -229, -56, 247, 62, -52, 26, -191, -77, -119, -22, 31, 40, 48, 48, 57, 210, 187, -6, 17, 68, -37, 115, -62, 123, -155, 30, -194]
3526a94K51O4O4j82l3Q3m1mO7j38j01K03L4j01L6q0J43K3j54J66mo3k0J0l1R0
3552H8l1o1J95k76M8J22j64Q6M0j35J64o4L10l23j79M0NK85j94J49j89n8K89j57
3576a0o2K89j74j81K51J23m02Q4j20M2K20J0m9j0j41R8l6o7K4N7K85l63R4k00
3600b38R6P0Q9l07J01K54n7O0J88j72J46k00mP1l8K26j98m74O59k78J14j39K6
3623eOO6N6o9nJ33j88q8J28P0j53l5J11R4j47J47n0j29N5l8J13r6L2qO8q7Q6l5
3651C2J35l19Q4K1O4rQ5J20o3k09K53k59n5l8R9r3K41j67O8J6%K0K0R2k67J43
3677A4k00o1L31r0q4J49r4M35o08J40j96L43q6j13J39o3K8j53J7K80l2j16L8J03
3701A21j38j2J15q9KL2O6k00J69J67l6j17k13j4K70J04k75Q3k17k2nJ82R3r7n8
$$ y = [-194, 57, 121, 185, 3, -30, 53, 12, 8, 75, -63, -164, 39, 73, -28, 8, -72, 71, 94, -60, 106, 102, 39, 19, 29, -2, 88, 57, -4, 191, -85, -37, 85, -79, 7, 47, -88, 76, 12, 322, -1, -180, -140, -135, 150, -44, 105, -84, -142, 147, -10, -72, 217, 43, -138, 113, 236, -166, -82, -202, -160, 60, 70, 21, 11, -130, -32, -68, -135, -111, -54, 231, -132, -38, -238, -142, -72, 17, -290, -189, 65, 8, 68, 256, 84, 230, 30, 26, 97, 59, 285, 87, -387, 272, -6, 108, -31, -5, 1, 67, 123, 54, 49, 182, -6, -94, 34, 104, -49, -84, 27, 121, -26, 121, 71, -58, -3, -41, 72, -24, 8, 0, 68, -19, 67, 32, 167, -152, -68, -47, 17, 8, 93, 213, 150, -59, 194, -65, -120, -158, -59, -152, 89, -78, -10, 6, 6, 26, 46, 138, -129, 14, -186, -247, 84, -6, -90, 59, -35, 400, -208, -68, -264, 79, -7, -120, 19, -44, -16, -169, -152, 128, 96, -20, 18, 121, -17, -29, 86, -3, -1, 31, 97, -103, 66, 233, 197, 80, -133, -147, 123, 227, -48, 35, -182, -204, -209, -27, 66, -31, -89]
3726h9j26K96J41k50m6J65O0m5j83L9j18K36j70K24n4j72M53m07l4K09n3q1m3
3749d8J18j28L11j17n8k29K73j75L0J9nk13J56r4L29k17o4J50j49L07k31J4J44
3772A23j12j82K28k38J98j48P9J35j07j02M1J37j81J70J64k54J67r8J17j35j73
3793a71J75k02L87j43j18Q3J32Ok25q1K1L39j95n5m7L02j72k03L01j74r3Q7n0
3816i6J04j31J88j06j1P2o7L3q2lJ87k7p8K34j13k18Q2K14j85M7j38J34m4j51
3840a55K74Lj54KQ9j72J75p1K00l29O9J10m0O0j33J34j07r2J82j20N5J02j17R8
3864F3j59K12O5j35J35j72n3j25K33J22j0j90R1M6j40j43K01k34K35j05q9L71
3886B19o3j49j17P8k63L00J2l4m7J51L5l07K85J71k54O7j11K7J02l84K81j12K04
$$ y = [-89, -215, 81, 222, -28, -74, 91, 151, 106, -77, -38, -156, 80, -90, 134, 80, -92, 361, -46, -80, 129, 76, -5, -48, 70, -58, 253, 136, 78, -151, 122, -53, -23, -4, -9, -222, -66, -160, 169, -48, -112, 38, -111, 196, -35, -21, 123, 11, -171, 57, -181, 17, -131, -52, 83, -24, -126, -85, 52, -129, 41, 205, -49, 118, 20, 137, 2, -171, 4, -198, 189, 46, -72, 11, 143, 149, -76, -157, -136, 203, 8, -47, -94, 208, 36, -167, 134, -40, -133, -46, -96, 8, -123, 65, -41, -52, 20, -47, -14, -96, -99, 88, 61, -17, 217, 104, -114, -32, 182, -3, 44, -94, 40, -4, -155, 119, 122, -32, -30, 59, -113, 62, -9, 191, -138, -69, 41, 1, 61, -72, 62, -45, -137, 45, -75, -20, 82, -35, 63, -96, 116, 181, 46, 181, 9, -44, -169, 64, 186, 176, -14, 77, 123, -17, -160, 41, -193, 42, -63, -152, 219, 156, 7, -110, -32, -295, 5, 17, -17, -64, 87, 122, -185, 100, 271, 17, 84, -27, 0, 102, -282, -1, -113, 91]
3909I1Mj21pn9J24L7k44L64r4n4K1J58k55k2O4kJ27j3qj06r1L5J15m5j30L28p7
3936A40pk25r9L16l2k25K36M1q2j02K29l02q3K64q7r7M9P7j78K38j5k42J23k6
3960h9K02j12J67j36l2r7N0K65j06k52K61j00k52J18K49K00k61j69J98j25j56
3981a77J96j28K08j35r7PJ81k13K38%j67K21k28R6k54N0L93k06K2J02k04K6l4
4004a03L08K6m12M0N8J40k28J04K10q4K8k62j76M40k2l79J58J34j91O7K04J92
4026B52j76k14K26q7r0K39j76K42j60k99N22k21k29L25j89J17m05J57R0Q5M6q9
4048c4l7j35J53m1K40l72J92O7L7j37R3j67K7K75k34K09M1j69J12k21K74n0r1
4071C2J79j23N3l26m8K12j01j1J56j00j20K10J47l51J10J0M7m9j18J37K51k84
$$ y = [91, 95, -26, -33, -92, 32, 69, -175, 189, 95, 41, 62, 220, -35, -57, 7, 5, 132, 119, 111, 5, -86, -51, 64, 19, -111, 217, 140, 133, -92, -191, 125, 93, -132, 104, 145, 63, -39, 190, -112, -195, 69, -18, -115, -66, 11, -167, 71, 56, -186, -63, -89, 113, 1, 168, 32, 0, -97, -47, 218, 112, -140, 121, 21, -231, -113, 136, 336, 75, -94, 104, -21, -177, 19, -109, 99, -36, -133, -126, 55, -158, 80, 80, -87, 134, -94, 2, -252, -202, 191, -15, 7, 109, -95, -69, -103, 205, 231, -181, -141, -83, 57, -171, -67, 143, 59, 87, -175, -351, 89, 67, -312, -154, -20, -211, -144, 60, 252, 76, -138, 88, 1, -89, 150, -26, 216, 56, -243, 279, 58, -171, 154, -35, 82, -323, -166, -76, 9, 55, -34, -71, -206, -53, -94, 146, -226, -34, 33, 70, -67, 26, -141, -114, 161, -73, 136, 177, 8, 120, -101, 173, 123, 32, 211, 88, 141, -185, -233, -21, -122, -133, 23, -77, -197, 13, 160, -191, -81, -71, -24, -73, -191, -54, 197, -87]
4093h7Q4L0k4r2N9J68j05j71J49K4o0j1J04J64k40J30p6p8l61K92L58l29j9M4
4117d7K68l21k3O0J73J9k24J23k8j7L4L3o6J31K5k03J90j38j36L05k9kj39N0R0
4142A28o7j64J21p3j79J11O7q0q0J02J63j62J34q4J35j41J68J08k93J41J95j01
4164A49k13K44K2l50K63m6j96R2N3j36J43N5o5p2j03K32j64J03r6Q1r5J22q2O8
4188IJ4r9JJ86j30J5jk5K5M6K69k96J35j24J7j6j10O3j07J00J23r8ML5k13J99
4214B2k87L43J29l42K47l34O6K25p8K2j31L66k74J30r1J39k79K63k7j53J00j56
4236a00q2L26kk33K08J24k06J4K0PJ3l7Q4m9n8j8k11K07j16R9j1R4k67L42j49
4261aO9j74J21k6p6J64j10k10K82n5j20L02k14J63j95LQ7m4j77p9L15k0j48J53
$$ y = [-87, -3, 27, 3, -89, -30, 138, 33, -138, 11, 35, -25, -36, 68, 232, -8, 122, 46, -32, -393, -101, 257, -72, -91, -47, 221, -100, -123, -63, 110, 129, -95, 28, 0, -17, 17, 50, -16, 115, 140, -63, 127, -11, -147, 158, 129, 127, -12, 38, 128, 61, -103, 18, -55, -234, -123, -56, -136, -216, -114, 49, -113, 21, -63, 72, -69, 99, 207, -86, 55, 250, 149, -64, 180, 202, -148, 115, 69, -127, -35, 18, -118, 25, 80, 15, -57, -160, 72, -92, 11, -85, -4, -99, 23, -59, 9, 23, -76, -75, 111, -19, -4, -5, -30, -5, 41, 310, 14, 149, 25, 42, 26, -84, -21, -128, -28, 95, -3, 1, 36, -177, 22, -265, 78, 207, -135, 112, -222, -156, 69, -9, 13, -118, 248, -26, 104, 13, 152, -127, 136, 109, -44, 56, -100, -182, 144, 142, -91, 117, 241, 35, 49, 69, 76, 89, 52, 136, 87, 29, 11, -200, 7, -109, -10, -21, 73, -194, 148, -1, 68, -106, 15, -11, -87, 77, -33, -243, 39, -16, -136, 166, -48, 115, -80, -77, 10, -34, -211, -290, 25, 5, -143, 10]
4285A0R2m3m18M37r3L7q8J13lJ3j5j57J67o8p2%L9qJ32j12J21r2k41J75K02P2
4311B00l53J79j02k7j75K70j4j2p1P9J23l9l3J80j58j93K38l3O3k59K04M8j0J
4335A06Kk48J08J09k52Q2K32n0n4k76J0N48j63j0j51j20K32j13J11j89J38l2L1
4358E1M4J0j01m3l8K34n2j92Q5L2j48k7K62j01K2n0N5m2l0P9r5K8o4K70p9r7r1
4385g8N7J57j4m6l00L40k24K31j43NO8m7k16K26l17K22K01k74J53l91N20j1j77
4408e8j9L0p1J9J13K1R9j30K20j43o5j01K30L8k25l1r6L75l08K40N2n5m0J99l16
4433b2mN9m0j03J27J06j16o2Q1o8R9n0k2L9j14J38q4J71j29Q4k24K26l24N09j14
4458A63l41L2J51R8j2k90L99Q5l74j70K05Q3j89K66n2k27k19N36K0j8k89K05K80
$$ y = [10, 102, 59, -359, 78, -15, 22, -66, 47, 44, 57, 42, -115, 52, -16, -88, -88, -49, -57, 75, -37, 84, -8, -249, -74, 128, 200, -153, 26, -76, -103, -278, -8, -22, -34, -105, -26, 97, 58, 25, 205, 47, -146, 92, 59, 122, -137, 67, 115, 105, 106, 108, -140, -32, 77, -175, -93, 139, 89, 35, -241, -231, 317, 154, 144, -7, -127, 105, -8, 103, -86, 52, 20, 51, 95, 105, 4, -39, -77, 157, 105, -87, -2, 30, -118, -145, 117, 16, 38, -12, 43, 1, -29, 50, -45, -17, -81, 189, 110, 13, -78, -21, 136, 122, 76, -224, 116, -108, 123, -20, -15, 53, 6, -210, 16, -301, -79, 122, -152, 1, -390, 130, 119, -58, -77, -47, -118, -99, 14, 35, 134, 4, 224, 81, 16, -85, 145, 183, -42, -73, -169, 206, -102, 138, 190, 135, 95, 294, -22, -26, 33, -7, -110, 17, 123, 7, -55, 26, -42, 57, 7, -15, 24, -90, 48, -36, 135, 6, 90, -134, 92, -232, 277, 163, -178, -146, 5, 103, 91, -199, 200, 285, -89, -259, -54, 29, -160, 106, 54, -173, -392, 144, 164, 146, -143, 62, 342]
4481C42l50j36K40J4o0j6R5K1k64P4K76k60j84J49J7P5K7j61NR0K1j87K85K9j54
4506a2J25k21oJ58l2NL6k61P4L54j28k39N4m2L02k06J23N4j09r6M4J71l24O6P7
4531c3N1O7p3nJ43j79k78M34k39p8N2J32R5k09K51j0k84j26L63kr4j2K40k53Q0
4556C3L8q5Q0k33K39L2Q8j67j49j23J71r0L42m5p7q1r2J64j3j47P7J24O6l64K10
4581bJ24m29N36k96Lj6K29j58N4n0N9J4j05j5J65k05J1J12J15l19L26j32n6K22
4605A87k35Q0n4Ko4K07j34j7J54j48k67M33pk00J56j94N7J38Pj22O7r2J15N0j21
4630bk24L46j40o7M5P4J76k75J31K9j53j21J16j62J43o3K64j97M2K52k49l06K18
4653a23L01j51j6R8l8k89J86MJ94k56L05l02J03j09j5K79k44MP0k18L52O4j63
$$ y = [342, -8, -144, 96, 110, 50, 34, 129, 150, -114, -40, 236, -24, -208, -59, -42, 33, 60, -101, -96, -6, 15, -172, 113, 142, -12, 113, -108, -114, 44, 12, 17, 53, -208, -134, 220, 92, -147, -93, -135, 167, -39, 84, 138, 29, -67, -23, 148, -176, -110, -33, 18, 85, 12, 7, 150, -29, -307, 127, -112, -190, -138, -6, 89, -120, 131, 121, -163, -289, 74, 72, -22, -34, 206, -47, 33, 71, -14, 66, -167, 72, 104, 192, 25, -124, -247, -76, -166, 176, 131, 54, -27, -119, 45, 32, -115, -38, 86, 152, -212, -2, 122, -307, 229, -67, -64, -80, 149, -9, 45, -5, 54, 68, -37, -52, 113, -92, -81, 31, 146, -173, 153, 21, -35, 187, -48, 32, -22, -20, -84, 123, -11, -28, 126, -22, -289, 144, 137, -63, 93, -101, -44, 94, 101, -21, 46, -46, 69, 119, -2, -226, 120, -20, -87, -42, 32, 208, -67, 64, 93, -60, -181, -65, -227, -84, -147, 117, -80, -38, 214, -35, -341, -123, 178, 27, 11, 109, 71, -218, -32, -28, 166, -90, 215, -87, 16, -93, -108, 171, -73, -69, 1, -217, 135, 199, 36]
4676C6L9j75m7K52j59R2k01N0R7j38j30J75J3j8O3j25J02K23j39j5R3k03K96k69
4700h8J11j39J93K5j14M3j07O1L0n8J40j80J87Q4j99j0M9j77J37Qk20K85Q1r4
4724D8j24k17J47O4K55k77j29L08j08J01p0p1O3j20K55l0k90J89M3l5M3L4Op3
4748A2Lj80J33p5J72j32J1L34k87j25J58k23j4L37l07L00j7q1mpK4Q7j06M3j05
4773d9m0L70k39NJ39k75K48j75k50K69N4j40L6J10k6Q2j78R1n6J13lk11J56J05
4797A36r2Jj70mL70k07r0J37j2k37P8o2J90Q6K6k26j8L55k00r3%P6J00r3k72J74
4823d7N7o1Q2l7J05k51J12P1o3J31j01p6l1n9M6J98p0L0q7mJ21j80J57j05O6J92
4849A96j16j86K11k07K06r4k63J75J21J5j81L8m7L82j84j36J36N9l19K71J06q4
$$ y = [36, 75, -100, -147, 105, -54, 38, -163, -113, -16, -154, -284, -109, -96, -114, -51, -176, -74, 149, 10, -5, 88, -115, 181, -88, 23, -116, 77, 102, -12, 31, -76, -15, 15, -43, 97, -83, 104, 188, -11, -21, 28, -149, -12, -4, -224, 61, 142, 48, -76, -293, -146, -82, 173, -104, -233, 75, -33, 68, -2, -73, -10, -130, 125, 95, -195, -6, 37, 2, 45, 79, 85, 12, 15, -165, -32, -107, 65, -67, -56, 278, -9, -134, 24, -199, -213, 124, -183, 117, 100, 19, 15, 8, 32, 119, 13, 56, -49, -89, 281, 42, 47, 186, -89, 159, -16, -266, 3, 57, -83, -47, 63, 37, 119, -59, 32, -24, 89, 86, -125, 31, 136, 44, 45, -125, -129, 241, 34, -56, 81, 69, -168, -90, -152, 38, 124, 150, -76, -94, 261, 61, -32, -32, 44, 144, 51, -221, -47, 10, -51, 31, -6, 99, -152, -40, 31, -32, 99, -2, -78, -109, -168, -122, 76, 6, 36, -51, -55, 66, -114, 43, -62, 4, 196, 80, -106, 105, -102, 104, 10, -253, -78, 43, 58, -123, -85, -132, 250, 66, -70, 66, 125, -194, 77, 183, 99]
4871I9k22J85N1j87J02j02K31k74q0K98j14m9n4J38J23j81l4Q6k83J51L45m21
4893a92J88L2J8l7J51o9j12o1K90j17n8J45j22O1k32L29j62k20J96j64K80j81
4915c7J07j59M5J1l1r5K80k13j24J92k0J37j37Q3o9L05m01J38j81L84j08j58K12
4938A61j08N7j40J66j02j04K27k3k04O9l0l5J48M2n4N4j49m2K33n6j76K48k25
4961d3J19j31Q6k1j8J0j30l8J13mj29O5J22n7L5j22K92o3k87J30K06m7j35q9J51
4986A5j63J31J10j15j90K27j20K6L12l78J75O4Jn4k6K37k12m6k8j8p3L61j13k02
5010g9Q0p2O8J07j99l1j6K26n8j19J29J75k90L5L40j73Nk3L1j51J79Qk05J3Q2
5035F2Q1l8o7k07P6K56j05l9Q3j50J52j64L99l92l9J11j27Q3M2j31J82p0j23J39
$$ y = [99, -123, 62, 113, -74, 28, -74, 157, -117, -197, 101, -13, -62, -116, 22, 145, -36, -70, 16, -267, -116, 229, -192, -4, 28, 46, 9, 160, 91, -21, -82, 208, 91, 33, 178, 56, 117, -115, 214, 52, -168, 28, -136, 144, -37, 70, -89, -44, -33, -64, -159, 121, -92, -216, -24, -44, 93, -44, 39, -30, 275, -126, 12, -169, 215, 107, -51, 161, 53, 110, -30, 136, 34, -70, 157, 134, -70, -1, -31, -66, 82, 124, 70, 124, -25, -67, 166, 110, -66, 182, -43, 76, -55, 31, 10, -8, 2, -128, -166, -53, -57, -186, -121, 1, -56, -21, -143, 149, 86, -201, -71, 135, 88, -47, -136, 15, -148, -17, 93, -22, -212, 15, -105, -79, 233, -145, 30, 94, 95, 41, 15, 252, 40, -6, -34, -52, -125, 236, 123, -79, 1, -71, -3, 104, -95, -126, -142, 84, 26, -93, 36, 211, -79, -44, 296, 123, 128, 105, 136, -15, 164, 172, -33, -20, 62, 143, 105, 38, -169, -93, 163, 58, 19, 102, -48, 104, -60, 339, -53, -92, 19, -108, -25, 17, -114, 68, -2, -125, 14]
5059A4mj96L6K98j45p8J00M6n9j62J74j52L13l10nJ56Q2j56Q6o0L01k59k32J64
5083d8Q0j24J25l9q5PL6J58j29J95j00K19l82q4J92Rq5J80j41J31k70J92K72k56
5107E3r1J47m4k44K20r5J85j23%P8q1k6p8J37q5j2j39J56o3K75k85J84Nj24j46
5132a96J14lJ28J41J40j82l35J84K10Om2j56J6Mk0O1k32K76j54j67K7J08p5J38
5156inJ91j09k78L12n6q9L28l75J61m6O2L0k57K6L94k41j25K3p9J72qj86N8K96
5181A90j05j0lp7lm6j22J0K92kj54l8K66r9l8K4j23R9Ok32J10O6M2p5J6N7l11
5208b60K45j01K15r8n3K1j40J8M8jJ22Q0m2R6P3k38j16J72p5j98J27K55n6l5J45
5233B04K4k44J6o3M4j90K12M8k8R3k45M5K60j57r5L18j66J01k56O8Q7k54P9J89
$$ y = [14, 10, -186, -150, 148, 3, -75, 25, 71, 12, -150, 24, -128, 185, -125, -130, 26, 108, -48, 38, -22, 279, 20, -212, -48, 32, -92, 33, -6, -91, -84, -48, 110, -19, 176, 76, 295, -87, -171, 21, 30, -55, 125, -16, 115, -155, 37, 309, 53, -38, 109, 65, -179, 41, -54, 131, 8, 8, 86, 5, -21, -99, 38, -47, -59, -198, -42, -105, 170, -115, 69, 74, -50, -196, -82, -85, 43, 184, 324, 142, -193, -9, 201, 207, 165, 9, 25, 29, 9, 70, -162, 114, -40, -207, -180, -72, -147, -9, -14, 177, 68, -210, 102, 46, -43, 285, -90, 71, 25, 87, 117, -140, -114, 280, 39, -86, -63, -142, 30, 22, -164, -106, 190, 85, 75, 72, -5, -8, -54, -176, -166, 126, 124, -30, -68, 198, 99, 61, 85, -38, 61, 67, -165, -55, 11, 53, -22, -6, 51, -260, -15, -116, 99, 1, -52, -31, -171, -153, -105, -106, 16, 96, 54, 150, 223, -15, -131, 41, -34, -232, -105, 150, 94, 59, 204, 228, -16, 0, -63, -19, -209, 3, 51, 23, 116, -129, -84, 176, 19, -76, 242, 76, 177, -79, -11, 76, -178, -99, 90]
5257I0jj57J7R8R6j73QP4n1J76j46mK2j50L9j36P8j7J42Q2q6M3j49K23o6j53R1
5284a0j19J2RJ22r9L2r0L60k63j67L04k08R0J25nk24K21n2k40J92M0j42K35l33
5308b10Q2pK21q8J90j52J95k36O9J5J1j99Q3LL91l61p3Q2m5q7R5K7ll6j8L8R7
5335H4j60k6m3R6m1j81J54J30j66nk9J42k4kJ38%j73K14j69K04k42L16O2m57L27
5360A49j07N1j02n7J18j18J11l3j16q1K40mL3k31J12N9j03M9j02J47J26j18k9
5383fL2n0p9K59m4j1J7j14K02l53K18k08K10J74j11q7Q3j77P3O7k4j83pp6M21
5408B26l24K40l10M6J39J9r3J95q7j79K94l56K22j99J86J78k51p2K38k32J88p8
5430a0M0j85oJ36o3k9J46n3J77k75R5m7K06j79O5l2O0Koo7J21L1n1K03l77J91
$$ y = [90, 89, -68, -51, 47, 143, -30, -22, 52, 1, 177, 31, 27, 49, -101, -62, -198, -120, -137, 5, 87, 1, 44, -105, 118, 52, -101, -10, -129, -117, -108, 14, -85, -53, -143, 217, -46, -213, 91, -117, -27, 98, 93, -131, 90, 38, -202, -10, 30, -112, 123, -210, -128, -135, 86, -2, 188, 36, 231, -5, 64, 79, 90, -109, -26, -23, 368, 7, -66, 16, -29, -116, -21, 6, 3, -33, -51, -13, 84, -76, -102, -145, -49, -90, -271, -117, 13, -153, -158, -187, -45, -69, -71, 67, 67, -106, 108, -61, 143, -99, 217, 279, -178, 149, 42, 93, -9, -66, 52, -66, 45, 12, -104, -185, 55, 51, 84, -147, -35, 24, -79, -30, -132, 15, 141, 23, -6, 26, -24, -103, 156, 112, 101, 118, 4, 206, -147, 71, -137, 73, 247, 136, 49, 132, -45, 28, 95, 71, -112, -119, -195, 226, -98, 142, -168, -122, 17, 36, -57, 138, 51, -128, 166, -190, 32, -167, 19, 197, -54, -126, 112, -120, 68, -10, 30, -155, -161, -25, -88, -117, 29, -24, 153, -122, -27, -74, 132, -47, 18, -14, 46, 48, 42, -25, 96, 127, 76, 279, -98, 93]
5456I3J62r3N5k01m3J19Rj47J92j26k3k9J59j10K3j56J28j61J51K36j23o8n9J31
5480A19k18J06r1J54r6M6M1l5R2j27j10N4J10k68K17L1O0Q1k57l7L52l38L3K09
5504A28k68J79j99K45j49r6L51j96j41J70J08j38o9R0m3l6K04j54m2j31K95l22
5526b14O2K04J0K8k51N52n69L24q3k26K70k56K17q9K7R8q0nL6o9Q7j98J79k05
5550a51P1J52j97J10k2K81k05k39R1m3K06J39j76J24k49P5l7j7K62m1M1l3r1m8
5574CJ64j60j54P9lj61J45L27p9k85K41k00K3M0J51m4r2L05n52K91j3j57R7J05
5598G1k33O8K94k54Qj11L2J16Np3J49n5k4Q0j50j81K31O7o5j52J58L1r2P0l1P7
5624C6j22O1L5O5N7j4l10M42j55j29J26k29Q8K07l45R0K1P8j06L36j35j82K6P4
$$ y = [93, 255, 162, 217, 16, -27, 92, 101, -46, 146, 20, -3, -32, 127, 17, 40, -116, 12, -149, 2, 238, 115, 47, -12, 119, -99, 7, -84, 70, -26, 20, 61, 26, 118, -9, -119, -65, 45, -223, -6, 25, 85, 166, -91, -128, 224, -114, -81, 128, -140, 39, -160, 85, -64, -160, 191, -5, -146, 24, 132, -6, -75, 15, -28, -64, 140, -14, -56, -187, 108, -214, -152, 52, 62, 90, -161, 391, -178, 146, 63, -163, 107, -149, 68, -21, 6, 104, 24, 19, 55, -14, 73, -125, 54, -151, -80, 72, -125, -15, -37, 244, 39, -200, -109, -152, 54, 193, 17, 141, -108, -33, -70, -87, 175, 134, 175, 142, 51, 3, 167, 7, -147, -68, -71, -232, -87, 240, 161, -124, 117, -83, -60, -20, 131, 87, -5, 300, -252, 39, 26, -131, -34, 71, -162, -94, 200, -54, -46, -157, -125, -9, -4, -77, 72, 17, -7, 73, -77, -258, -27, 40, -25, -177, -19, 12, -80, -10, -41, 36, -86, -25, 10, 75, 132, 118, -192, 250, 95, -34, 92, -137, -49, 158, -187, -97, -76, 2, -104, 232, 97, -85, -59, 15]
5648A5Q8P9Rm78M89m9j65O8k76K98J69j40l06J91j3M4o7l4M2J85k29L07o9k2l7
5673I9k21J19j52R3q1J35k13Q6l6J84m3K14k99k6K77j95k0K83l24J29J4ql14K62
5697c7n7K44k13J23K34m52J81J86k07q1J5L3N3j72M1L3l7J61l06K42m9L8K22l35
5721a40J53J28l46K18J66p4Q3o9k86L43j97r1K55q8j25J05J07j56k71M74l49J70
5743A0Jm1j42J34L04m34K73j78L48l52K8J30j57R2j79J94j4j7j15J07J05k13J93
5766G7O6k04l8J47j47K06p5m6N1j49J3J21J50K6k24qj05J79Q9m3j01k03J73N0
5790Ej37K38q4j70L62j63j5p4L5M3m6J2J1r7M27l23Nk64L51j70K8j5n0L0k5K28
5816A42n9M1l01K89o8j30K36l26J6K09j02L21k71q5J3K95j60p7J43k06K1Q6M7
$$ y = [15, 103, 182, 191, -287, 202, 153, -12, 56, -220, 78, 247, 107, -199, -8, -21, 23, -44, -78, -36, 149, -80, 227, 158, 136, 99, -122, -3, -155, -62, -143, -8, -221, -135, -171, 13, -30, 184, -115, -141, 136, -59, -79, 204, -120, 9, 23, 15, -299, -37, -94, 150, -63, 60, 294, -158, 23, 209, 2, -79, -64, -31, 22, -150, -109, -76, -113, 48, -258, -16, -65, -27, 195, -140, 13, 141, -205, 13, 179, 105, 188, 119, -167, 176, -21, -112, 143, 55, -70, 35, 142, -14, -285, 189, -160, 10, 11, -30, -172, -38, 266, -168, 105, -73, 275, -77, -49, 81, -76, 16, -163, 31, 17, 0, -115, -8, 97, -116, 77, 143, -61, -99, 48, -99, 107, 32, -14, 37, -112, -99, 22, 172, 198, -26, -34, -139, 40, 129, 86, -15, -218, -45, 5, -132, 106, 22, -148, 214, 51, 36, -38, -3, 40, -6, 6, 17, -80, 347, 24, 29, -235, 116, -54, -26, -41, -91, -61, -86, 142, 83, 124, -177, 112, 44, -86, 150, -176, -160, 49, -53, 268, -3, -88, -75, 220, 60, -17, 126, -80, -59, 27, 74]
5839G4j9k27Q1K7QJ6l6P4K69r6j81l01M79j59j99K44p6N4J8K3o1j34K83p0j66
5864g5J05r0N4P7j47j38L29k35Q5L1j72K72k42K28l4kj17Q1j3L5r5O6J7j07P0
5889a7Q4R7q2k17J67K02k40p4J85j02j16j8j6K93k23L25n8j45P0k02j18J61K2
5912b2q3K22k50J61J0j56N00m87K15r7J23m5n5q8K01j37J7j63K56k69J44Q7k23
5935a39J00L0K25j67k04J83q0p5R6L1R6j78J14k54K86J0j05q9K45l6j99K47M2
5958A79j64j6M7j71L14j41j83K10j88J43K9K2J9j05j28mJR0j61P3L16l02N1L3
5982c6J8k3K36k78l4K26p0J47o8l44K21p8l0J57oJ7k41L66k36J15l0J7r8J54n3
6007D9lM1m2ok85J70K3J76j95J28K45k57j50J97n4K4l3j75J42L3m4j92J14K09
$$ y = [74, 55, -172, -91, -64, -56, -40, -76, -2, 267, 171, -10, -311, 168, 9, -190, 54, -22, 32, 50, 73, 12, -122, 161, 91, -75, 30, -60, -6, 71, -76, -214, 115, -120, -35, -4, -176, 96, -146, 82, 48, 46, -71, 10, -3, 32, -63, 3, 20, -87, -17, 67, 164, 82, -135, 32, 234, -6, -80, 105, 3, -113, -131, -147, 146, -77, 248, 190, 45, 115, -87, -205, -44, -22, -105, 117, -133, 28, 38, -118, 382, -105, 110, 13, 136, 91, 36, -52, 149, 12, 29, -134, 122, -147, -3, 84, -139, -39, -9, 216, 49, -155, 28, -52, -127, -31, 0, 96, -82, 32, -222, 64, 74, -31, -120, 125, 89, -110, 137, 179, 15, -1, 46, -125, 189, 48, -135, 75, -113, 30, 59, 81, 100, -5, -133, -137, -136, -46, -207, -134, 182, -120, -69, -36, -18, -41, 195, -83, -117, 109, 39, 186, 118, -226, -5, -83, -113, 44, 38, 55, -186, 180, -56, 59, 29, 46, -52, 102, 49, 46, 87, 45, 39, -246, -76, -53, 123, -72, 56, 301, 44, -106, 91, 37, 61, 28, -147, -5, 28, -16, -208, -94, 115]
6031A15o7Q0l33K94qL5k59L1N7R3m8R9j94q5J33K6j05j45L21J36j63j10J37R0
6055A30l8m3j71L59j20j73J29j44J43q1Q0lj40J33R3l98L53l1N1l1mq3K8J06j38
6080Gp7R6m4O7J1m8k00R8mk5L36J4j67k5n4J54j23J08l62M6L19j42J70q9j55J59
6106G0k6n6P7mJ08k17K9r8J02rJ21M2k58k35J30L00j81j6J48P6q0j28R2j39L07
6131A55k58K52j02J18l29J07Q1m4P4r1Nq4J2j48N13j03l12K50o2qO1o9Jr3OL73
6157C05k87J84j54P0r0k84K30N9M0j57L49k10j16l3Q7K08k97K76j74j67K26k00
6179a35K7K57j88J86l01J04J05R6l45K24J2N0J2k41J17J83NM8j35p7J3n5n5K33
6203A40n0j62j27P7L01j38M5On0J3l3M7k6O3r9k5m7M0M7j5K42j03j86K1J79k67
$$ y = [115, 48, 128, -205, 89, 81, 116, -143, -112, -55, 38, -10, 89, -105, -190, -57, -31, -136, -281, 40, 176, 13, -97, 40, 130, 92, 49, -122, 237, 117, -56, 73, -71, 72, -9, 71, 68, -72, 61, 154, -244, 109, 78, 129, 98, 94, 11, 39, 145, 7, -70, 26, -18, 49, 60, 12, -188, -90, -94, -119, 217, 231, 64, 39, -15, 139, 16, 124, -238, -192, 127, -15, 155, 66, -89, 70, 44, -12, 65, 61, 169, -48, -19, -117, -15, -24, 97, 139, -119, -354, -224, 76, -105, -121, 27, 103, 23, -105, -13, -152, 155, -103, 149, 47, 165, -164, -57, 24, -20, 54, -37, -32, -116, -104, -252, 261, 158, -154, 96, 34, 26, 87, 18, 19, -74, -68, 305, 18, 202, 48, 118, 28, -256, -26, 33, 73, -84, 265, 55, -61, -94, -7, 201, -96, 180, 6, -161, 65, -135, -108, 149, -39, 147, -154, -50, 55, 151, -194, 30, 42, 92, 104, -137, -20, 163, 168, 216, 81, 4, 17, -38, -93, 140, 90, -72, -199, -122, 179, 41, 86, 92, 42, 55, 22, 69, 43, 106, 7, -18, -65, -25, 22, 7, 249, 146, -40, -19, 160, -107]
6229a07J07J45k7%Om7R0l58O8J20q8LJ51J4nk61L25o5m81N32k11j05K99n6N3j21
6255a9J07K19o31K95k2q4J89J06l65J57J88p2J10r3j25Q2j72K33j56k40J14p3
6277b52K03j47R4q4K46k42M4J03p5l9K57J29l08pJ40l6p3Q4R2R7m60K54J76j85
6301A1j91n4K73o0j76K95J5j74J51k36J27R6rO8p2j53Q8K9j57L06k05j03J22o9
6325g8N1l4j69L12j39j63L15k19J87k18P2J45k5Q4J06j25O0k5o6N7q9K8K5r3k9
6350c0J80k53k8M6J61j43K33j75K15k95Q1o8jJ18K1O3q5j93n7J50j6Q3P9j72Q5
6375aj02K9J2n8J46J05j67o5M1J81k88L9Q4K13q6l44J58J10J79j79k37l2K33J2
6399a7J70o7R1j14j08K7J83l95J92m8qJ72r2nr6n1K6J47J99j22j14l3j41K89k99
$$ y = [-107, 0, 145, 118, 118, 124, 77, 167, -191, -123, -3, -91, -88, 63, 77, 72, -189, 136, 71, -410, 122, -89, -194, 105, 49, 102, -19, 88, 307, -324, -29, -51, -135, 54, 160, -205, -48, 140, 68, 178, 85, -40, 42, -130, 103, -53, -293, -179, -252, -49, -196, -102, -186, 60, -182, -138, -35, -110, -149, 108, 237, -71, -78, 62, 26, -47, 37, 129, 226, -234, 20, 196, 11, -180, -234, 39, -21, -197, 98, 113, -61, 90, -146, -19, 77, 68, 136, 64, -89, -1, 28, -129, 177, -28, -131, -9, -78, -27, -61, -230, 82, -57, -220, 95, -124, 63, -155, -83, 62, 37, 121, 227, 102, 162, 137, 71, 128, 39, 67, 92, -1, -30, 150, -103, -131, -85, 76, -67, 166, -9, 206, -89, -8, -76, -77, 41, 62, 125, 40, -153, -210, -60, -76, 7, 86, -86, -1, -103, -74, -62, -120, 26, 131, -36, -101, -60, 121, -167, -128, -44, 169, 83, -261, -103, 7, 186, 7, -230, -262, -29, -17, 153, 86, 177, 63, -45, -18, 165, -230, -38, -86, -94, 78, -14, -19, -115, -166, -140, 7, 206, 84, -30, -63, -204, 85, -214]
6424b14K70l5KJ09j12R3j20m7L3nj27o3J48J53k3j98J46q2j54M58j30k46J98J4
6448F8j45m4l8J53L5j39K13j84o3K74K2j40P0j62P0O3R6k40K18r6mK5J1J9k02
6473a20N9l3K15j68j03K70n9j99N2J84j77Q8L8l9m1m1J10j64J49J8k9O6J24l50
6497a50j9K33J50q2J7o3l4M1j23J68k79J82j12L8J46j81o9Q0Q6Mj93J67J32k80
6521a41J92j42Q3j57p4L59j43K0J68k06q9j56M30P2r2m15L60m4J53j25j95L3K8
6544h1J04J73q2k00P6o4L38l08R6l0n5j6J39j44J35m77N32K2J14n28J99J86l15
6567a86K13J85k40j63Q8L17l15J05nO3l5j5N6o6j97K37J02k42K89j56O0j4j48
6590f7l7J51o5K13n6m6Q6j69l6J51p6j65M9J17J1j5oj00j57P2J32p5K03j95N3
$$ y = [-214, 56, 21, 23, 132, 20, 113, -7, -54, -21, -26, -153, -216, -68, 85, 62, -136, 10, -72, -226, 232, 102, -144, 54, 68, -77, -121, -159, -6, 29, -110, 103, -81, -144, 130, 152, 12, 82, -80, -10, 53, 149, -91, 127, 31, 27, 52, 63, 82, -120, -61, -94, 121, -47, -150, 120, 61, -138, -86, 98, -79, 9, 47, 8, -33, -74, 36, -128, 21, 39, 10, 76, 200, -150, -169, 64, 214, 132, 149, 86, 52, 93, -30, 138, -141, 41, -71, -33, 113, -68, -137, -57, 29, 33, -160, 7, 139, -141, 51, -91, -8, -165, -239, 120, -23, -3, 165, -41, -130, -286, 144, 216, 124, -291, 69, 25, 178, 53, -142, -109, -81, 23, 196, 114, -86, -10, -74, 264, -44, 52, 22, -33, -49, 90, -54, 81, -396, 136, 158, 272, -256, -57, 129, -186, 27, 212, -28, -191, -103, 214, -101, 4, -1, 62, 27, 12, 68, 2, -195, 42, 144, -98, 191, 35, 95, 81, -67, -104, 47, -18, 195, 139, 93, 179, 10, -26, 125, 49, -116, -67, 50, 61, 46, 40, -60, -217, -145, -13, -88, 115, -80, -27]
6615b7j48J64p3K9P6j09J59j30K8O6L5l8j83O8j08K76o3N1j69P2l4P2J56k64L18
6640B24Oj58K6oj6j08l0nj12L23j29j35J27j30J72j20P5j6Q9p7r1J59j06j63m8
6665b49K49o4O7O3q0m7q0k9K66l0k51J89k12K56J20j02j93K29k33L41l88O3j44
6688b59L18m4nk03M4K31j47J35k9m6K01r8j42J70j65O9n4r7K51j47K81j63q7j
6712A3j6Qp5L8M4m2R2p0n9L1K08J6j96p8r1J01J34k02K11N9k10j5j26K53k13L7
6738a48J93J5K9O3j05j39q3K30J91n58L33lJ14j20n2L07k3k82L9J07j89J03j45
6761a23j3J15o3J46jj72K02p4k8k9J11n4j7R3K0m5j51KQ7N1j3J58k70L8R6O4n8
6788G2j28J17oj40J00j7mj50K63n1J14r3r9Q7r8J14l24J55J23r2K56N4j44j88
$$ y = [-27, -175, -11, -84, -55, 21, -88, 71, -59, -31, 35, 70, 32, -151, -83, -191, 85, 22, 73, -96, -24, -58, 14, 170, -94, 224, 230, 72, 98, 92, 76, -32, -62, -67, -179, 144, 15, -120, 7, -123, 49, -71, 4, -12, 77, 0, -91, 68, -38, -201, -249, 0, -64, 3, 66, -14, -61, -141, -170, 96, 66, -185, 4, -208, 48, 168, 66, -127, 102, -131, 210, -178, -115, -259, 59, 15, 10, -193, -149, 82, -65, 70, 41, -5, 196, 98, -44, 126, -39, 30, -24, -121, 130, -17, 264, 101, 14, 13, -3, 5, -70, -32, 12, -30, 62, -8, -67, -36, 172, 188, -8, -86, -177, -76, 58, -144, 67, 126, -84, -99, -225, 28, -185, -148, 45, 60, 89, 152, 47, -92, -175, 55, 246, -312, 21, 18, 132, 12, -40, 267, 244, -38, 1, 108, -81, 22, -123, -136, -21, -84, 62, 61, -111, 91, 17, -11, -40, 71, 17, 0, 93, 113, 68, -83, -81, 6, 57, 44, 202, -68, -30, 66, 130, 72, -56, 61, 55, -85, 15, -2, -6, -156, 107, 56, 170, 77, -22, 65, -33, 81, -243, -88, 35, -57, 199, 253, 109, -79]
6812g9J19n8K7M9o5j0J57q5R8j3p4R5l3l01J78l3Nj21J98k8j09K80r6nPQ0m15
6839b32J35K65Oj33J63k9l52J84o4rK4N2J53k90o8K01j20J78R7k92M14j85L2o9
6863F1j14Q2j78K1J19k2l4l8Nq6P0L9o5j8R1K0j6J64q4m6J40k22j38N48k16N1
6889A34j19rj2J59j2j23k02L62n8j41J18p5l11J46K25P3j77J77j28J84k80r9K
6912a66K02o7j02J51j66L06k51J08l6K0j63J05o6J93j73p7L6J49M3j34R1Omj71
6936a66L05k92J86r7m9J47N8j57Pr4J97J41l33K25k04K07j4k11n5O9J25jM1O1
6960I6j13j4n1J26p0k6JNm8J23J71k35J78l5J4M4j66P2m2Op7r3N8N5j64p4K71
6987A2P0l17K79J11Mpj80K17j68j86K59j63K06k55J86J2j69j04M62j57j37j26
$$ y = [-79, 40, -18, 9, 58, -7, -17, 140, 55, 153, 140, 66, 161, 128, -173, 5, -28, -23, -144, 54, 26, -83, 197, 101, 96, 103, 183, -232, -97, 168, 174, 41, 204, 175, -177, 7, -57, -66, -42, 10, 163, -127, -195, 6, -114, 64, 161, -131, 283, 98, 130, 61, -53, 29, -149, -128, -9, -31, -65, -103, -98, -184, -114, -75, -140, -158, -67, -47, -63, 101, 17, -29, 111, -111, -249, 299, 83, 134, 15, 6, -6, 153, 141, 18, -184, 178, 120, -21, 97, 22, -289, -143, 82, 155, -22, 155, 27, 211, -69, -168, -166, 36, -31, -133, 18, -148, 158, -93, 15, -21, -1, -164, -59, -125, 68, -105, -182, -146, 3, 46, -88, 3, 9, 5, -166, 139, -153, 33, -64, -113, 34, 92, -65, -58, -152, 45, 186, -147, 78, -126, 81, 67, -144, -199, -130, -5, -6, 35, 96, -17, -31, -82, 44, -26, -52, -51, -46, -94, 29, 200, -35, 143, 108, 122, 166, 0, 72, 30, 36, -41, -134, -76, -21, -185, -259, 12, 82, -235, 44, 155, 159, 152, -28, 189, 21, -165, 94, -69, 137, -118, 68, 80, -89, -193, 269, 112, -25, -151]
7009a51K57q6j87J77oP1m1M8j65K27j06J07K84l14k29J18J44r6k02J60N3m9m5
7032c1R3q5J42r6O4m6k06K70j78L3Jo4R4J1K9L74l53k02K13j29M6J4ROJ17j66
7058d0J44P2M0l49L04j47J0k22M08j10k12l5J13J39o1n2%N4Q3k75J61J09p0Q7
7082A51n0k5j06R7k78l2J83N2N9j88J39o4L3l4Q5o8j09O6M4J50k67J34kP8j20
7107g2j68J21K1K59j74rK0j5m8J07j80K22Q8j72J31r5k31K13J51k63J42O0%q6
7131B2K9O8k42P9m1J2J45j73l6K10OJ38l71M61l98J60j57J14j4r6r5K49p3lo3
7156f9K28j35KJ0j74J76j2J85k77L04m7k15m0J24j0lj44K58j62N6j10k21J43l
7180a36L45j69n5K37r4j8j8K14l76J17k36n8L65k26L13k31Q5j06q8n5K07J02P0
$$ y = [-151, 106, 20, -167, 10, 4, 75, 34, 82, -83, 144, 38, 145, 429, 115, -114, 4, 148, 52, -150, 10, 63, 14, -31, 62, -23, 119, 23, 87, 41, -165, 105, -73, -40, -39, -103, -9, 2, 31, 405, 52, -150, 63, -66, -20, -6, 3, 9, 126, -40, 104, 176, 216, -133, 171, 24, 34, -188, 220, 110, -102, -137, -24, 115, 54, 2, 2, 56, 139, -136, 25, 134, 64, 151, 101, 76, -30, 67, -211, -243, -60, -8, 51, -137, 2, -62, -29, -63, 22, -46, -155, -89, -45, 105, -162, -28, -30, 48, -72, -240, -119, -98, 161, -13, -22, -2, -17, -65, 42, -138, 84, 172, 0, 131, 36, -195, 18, 169, -94, 48, 108, 108, 22, 51, 119, -123, -44, -85, -73, 72, -101, -137, 73, 79, 217, -154, 307, -91, 69, -88, 26, 12, -84, -179, 70, -3, -6, -69, 159, 24, 26, 36, -138, 38, 26, 211, -66, 238, 191, -24, -64, 60, 50, 47, -97, 161, -1, 55, -55, -276, -133, -136, 209, 40, -15, 222, 128, 110, 92, 306, -70, 47, -189, -247, 118, -108, 205, -26, 59, -47, -135, -190, 17, 119, 189]
7203A89k52K92j52j84j0J49Lk62K29j46J1J59M2r3R0p4R3n0l1q6L6Q6J18j06k05
7228a54M3RJ98q1o9L1l5P7k0q6J94j08O4p8J18j01R0k51O6l3J45p9P2j9Rn7J97
7255A42k92K11q4j01O6K3LN6K16j53j85K90m16L72j95O0J36p4Jp0J34j68j45R7
7279g6P5lJ80l8j98R5L8M2p8k2N8KJ03L3l64K99j98j41J07N2p7J33Qk10L06k45
7305a19K42j5J02k34j08K39j40p1L79k10J1k87K62k13K16j76K60j69KPp4J12j7
7328aM9j05J48k60J26j67M17j45nlj22P2J29L0k07j7P2pp6P8j03J8M9j61L86j61
7354C4p4j07j3R4j4P8K31l17K41p6j26J07k02K76j22l2j51J3L20r0k33K62j47
7377d8j27l7J33J18lp3o7R4k9j92J56K18j85r9R9P1q4P4j78L01O0j84l6J17k92
$$ y = [189, -63, 229, 77, -107, -117, 32, 35, -227, 2, -144, -133, 26, 68, -25, 65, -9, 84, 34, 3, -83, -47, 39, 157, 51, -154, -111, -102, 96, 15, -54, -23, -58, 19, -1, -87, 107, -1, 63, -15, 103, 2, 92, -159, -93, -126, 19, -60, 12, -7, 2, -55, 142, -150, 61, -23, -124, -58, -35, -32, 24, 240, 87, -98, 192, -224, 148, -47, 13, 149, 75, 76, 6, 140, -28, -173, -76, -1, -4, 176, 138, -60, 35, 73, 115, 37, 15, 73, 75, 178, 211, -153, 146, -52, -193, -86, -34, -111, 22, 30, -180, 126, -119, 123, 108, 210, -24, -132, 107, -33, -104, 275, 65, 76, -211, 51, -162, 54, -122, 138, -31, -29, -22, -96, 16, -1, 48, -57, 91, -169, -43, -210, 207, 62, 57, 54, -68, 4, 133, 163, -44, -61, 11, 4, -72, 6, -97, -79, -30, -191, 195, 34, -40, -147, -160, -66, -80, -2, 229, -88, 153, 77, -49, 58, -144, 132, 10, -22, -173, -160, 160, 70, -163, 99, -48, -175, -212, -79, 39, 36, -37, -104, -10, -39, -231, -75, 143, -42, -141, -42, 29, -55, 19, -159, 142, 202, 18, -18, 99, -193]
7402a93J28K32j33j45j3J6J04m0J60j98k7L06k79q8oK59j26K9m1J85lk31J74k40
7426a70K93R2k23qj15q2K51J74k34lo0Q0L9r8K5J60J45j62l6k59P6P1L12j91O0
7451A37j9k5LP7j58n7R8j45J68j68J79Ml19J84L00l28nn3K36o1L8k96J70O5j53
7476a28J58J2L7j32k2NP2K3j4n1j01j3K28M8j79O3J08Q7l38J42O4P7k48J63L2
7501I3k00K87k16l2J00j29L2j81L73k76RJ35l5O2p6K27l0j04lN0Q9N6j43M8j20
7526A6o1J34n0p6J37r2Ln8J92M7J65l89q7q5K80k18K00J51k84j60K45q8QK8R9
7551E7l8N6j98N1l4J67j33l5M12l44K15k63k0J22M8p5l2nN9O8l22K60j01M3o4
7576a06Jj05K46J8q6M3k45J64O4l6M4L8k70K44L5K3M2j58O7l1l2nM9J37k15N9
$$ y = [-193, -65, 167, 34, -111, -124, -108, -4, -44, 116, -82, -109, 197, -82, -170, -176, 83, -43, -14, -55, 130, 127, -104, 70, -170, 123, 215, -8, -16, -131, -213, 38, 212, -22, -25, -85, -5, 34, -64, -39, 121, 266, 104, 68, -191, -115, -44, 268, 77, 137, 118, 93, 96, 173, 15, -42, 56, -89, 79, -89, 90, 94, -225, -41, 259, -69, -74, -127, 109, 48, 86, -210, -40, 25, -128, 30, 42, 79, -53, -75, -70, 2, 25, 11, -40, -141, -154, 74, 122, -57, 6, 114, 201, -137, 5, 69, 146, -102, 61, 93, -107, 180, -36, -68, 32, -97, -65, -246, 127, -149, -140, -5, -40, 22, -54, 173, 143, 39, 36, 86, 175, 231, 88, 136, 16, -45, 89, 39, -37, 100, 8, 11, -47, 145, 192, 357, -32, -119, -204, 76, -142, 58, 209, -75, -235, 10, -78, -70, -42, 57, 19, 75, -123, -72, -106, 61, -72, -107, 305, -39, 176, -87, -107, 15, 63, -12, -44, -49, 10, 78, -244, 16, -85, -42, -106, -105, -210, 36, 54, -32, 11, -234, -70, -6, -42, 2, 40, -230, 14, 49, 72, 114, -44, 23, -8, -40, -45, 4, 141, -74, -15]
7602a5m4N2N8j35J54k16O8K43l17J80K9j55p7K2K21k92K04M6j47P6k8N3j07Q5
7626d2r9J71k01J82p5j4M9O1L4k7k82K14K4l44K81jj50J79K6R5M7k93L20k60J01
7651dj26J78N4j83Jl4Q2p7R7Q6mo3J18M7k04R7J4j65J45j60Q0L20k21r1j09n3
7677a75J21K18l94J83p2K44k26p4K37O5j63j50J98J02Nk18K36j4k01J22M1l9J84
7700B30j06n0j11p6P1K8R7J14k60O1j21j2P4Q7J79k6j69N0J6J00m4j25J52j09
7724E0k2q3Q4k47K60kK9o9j62L00n6O2q4K76n30L43j57p6K44k26j5M5k11K76j58
7749a29R3m0m1K73m2j41n7K78j73J0j37K74l44j5L17m9j85k4K46J7o7lk81M42
7773B22l43J68mj60%R5K1l9R9O9k28L02k10k22K67k3P9Q5m0j60O9q3L10l32J67
$$ y = [-15, -59, -7, 51, -84, 70, -146, -78, 165, -152, 28, 57, -98, -175, -153, 68, -224, -20, 26, -121, -45, -73, -20, -127, -42, -141, 30, -171, 11, -64, -78, -29, 32, 66, 39, -243, -29, -5, -349, -68, -69, -219, -40, -14, 81, 128, -165, 155, -105, -4, -130, 48, 102, -81, -80, -114, -32, -109, -12, 74, 70, 7, 125, 172, -32, 65, 79, -86, 59, -101, -21, 299, 78, -13, -122, -175, -54, 164, -230, -47, -119, 125, -101, -175, 62, 127, -36, -186, 12, 114, 119, -99, 137, 123, -78, 44, 85, 46, 230, 124, 74, -37, -113, -42, -14, 83, 197, -63, -2, -123, -135, -61, 26, 205, 179, 10, 60, 76, 176, 132, 7, 159, 50, 28, -55, 29, -218, 42, 40, 69, 0, -162, 138, 82, 144, 60, 336, -194, 149, -8, -84, 160, -66, -81, -36, -247, 29, -129, -36, -76, -117, 156, 114, -27, -84, 194, 21, 31, -106, 168, -176, -191, 126, 77, -108, -132, 114, 131, 64, 61, -220, 222, -121, 47, 43, -117, -117, -22, -1, -40, 59, 128, -100, 202, -8, -230, 37, 14, 93, 178, 138, -22, 47, -36, 274, -58, 109]
7798A09j45J3J12j43r1J33j39J05j4J63j27O3P6j15J52k30J56m9l6k0J19O6Qj00
7822F6kL2j53J96j00q3o4J7L2K25j25j08J91r1r9Q9m4L3k95J84j10K60J09j30
7846C0l3p0L2J2J78o8M4j14o8L4K00k45L4j3N2j49K61L1k08J75j84K3K27j41k80
7871b40Q9L02J1l1j55L5J1j99J04J70j7j13J67j64K9o2J31j1j8j00n9O4rR5k00
7896a70K07J26j06K3j87L23l47l0M2J30J1N7Rj82K32k47L9P6o3O5j62L88n08K94
7920B0K03l21L3p5J45n0O6J36l77J27N8J0J5J09m4j10K22j38J8K1K6j29o8J31
7944B8q6J35j52J09j10J50j21J6K85k38J5K14k82K51j61m9rN1j66j11J58m3j9
7967a35R4m8K10R3l65O9M9P2J09j76q6M2L8L1p3J70J22j96J6kJ19j7j94k3R1J03
$$ y = [109, -36, -23, 89, -54, -145, -12, -151, -46, -60, 103, -24, 39, 115, 0, 152, -78, 78, 29, -7, -27, 92, 158, 166, 66, 64, 96, -57, 139, 39, -44, -108, -91, -59, 166, 41, -67, 124, 33, -66, 23, -21, 12, -283, -99, -209, 51, 160, 30, -3, -73, -41, -29, 149, 81, 125, 11, -57, -23, 177, -68, -34, -47, 5, -144, 117, 148, -60, 115, -69, -46, 181, 40, -240, -151, 151, 162, 131, -24, 11, 22, -177, -73, 97, 80, -33, 134, -30, -1, -63, 68, 57, 39, -61, -120, -56, -65, 30, -170, 37, 163, 57, 80, -107, 216, -131, -161, -119, 11, 22, 79, 88, -94, 138, -109, -70, 6, -57, 8, -154, 234, -274, 20, 223, -98, -65, -140, 5, -45, 21, 157, -220, -93, -35, -25, -10, 99, 55, -55, 167, 29, 47, 68, 94, -35, -103, 28, -58, 77, -75, 34, -76, 74, -47, -31, 254, 16, 31, 245, -37, 214, 53, 4, -5, 46, -120, -231, -73, -116, -135, -41, -89, 121, 214, -151, -82, -33, 39, 148, -28, -114, -72, -34, -3, -76, 94, 216, 20, 36, 34, 153, 136, -58, -81, 10, 113]
7993A13l45K45j8J83k45J75Nl07K06M2K27k83qn0n1J65j81j24L07j20Q2l5L6j75
8017a56JJ70k20K90J6j98J30j28k3J41K5J52j00J21n14L19j46k7K29P1j04p5J10
8040H4K6l30J22j82L06L2k61K66j10N1J23k93R2j06J68O5l2P4k89N38l68n9L3
8063e0Q4j79J71p0j08M8Q1N0J9J46q1k00M9j27K72q9J7L5o4o4k7J78j29j99J36
8088a01J80j29J79j96m5J7J61n8J87k12j47J98J7j19j43K79q2l1p7K12P6R6k08
8111E4p6q1K54j81J63o6l05L09j60P8n5J11jR1j61j60O1r1J69J74n9k18K7K46
8135A23k92J44P2j05rj9j42J04JK17j63K22k09K1O4j62L60m73J58K6j14L2K62
8158A18k26J4K1K48k83J64J45k94K72j64j9j69K19j95J04R4k0m6J4r5P9n0n6J62
$$ y = [113, -232, 13, -5, 178, -67, 108, 113, -194, 12, 54, 281, -2, -10, -60, -111, 54, -127, -251, 56, -64, 18, -17, 19, -156, -155, 15, -205, 85, 101, -97, 33, -95, -118, 23, 48, 200, 100, 221, -293, 26, -120, -147, 82, 153, 49, -26, 84, 110, -220, -98, -280, 26, 58, -203, 63, -47, 4, 127, -166, -74, -180, -12, 53, 21, 95, -194, 344, -24, -83, -50, 34, -145, 26, -44, -152, -104, -23, 27, 46, 192, 111, -89, -40, -167, 105, 16, 33, 68, 4, -60, -87, 91, -38, -237, -101, 79, -50, 129, -67, -112, -95, 66, 8, 195, -17, -164, 34, 51, -68, -211, 68, -14, -45, -122, 90, 166, 262, 54, -22, -103, 151, -30, 133, 67, -238, 71, -89, -11, -66, 45, 44, 135, -26, -186, -125, -216, -47, 127, 68, -150, -123, 123, -169, -25, 47, -58, -67, -86, -228, -124, -123, 94, -69, 153, -56, -35, 29, -133, 227, -246, -88, -62, -176, -144, 118, -108, -94, -73, 175, -108, 56, 201, -93, 179, 15, -4, -173, 46, -149, -45, 49, 29, -17, -3, -98, -19, -69, -125, 37]
8182C7r9O0j03K70l16K09j08o8k4
$$ y = [37, -62, -2, -105, 165, -151, 58, -50, -118, -142]
8191a42
$$ Imaginary data points
##PAGE= N=2
##DATA TABLE= (X++(I..I)), XYDATA
0@%%%%%%Qj2MqJ6j6K4l2M0n6P2q8J04j20J44j76K08k44K88l34L84m46N16n92O72
31C56p64Q69r83J112j251J401j570J758j960K176k417K685k972L285l629M001
47B097m411M862n353N894o497P164p903Q735r677J0747j1975J3408j5105J7144
61I130j9648K2815k6967L2663m0976N4272p8857J38777n54217n21412J566804
72E82384K66563j206704l39717Q31840K06021k83200j62218j14635m0717M59337
82A98954K56461o40794m62480O70738N88407n54707o66544M55644N73972k77219
92A42432m02230Q1980J93258O4106N3962j45158k97018K39222M25261k75626m38867
103c58678K79729L70092k60267k04182K29622j4562j67109K34374J18255m18401
$$ y = [0, 0, 0, 0, 0, 0, 0, 8, -4, 0, -8, 8, -8, 16, -16, 24, -32, 40, -48, 56, -64, 80, -96, 112, -132, 156, -178, 206, -240, 276, -316, 356, -408, 461, -522, 590, -661, 740, -830, 928, -1032, 1144, -1273, 1412, -1560, 1725, -1904, 2097, -2314, 2548, -2805, 3089, -3408, 3756, -4147, 4588, -5089, 5658, -6317, 7091, -8014, 9130, -10518, 12297, -14670, 17993, -22983, 31289, -47568, 91209, -463008, -984420, 582384, 848947, -357757, -697474, 134366, 340387, 57187, -105031, -219666, -260383, 198954, 455415, -185379, -647859, 22879, 611286, 56579, -609965, -154321, 419651, 142432, -259798, -177818, 15440, 79546, 133508, -11650, -308668, -69446, 355815, 80189, -358678, -78949, 291143, 30876, -173306, 56316, 41754, -125355, 109019, 227274, -191127]
113a91127o9368N41225M1433n81811k9245N70109K336n08972O4247L84942j46304
124G7465k32920K43724Q1348l66177O7635M68099j94224n12371K61422N02853
134C96854k76710m46397K52953L32980j94637j80045J13490J0470m0080J42841
144A11719j7049k63120M3367L32831n0921l58192M3291L24839l5540k51790K7414
155i3151J50956m0972m2914O0483p1234p1974J59984O1314k13669l2641K31056
166I7238k3001k17817R8728J81693j73939j36239K37336R9752k76599p1224K87459
177A03387M9553k55577k5959J89972l200j00958M2750N110r1767Q8743J43845
188A45899j64321j86740K08890K14838k14016k17214J92253J90164j43318j29063
$$ y = [-191127, -260495, 280730, 322163, -259648, -288893, 281216, 283552, -225420, -161173, 223769, 77465, -155455, 88269, 169617, -196560, -128925, 339174, 144950, -367421, -105999, 396854, 120144, -326253, -73300, 259680, 65043, -115002, -1512, 8958, -31122, 111719, 94670, -168450, -125083, 207748, 156827, -201365, -158074, 166765, 131225, -120565, -93151, 57805, 16833, -26081, 34402, -36832, -108806, 51178, 112492, -101177, -133818, 97238, 74237, -143580, -44852, 136841, -37098, -173337, 63999, 163751, -112848, -184072, 103387, 152940, -102637, -128596, 61376, 58176, -42782, -32, 5078, -86689, 2054, 145899, -18422, -205162, 3728, 218566, 4550, -212664, -20411, 169753, 26435, -102628]
198a02628P7239N6637l051K2240n3411r5620R1582J59248j08057j94329J05818
209d4332K02341q3793j87616N5946J51469l3648r0617J2901J2820O509O0663k3189
221C9454j21722K8636J65204l3147j88314L9651J76451m4050j38845M0166R0567
232E4051l7460m2054M2116j0023m6215N4594M2222p9620l9187Q5464L6621q6950
244b6441k6462Q0575j383o3010L1172L6282n8277j7283Q1930J62j03354J9503
256d6586J05879l6934q6337L9434N7821l1684k9247K7382k215k3245L8684J4551
268B7503o2533m053P4192M309p9265o595Q5399R84p8675J0816N8260j5755l5194
281b0607J9466J3603k7612J3241L3227m3611k6416O4151J4183o8664o419O7541
$$ y = [-102628, -25389, 31248, 28197, 50437, -2974, -98594, -7012, 152236, 44179, -150150, -44332, 158009, 74216, -113400, -57454, 94015, 60367, -30250, -17349, -4529, 1980, 62643, 39454, -82268, -53632, 111572, 78425, -109889, -70238, 106213, 62163, -76682, -36516, 54051, 16591, -25463, 16653, 6630, -39585, 15009, 57231, -22389, -61576, 23888, 60509, -26441, -52903, 27672, 26289, -36721, -5549, 30733, -27544, -44827, 37103, 37265, -66089, -46586, 59293, 22359, -63978, -24544, 33277, 1593, -27654, -272, -2487, -25732, 12952, 27503, -35030, -39083, 35109, 39418, -39847, -46442, 38957, 39941, -38734, -27918, 30342, 14587, -20607, -1141, 12462, -15150, -1909, 31318, -12293, -38709, 25442, 39625, -29039, -35458, 32083]
293C2083K513o2372P654M8117j3755k4997J3704O547r995N673J4620j9494k0640
306b0342L6739J9986m8368j6839N0519J4965n2454j1822N0585q57l9555J2582
318d861J6899j7027R54J6479j5049j7545K7040J5959l7068r794L8759L759l2105
331a3600m149K8174L716k5764J380K0247q108j1347J0922L710j4480K290J8704
344A1695j3121j8759K2959J1290k7488l228K4790l020k0878Q283J5503j3764n576
357a1314J5665k206j2727N122J2214l609j1938M336J2167l893q351L617N169m474
371b22Q94P472r621r502J9339Q588k4685p622K4249P067k0457n984J1712M153
385E381K1l637j0119L372J5706o16j6467m207J6249Q622j0940j1900M041J5594
$$ y = [32083, 34596, -27776, -20122, 27995, 14240, -10757, 2947, 9494, -501, 5172, 19792, 298, -20342, 16397, 36383, -11985, -28824, 21695, 36660, -15794, -27616, 22969, 22112, -17443, -4861, 12038, -4989, -4035, 12444, -2605, -20150, 6890, 22849, -14219, -24013, 14746, 18505, -13600, -17749, 10425, 14141, -11623, -10243, 10004, 1896, -9451, 1471, 5181, -9299, -7009, 11695, -1426, -20185, 2774, 14064, -13424, -16652, 8138, 5118, -15760, -7477, 8026, -5738, -11314, 4351, 2145, -10582, -5460, 6754, 3145, -8793, -4457, 7710, 3817, -4534, -917, 4252, -222, 672, 8144, -1477, -10979, 8360, 16948, -7737, -15359, 8890, 15957, -4500, -10484, 1228, 5381, 5402, 1765, -8354, -4982, 10724, 10108, -6359, -10566, 5683, 14305, 3365, -8535, -4494, 11100]
399A1100J573j5121m734Q316Q883O63j4537q681J6173J4708j6748k0520J6591
412b334J9926j5992j4599R201P082j098k704l530k327M026J0065n044j5285L777
426h836J8412L129k1457j1351K6498J4183k6132j2688J9804J2417j3133j1202
438a0356P836M477j785L178m633o608K998P364O288j2112j6038J6707K2198j5444
452D070k8263J2379L3443j0691k9953R345J9896k508j1123o4Q133n341m427J5207
466A0103O62k2177o65K9571M344l9822m380M4846q39m0402M127L0915n703k6905
480a6325J0323K4021j7819j8498K0996J5782k0541k0397K3437K5698k7690k1694
492b2707K8121J4080k5938p515K7974N61l2102R186L2324j4990l2254J0693L6540
$$ y = [11100, 12673, -2448, -7182, 1134, 10017, 10680, -3857, -12538, 3635, 18343, 1595, -18925, -2334, 17592, 1600, -12999, -3798, 3284, 2186, -518, -4048, -6375, -2349, 7716, 2672, -12613, -8836, 9576, 12705, -8752, -20103, 6395, 20578, -5554, -18242, 1562, 13979, 846, -10356, -2520, 1957, 172, 3350, -1283, -7891, -4893, 2471, 8759, -3353, -19391, -2684, 19514, 4070, -24193, -11814, 21629, 10938, -19015, -9670, 10226, 7718, -3405, -3469, 4664, -677, -5104, 10103, 10765, -11412, -12077, 17494, 21838, -17984, -22364, 22482, 21643, -18759, -14632, 16283, 10580, -16325, -6002, 18019, 200, -18298, 2698, 18480, -2061, -22458, 979, 26677, -1013, -22707, 5414, 19494, -6444, -13959, 14015, 14576, -17526, -8340, 23984, 8994, -23260, -12567, 23973]
505B3973l365m3872k169M4809N543m1596r822L7805P804l2313J921K0966j3172
518c488r407K2257M838l1013n015M2038O210m9082q227N1628J4125n1920j8966
531c6022N4225J6866n4196j0257M8205L965m0305K866L2434j4005k4110K3714
543C380J5413k9221r787L1259R829l5327j1140L9983J2505m0232j4666L8864J7862
556B8722l6731j7423L4244J4186k7916j0512K1804O952j8331p09J7369p105j8504
569a3954J0651K2029j1634k7423J1724K9673j2680k9764J2537K8115j3040k4132
581a7898J5755J6343k1235p108K8099K289l4963O52M1325k718m4470L554M4653
594B4278j075m0775k687L2270L018k1061P8J0075m676m503R941J279j8363J052
$$ y = [23973, 20608, -23264, -25433, 19376, 24919, -16677, -26499, 11306, 19110, -13203, -11282, 9684, -3488, -12895, 9362, 14200, -16813, -21828, 20210, 26420, -22662, -30889, 20739, 34864, -17056, -36022, 18203, 35069, -19127, -29384, 18821, 22786, -17519, -14653, 17781, 3776, -20334, 3380, 18793, -10428, -20215, 11044, 20873, -14454, -25594, 14389, 26894, -13338, -28004, 10860, 28722, -8009, -25432, 8812, 22998, -4918, -15430, 6374, 13326, -5005, -5714, 11655, 4550, -13954, -3303, 18726, 7092, -20331, -8607, 21066, 8386, -21378, -8841, 19274, 6234, -17898, -2143, 14200, -7035, -14143, 13956, 16245, -18718, -18066, 23259, 20541, -23929, -20375, 24278, 23203, -17572, -20259, 12011, 15029, -6032, -5954, 4121, -555, -5058, 4883, 6162, -12201, -11149]
608a1149K5683j794k8415k359K6912P318k2577q252J5315P830o498p269J020O025
622A790M71l00J215n896m210R399J0486j0582j8509J1891K2172j0907k1461N812
636h629J9039j044j7221j212J1394K313l300l010k950j10N560R954r472j8404
650a7092J4718K2616j5158k4417J1473K6807o690k4255K089J5959N545q153j3051
663i609L024J4959K130j2063j1102Q106J6690l122j7345n928J5799J4334j5357
676E16j7046J1833J5072l299j3500l825J1772Q116o235j0627J61J4115Q82j2165
690d230N07M786J769Q79m244l776L199N259n21p764k77O179j95j669k303o81M820
707A738j222l510J887M31J41R12O2o68k437L404K663m773Q10K690j879M74L41
$$ y = [-11149, 14534, 12740, -15675, -18034, 8878, 16196, -6381, -14633, 682, 8512, 2014, -5255, -4235, 1790, 2261, 1961, 3176, -2720, -6930, 2469, 12955, 2373, -16136, -4245, 17927, 7020, -14441, -8629, 10410, 9366, -7855, -9067, 2327, 4640, 1340, -1670, -4620, -4730, 830, 10784, 1312, -17092, -2374, 20242, 5084, -19333, -7860, 18947, 12257, -11998, -9909, 6050, 11595, 3442, -9609, -6585, 8374, 10504, -1559, -12661, -4555, 12135, 9013, -8332, -14260, 1539, 15873, 516, -16530, -4697, 10375, 7076, -6424, -10249, 1523, 9639, 3404, -7223, -7062, 7053, 7935, -4230, -3723, 1063, 2832, 3711, -533, -4309, -1110, 4149, 3628, -4136, -4413, 1766, 1571, -98, -2401, -3082, 1738, 516, -2994, -1107, -676, -535, 377, 439, -229, -2666, 738, 3401, -1372, -562, 2128, 249, 723, 1064]
724A064j259K71R31J490k706j704K632k94J89m29k955L150J444m453O08K866J7
741H62k348j63K631q26j111J414j143J422J694l790L72L421J4k834r00K566J946
758C227k195k560q7M019J738o562j770N394J878l790l069J751L581J48l502k781
774d580L913M972m226m585L156L750l44k863j782K641L194j098m040J94M648k78
790B672l478l12J036J762l09k927o06L170O53k985j415K605Q6j83n73j520J718
807f06K473j935k473J859K946j641k478K241R31l39J57j796O15K583j187k037
823f87J03J793K41k105J1O47K11O93k203l38K324j343j51R45j458L02J841l17
841E09j742l92L632j112k636K950o77j463K709j5k754m88K838K402m450j840L692
$$ y = [1064, -195, 76, 1007, 2497, -209, -1913, 719, 425, 614, 185, -2770, 380, 1824, -2629, -2021, 845, 862, -1486, -1649, 982, 156, -955, 459, -684, 738, 2432, -1358, -986, 2435, 2449, -385, -1285, 1281, 3227, 1032, -1528, -1615, 2404, 4142, -2420, -4190, 1204, 3082, -708, -3777, -2026, 1555, 1703, -1799, -4580, -667, 4305, 79, -4506, -1350, 2400, 2056, -807, -2589, 52, 3246, 2148, -1892, -1698, 2950, 2672, -806, -1118, -82, 1680, 1371, -1556, -2162, 1008, 1661, -1324, -2739, -134, -48, -231, -804, -2324, -606, 1867, -68, -2541, -682, 2264, 623, -1855, 386, 1317, 978, 1135, -661, -46, 2537, 1350, -687, -584, 1209, 1450, -655, -644, 3, 214, 907, -1296, -1634, 690, -653, -804, 141, -1317, -1015, 826, 509, -1233, -1625, 2007, 895, -1741, 1209, 532, -931, 1778, 1763, -991, -1479, 1359, 3761, -689, -2529, 1163]
858A163J384j538l089m40M104m15j814p18j609L048L240m236l947K823O804k574
874B186p993M026N041k163n92j279j392K603L473p32p459j85J0047M3q481k566
890e423O349N715o388n892M884K316p01K41l644j593L802N395l738r083M635R276
906F151l115n943j288L724N680j894o686j281O779N565p514o380O475M764k779
921B258l901q76K489J176J298p27p805J183J1511Q8j4355l058J7395M419j9111
936h016k348J6614Q71j1457K13P137k295l125P091j177j0848M220J3082m504j5176
951i718K699J7669k024j7342Q06J3349J348r273k674N334J453j461N57l183j827
966d287N040L114k901n357m36P530M357o956r273O221J4285n616j6144M602J5618
$$ y = [1163, 2547, 1009, -2080, -2520, 1584, 1169, -645, -1363, -2972, 76, 3316, -920, -4867, -2044, 4760, 2186, -5807, -1781, 3260, 1097, 505, -774, -2166, 437, 3910, 3178, -4281, -4466, 5581, 5624, -2857, -5423, 926, 6641, 253, -5639, -755, 1561, 860, 1101, -2543, -4136, -334, 5061, 1323, -7760, -3125, 6151, 3036, -2907, -4195, -471, 5209, 3315, -3371, -4652, 2127, 7692, 178, -6202, 273, 5037, 2258, -1643, -2519, -30, 1146, 2444, 1717, -6088, -4905, 6606, 6694, -7661, -10719, 6676, 11095, -8016, -10364, 6250, 7121, -4336, -4123, 3014, 719, -2406, 4685, 3508, -7340, -3120, 9962, 5458, -9718, -7019, 10650, 8626, -8716, -7910, 5439, 6787, -2486, -5160, 174, 1627, 166, 723, -2460, -4287, 753, 3867, 966, -4391, -4827, 2703, 7060, 104, -9169, -2948, 11337, 5721, -10423, -5821, 9797]
981I797k545j3860J888J0453m009n620P018K04j0929L135J5965o581k0752R256
995f580K3464j1045k3120J0174K1201q836j6983Q627J0454q285l471R225k056
1008B769j0326O691J2676j0250j4102J1045J4579r438j3846O524J2145m474r093
1021e100J297N319J954k777m322O36M022M95k357k78N81k241L115N204p008p352
1037h812J0022R384j0196j1919J0992J3696j2118j2219J1954R530j1098o977J1882
1050D121K102j3476M661J2947j1448j1269J5130J0848j7986j1119J9900Q374j8483
1063e698m306J4083J679r169l34O691k549l848O804J268r267L86R183Q74r617
1078c820j193J0145n41p128N06J136J469K638k627n223K197P465l309q599N832
$$ y = [9797, 7252, -6608, -4720, 5733, 1724, -3896, 3122, 3326, -7603, -4468, 11497, 4916, -15836, -6580, 16884, 5839, -17281, -7107, 14094, 5258, -11725, -3098, 7356, -929, -4400, 4825, 2769, -7557, -866, 11810, 1560, -12542, -1497, 13082, 3644, -10202, -3678, 8467, 3993, -5100, -3803, 1516, 3470, 693, -3629, -2993, 1029, 1524, -833, -1111, -530, -2771, 344, 5548, -1460, -8812, 1210, 10594, 398, -11521, -529, 13167, 1049, -11170, 784, 10314, -784, -7761, 4121, 6223, -7253, -2592, 10355, -1093, -12362, 2768, 13616, -4370, -15489, 4411, 12785, -5698, -10004, 4079, 5758, -3411, -3745, 2946, 397, -3451, 3353, 4621, -4646, -4260, 4923, 5797, -3820, -5013, 5132, 4591, -2537, -2031, -895, 574, 3212, 585, -4638, -2441, 5024, 1715, -6884, -1052]
1093a052N967o960j160N631j930m906M493O118p726n756J1495L380j1660k229
1107f295J0933K330j1353k53J1666m382r225P023N898q641l840J0557J370j3083
1121g295K624J1693n979q565P528N303o881l351O942P39o930L718M850n014l145
1136c763N230K672n905j776P397r77o569L661L880m734k075N636J6o748K745O402
1152E092o105m513P570J587p058j27O643j665o000M809L326o241q31O765k19o305
1168c272J383O375l411n890N629M742o737k407O656J33p131K384P083o025m508
1183d996P343J793q217N27P760k285p016M468M874n941k673O344J178n908L35
1198b414O065k481n279M936L577n187k576N954R95o559J445N934l419m600M930
$$ y = [-1052, 4915, -2045, -3205, 2426, 496, -4410, 83, 6201, -1525, -7281, 4214, 7594, -4066, -6295, 4638, 6968, -4385, -4638, 7028, 2646, -6579, 444, 6342, -2299, -6139, 4418, 5788, -7295, -4671, 7022, 1043, -7522, 6, 5309, -1572, -4923, 2019, 2758, -4172, -454, 4396, -618, -3763, 1467, 4139, -1766, -3542, 3855, 2878, -3691, -30, 3850, -884, -2959, 2677, 2693, -4055, -1310, 5092, -1013, -5526, 2044, 3631, -3427, -3554, 3089, 1424, -4576, 233, 3559, -2682, -3513, 3252, 3033, -3272, -1889, 4486, 1075, -4815, 814, 5556, -1181, -3588, 3068, 3201, -3930, -1546, 5537, -488, -4996, 2347, 4140, -4077, -3550, 4210, 1925, -5091, -623, 4251, -1690, -4363, 1981, 3159, -2749, -2414, 3651, 1170, -4109, 827, 4404, -783, -3359, 2595, 3590, -2969, -1524, 4410, 991, -3609, 1321]
1213A321J525n485K0O272k572n411M046L453n187j188N107j3m842J539M454l275
1229b36l208M957J750n428p0N123l46n715K418N163m475l431N252J525n792L05
1245b208N549j769n916M176L780n425j478N302R2n005O98M979k522l926M208K206
1261B741m374m66L796Q8l965J198M753l411l196M784J048m598k37M457q42m469
1277b693K527K934m092r93M008j034k841Q73L276k405k659L979J071m119O07L099
1293A538n96k567P21L513k748j893L993j82l422R00L382j705l540K682L104m560
1309a380p61M377j040l430J392K695j758k765L126J412l785O7L000l19k526N82
1325a113K945j411k401K656J253k473J06J737q8k141R71J842k070j081K562n92
$$ y = [1321, 2846, -2639, -2619, 3653, 1081, -4330, -284, 3169, -2018, -3206, 1901, 1888, -2954, -1415, 3039, -236, -3444, 1513, 3263, -2165, -2235, 2888, 2542, -3173, -755, 4408, -67, -3498, 1754, 3279, -2513, -2208, 3341, 1572, -4344, -168, 3612, -1813, -3291, 2011, 2103, -2902, -2204, 2775, 253, -3673, 535, 2741, -1633, -2099, 1697, 1785, -2180, -982, 3771, 360, -2836, 1948, 2996, -1602, -1839, 2618, 1776, -2693, -166, 2768, -1324, -2317, 1691, 657, -2184, -1311, 1965, -440, -3099, 880, 1951, -2168, -1561, 1538, 942, -1625, -904, 2609, -139, -2032, 1961, 1779, -1643, -743, 2639, 934, -2606, 76, 3180, -1380, -2141, 2236, 1196, -2234, -842, 1853, 95, -2670, 456, 1868, -1917, -1850, 1150, 831, -1695, -1113, 1832, 421, -1980, 676, 1929, -544, -438, 1299, 1211, -930, 41, 1883, -187, -1268, 1294, 702]
1341G02j706Q04P40p62p57J261J04j846P44J798j800m65J061J057j322p79J459
1358B93P09k056P77J405q43r69P99J574j926p00K384l80j852M56J060l81r23L66
1376b07N86j013M1O54m84J01j39J98M62o81M2K47R3K53k54m39Q77J83l7j059N26
1397e0J488j027q51R40N11j074l95J201j81j651O85J609j280j264Q23J213l26
1414C71j810N67J714o53j612O35J935j214j650K139Q71j750o06K025N06j682q36
1431a050K442K49k566l34K918J2k747m8K961j350k382J712J478j373k071J771
1447c78J906k257j151K402Q73j928j208J905J767k445j144K985M59k635k31K065
1463I85R35l127L40K338p12j428M2J811j01k826N78L120j514k577R60L344j279
$$ y = [702, -1004, -200, 540, -222, -979, 282, 386, -1460, -716, 1082, -718, -1183, -122, 935, -387, -1166, 293, 1002, -1054, -277, 1128, 285, -684, 115, 1689, -237, -937, 1447, 1067, -785, -329, 731, 350, -573, -207, 379, -634, -593, 61, -423, -322, -461, -263, 199, -482, -440, -193, -100, 153, -101, -540, 337, 520, 483, -576, -50, 1438, 411, -440, 500, 1011, -63, -458, 743, 562, -1089, -404, 1205, -75, -1339, -516, 697, 371, -1439, -872, 842, 189, -1423, -788, 1147, -67, -1717, 422, 1293, -457, -1063, 962, 1468, -214, -1050, 1392, 1641, -925, -1259, 1659, 1671, -1076, -1124, 1837, 487, -1895, -183, 1295, -78, -2149, -378, 1528, -729, -1880, 522, 1395, -533, -1741, 164, 1931, -514, -1658, 1327, 1786, -849, -1080, 985, 1920, -1207, -867, 1471, 759, -669, -627, 1184, 1083, -1743, -1165, 1955, 441, -2136, -1176, 2168, 889]
1480H89l843K345L011l194j550K715J916k889j672L684Q21l745K2L714k00l699
1496a675j48M642r31m768K186L359k229k917K191K515k691j666L060K81k504k12
1512a507J909R89k327j282L024P29k569k72K143O47k493m59L018m23k059N76J405
1529A049J2j722Q9K012n58k203P94K171p97l248J635L578k963k872L087J640k722
1546a018j079L092Q70l843M20L253q40k370J359J977j081k703J707K775k572j781
1562a834K417J320k590j020K704M75k676O68J515j136p01K94J261o62q71N23N2
1579b61m9J85m65J115L42j505J24J067R4n79k16J152j05j550O1J440n5j363J82
1598c86J767j215k180K159J539k342j022K649J75l022O45K873j305k052J860J482
$$ y = [889, -2954, -609, 2402, -792, -2342, 373, 2289, -600, -2272, 1412, 2233, -1512, -1490, 2224, 2024, -1675, -1823, 2819, 1888, -2880, -694, 2665, 436, -2481, -290, 2225, -466, -2132, 928, 1209, -1295, -1507, 402, 1391, -936, -2218, 806, 1535, -1034, -1306, 837, 1484, -1009, -1468, 1550, 1127, -932, -356, 1049, 1061, -661, -572, 1440, 882, -1321, -527, 1644, 847, -2401, -766, 2812, -151, -3023, 64, 1704, -1018, -2097, 995, 1865, -1978, -1558, 1695, 855, -1515, -156, 1821, 740, -1963, -256, 2519, -53, -1834, 583, 1903, -687, -1707, 997, 1472, -1204, -536, 979, -157, -858, -564, 697, 35, -836, -313, -261, -310, -125, -590, 525, 867, -638, -514, 553, 647, 68, -148, 1004, 899, -651, -590, 850, 795, -568, -386, 1381, 166, -2014, 145, 1684, -658, -1680, 969, 1144, -1878, -1233, 1640, 335, -1717, 143, 1625]
1614A625k212j126K119P30j556j04J415j01j487J36J769o90j355J393P03j593
1630c34l49J335J90k060R00J270j590l79J627o68n89N08N32q56k36J187j17r62
1648e91O26O34j062K2Q39l6p87L58J064p68j058J145N14r46p17J095O67k038J37
1667i02J878q84j600J564J115j661j062K209L85k307O82J600p90j090O47J186
1683I70r43p62J637j89j566R17Q40p36o68N95J062j316o84J381o10p24Q67L17
1701C88p03o16J065K12j326O89J361j600j99Q18J54m92l05J321m22j248J653K38
1719I88j186k19J244J58j366m4J459p39j091J117J00p88k34R19k1j263L14J534
1737H82j031q94J133J98n27m22Q73O12j527P09Q98j268q2J098J13j071R9J326
$$ y = [1625, -587, -1713, 406, 1136, -420, -524, 891, 790, -697, -561, 1208, 518, -837, 556, 1259, -334, -683, 652, 842, -1218, -318, 952, -638, -1017, 610, -58, -647, -139, 393, -463, -699, 488, 371, -591, 35, 669, -393, -371, 468, 432, -355, 3, 1067, 299, -759, 386, 900, -46, -763, 332, 999, -1039, -902, 976, 92, -1508, 56, 1171, -490, -1552, 657, 1042, -1265, -583, 1017, 227, -863, -216, 970, 27, -735, 902, 713, -853, 64, 904, 168, -500, 95, 1157, -159, -843, 538, -72, -796, 71, 388, -315, -931, 134, 346, -980, -291, 1070, -530, -729, 89, 243, -249, -554, 767, 345, -903, 750, 988, -198, -417, 827, 985, -381, -425, 1034, 295, -796, 321, 421, -367, -601, 318, 297, -966, -652, 882, -149, -1043, 90, 288, -239, -661, 212, 824, -703, 6, 904, -364, -446, 652, 765, -306, -207, 1119]
1755A119o12j146R62L52j152J29P64o5q22K28O51m88p82J030j26n18j18N05L61
1774B72q51R6J038p41m59Q57J39l35j28Q75n58o55R56K05j216N19L81j66o02K93
1794h0O62r22k80Q54q5o25NP64l42q56Q44P95r94n35J225K37j268J02J419k49
1814F71j343Q89O37q10m56J140k71q00L46N78n72l77M01J65m42m4N09l75l12L20
1834a46K38m39j71N18P2l08K31N86m79p88J326k8j127P07O50m31j117M72J175
1853I41j232j03P23N8r55K48P58j59j112O76O03p04m43P38J34n54m53R87L75j158
1873f32O08L96k66k11M22J62n38J30M39m41k35O21k66m28N16j36j99m40O87R5
1893B84j254P85Q00p52m57L45O49m85j148J157Q74j355k27J404l37n60j76J431
$$ y = [1119, 507, -639, 323, 675, -477, -348, 416, 351, -471, -243, 408, -80, -862, 168, 42, -476, -594, -89, 272, -579, -483, 555, -186, -645, 212, 351, 16, -112, 763, 205, -450, 506, 711, -505, 14, 395, 229, -373, -80, 582, -340, -620, 234, 149, -476, -471, 293, -49, -905, -61, 734, -260, -795, 430, 667, -601, -499, 920, 671, -672, 217, 854, 44, -412, 728, 457, -343, 3, 581, 9, -368, 33, 198, -244, -288, 221, -154, -466, -146, 92, -347, -518, 0, 72, -236, -5, 581, 102, -686, 640, 612, -515, 192, 842, 411, -706, -234, 941, -291, -394, 329, 387, -568, -320, 438, 279, -833, -157, 446, -258, -701, 37, 171, -383, -836, 151, 526, -632, -24, 372, 106, -105, 317, 479, -59, 71, 510, 69, -166, 455, 189, -239, 277, 141, -58, -498, 189, 284, -970, -185, 615, -137, -594, -249, 400, -85, -1233, -76, 798, -557, -784, 620, 283, -277, -453, 978]
1911I78o49j263J156O02p93k26L04N46o25m44N01J91m70m8K85K99o08k18R83m00
1931A01m33J53J66J00k46l05Q46Q9o00N1K35N80r09l91J358k46n91J80L47rj067
1952e91K24J357j018p59R60L08p62n42P72P17j197m44J409P4j054j86J136K48
1970F52j167J96R03k63o44M02M30j64q70N80R92j105o84J076N09q47p18Q94M81
1989F53j189k93P97P84j349r5J154j43j176M94J034n95r24M77J148m41j017Q15
2007A34O45o68n71N46O86o35m01N28J90q91K03O10K7o42J16K49k12j96l52P35
2027A01J05l87o54J171Rr15L6J023kj088M71P20l97q02P97O65r07m68R45M83j347
2048d41l22J547j56j106j08J007k05j090O72P33n48o35P62K90r23K5J070k10q62
$$ y = [978, 329, -934, 222, 824, 31, -195, 109, 655, 30, -414, 87, 278, -192, -240, 45, 344, -264, -482, 501, 101, -332, -179, -13, 87, -159, -464, 382, 471, -129, -78, 157, 737, -172, -563, 795, 549, -42, 138, 485, 476, -591, -367, 990, -28, -787, 173, 481, -281, -823, -51, 666, -531, -975, 434, 508, -546, -732, 404, 652, -515, -319, 584, 321, -323, 79, 509, 345, -525, 55, 1047, -58, -742, 334, 843, -4, -722, 172, 653, -536, -829, -32, 752, -597, -692, 462, 319, -857, -363, 671, 76, -848, -371, 777, 336, -681, 134, 779, 111, -460, 86, 772, 137, -264, 264, 454, -437, -234, 376, 403, -239, -123, 126, -86, -282, -634, 101, 206, -181, -835, 336, 345, -570, -534, 489, 487, -601, -130, 590, 193, -609, 188, 853, -54, -522, 423, 906, -441, -763, 784, 628, -478, -586, 421, 216, -874, -202, 531, -17, -652, 110, 400, -523, -498, 572, 362, -500]
2067e00K06M77p8m29O28K83o24L54q7k00L91j98q3J31k06J64n03J54O31n52l77
2088d18N77J91n24o52R21N28j190K0J081o39o20O07J024q83r34J357N10j548K58
2107c34J045m6j274L79R87p66n45Q11M61j021j54K94N26o14j29J016n45q00N40
2126a69M37m65j39M33P7n77K75O87q40J34O98l52l66M11q0k26l17J017j89r51
2146e02N38M26o04k47M50M73q80l56J108k37j002N64O21k19r17Q24O28q54l21
2165e07J130j5r40K14P42m57o13P00N77j249L44L62j48l49JN93n98n0M15M4n83
2186c87L96K60l88k25J49N24m48k10R35n44o23O92M37n81k79Q25N6r87L23Q55
2206G80p42l20O16J30p83n2Q04j5r40J17N83m22k40L42N26o65k8N50R5n56K77
$$ y = [-500, -294, 183, 105, -324, 304, 587, -37, 317, 230, 30, 421, 223, 140, 271, 65, 229, -274, -120, 511, -41, -418, 159, 350, -174, -826, 95, 623, -567, -547, 534, -105, -725, -118, 906, 23, -911, 446, 956, -592, -334, 711, 665, -609, -230, 757, -9, -554, 257, 718, -303, -457, -163, 363, -251, -380, 636, 91, -709, -169, 268, -197, -336, 97, 174, -403, -128, 559, -281, -147, 551, 199, -167, 244, 164, -62, -379, 638, 449, -502, 36, 462, -142, -389, 61, 534, -346, -702, 406, 169, -833, -269, 352, 133, -784, 40, 668, -186, -507, 623, 608, -332, -118, 624, 167, -446, 254, 831, -418, -74, 288, 140, -209, -208, 385, -213, -263, 152, 196, -387, 9, 269, -119, -344, -195, 329, -119, -329, 606, 62, -561, 131, 568, -13, -292, 533, 589, -398, -75, 780, 38, -282, 334, 464, -319, -371, 433, 418, -522, -405, 178, -244, -484, -142, 384, -281, -309, 241, 336, -220, 57]
2227E7K13m35n64R75J86m99k20Q13l76k88K80M21o40j89R43o14j89L40J21m47
2247a12j05L55L14o76k17N58k47l23L96K32l21k54M72O8o50K63O50l28l07L86
2267A54L49o41j55M87P7o18O87m0l25j62L54J7m92K3O44m67k34K40L04m56m5L79
2289H0K13n82J79N37o30j23N16J34l92k18P76l28o18P31K66l96m95M59K81m92
2309a02k44M63j45l67K89N16n41k00K73K36o00J09N69l05k56M07N2j11j19N21
2329D45k59l72K56L58n87J17L92l97k12R2O03k57l93N13j46m45J06K88J8n42N1
2350c71P05o04j90P11q9k26k1K95j61j89p3N60k08p3n9K92j77k29J91J78k60J36
2372A38k1j62j56J20Pj64Q8O3k21J32K18l16O1N4K66m9l13M51L15n26J28L75n19
$$ y = [57, 270, -165, -729, 246, 432, -67, -287, 526, 150, -138, 142, 563, -77, -266, 677, 63, -126, 214, 335, -112, -217, 138, 452, -224, -441, 117, -130, -453, -57, 175, -146, -400, 72, 140, -510, -247, 403, 75, -232, 154, 503, -138, -293, 194, 271, -347, 340, 300, -25, -187, 167, 184, -308, -285, 359, -108, -342, -102, 202, -254, -299, 80, 293, -289, -110, 427, -203, -326, 190, 324, -68, -286, 490, 162, -456, 275, 541, 145, -350, 109, 390, -102, -346, 117, -28, -395, -106, 410, -131, -331, -58, 178, -422, -313, 256, -49, -305, 102, 154, 43, -76, 445, 186, -186, 70, 428, -159, -42, 350, -47, -259, -167, 436, 179, -214, 299, 153, -292, -186, 102, 120, -422, -371, 334, -270, -460, 251, 162, -64, -85, 210, 49, -140, -213, 347, 139, 66, 7, 299, 122, -107, 84, 262, 2, 138, 117, -45, -201, -81, -74, -238, -150, -87, -308, -176, 42, -274, -213, -159, 107, 58, -255, 196, 511, -15, 113, 488, -31]
2395c1k17J55M64k28r9J07K50n75l5M04Ll27j95N77q6m02L00M0j12k09J11K60
2417A55p4l96K64J13j36R5O9J59k06j7J59j29J40k04P8K79l86o5J17J85k20l47
2439c67L08M56m29l46M76J04k87l19K94J42m12K02L48k18k86K15L69k38j77L28
2459A63K77n59R5L40Kk78j47L06L2j23j73N7M0k97J72K17n9l15L26P2L0n48L18
2482e2R9J54n77M52J12j6k72K04J19J9l94M97l7o8k07o2L41k85q2P6O5k2k06J02
2506d0K5l25Q3L07k72Q1rK67j10k92K92K22j82o8J25jj5k85L48L2M4k06M8K09
2530B78j93l01L77L2l40kL53m01R7p4L28j13l37J75Mm0J11j46M88l55j04L19R3
2553B49j17l6J95k44J7k7N7j15n2M32m46J03Mj34Q3r5J45m8k17K33j47j59L99
$$ y = [-31, -248, -93, 371, 143, 44, 151, 401, -174, -209, 195, 198, -129, -324, 253, 167, -235, 65, 105, -7, -216, -105, 155, 81, -315, -51, 62, -74, 21, 90, 249, 43, 26, 185, 56, 196, -8, 70, 349, -37, -102, 15, 200, -20, -367, -59, 397, -32, -378, 98, 202, -85, -404, -110, 32, -380, -178, 170, -48, -334, -119, 250, 12, -165, 163, 440, -119, -24, 316, 318, 40, -107, 199, 231, 108, -65, -8, 32, -265, -93, 124, 65, -250, 76, 148, 178, -370, -52, 47, 201, -376, 76, 188, 172, -100, 104, 223, 242, -152, 345, 308, 240, 33, -29, 312, 27, -55, 21, 86, 64, -142, -40, -15, -340, -257, 50, -222, -141, -150, 117, 7, -285, 7, 229, 47, -21, 104, 103, 88, -197, 151, 183, 227, 21, 69, 278, 85, -216, 161, 193, -147, -149, 204, -197, -100, -174, 154, 41, -296, -121, -117, -157, -46, -192, 296, -59, -163, 156, 249, 132, 96, 291, 47, 64, 37, 94, -21, -73, 359, -87, 16, 20, -114, -31, -126, 19, -29, -246, -13, -160, -319, 80]
2576H0P6j17l45L21J37l55L9L45k1k44o3L25l3o3J78J17m32P5m1K12l07j5L99
2599B68j07m31L14j34N0j75MJ21oJJ80M5m37K81Pl2J04M0q0O2M9J87m08K27J3
2624A43l94J40K75r8j80M3Q8O0l81L47k6j1p6L5m8o4j82K99j84L5M6L45j15l53
2648b56L18J64m60R0L06O2l32j5N67k18k88J77J24l55K93r3J30l88j25K54Nm2
2670h2P6k55J4M1K07l6l9J17j90n1L21K7k79J62Q6j10R5q0K12j28k32K67m4q2
2694A7j1J22J9j95k22N32j85k98R8L31k67n7J25J68n48L31L34n39K66k51N23l41
2716d8qJ58J83k53K00Q4l59k4O2J54l22KJ38J47j13K3J64k69p6Rm0J11l1K42r9
2741C5k69R3M5j79M3M20Q4k69R3kj11m8J36K28l09k11N10n3o47M99K25m35K53
$$ y = [80, 156, 39, -306, 15, 152, -203, -164, 181, 160, -84, -147, 178, 145, 82, 260, 377, -55, 20, -21, 191, -116, -131, 268, 161, -270, 44, -90, -40, -215, -211, -90, -96, -95, 85, 130, -307, -26, -19, -51, 53, 93, 13, 75, 124, 311, -97, 130, 143, -251, -111, 164, 66, -114, -71, 17, 77, -304, 43, 17, 6, -70, -35, -83, -147, -329, -30, -214, -179, -133, 212, 97, -256, 62, 226, -234, -144, 162, 224, -108, -123, 444, 226, -62, 115, 239, -116, 177, 84, 214, -174, -299, -45, -40, -82, -6, -261, -247, -206, 1, -35, -74, 43, -147, -198, 123, 150, -129, 33, 119, 9, 104, 24, 236, 108, -124, 143, 99, 17, 6, 128, 147, -48, -270, 262, 77, -221, -123, 208, -59, -116, 9, 177, -371, -40, 294, -245, 21, -230, 293, -48, -56, 102, 285, 32, 232, 316, -43, -67, -5, 149, -173, -171, -33, 114, 1, 24, 188, -81, -157, -148, -188, -77, -108, 134, 35, -234, -141, -96, -275, -232, 188, 272, 3, 96, 94, -17, -65, 71, 299, -10, -221, 289, 236, -411, 88, 313, -122, 131]
2764A31k28L48m80Q8N5l4n2J76j6j75o3L97M1j23n4J80J3k65M15j13j98o1J74
2787A56m2l00J92J04q7r5p6Q6j71j4K75J00n44L53M7k2j74J17J77l03J2J88K37
2810B16k50P1J86j50l20K23K82k10k5Q1j05j29L4R2J24k01K29l41R3J48j95J72
2832B5j33L05j99k93K83R6n2q1J05M3j43L2K98k03q3NL49j58j94J20j69J86l59
2855b20K62Pk16J83J26l21J18K15k86K29k66J83j51p4K09k2P1L01j22k33q1J46
2877E8Q0k94Q6M17k17j02O9J40k76P5l9k9Rk56K89j52q3J28o6j33L04J73j28k04
2901a51R6J57j89j6P6l5J40j02J70O1o2n3M0m3j76J91Q9k2j96J52k31k9K85K0
2925A72p0l59L75k01N0j88j3J30K9K34o5m38N73j08l40Q6L34n4k31K48j33j15
$$ y = [131, -97, 251, -229, -141, -86, -120, -172, 4, -12, -187, -250, 147, 188, 65, 11, 191, 204, -61, 354, 241, 43, -18, 156, 114, -186, 6, 110, 23, -72, -148, -62, -233, -247, 28, 128, -416, -63, -16, -38, -212, -95, 82, -221, -209, -21, 216, -34, 37, 223, 73, -247, -24, 258, 48, 23, 104, -1, -130, -96, -4, 120, -81, 148, -193, -100, 48, -147, 25, -108, 197, -2, -295, -12, 84, 32, -49, 56, 99, -44, -12, 286, 83, 0, 5, 354, 196, 2, 122, -47, 139, -220, 42, 49, -167, 16, 142, -179, -61, 154, -132, 97, -169, 14, -137, -211, -2, -24, 47, 348, 226, -7, -88, 58, 138, -156, -70, 347, 130, 28, 97, 237, -39, 36, -3, -32, -23, -279, 10, -142, -225, -97, -163, -296, 8, 181, 53, -151, -55, 102, -87, -103, -27, -62, 78, -24, 146, 207, 145, 92, 132, 89, -87, 104, 193, 171, -25, 127, -104, -133, 152, 172, 102, -257, 118, -83, -33, -221, -234, -104, -75, 159, 94, -344, 229, 121, -219, -133, 201, 147, -84, 164, 31, -84]
2947h4J35O1K35k57o5j16N8j72J90Q0J25l37K57j71M7j27J00K69l66N7J91l44
2969b34J03l3J43K06k42J27l7k7J45ml89K56oJ27m5%M5j53Q3k9j56j57J78L14
2993B15l08k50L28N8l77K53J27o9k33K81K10m8l80K13j7LJ2j37L65jk12KoK7j76
3018a20J82J9j06L4J57l32J3K21j9j05J06NQ6j44Q3j84J54p7RJ51Nm5j01p1m1
$$ y = [-84, 51, 112, 347, 90, 25, -91, -33, -205, -15, 65, 190, -147, 110, -61, -14, -141, -41, 228, -138, -81, 110, -234, -131, -164, -21, 185, -57, 70, 33, 6, 151, 147, -242, 14, 8, 135, 90, 90, 135, -18, 65, 36, -120, -277, -99, 215, -93, -343, -15, 43, -334, -81, 46, -23, -256, 25, 235, 187, -193, 20, 3, 6, 18, -119, 246, 245, 33, 35, 29, 56, -120, 62, 81, -25, 9, 166, -166, -153, 68, 49, -56, 50, 55, 141, -3, 80, -104, 50, -27, -18, 133, 138, 93, -8, -79, -120]
$$ [...]
8191f1
##END NTUPLES=NMR FID
##END=
