##TITLE=1H_Pr Mat-2
 200.13MHz, CDCl3,
 8 sc
 
 10.6.2025
##JCAMPDX= 6.0         $$ Bruker NMR JCAMP-DX V2.0
##DATA TYPE= NMR FID
##DATA CLASS= NTUPLES
##ORIGIN= UXNMR, Bruker Analytische Messtechnik GmbH
##OWNER= pz
$$ XWIN-NMR		Version 3.5
$$ Tue Jun 10 15:29:27 2025 Russian Standard Time (UT+4h)  she@DPX200
##.OBSERVE FREQUENCY= 200.1313
##.OBSERVE NUCLEUS= ^1H
##.DELAY= (6, 6)
##.ACQUISITION MODE= SIMULTANEOUS
##.ACQUISITION SCHEME= undefined
##.AVERAGES= 8
##.DIGITISER RES= 18
##SPECTROMETER/DATA SYSTEM= spect
##.PULSE SEQUENCE= zg30
##.SOLVENT NAME= CDCl3
##.SHIFT REFERENCE= (INTERNAL, CDCl3, 0, 14.3821)
##AUDIT TRAIL= $$ (NUMBER, WHEN, WHO, WHERE, WHAT)
$$ ##TITLE= Audit trail, XWIN-NMR		Version 3.5
$$ ##JCAMPDX= 5.01
$$ ##ORIGIN= Bruker BioSpin GmbH
$$ ##OWNER= she
$$ F:/spectra/data/she/nmr/H-C/1/audita.txt
$$ ##AUDIT TRAIL=  $$ (NUMBER, WHEN, WHO, WHERE, WHAT)
(   1,<2025-06-10 15:28:02.73 +0400>,<she>,<DPX200>,
      <created by zg, POWCHK disabled, PULCHK disabled
       configuration hash MD5:
       00 E9 B6 7A A2 85 ED C7 34 08 36 98 17 FE 4E 26
       data hash MD5: 16K
       31 80 9E EB B1 A0 BA 0F DF BC AF 36 17 BE 26 30>)
$$ ##END=
$$ 
$$ hash MD5
$$ 7E 13 45 1D AF 69 85 D0 E9 50 F8 FC 07 81 25 7D
##$RELAX= 
##$RELAX= 
##$RELAX= 
##$RELAX= 
##$RELAX= 
##$RELAX= 
$$ Bruker specific parameters
$$ --------------------------
##$DU= <F:/spectra>
##$EXPNO= 1
##$NAME= <H-C>
##$PROCNO= 1
##$TYPE= <nmr>
##$USER= <she>
##$AMP= (0..31)
100 100 100 100 100 100 100 100 100 100 100 100 100 100 100 100 100 100 
100 100 100 100 100 100 100 100 100 100 100 100 100 100 
##$AQSEQ= 0
##$AQ_mod= 1
##$AUNM= <au_zg>
##$AUTOPOS= <>
##$BF1= 200.13
##$BF2= 200.13
##$BF3= 200.13
##$BF4= 200.13
##$BF5= 200.13
##$BF6= 200.13
##$BF7= 200.13
##$BF8= 200.13
##$BYTORDA= 1
##$CFDGTYP= 0
##$CFRGTYP= 5
##$CHEMSTR= <none>
##$CNST= (0..31)
1 1 145 1 1 1 1 1 1 1 1 1 1 1 1 1 1 1 1 1 1 1 1 1 1 1 1 1 1 1 1 1 
##$CPDPRG= <>
##$CPDPRG1= <>
##$CPDPRG2= <>
##$CPDPRG3= <>
##$CPDPRG4= <mlev>
##$CPDPRG5= <mlev>
##$CPDPRG6= <mlev>
##$CPDPRG7= <mlev>
##$CPDPRG8= <mlev>
##$CPDPRGB= <>
##$CPDPRGT= <>
##$D= (0..31)
0 0.7 0 0 0 0 0 0 0 0 0 0.03 0 0 0 0 0 0 0 0 0 0 0 0 0 0 0 0 0 0 0 0 
##$DATE= 1749554882
##$DBL= (0..7)
120 120 120 120 120 120 120 120 
##$DBP= (0..7)
150 150 150 150 150 150 150 150 
##$DBP07= 0
##$DBPNAM0= <>
##$DBPNAM1= <>
##$DBPNAM2= <>
##$DBPNAM3= <>
##$DBPNAM4= <>
##$DBPNAM5= <>
##$DBPNAM6= <>
##$DBPNAM7= <>
##$DBPOAL= (0..7)
0.5 0.5 0.5 0.5 0.5 0.5 0.5 0.5 
##$DBPOFFS= (0..7)
0 0 0 0 0 0 0 0 
##$DE= 6
##$DECBNUC= <off>
##$DECIM= 32
##$DECNUC= <off>
##$DECSTAT= 4
##$DIGMOD= 1
##$DIGTYP= 9
##$DL= (0..7)
0 120 120 120 120 120 120 120 
##$DP= (0..7)
150 150 150 150 150 150 150 150 
##$DP07= 0
##$DPNAME0= <>
##$DPNAME1= <>
##$DPNAME2= <>
##$DPNAME3= <>
##$DPNAME4= <>
##$DPNAME5= <>
##$DPNAME6= <>
##$DPNAME7= <>
##$DPOAL= (0..7)
0.5 0.5 0.5 0.5 0.5 0.5 0.5 0.5 
##$DPOFFS= (0..7)
0 0 0 0 0 0 0 0 
##$DQDMODE= 0
##$DR= 18
##$DS= 0
##$DSLIST= <SSSSSSSSSSSSSSS>
$$ [...]
##$SUBNAM0= <"">
##$SUBNAM1= <"">
##$SUBNAM2= <"">
##$SUBNAM3= <"">
##$SUBNAM4= <"">
##$SUBNAM5= <"">
##$SUBNAM6= <"">
##$SUBNAM7= <"">
##$SUBNAM8= <"">
##$SUBNAM9= <"">
##$SW= 18.0517328524113
##$SWIBOX= (0..15)
0 0 2 0 0 0 0 0 0 0 0 0 0 0 0 0 
##$SW_h= 3612.71676300578
##$TD= 16384
##$TD0= 1
##$TE= 0
##$TE2= 300
##$TE3= 300
##$TEG= 300
##$TL= (0..7)
0 120 120 120 120 120 120 120 
##$TP= (0..7)
150 150 150 150 150 150 150 150 
##$TP07= 0
##$TPNAME0= <>
##$TPNAME1= <>
##$TPNAME2= <>
##$TPNAME3= <>
##$TPNAME4= <>
##$TPNAME5= <>
##$TPNAME6= <>
##$TPNAME7= <>
##$TPOAL= (0..7)
0.5 0.5 0.5 0.5 0.5 0.5 0.5 0.5 
##$TPOFFS= (0..7)
0 0 0 0 0 0 0 0 
##$TUNHIN= 0
##$TUNHOUT= 0
##$TUNXOUT= 0
##$USERA1= <user>
##$USERA2= <user>
##$USERA3= <user>
##$USERA4= <user>
##$USERA5= <user>
##$V9= 5
##$VALIST= <valist>
##$VCLIST= <CCCCCCCCCCCCCCC>
##$VD= 0
##$VDLIST= <DDDDDDDDDDDDDDD>
##$VPLIST= <PPPPPPPPPPPPPPP>
##$VTLIST= <TTTTTTTTTTTTTTT>
##$WBST= 1024
##$WBSW= 4
##$XGAIN= (0..3)
0 0 0 0 
##$XL= 0
##$YL= 0
##$YMAX_a= 47242
##$YMIN_a= -72343
##$ZGOPTNS= <>
##$ZL1= 120
##$ZL2= 120
##$ZL3= 120
##$ZL4= 120
##$ABSF1= 10
##$ABSF2= 0
##$ABSG= 5
##$ABSL= 3
##$ALPHA= 0
##$AQORDER= 0
##$ASSFAC= 0
##$ASSFACI= 0
##$ASSFACX= 0
##$ASSWID= 0
##$AUNMP= <proc_1d>
##$AZFE= 0.1
##$AZFW= 0.1
##$BCFW= 1
##$BC_mod= 2
##$BYTORDP= 1
##$COROFFS= 0
##$CY= -3
##$DATMOD= 1
##$DC= 2
##$DFILT= <>
##$DTYPP= 0
##$F1P= 0
##$F2P= 0
##$FCOR= 0.5
##$FTSIZE= 0
##$FT_mod= 4
##$GAMMA= 1
##$GB= 0.15
##$INTBC= 1
##$INTSCL= 1
##$ISEN= 128
##$LB= 0.25
##$LEV0= 0
##$LPBIN= 0
##$MAXI= 10000
##$MC2= 0
##$MEAN= 0
##$ME_mod= 0
##$MI= 1.114404
##$NCOEF= 0
##$NC_proc= 0
##$NLEV= 6
##$NOISF1= 3.799351
##$NOISF2= 2.8
##$NSP= 1
##$NTH_PI= 0
##$NZP= 0
##$OFFSET= 14.38212
##$PC= 1
##$PHC0= -1469.625
##$PHC1= 14.1922
##$PH_mod= 1
##$PKNL= yes
##$PPARMOD= 0
##$PSCAL= 0
##$PSIGN= 0
##$REVERSE= no
##$SF= 200.129724274929
##$SI= 16384
##$SIGF1= 3
##$SIGF2= 2
##$SINO= 400
##$SIOLD= 16384
##$SREGLST= <1H.CDCl3>
##$SSB= 0
##$STSI= 0
##$STSR= 0
##$SW_p= 3205.1282051282
##$SYMM= 0
##$S_DEV= 0
##$TDeff= 0
##$TDoff= 0
##$TI= <>
##$TILT= no
##$TM1= 0
##$TM2= 0
##$TOPLEV= 0
##$USERP1= <user>
##$USERP2= <user>
##$USERP3= <user>
##$USERP4= <user>
##$USERP5= <user>
##$WDW= 1
##$XDIM= 8192
##$YMAX_p= 0
##$YMIN_p= 0
$$ End of Bruker specific parameters
$$ ---------------------------------
##NTUPLES= NMR FID
##VAR_NAME=  TIME,          FID/REAL,        FID/IMAG
##SYMBOL=    X,             R,               I
##VAR_TYPE=  INDEPENDENT,   DEPENDENT,       DEPENDENT
##VAR_FORM=  AFFN,          ASDF,            ASDF
##VAR_DIM=   8192,          8192,            8192
##UNITS=     SECONDS,       ARBITRARY UNITS, ARBITRARY UNITS
##FACTOR=    0.0002768,     1,               1
##FIRST=     0,             0,               0
##LAST=      2.2672688,     0,               0
##MIN=       0,             -72343,          0
##MAX=       2.2672688,     47242,           0
$$ Real data points
##PAGE= N=1
##DATA TABLE= (X++(R..R)), XYDATA
0@%%%%%%%%%%%%%%%%%Qj6J6j6J6j6K4l2L2m0M8n6O4p2Q1q9J04j20J36j52J68j85
39i7K09k33K58k89L21l54L92m32M74n22N78o41P05p74Q54r46J044j156J285j432
59g56J606j814K066k379K780l313M066n215P197j1558L8530k7377o8418O0236
73d349L7821k4524l0640J7222J2969m321p412M559o509o958Q611K4229l262l4199
87a6763q591L7739J2787k7444j4812J3554J0833j059n212j693m222p13J1157L974
101I535j7435p627J9506J4456j5795j4848R611N199p240Q167P635j3855p477J1994
115A826P120q463j0772M815J5254O72j4705m809J0090K689q341M020R274j1347
129b677r204J5891Q749j5384r671J1828J2117p564j1167N323O212n339j514N012
$$ plain form
0 0 0 0 0 0 0 0 0 0 0 0 0 0 0 0 0 0 0 8 -8 8 -8 8 -8 16 -16 16 -24 24 -32 32 -40 41 -48 56 -64 72 -80 88 -97
39 -97 112 -121 137 -152 169 -185 207 -225 249 -273 305 -336 369 -405 449 -497 547 -609 676 -756
59 -756 850 -964 1102 -1277 1503 -1810 2256 -2959 4238 -7320 31210 3833 -64585 -4349
73 -4349 33472 8948 -21692 -4470 8499 4178 -3234 1325 -5184 -12142 -3531 20698 17436 -16763
87 -16763 -25354 12385 25172 -2272 -17084 -3530 7303 6244 1032 -661 -4883 -5596 5561 9535
101 9535 -7900 -15527 3979 18435 2640 -12208 -2597 2602 -4638 3529 11164 -2691 -10168 1826
115 1826 8946 483 -10289 -5474 9780 10452 -4253 -9062 1028 3717 -4624 -604 8670 -2677
129 -2677 -11881 4010 12759 -2625 -12296 -468 11649 4085 -7082 -1759 4453 -886 -2400 2612
143B612k292o930M340J1977l841j5396J113J3570K391r419n276P474P030o675
157F78n277N240M85l688M153M194n396n513M905L885o468j551O978m79m668K308
173b14L558k533n625J217Q029q8p384K86N189l26l770M38L928j865m236M588M154
190E346o583n768N414P723l770r281L142Q354j786l581P16j514p29M181K912m064
206G12n682L260O912k213p196j317O069N561m098o769J615L431O96J083j749l492
222c177J774N108M46o809l172P496M541n776m573K095L526k77k568O01O22j462
238a605K217J949k972j671J629K084m2l512n37M237O84l089q26J950N82k407P46
255e83L265k889k850L647Q36l128P8K304P04j753p97K096k22j942J062J088l42
$$ plain form
143 2612 320 -6610 -2270 9707 5866 -9530 -8417 5153 7544 -1875 -7151 323 7353 678
157 678 -4599 641 1126 -2562 1591 5785 389 -5124 -219 3666 -2802 -4353 2625 2146 -2522 -214
173 -214 3344 811 -4814 -3597 4432 4344 -3040 -2754 2435 2109 -1661 -1223 2705 840 -3396 1192 5346
190 5346 -1237 -7005 -1591 6132 2362 -6919 -3777 4577 2791 -790 -74 -1588 -2317 1864 4776 712
206 712 -4970 -1710 5202 2989 -4207 -5524 545 6106 2008 -4761 -3146 285 981 2064 315 -3177
222 -3177 -1403 3705 4151 -2658 -5830 1666 6207 431 -4142 -2047 1479 1202 -1366 -765 -143 -1605
238 -1605 612 2561 -411 -2082 -453 1631 1589 -1923 -2460 1777 2461 -628 -1454 496 1078 -1329 -583
255 -583 2682 -207 -3057 590 1426 -1702 -1624 680 1384 -369 -1166 930 708 -1234 -172 916 574
272E74q50p42J879R02k732l20K053k25j157m53J181O65k065M82K368k026j282
289a748K791P92k178j150J974J453k544q58K242m03p95P56p29o8O20k95N20l18
307F2j041R49Q59m47j108n90K185O56k669L32J891q16m46L92l2m11n46J263M38
326I21k322L16K164o20q42j56J93J052l27j050L90L95M40j54q69P84J52q98J068
345F37k07j613J065Q49j228o39O56J104m20j070J082L05r19Q35K80r60K44J68
363A69J24J57q99J58O29j75k5q66l88J653rj128M14K4m5P12J8n42o43O53J552
384A543j189j483J318K73o71N36n55n78P48O17j06r90l34R49L2K75N52j487m99
403a049J664K16o67o29l12J208R55q31j314p47J576J776j744j692P38J135Q99
$$ plain form
272 574 -276 -1018 861 1763 -969 -1289 764 539 -618 -1071 110 775 -1290 -808 1560 -466 -1748
289 -1748 1043 1835 -343 -1493 481 1934 -610 -1468 774 371 -424 332 -397 -465 155 -140 380 62
307 62 -979 -30 829 382 -726 -1316 869 1525 -1144 -812 1079 263 -183 209 177 -234 -780 483 921
326 921 -1401 -1085 1079 459 -383 -539 -346 706 379 -671 -281 114 554 400 -469 315 467 -431 637
345 637 430 -1183 -118 731 -497 -1136 -480 624 204 -866 216 521 -398 437 717 -243 1 169
363 169 293 450 -449 -291 338 163 138 -728 -1116 537 528 -600 -186 -162 -207 505 523 -19 -662 -9 1543
384 1543 354 -1129 189 462 -209 327 -228 -806 -58 559 453 -537 -871 78 110 385 937 -550 -1049
403 -1049 615 831 164 -465 -777 431 1386 555 -759 -1506 70 1846 102 -1590 -852 283 1182
420A182o06j663K7R92J369Q2k300m93K152M54r08r62o18J502J413q46j483o63
438a369Q98R16m04L21l77j453J558J990j597j988P4K023J992j435k901q6K614
455G76J648k432k792K039K540o67j283j059J03J276K31rJq92K28J161J53q89j881
474a748K47L177P43k601j476R95J635n50j540O16M50j63J466j3k205q86J039K153
492A339P65k510j651K107K567j065m074m14M119J253k050r83j44M85N18n38k25
509e01P1M6J306O38r30j665j210J869K938j007k824k02K057J435j919k489R07
526a480K070J276l92k578r90J901J285k16j364j186J754K430o80l054j615K558
542b81K630j685j805P87P09J16m21o02n8m56O81K343k46k798j187J852K597r50
$$ plain form
420 1182 576 -1087 -1060 -68 1301 1383 -917 -1410 742 1196 288 -674 -1292 210 1623 777 -706 -1369
438 -1369 -471 445 41 362 -15 -1468 90 2080 483 -1505 -1431 592 2584 1149 -1752 -1838 776
455 776 2424 -8 -2800 -761 1779 1112 -171 -1230 -1127 149 380 371 372 -520 -292 869 1022 133 -1748
474 -1748 -1501 1676 2419 -182 -1658 -663 972 422 -1118 -502 -52 -215 1251 1238 -967 -1853 -814 1339
492 1339 2104 -406 -2057 50 2617 1552 -2522 -2936 1183 2436 386 -597 -741 -256 262 -276 -501
509 -501 -430 -384 922 1560 630 -1035 -2245 -376 2562 1555 -1269 -1471 586 2021 102 -2387 -1480
526 -1480 590 1866 1474 -1104 -2094 -193 1092 876 -488 -1674 80 2510 1830 -1224 -2839 -281
542 -281 2349 664 -1141 -354 355 471 50 -552 -610 -1066 -385 1958 1712 -1086 -2273 -421 2176 1226
560A226l256N23L080Q10j907k416J94K144O02l69m95r37M16J039j90r65j254O12
578a143K965O36k571j958R34K589m5k548j65K010Q02o50j641n90R39M17L71O02
596I54q71j068K99J502N71k480j442L026K236j718k348j41K036Q02j761q41J150
613i4J114k5j358n95O19j42L87J122o63r25K38M40K69m54n50N83N16J75o0j025
633d28m82P41K84J53k00m13M56J77k44k33p83K45J511J36q00m21k5N71J48p34
653c41j73N63O80Pr29k47j8m51J114R49j329o19R66L63n67q48J77J128L75j57
673F43o03o43N01L83m15J34k07pR74j98j082l37K96Q90J18p20J82L59k79M3q8
694e6k76K15K66N24k61q48L83K68o25L08J34m09N23L21m35l14k01K21K84J69K33
$$ plain form
560 1226 -2030 -1507 1573 2383 476 -1940 -1746 398 1000 631 136 -801 -385 654 464 -501 -1755 -1143
578 -1143 1822 2458 -113 -2071 -1137 1452 1407 -1141 -1306 704 1506 856 -785 -1375 -436 -19 352 954
596 954 83 -985 -686 816 1387 -1093 -2535 491 2727 1009 -1339 -1480 556 1358 -403 -1244 -94
613 -94 1020 995 -363 -958 -339 -481 -94 1028 365 -560 -322 118 387 -67 -617 -34 482 657 597 -428
633 -428 -910 -169 115 268 68 -345 111 288 44 -189 -972 -727 784 920 120 -301 -326 245 393 -341
653 -341 -514 49 729 736 -193 -440 -458 -909 205 1154 -175 -794 172 535 -32 -880 -703 425 800 643
673 643 40 -603 -102 281 -134 0 -207 -214 760 562 -520 -857 -561 329 447 -273 -91 268 -11 32 -56
694 -56 -332 -117 149 673 412 -436 -53 215 -410 -102 32 -377 146 467 32 -282 -483 -262 22 191 424
715D24m09k34P46l54p78M75K74rK40k83k04m3k23L19%j66M55j8k22J08m79l9N08
738H8J44J68k53l24M80o4m68J34j79J94O33m32n71K63J28J14l30r9O67nk45O1
760A04l77J65N49m02j05K47j31J22p6m12J32P4J01J75l65J8L14j78M7K6k51L47
782A24J00j65Q2l09J33L56m81j7L62j99J37k7m40J82K26k7l0k29K45J11l99K68
804CJ61l47L81Q1m20J79Q2j86J81j02n9K3j51K20o2k76L74m6j95K76j57k3J90
827A27j63J19O2k86L05J27m34J07K6o2J83k31q1J51LJ59k21k31N22m2k93L74j77
850D4k17L99j04k21R5J1J39q2k03K29k06r8L04j23k3L1j89K88K00n06j2L41J66
873B63M5m46j11M81o4p4k6l60K24L11j76k42j87K82M58m71k90M65n2L9J42k29
$$ plain form
715 424 15 -219 527 173 -605 -130 144 135 375 92 -112 -155 -378 -59 -59 -225 230 212 -10 98 -381 -420 88
738 88 232 400 147 -177 303 239 -229 -95 -274 -80 553 121 -450 -187 -59 55 -275 -374 293 288 43 104
760 104 -273 -108 441 39 -66 181 50 172 96 -316 -184 -110 -9 166 -199 -181 133 -45 2 28 -223 124
782 124 224 59 141 -168 -35 321 -160 -177 185 -14 123 96 -344 -162 64 37 7 -222 23 134 -265 3
804 3 164 -183 198 279 -141 38 120 -66 115 13 -46 -23 -174 46 -16 -292 82 36 -159 117 -40 -63 127
827 127 -36 83 145 -141 164 291 -143 -36 -10 -72 111 -120 -201 -50 -47 112 -109 -340 182 140 -153 221 44
850 44 -173 226 122 -99 -4 7 146 64 -139 90 -116 -214 90 -33 -56 -25 -214 74 274 -232 -244 97 263
873 263 308 -138 -249 232 168 94 68 -292 -68 243 67 -175 -362 -80 378 -93 -383 82 30 69 211 -18
895a8Q1l7j26L24nl18p0R1L94k03o50L25M70l00Q5k0k89J56K09J71k05n35L95
918g5O13k55m85j00K62N13l65n13L34J19N7Ml58R5J04j79L82J39l92l5Q0J56J40
941B41l43j40K75L51K09p71o53Q77N25n97l03R2L45J60m24q2R2j05L77K63k28
962A61k86k29N39M89q82m91Q49M45l37n38r9N27k18l94N71K03l99j42K69L62m42
983d2p26N89R30j74o01m75L95O81n30n90L15L73K58k21o04J01K96k5Nm0K21P2
1005B08l71L42L03q88j67O94M99k58o64n1O84j91n53J38K08K15k0o9J31m67m12
1026f89P90N36n72m34L11P23l22j082K64Q26j35j65O8j82pj65O3K79k67kL85M2
1048B65r0m80j77N65J62j30J30l02l8L29k55k80M6J93L92n8m18M1o3n0K52Nj54
$$ plain form
895 -18 63 26 -100 224 219 -99 -169 -78 316 113 -537 -212 258 -42 43 23 -266 -110 99 270 65 -470 -75
918 -75 538 283 -202 -302 -40 473 108 -405 -71 48 105 109 -249 -154 -50 -229 153 292 -100 -135 -55 101 241
941 241 -102 -242 33 384 593 -178 -831 46 571 -26 -329 -237 108 268 -156 -238 -146 -251 126 389 161
962 161 -125 -354 185 674 -208 -699 150 595 258 -280 -379 148 -70 -464 107 310 -89 -231 38 400 -42
983 -42 -768 -179 751 577 -24 -499 -104 577 47 -543 -228 145 403 182 -422 -321 -25 -50 -45 -85 136 208
1005 208 -163 179 482 -406 -573 121 620 362 -302 -353 331 140 -413 -275 -67 148 128 59 190 -277 -689
1026 -689 101 637 65 -369 -58 665 343 -739 -475 351 216 51 119 -63 -70 -235 -172 107 -160 -162 223 265
1048 265 175 -305 -482 83 245 115 245 -57 -95 234 -21 -301 -255 -62 330 272 -146 -105 -168 -218 34 39 -115
1071a15NL29M02o22p33O11N70l51j26J49J43p8n28j2M35j84j86L68M80l18r16
1092f77J82R11k77l93L49K07N4k15m78R9K39QJ75p5j97M7j2l1j50j14M51J26k23
1115FK54j52m14J33J77J74M6l31J98L45m98m06K15L67l9j92K57J48o03M1M57l03
1137a20j15L61J89J2l63k68L46Pj65J17J82K4k32r2J95l11k89N59K06k02J1OJ0
1160F8j52l13L38L97k94K4L13k23m03j93L93K76l30M2L34j85k19j16n0L16M3o2
1182DL68j94l33J51k4r9O8J78K09k75j77K49j90k98K65J68N8o4k08K87j4m98J13
1205b56M34Mp0q2J04N3m11N7L15j41m1J05K1p2l18Q8M09l51o6M61q4k41J4Q7K6
1230D5j55K2L12k7k18j5l8P4p1j67L53O9l39J34Q6j82nN4J26J40k86J46J38l09
$$ plain form
1071 -115 -110 219 621 -1 -734 -123 447 96 -30 119 262 184 -344 -356 79 -105 -291 77 557 239 -677
1092 -677 -495 416 139 -254 95 302 356 141 -337 -238 1 9 184 109 -88 -41 -53 -84 -234 -348 103 229 6
1115 6 260 108 -306 -173 4 178 224 -107 91 436 -62 -468 -253 114 75 -117 140 288 -315 -274 183 -120
1137 -120 -235 126 315 327 -36 -304 42 49 -116 1 183 207 -25 -117 78 -233 -522 37 243 41 52 58 68
1160 68 -84 -397 -59 338 44 68 381 158 -245 -438 -45 231 -99 -57 277 92 -127 -243 -293 23 66 4
1182 4 372 178 -155 -4 -28 -127 -59 119 328 53 -124 125 -65 -363 -98 70 128 64 -144 143 129 -369 -256
1205 -256 178 182 112 30 134 187 -224 -167 148 7 -34 71 92 20 -298 -210 199 -152 -218 243 159 -82 -68 19 45
1230 45 -110 -88 224 197 -21 -36 -74 0 -71 -238 115 184 -155 -21 65 -117 -122 -68 58 198 -88 58 196 -113
1254a13o3K12N5l1j27J22J30l88K5L15j75n7J27n7P4p3r9J54Nj08R4J01lj44r0
1279a14K59p4l04L07J11k82J8M7M1nk04J89J95k47m0J59M0r0j05J49J43k10j1
1302b8J76j79l0O5q7J43r7j39K79p4k50J83J25r6m3P2J36j50j11K39p1j45J77
1325I5j04RO9j60M7J64j79J2K2n1O0l8O7K0j44J04J72j59k6M3rQ6j42n0J73m6
1351C5j58J53o8l9Q0l5M9jo7O7ql8R8j48O7J51j53L0K2j36P2J00j23J6k0L7Q1
1378F4j65j9J71r7O0J0p1R7m4k1J23j31k8J05p0K7Mj10Q9K1j13R8n6k3J06nm5
1405b3Qp3J71M3j13N2o4j1J42j33j75K05L6m7l1q7J16rj03J14j7r3R5j2P1Mj88
1432a22J05J17q9j0k2mJ30j02q2M8l3NJ21j26L1k7RR6p0o0J48jj8P3j75k8J96
$$ plain form
1254 -113 -176 36 91 60 -67 55 185 -203 -178 137 -38 -95 32 -25 49 -24 -123 31 36 -72 22 123 120 -24 -114
1279 -114 145 71 -233 74 185 -97 -79 -32 9 4 -200 -11 184 -63 -103 56 96 6 -99 50 193 -17 -28
1302 -28 148 -31 -61 4 -83 60 -37 -176 103 29 -221 -38 87 -9 -52 20 156 6 -105 134 63 -82 95
1325 95 -9 0 69 -91 -44 120 -59 -47 -25 -76 -16 -54 13 33 -111 -7 165 6 -20 23 14 100 -42 -92 81 35
1351 35 -123 30 -38 -77 3 -32 17 16 -51 16 8 -30 68 -80 -13 138 -15 15 37 -99 -27 73 -50 -34 -54 -17 64
1378 64 -101 -120 51 -46 14 24 -47 50 6 -15 108 -23 -51 54 -16 11 15 -95 -6 15 -98 0 -56 -79 27 22 -23
1405 -23 -15 -88 83 126 13 65 1 -10 132 -1 -176 29 65 18 -13 -100 16 7 -96 18 1 -92 3 -9 62 66 -122
1432 -122 -17 100 11 1 -21 -25 105 3 -79 -31 -64 -59 62 -64 -33 -60 -51 45 -25 -85 63 62 44 117 -58 -86 110
1459A10q9m0k1M6J05j78p6J79o8m9R8oJ03o6k25J74J84j49j44N2K51M3l28m6J96
1484E6j9r3j9J7J73n8k21J33Lk9M2N4R3j8j94O5Q1p8Kn6P6J18j60o0R0n9l5O6
1512c0j0J42o9j05J13Oj50LN7K45n8k58P3J77j20j06mP2J89j55j05M7K2l5pL9
1538b7J71q0j33J29lj52O2L1L2R1o5l5j06j7J03Mj00J18Olpj81M3J57k3N2K6q3
1566A0N8j1j16M2k7P5N2n8J0pj55KK3P9J35j10nJ66j58k03J07J63jn8K0J01j09
1593B5j50O8l9J9J01K5O2j7k64M8J26m6KM9J73k3k26j0O6n1K0J01nQ4q7j68O0
1620e7n4j7J27Q0Ql5q6m2j2J9J58n5l0J43n8j03o9m2Q7Q1p2Q0M6j60l7K6L4J4
1648b6j5J23M9j36Pmp1P7jL6Q0j39j9N8q9m8R2R4M1q6r2J33j03r5R9M5J2Q4p6
$$ plain form
1459 110 21 -19 -40 6 111 -67 -143 36 -32 -81 17 11 114 48 -177 -3 181 32 -112 -60 191 234 -94 -140 56
1484 56 37 -56 -75 -58 115 57 -164 -31 -28 -57 -15 39 132 114 -80 -15 66 -12 -10 -66 10 128 -32 -92 -2 -61 -96 -30
1512 -30 -40 102 33 -72 41 47 -103 -100 -43 202 144 -114 -41 136 16 -90 -94 -22 167 12 -93 -46 -24 -59 -66 -27
1538 -27 144 64 -69 60 57 -95 -33 -2 30 121 56 21 -85 -102 1 5 -95 23 29 26 19 -162 -119 38 15 67 93 10
1566 10 68 57 -59 -17 -44 31 83 25 35 28 -127 -125 -102 -23 112 2 -3 163 5 -198 -91 72 71 13 33 134 25
1593 25 -125 -57 -96 -77 24 49 111 94 -170 -122 4 -42 -40 9 182 159 -67 -77 -11 -62 -42 59 54 138 51 -117 -57
1620 -57 -111 -128 -1 79 87 52 -34 -76 -88 -69 89 34 4 147 89 -14 -83 -125 -38 43 -29 51 97 -63 -100 -74 -40 -26
1648 -26 -41 82 131 -5 2 -2 -73 4 3 39 119 -20 -39 19 -70 -118 -26 68 109 23 -69 64 -39 -134 -35 10 22 106 30
1677C0L1m6j22J04J3j9J07l1k3n6p3j7N5l1J04P2p0l0k9k3O0l7L2J55j35J6J0
1704D7j01qJ1M9Q2m8m5L1l1p1N6kN9Pn2P5l5q6P4j8PO0o1M5K7j44pR4n4NM0K3
1736B9pp9M5J5m7J8Q9l8Mk0p7J00n8m2J33Nj05QL5rm9jJ05l1m4P1k4p1N5o1N9
1767HK9p2Q7K7j44kP6k1k4L5L0J2q9KM1k0L6J6j3O8q1o5J07n8l2O1Qj2k5lN5n9
1799b2m9J04j0l0J5l0J8M5j25Q1N2o0L3Jl8P0p7qO2l5j5M1l9j4roJ08q0j5Q5o0
1830gk9R2p3L5Rm4O7m2m9Q3k3n3M8m1mL7n9Q6l0p7O8L1nj6l1M3O9j06LP3k1m9
1862a5nj1J5ml0P3q9L9P2o9K1Qo1R7Om2K4mo9N8k3L3j9j9L5l3k8L4Pl7M7l5L5
1895A1Nq5J03M0p2j9Q3m5rl8K1K8j7l2K0k6P9n3n8P0k2l4O4J6m2Q3p8j5K7OOl1
$$ plain form
1677 30 61 15 -107 -3 10 -9 98 67 44 -12 -85 -102 -47 -78 26 98 28 -2 -31 -54 6 -31 1 156 21 37 47
1704 47 -54 -62 -51 -2 80 32 -13 18 -13 -84 -28 -30 29 36 -16 59 24 -62 12 -6 1 61 0 45 72 -72 -79 15 -39 -34 6 29
1736 29 22 -57 -12 3 -44 -26 63 25 29 9 -68 32 -26 -68 65 70 -35 -27 8 -1 -50 -51 54 23 -21 50 26 -45 10 -51 8
1767 8 37 -35 52 79 -65 -67 9 -12 -36 -1 29 41 -48 -46 -5 -25 11 27 14 82 1 -64 43 -15 -47 14 22 10 -15 -18 37 -22
1799 -22 -71 33 23 -7 8 -22 -4 41 -84 -3 49 -11 22 23 -15 55 -22 -30 32 -3 -18 23 -16 -30 -39 -45 63 -17 -32 53 -7
1830 -7 -36 56 -17 18 27 -17 50 8 -41 42 19 -34 14 -27 -31 6 -53 33 3 -74 -6 25 20 4 -27 16 85 -21 -18 55 34 -15
1862 -15 -20 -31 -16 -20 -50 23 -66 -27 45 -24 -3 5 -56 41 47 5 29 25 -44 14 -9 24 5 -14 21 -12 -40 -6 1 -36 11 -24 11
1895 11 16 -69 34 74 2 -17 66 21 12 -26 -5 23 6 -26 -6 -32 47 -6 -64 6 -16 -50 14 30 -12 71 -7 -22 5 11 17 -14
1927a4oJ00n8o7N2l1L3J7p6M1L1l7RL3m5N7rl5%l8M6O0q8M4k5%M2r0J3P2m8k6
1959d3M1Nj1K7l1M9J1m3n5L4L5Ln5M9Qm9LL5o0K1K2j0M0m1j1P9m7j9lPP2j8q7
1992d2O0Ql3Jl5N3M0q0NJ2l7L0rLN3l7k8J9QK2Oo5O2K7k3kn0J1N3l7m2Q5l3m1
2026c6J2k2K5J9ORJ8o0Q2n2j7MpL7K7p8J0N3o7J0k6M1P0p4J3J5Lm7m3R8J0L8p3
2059bRl3j9M6PROk5K3k0n5L7k6N3J7l6M5Kn5J6K3p1P9l6j0N5m6l5J2pN6K7k4l
2093A9kj7l0k8J5P5m2J3N9l6l7lj7M5K0m2M5k8l9K0j1loK4O3m0j6qpj4PK2L7N
2127D3m2K1l1jk0K1qK2J0k7J5l4J9%J3j7O0m8Ql6qN2j3j9P3k3k3l0j3L0k6JP3
2160D2j9j1kl2J5Qk0L7K3j6j1loj1K0MJ6o0j6M6l1j1K6K3K5Mn2L8m6k2L8lOL0
$$ plain form
1927 -14 -20 80 22 -45 7 -24 9 26 -50 -9 22 -15 -6 27 -18 39 30 -5 -5 -43 3 63 -25 19 -6 -6 36 -54 -41 31 -17 -43
1959 -43 -2 3 -8 19 -12 37 48 5 -50 -16 19 22 -33 16 24 -25 -22 13 -47 -26 -4 -14 26 -15 -26 53 6 -13 -16 -9 63 45 -42
1992 -42 18 26 -7 -6 -41 12 52 -28 -23 -11 -48 -18 -27 -24 29 -8 -36 -17 -9 13 19 -46 16 43 20 18 -32 -21 32 -5 -47 38 5 -36
2026 -36 -24 -46 -21 -2 4 13 31 -29 53 1 -16 -12 -19 18 45 -33 -23 30 -37 -27 -53 -12 58 -16 -3 12 15 -32 -75 23 33 71 -2
2059 -2 7 -26 -45 1 8 17 23 -2 21 1 -54 -17 -43 10 27 -9 36 38 -17 -1 22 -49 30 -6 -16 39 -7 -42 -30 -37 19 46 22 19
2093 19 17 0 -30 -58 -43 32 -10 3 62 26 -11 -14 -31 14 34 -8 37 9 -30 -10 -21 -24 -30 -6 57 17 1 -7 -14 -28 -21 1 38 43
2127 43 1 22 -9 -10 -30 -9 -17 5 15 -12 3 -31 -12 -12 1 -16 44 -4 4 -32 -40 12 -1 -20 53 30 7 -23 -36 -6 -32 -31 42
2160 42 23 12 10 -22 -7 1 -19 18 41 25 14 11 5 -6 14 18 34 -26 -42 4 -27 -38 -12 11 36 40 -12 26 -20 -42 -4 -7 -1 29
2194B9Rj3m1kpj9J3N8J3n4L7o6L6K0o6K0N8k7J8k2k2L3m5L9L8k0k7LoKk5J7L8
2227A9%qLj0j2J7MpJ5k5K7Lk3J3j7J4j4rK7Po2J8k7J1N8j7%j7J2kKKJ6K6l7J6
2263B3k2j1L5n2LL8k9%K5k1jl%M4J0m9L6rl2K2j2j%rJ0lk7L7j9pRrL4Pk2k2N1
2300B4o0j3N0j9M0l2L9m0J1j7mj5M5k7nL7n0K5qL6ppj3M3k4j7K3k9JK3l1J7j5
2333a9J9m2K5J2J0J9n5K0K5j4Nl9M1j8pkJ6J4Oj4k3K7Km1K3k0M5oNlOk5L5m2l
2368a8lJ3M4k6j7RQqMk4jL7m5J3L2n7M2j0j1OK3k3K7k2jL6m5J0J4pJm1L3J2qj8
2404b1L7k0Qj6J7k8J7j6M3l3Kj9M4m3K9j3qL0j3j3KJ1Kj%%k7L5j3J7J1l4%kL2
2439A7ok4Oj4M0k3j4J0MOm2nJ5J9mJ4j3mN3j3l0lplM2m7M6k8j9L0m7O5ml8J3K8
$$ plain form
2194 29 38 25 -16 -18 -25 -44 -31 27 40 -14 23 -43 -7 13 -53 -33 25 -2 16 -6 -28 5 -40 -1 37 17 -10 -7 -13 -11 -36 -19 19
2227 19 19 11 14 4 -8 9 13 6 21 -4 23 26 3 16 -1 13 -1 -10 17 24 -38 -20 -47 -36 22 5 5 -12 0 -2 0 2 18 44 7 23
2263 23 1 -10 25 -27 -24 14 -15 -15 10 -11 -12 -15 -15 29 39 -10 26 17 -15 7 -5 -6 -6 -15 -5 -8 -35 2 -17 -24 -15 -24 10 17 -5 -27 24
2300 24 -36 -49 1 -18 22 -10 29 -11 0 -17 -21 -36 9 -18 -23 14 -36 -11 -19 17 10 3 -10 33 9 -8 15 -14 -13 10 -21 -4 -19
2333 -19 0 -42 -17 -5 5 24 -31 -11 14 0 5 -34 7 -11 -18 -20 -4 10 16 2 -21 6 8 -33 -10 -30 15 9 14 11 17 -8 27 -15 -18
2368 -18 -21 -8 36 10 -7 2 10 2 6 -18 -19 18 -27 -14 18 -39 3 -7 -18 -12 11 -12 15 -7 -8 28 -17 -7 7 0 1 -40 -7 5 -3 -21
2404 -21 16 -4 4 -12 5 -23 -6 -22 21 -12 -10 -29 15 -28 1 -12 -20 10 -3 -16 -14 -3 -1 -2 -2 -2 -29 6 -7 10 21 -13 -13 -15 17
2439 17 11 -13 -7 -21 19 -4 -18 -8 -4 2 -40 -45 -30 -11 -15 -1 -14 -18 35 22 -8 -11 -18 -21 21 -26 20 -8 -27 3 -44 21 17 -21 -8 20
2475B0l1jKj5M7k2l3NN2k1K3j4%K2k2l7JK3mlqMK1jj8J2j6J7j3J5knLJ3l0K0k3
2512a9K1j4OJ9ll8L2m0LL9lk1J9pJ4Pj6K4Nk6nOkJ4l1k0N9pk0j3K4J1l5O1l5q
2548Aj3K6Jj0RkKj4jqnlK6J0k3J4l4J8J2J5Jl2J6j0J4rK6k7j6K6j6K1k4J7rNj1
2585gL6l2J4j5j9K7J2k8L8Pl0j9K4joJMk1ML1j5K6l8J6Ol1L2k2L6l3j0M7l2k0
2619a8J7nJ6j1J6k6K2j4nl7L1mnK4j6J2NJQm1M2k6NOnQMJ9k4rQjM2lm9J0Ol0K1
2658fK1j7LLj3QMm2OJ9nK4k9K0oj3K3k7M6j5J0JoJ1J3l6J3J1j7J8k0jQj5k0J1
2694a5L8j4j1j%J1mplJ0J1k0mK2l4J9j0K1l1LK7oj1J7m3M7j6J9k4QK0j7L5n3L2
2729A6k1J5j3NlJ4PLJ5m9L1k1j3K6ok7K3k5L8j1J4k6L7j5m3J1K9j8Qj8M7l4l3
$$ plain form
2475 20 -11 -12 -10 -25 22 0 -33 -28 24 3 26 12 12 34 12 -25 -24 -1 -5 -8 -16 -12 9 8 -10 2 -14 3 -10 5 3 -2 1 14 -16 4 -19
2512 -19 2 -12 -6 13 10 -28 4 -36 -33 6 3 -18 1 -6 8 15 -1 23 28 2 -3 3 1 15 -16 -36 23 16 -4 -17 7 18 -17 44 9 1
2548 1 -12 14 15 5 14 12 14 0 -1 -9 -14 -17 9 19 -4 10 -24 -6 6 21 22 -10 6 -4 10 1 27 0 -16 10 -6 15 -9 8 -1 4 -7
2585 -7 29 -3 11 -4 -23 4 16 -12 26 33 3 -16 8 7 1 2 6 -15 -11 20 5 31 -7 9 15 -16 16 -6 30 -3 -13 34 2 -18
2619 -18 -1 -6 10 -1 15 -11 11 -3 -8 -45 -14 -18 -23 1 -15 -3 2 3 11 -30 12 -14 -9 -3 -8 0 4 23 -1 -10 -2 -3 39 36 -13 -3 3 -27 -6
2658 -6 15 -2 1 4 -9 -1 3 -39 -33 -14 -19 5 -24 -4 -10 -23 0 -27 19 4 14 15 9 20 33 -3 10 21 4 22 2 1 9 -6 -26 -15
2694 -15 23 9 -2 -3 -3 8 4 -3 -6 4 15 -5 -9 13 -21 -2 -12 9 -22 -19 8 2 -9 8 -35 12 -4 15 -9 -1 19 2 37 -16 16
2729 16 -5 10 -3 2 -1 13 20 23 38 -11 20 -1 -14 12 6 -21 2 -23 15 4 18 -8 29 14 -29 -18 11 -7 1 -17 30 -4 -37
2762c7K6K7Ok6rRJ2k1K8n0N6k3JK0l1k4L5Kj2K8krj5%K6l6M1j0j8MK6k3NlL4m0
2798clQmK1k1%J3j2Jk0K1K9k4qJ1pNm9P0Ql4M2k5m3K7RK4l6J4k2KK0J7m8L8rK2
2835C4j9Jj5J1mk3K0Ok4K2J2j7J3k0J7k0K5l0%j0K2oJ1Om0J5L1j1j6kK2l4OJ0
2869gk1L4j3J1pJ1j4RK5k2J8l6K8j7RMk6L3k0Jj7J1%O%j1J8pMK1k4K6j9Nkomr
2907hJ2Lj0j6pPRNK1lpQj0J5j5j1J4NQk9rJ3lj3K9J3%LoqOj9jLMN%pK2k0pK6k6
2950dJ7%k2K0K4k5j9LK1J1j5j4LJ2%k1M2l7J8J5l4J7j7j4NnL8j9mK1K2l5nMj0
2985gJ4J0J8n6RK8k0K5oppK2l4PJ6K0l2j3J5K1qj1k5J6K2oj1L7j9k4Mj0nK4j0
3020cJ9jooQj7O%nJ5rK7j1Rj0qpOQRnk0Oj0k5L4J6l0J2oQjj6jJ9J9J4k6m3M0%
$$ plain form
2762 -37 -11 16 22 -4 -13 -4 8 -13 15 -35 21 -2 -1 19 -12 -36 -1 1 -11 17 15 6 -9 -9 17 -19 22 12 -6 -2 24 1 6 3 37 -3
2798 -3 -6 2 -2 19 -2 -2 11 -1 0 -20 1 30 6 -2 9 2 7 -42 28 36 2 44 19 -24 3 12 36 0 14 -8 -6 14 31 -17 21 12 34
2835 34 15 16 1 12 8 -15 5 11 -13 9 21 4 17 -3 14 -6 19 -11 -11 -21 1 -5 6 12 -28 -13 18 7 -9 -11 11 -23 -17 -7
2869 -7 -28 6 -7 4 -3 8 -6 3 28 6 24 -12 16 -1 8 12 -14 19 -1 0 -17 -6 -6 0 0 -11 7 0 4 25 1 27 8 13 11 5 1 -8
2907 -8 4 7 -3 -19 -26 -19 -10 -5 16 13 6 14 4 19 4 -7 7 12 20 -9 -18 -5 -8 -21 8 21 21 24 18 10 16 -3 -4 -1 3 8 8 1 23 3 -4 22 -4
2950 -4 13 13 -9 11 35 10 -9 -6 15 26 11 -3 0 12 12 -9 33 -4 14 29 -5 12 -5 -19 -14 -19 19 0 -4 17 39 4 -1 3 -7
2985 -7 7 17 35 -21 -12 16 -4 21 15 8 1 23 -11 -4 12 32 0 -13 2 23 15 4 -21 -5 17 11 0 37 18 -6 -2 -12 -17 7 -3
3020 -3 16 15 9 3 11 -6 0 0 -5 10 1 28 17 26 16 8 1 7 15 24 19 -1 5 -5 -30 4 20 -10 2 -4 4 3 -13 -14 5 24 38 12 -31 9 9
3061Ij5nQJRoKKJ0L4n8kM8j1m6POL2l1pM9n3K3Qk0L8On4RL0l3j0M5k3LJ7k0k0
3099a8L6l7J9k1mM9j7pL0j9k7Lj2L6J8m1K2j4J5qQQl4L9m7K7pj0OJMj2K6J2j6
3134HJ3j9l5M2j4MJ5krj5k6L9J7om9M1j0PRl4K8J6pk2K1j0J7k2j1L1k4K1J5kj4
3169A3rj1K5k3jK4m0K3j3k0L1J8rMk6J9J8mk8qMOQJL5l8j7jOL1Jk3L1k0l5L6k6
3206a8J7K9l3NJ6k7J1l9J6J9Lpj1OLQj2J2J3j3Lj3mM3l8lK5j0nK1m1K9j6j1L8
3241A6nJ2k4j2R%MMr%jLKn%PJ6j8J4Nj7k5M7Jn3L6J0l0K6mk3K1k6K5Qj4K5Mk0
3280Ik8L4j5j4nJ4lJ7j3J8j5K3j4lM2o4L7m3k5N6k0jL4l4L2qk3oK6K2m8j1QK0
3314a%RJ5j7K6m7NK9l9L5k1L3ll5rK3jk2K5OJ0J3m8K4qJ2roKKJ3l2K6m2J8K0J7
$$ plain form
3061 9 -6 -11 -3 -2 7 1 3 5 15 49 -9 -11 37 26 -20 -13 -7 25 -6 -13 36 -17 6 14 -6 32 38 -16 -7 23 -10 -20 25 2 5 22 2 -18
3099 -18 18 -19 0 -21 -25 24 7 0 30 11 -16 -13 -25 11 29 -12 10 -4 11 3 11 19 -15 24 -23 4 -3 -13 -7 -6 -2 -14 12 24 8
3134 8 21 2 -33 9 -5 -1 14 12 3 -12 -38 1 18 12 -37 4 -6 1 10 -24 4 20 13 -9 12 2 19 -3 -14 17 -7 14 29 27 13
3169 13 4 -7 18 -5 -6 18 -22 1 -12 -32 -1 17 8 12 -14 5 23 19 -9 -17 -13 -7 1 2 37 -1 -18 -19 -13 18 19 -4 27 7 -28 8 -18
3206 -18 -1 28 -5 0 16 -11 0 -39 -23 -4 -1 -8 -19 -13 -10 -2 -14 -2 11 -2 1 -12 -16 27 -11 -14 11 1 -4 17 -24 5 -11 -22 16
3241 16 11 23 -1 -13 -4 -4 0 4 -5 -5 -6 -3 -1 -6 -6 1 17 -1 13 18 1 -24 23 24 -29 7 17 -13 13 9 -14 7 -19 6 14 0 25 29 9
3280 9 -19 15 0 -14 -19 -5 -8 9 -4 14 -1 22 8 5 47 -17 20 -23 -48 8 -12 -13 21 -13 19 11 -12 -18 8 30 -18 -29 -21 -1
3314 -1 -1 8 23 6 32 -15 -10 19 -20 15 -6 27 24 -11 -20 3 2 -20 5 11 21 34 -14 10 2 14 5 -1 1 3 16 -16 10 -32 -14 6 23
3351B3K3l5k2J9j9J0J5mJJ5j0k9L8l8L1k9j0M9k7J1Oj3j1O1m2j2PpJ4%k6L8l3
3384fj3O1m1k3K1J4k9K9k3MJ7ql9O1l7L1k6j0L5Nk2J7m6L3M7m6k4J4J1j2j8J2
3416a1J8J2j0J2k2j3Jj7M6m1J9J4k3J6J2oRpk1J3rqQL2k7J3k3pL9k0%K2l7K5j2
3451cjJ1qnK4k6J6Rk5J0kojkNj4lL6k9kJ6L3m8J0J4J0k1%k3L9qj4J1qK0%k1L9
3489C3j0J1k8MnK8j2j5pJ8jj5j0J2Ljl4K7Kj3Jk3K3m%K9n5L1K1m5M0j3J5Opj2
3525fK1j6K3nlkj7J3l9KN3Qq0N8K2m4J6k0K2K3m0QK5l6M8m0k8QK3k1J8jJ3J6m2
3560b0kJK1NJ1k6M1j1k2LmJ0K9p4O6j2k5KJ2j9K7om2M8m1L8K2m6L3j5nkJ6%Pm6
3596b6L5j0MPK2m0j7ROL7l1K7ok6J8lk6L8l0J5J8n4J8K9m2PJ7qRMK%Mj0j2K0l
$$ plain form
3351 23 46 11 -11 8 -11 -1 14 10 11 26 16 -13 25 -13 18 -11 -21 28 1 12 18 5 -6 55 13 1 8 1 15 15 -11 27 -6
3384 -6 -19 42 1 -22 -1 13 -16 13 -10 -6 11 3 -36 25 -12 19 -7 -17 18 23 1 18 -28 5 52 6 -18 -4 7 -5 -23 -11
3416 -11 7 19 9 21 -1 -14 -13 -30 16 -25 -6 8 -15 1 13 7 16 9 -12 1 -8 -16 -8 24 -3 10 -13 -20 19 -1 -1 21 -16 9 -3
3451 -3 -4 7 -1 -6 18 -8 8 17 -8 2 0 -6 -7 -9 -4 -18 -21 15 -14 -16 0 33 -15 -5 9 19 -2 -2 -25 14 6 -8 3 -5 15 15 -6 33
3489 33 23 34 6 10 5 33 21 6 -1 17 16 1 -9 3 6 5 -29 -2 0 -13 -12 -35 -12 -16 -16 13 -42 -11 10 -35 5 -8 7 13 6 -6
3525 -6 15 -1 22 17 14 12 -5 8 -31 -29 24 32 -48 10 32 -12 4 -16 6 29 -11 -3 22 -14 34 -6 -34 -26 -3 -24 -6 -7 6 22 -20
3560 -20 -22 -21 0 5 16 -10 31 20 -2 1 -3 7 36 -38 28 16 -9 -7 5 -14 13 7 -35 13 -28 10 32 -14 19 4 -1 -3 13 13 20 -26
3596 -26 9 -1 3 10 32 -8 -25 -16 -10 27 -4 23 17 -9 9 6 -20 18 -12 3 21 -33 -15 14 -28 -21 -4 -12 -3 1 3 3 7 -3 -15 5 2
3633BM3m4QK0l7J4%mjnMklj2J7l2K4K8j1jNl0K7j0QJ6k6RJ4j7k6NK0k4MJ0K6l2
3671a3J0j4nM0Mk9K9j2m2L8pjJ0RqK2o4L8j6Nj0mJ9N1n3Pl2J7J4J9n4K6M1m4P
3706bj3k1M1j4J4Mk6J1J3m3K0JK5J9l8Rj0L2m1K2%j3K4k6%j3RJ9l1M1K0l1%j9
3740a7j8M6lnM%J4l9lMK0k2L0k0K3Kj7k8j4L6k6L9l0L6J1o7L4M5l0Om6M4l1qJ6
3775a4PQNk0J0M4k6l2K4j5J5Nmj9mLj9L5j0J4j6K5j2k3k0J6mJ5J0j4L6qm8K4Q
3810djJ6j7K0mrJ7k4%K8m3L5Jj4j4JqJ8K8l3J1K5mk8pK0L8p7K9KJ8m6J5k5K3J2
3846aqK3rj8RK1J6k6Rk2J5j2Kpk6O0j2k4Pk1L8Rn2J3N5p4L1J0j9K7nj0L0o4M4
3881Ij6J5qmJK9j3l6L9pJ6l4j7L7j5pJ5Oj6K1j2kJ1l2J9K4l5J9Rk7LKJ9k2J0k7
$$ plain form
3633 2 45 1 9 29 -8 6 6 2 1 -4 0 -2 -5 -17 0 -32 -8 20 9 8 13 -17 10 0 8 24 -2 7 21 4 -22 -17 3 -21 -17 -7 19 -13
3671 -13 -3 -17 -22 18 22 -7 22 10 -32 6 -1 -2 8 17 9 31 -33 5 -11 -6 -16 -20 -1 50 -3 4 -28 -11 3 22 -32 -6 35 -9 -2
3706 -2 -15 -36 5 -9 5 9 -17 -6 7 -36 -16 -15 10 29 -9 0 -10 22 -19 3 3 -10 14 -12 -12 -25 -16 3 -28 13 33 2 2 -17
3740 -17 -35 11 8 3 7 7 21 -18 -21 -17 3 -19 11 -9 14 16 -1 -29 -43 -7 -33 6 -24 12 23 -44 -10 35 5 11 -35 9 -22 -30 -14
3775 -14 -7 1 6 -14 -4 40 14 -18 6 -9 6 11 7 -12 -16 -13 -32 3 -7 7 -9 16 4 -19 -39 -23 -27 -12 -2 -16 20 12 -36 -12 -4
3810 -4 -5 11 -6 14 10 1 18 -6 -6 22 -21 14 15 1 -13 -12 -20 -2 26 -7 4 29 25 -3 -10 10 48 -29 0 2 20 -26 -11 -36 -13 -1
3846 -1 -9 14 5 -13 -4 17 33 7 16 -6 9 -3 -1 -8 -34 26 14 -10 -3 -24 14 23 -29 -16 39 -35 -4 6 -13 14 9 -1 29 -35 9
3881 9 -7 8 0 -4 -3 26 13 -23 16 9 25 -9 -26 11 -4 -11 4 10 -6 15 3 1 12 -20 -1 23 -12 7 16 -11 -8 -6 13 -9 1 -26
3917b6M5l9L3J6l9J3Nk9K7jpKppNj8K3K3l0j7jK1Q%k9L5J4j4j6%K3j5j1PPj3M9
3954C7n4OJ8k7j2M4l0MK5J0Lj1Qj3LJ5l7J9K0m3J5K0k7l1M6l3M2l0rL3K6l3J2
3987A6j0j0K4pjpJ3j1J4j3J0j9j9K5k0L2j1j0k6M0k1J9l1j7P0l0lL1m1jj8J5K4
4020GJ0k8rL6j7QKk2K4j6j3N2m3K6J3m9nL8m4L5pPK4k6k1J1j3oM2l7M7k3k0J9
4054Bl1M7Rl1oJ3Rl1J8j1QJ5l9L9j0lRJpK8j4Oj1oJj8lMj6N5J8l0j4ml1J9%J5
4092@K8l7J2j7J4J2K2n3L3k3j5N0l1RNk9M5k5K7n0KjK2j0k9L0J4j2Mmlj2NJ6M4
4127D3l7j3ll0K5K3mJ6k1J1J0l5NK7k6kOJ4Jk3n%lM8j4j5K4omMj8k0L5j1%K2n5
4164c1K1mrL9jJ6%j4k9J5j0rK5J8k1k0J3J3m1J7OJ6J6Lo0M2k9J8J5kQnj3k0L8
$$ plain form
3917 -26 19 -20 13 29 -10 3 8 -21 6 5 -2 0 -7 -14 -9 -27 -4 19 -11 -28 -29 -8 0 0 -29 6 20 6 -10 -10 13 -2 -13 -6 1 -12 37
3954 37 -17 -11 7 -20 -32 12 -18 -14 11 21 24 13 21 8 11 26 -11 8 28 -15 0 20 -7 -38 8 -25 17 -13 -22 11 37 4 16
3987 16 6 -4 20 13 12 5 18 7 21 8 18 -1 -20 5 -15 17 6 -4 -30 10 -11 8 -23 -40 30 0 -3 28 -13 -14 -32 -17 7
4020 7 17 -11 -20 16 -1 7 9 -13 11 -5 -18 34 -9 17 30 -19 -24 14 -30 5 -2 5 29 3 -18 -7 -20 -26 16 -21 26 3 -17 2
4054 2 -29 18 27 -4 -10 3 12 -19 -1 -12 -4 11 -28 11 1 -2 7 8 1 29 15 21 10 4 5 -13 -16 -12 -28 27 45 15 1 -3 -34 -15 -15 0
4092 0 28 -9 3 -14 0 12 34 -19 14 -9 -24 26 -5 4 9 -20 25 0 27 -23 -21 -22 0 -10 -39 -9 5 -7 -3 -7 -10 -22 -17 -1 43
4127 43 6 -7 -10 -40 -15 8 4 20 -1 10 20 -15 -10 17 -9 -11 -5 9 10 -13 -18 -18 -21 27 13 -2 22 16 12 16 -2 -22 13 2 2 24 -31
4164 -31 -10 -14 -23 16 15 31 31 17 -12 3 -7 -16 9 27 6 -14 -1 12 -29 -12 -6 10 26 29 -31 11 -18 0 15 13 21 16 3 -17 21
4199B1m8K3kQ%Kj9j6K3M5qk7pM4m3LJ9k7L6l4PJ1%K0l4l3K1j3qM2Nk9L0l6LK5
4235DJ0j0K7m4K1j1j9oK1lL9m0L8n2OrM2k9K4N7q7L2Nmj9Lk0M0oJ3l6o%J5j3K9
4271A2lOJ1k6m2M6J6j1L3j2l5%JK8l3KK6k3oJ2kk5J0JL2j8%K4Nqk8lK0J3l3M9
4307C9m2J1Jk1lJ6PNpl1J5RK0k2J5j4L7l3PnJ5j2Rrk7NJ3J4j7l4O9l6K0oj3J2
4343Gk0%K9J2l3K8j8l0M4m4J5M1l1J3J4m1K1k8PK3k4L9k1J2j5L3k1J0Mj9j0K2
4375A9l1M0k1m4M8k6J8Rl7K9K6k4j5K4k2lM0mk7J1kj5OL2k9J4qj0jKj1K7j8j2
4409a5L2J2l0OJ6j0K3l7jjjPLl9N9k3k6M0q%Ol6mL8pJ3J1j3J9l0l7K3NLRl1L6
4446A2k1K0j4RPJ1qm3O9m1J2k9j1K5K8l8mJ2l4Q1o5K8ok1K2j4oL5orl0K9j3J7
$$ plain form
4199 21 -27 -4 -6 2 2 4 -15 -31 -8 37 29 2 -5 39 -4 -1 18 -9 27 -7 0 11 11 31 -3 -36 -15 -28 -36 6 11 -18 12 -24 -21 4
4235 4 14 4 31 -13 8 -3 -22 -28 -7 -10 29 -11 27 -25 -19 -28 14 -15 9 66 -21 11 16 12 -7 -4 -24 16 10 23 -13 -19 -19 -4 -17 12
4271 12 9 15 26 0 -42 4 20 9 42 30 -5 -5 -4 24 -9 -7 19 -4 -10 2 0 -25 -15 -14 18 0 0 24 29 21 -7 -10 10 23 -10 39
4307 39 -3 8 9 -12 -15 1 8 13 6 -25 -10 -1 19 -3 12 -2 35 2 9 4 19 7 16 7 -20 -15 -2 12 -5 -39 30 -6 14 8 -5 7
4343 7 -13 -13 16 28 -5 23 5 -25 19 -25 -10 31 0 13 27 -14 7 -21 -14 9 -15 24 3 15 0 33 12 22 26 7 -3 19
4375 19 -12 28 7 -37 11 -15 3 12 -25 4 30 6 -9 15 -7 -10 30 26 -1 10 8 -7 -1 31 2 16 8 -2 -3 -1 -12 15 -3 -15
4409 -15 17 29 -1 5 21 11 34 -3 -4 -5 -6 1 4 -35 24 1 -25 15 7 7 13 -23 -27 11 4 17 28 15 34 4 -33 -10 -5 -2 7 -24 12
4446 12 -9 11 -3 6 13 24 16 -27 42 1 13 -16 -27 -2 26 -12 -16 -4 -38 43 -22 6 0 -21 1 -13 -19 16 10 1 -29 0 -13 4
4480Dj7J8J4j6J9k1j0j2K8j7L9l4j9L7k7L1Kj5mqJ4Rj0qJ8J4kk8k9M4%j5qjJ7
4515GNK1j5mMl5M0m7M1j2j9M5j7Nkkm1M7ok5K9k1Qk7J8L2ol7L1l2N0pk2M%k6o
4552b2J8k2K8j2J8Mk6J2kJkKkK9m0pL0Nk1K0j1K1J4n2J6K9k2Jl6K1L6k2l6M9k7
4587hJ6k6J1K1k0pM3j7J7k9k3J0L9l6J8j4J5Mj7J3lJ2J3l4l5L4J3j2JM7m2L0l5
4620ajJ0MLj3nK2k9J5pJ4J1j5m5L2J6j0OLj4nJ3l0L9l%j0NOK9m3J2j0lJ0rNK3
4658B5m5K3M6n3j0K2k4K5k7K2M7l2j7J5j1j9K8k3k3K8JJ0j4J3l1L9j8L1j5jj8
4689flpJ8j7J9OqJ4j5K4l0j4M4j0J0jqJ6l3oJL8n9L4Rk3rK7k9J3RK1j0j4J5l1
4725a5J9K3k0Ok1L1j2qk4PK2OJj7L1Kk7l3M6Ok2K2Kj2nJ6k5Pk4M5Nn1J2Nk6M4
$$ plain form
4480 4 -13 5 19 3 22 1 -9 -21 7 -10 29 -5 -24 13 -14 17 19 4 0 -8 6 15 5 -3 15 29 27 -1 -30 14 14 -1 -9 -10 7
4515 7 12 33 18 14 18 -17 23 -24 17 5 -14 31 14 19 17 15 -26 21 15 -10 19 -2 6 -21 -3 29 23 -14 17 -15 35 28 6 10 10 -16 -22
4552 -22 -4 -26 2 -10 8 12 -14 -2 -4 -3 -5 -3 -5 24 -16 -23 7 12 -9 11 0 21 35 -17 -1 28 6 7 -29 -8 28 6 -30 19 -8
4587 -8 8 -18 -7 14 -6 -13 30 13 30 1 -22 -12 27 -9 9 -5 10 14 -3 10 7 19 32 -2 -37 -3 10 -2 -1 46 4 34 -1
4620 -1 -2 8 12 15 2 -3 19 -10 5 -2 12 23 8 -37 -5 11 1 7 10 -4 -9 4 -26 13 10 10 0 5 11 40 -3 9 -1 -4 6 -3 2 25
4658 25 -20 3 49 -4 -14 8 -16 9 -18 4 51 19 2 17 6 -13 15 -8 -31 -3 -2 8 -6 7 -24 15 -3 28 13 12 -6
4689 -6 -9 -16 2 -15 4 10 2 16 1 25 -5 -19 25 15 25 24 16 32 -1 -7 -6 32 -27 7 16 -7 -16 11 -18 -5 4 25 15 1 16 -15
4725 -15 4 27 7 13 -8 23 11 3 -21 -14 8 14 15 -2 29 31 4 -29 17 23 1 23 25 13 8 24 -1 6 -18 27 32 -19 -7 -2 -28 16
4761A6rL1m4J4lPKrJj1N1l8j0K4j%l2JL3j5k2K5j4k7M5mjM1m6rK6l3NJ1L1j3j2
4798A1j6J1J7l8j4j0K2L2m2M0j7oJ5oLmmnRklK0j2NLK0k0j1j9J8pJ2LJ0j7k5L9
4835A2k4PJ8j5KrJ2KQj4k2K3j0mL0k2mK5n5J8J3k0K3mJ5K7lm4K7l5K5NK2j4Pm5
4871b3J8J1OkJl0MK0J1l4J1K9Nk9kKlJ0J6Ok4oj5L0lJ6m0M2l1RmKk2N5nl4J6L7
4909E0m6K8qk8J2Lk2J9Lol9K1OQM1m8L1l2K4j3Qj0JkK0oKj1j7K7mk5K6k7JK6K0
4946C3j9oQJ7J0k6J5l4QOolJqjj6K6OQk9L4j8rlk1K6rJ9pPmJ7l8k3P2k5k1J4j1
4985a0J9lLj6jkJ8MOl5J7k5K1J4j9N5n6J7k1K5Jk7L5j0m4K0K2k2L3k3nL0Lj4%
5020A0k4K7j8jL8ql3J2Jk5N2k1nnjL6j7j8j5M%J6k4J8J9n8N6J1m0L9J1o2jM3l
$$ plain form
4761 16 7 38 -6 8 5 12 14 5 6 -5 46 8 -2 22 21 21 -11 -10 23 8 -14 11 -3 -30 15 11 10 51 5 -4 22 -11 -6 5 36 23 11
4798 11 -5 6 23 -15 -29 -39 -17 15 -27 13 -4 -10 5 -1 2 -2 -6 -11 -2 -4 -7 13 1 6 9 29 9 -2 -21 -3 -10 2 5 15 -2 -27 12
4835 12 -12 -5 13 -2 0 -9 3 5 13 -1 -23 0 -10 -14 16 -6 -10 15 -40 -22 -9 -29 -6 -10 5 32 29 -15 12 -23 2 7 29 15 22 -23
4871 -23 -5 6 12 10 11 -19 -15 5 16 -18 -7 22 27 -2 -4 -2 -5 5 21 27 3 -3 -18 12 9 25 -15 27 -4 5 1 3 -19 36 31 -3 13 50
4909 50 4 32 24 -4 8 11 -11 8 11 5 -34 -13 -7 1 42 -6 25 -7 17 4 12 2 3 1 21 15 17 6 -11 16 12 -13 13 -14 -13 13 33
4946 33 14 8 16 33 43 17 32 -2 6 12 6 3 4 -4 -5 -21 5 11 19 -10 24 6 -3 -6 -27 -1 -10 9 2 9 5 22 -16 -39 33 8 -13 1 -10
4985 -10 9 6 9 -7 -8 -10 8 12 18 -17 0 -25 -4 10 -9 46 -10 7 -14 11 12 -15 20 10 -34 -14 8 -14 19 -4 -9 21 24 10 10
5020 10 -14 13 -5 -6 32 24 -9 3 4 -21 31 10 5 0 -1 35 18 0 -15 -11 -11 5 -19 -1 18 -40 16 27 -13 26 37 -25 -26 17 14
5055A4qk0L3Ll6J3QPJ3ok0J4l2j3J5J6K2k5l6L9Ok3K2l1J5J8nmJ4n%Ok5J6Pk0
5091hJ7Nj3J8j1j4jJ1k2LrL5l5K9NJ0k6K1j2kj4K0j5J4J5m6L9j4J6l4K1lJ2qK
5126Fl6J7RNJ5m1nO2n9M1k3j1K6Qj0k5M2k7j1K1J6l2L4oL2o1K2qQJ2Kk2j0rJ4
5161dK6j1J7J0k4%k5k5P7k4L3k8%l5J4Pj4jk1L2J4j6pk4J2K3nJ1nLj9Rmj1K8j7
5197dj6M4j3%k0JJ5LJ8j0j1k0L2l0L4k7krMJNL6j9Pk0Ok5K0mLrK2j8K7ll4J4J5
5235A3j0QPrK5rj3K8n5J9nJ7J2l5Oln%J0J3j5J1PJ3k1j8J7njK9l9K2j3kkM6o9
5272b6J8K7Lk0j1J5J5j8j5M2j7lPrrol3O6j3j2JNL2j9l2L1j9k1K5j0pJ5j9J6J7
5307A6R%k1l4M7l5K9Ml2K3Qj4j7J1J3LJK4kj9MKj5nJ1jNk2J5jk0j2L6j0K2l6m
$$ plain form
5055 14 6 -14 19 22 -14 -1 7 14 27 21 1 15 -17 -30 -15 1 23 -2 -38 1 7 -16 6 -25 -10 8 3 -1 13 8 8 14 -11 5 12 -8
5091 -8 9 14 1 19 8 -6 -7 4 -18 -15 -24 11 -24 5 10 20 -6 15 3 1 -13 7 -8 6 21 -25 14 0 16 -18 3 0 12 4 6
5126 6 -30 -13 -4 1 16 -25 -30 32 -27 14 -9 -20 6 14 4 -21 21 -6 -17 4 20 -12 22 16 48 -13 9 1 9 21 23 1 -9 -18 -4
5161 -4 22 11 28 38 14 14 -11 -36 41 17 50 22 22 -13 1 8 -6 -7 -28 4 18 2 -5 -29 -17 6 1 12 7 10 -9 0 -4 -15 13 -4
5197 -4 -20 24 11 11 -9 -8 7 10 28 18 7 -13 19 -11 23 -4 -6 -15 -11 -10 -5 31 12 19 -1 5 -20 0 -4 -1 -10 12 -6 21 18 -16 -2 13
5235 13 3 11 18 9 34 25 12 40 -15 4 -1 16 28 -7 -1 -4 -9 -9 1 14 -1 10 17 30 9 -9 8 3 2 31 -8 14 1 -1 -3 43 -26
5272 -26 -8 19 22 2 -9 6 21 3 -12 30 13 10 17 8 -1 -7 -40 26 13 1 2 7 39 20 -12 19 0 -21 4 -6 -13 2 -17 -1 16
5307 16 25 25 4 -30 17 -18 11 15 -17 6 14 0 -17 -6 7 10 11 35 33 14 18 20 5 0 11 10 15 -7 8 7 -13 -25 11 1 23 -13 -17
5344a7J3nkpK5j4M1m1oL9k5pJ1j0kJ8j1pK4kJ1k9Lk1L3j3OpJ2j5qL5%k1Nrk1j0
5382c4L2j6J1LPk4K0mkj9M3K3k9Jk0K3k0PQQNl4M2nk8J1lqJK2j6l1L2j3N1m0j4
5419a0J2J7n5L6lk0J7j8J6Ok1K3oj2j5M0k1L7pm3J3K5oK1j5k2K2opRk0L3j6k0
5453a6K0J5j3Qj9%K0j6LlPpRJ3k2j0L0l8NL1qkJ0mMm1nL1LKj0Mr%NOmrL3jk3l
5495dnJ5pM4o7J5J3okPk0K2k5M0j7nRpQjj3oK0oMK0j5k1K9k0PJ2k7kJ0L4j4k4
5533ej3K7jk4K7k9L8l1K2ok3K0qJ7m6N1j7Kj4L5l2L6l0Lk0J5NJkRqj7J9J9Ol0
5569dK0pj5j7L9lrmoK5o6N9kJ1j8M2k9l6L7k2OJ0l3kK9j9J0jjQJ7k5k6K8j9KL2
5606A1krJ2olmNK7m5L9n2L0J4qNJj7j0NOqoK1J3j4Mk0rL1j0MpK5J1k5k8qM0j7
$$ plain form
5344 -17 -4 -9 -11 -18 7 -7 34 -7 -13 26 1 -6 5 -5 -7 11 0 -7 17 15 26 -3 0 -21 12 -1 5 -2 10 -5 -13 22 22 1 6 -3 -24 -34
5382 -34 -2 -18 -7 -4 3 -21 -1 -5 -7 -26 17 40 11 12 -8 15 -5 2 10 18 23 -11 31 26 -2 9 6 -2 -1 21 5 -26 6 -7 44 4 -10
5419 -10 2 19 -36 0 -3 -23 -6 -24 -8 -2 -23 0 -6 -18 -33 7 -14 23 16 -27 -14 11 5 26 11 -11 11 5 -2 7 -13 20 4 -16
5453 -16 4 19 6 14 -5 -5 15 -1 2 -1 6 -1 8 21 -1 -11 19 -19 -14 17 9 7 17 13 17 -24 -29 2 5 7 -3 1 -8 -8 -3 3 -1 -10 23 22 -1 -4
5495 -4 -9 6 -1 43 -24 -9 4 -2 -4 3 -17 5 -20 20 3 -2 7 0 8 7 -6 -12 8 2 6 26 11 -10 19 -1 6 18 -9 -11 -1 33 19 -5
5533 -5 -18 9 8 -16 11 -18 20 -11 11 5 -18 2 -6 11 -35 16 -1 1 -13 22 -10 26 -4 -1 -21 -6 -1 0 -2 7 -1 -18 1 20 26 -4
5569 -4 16 9 -6 -23 16 13 4 0 -6 19 -47 12 10 21 3 45 16 -20 17 -5 1 11 -22 -24 5 -14 -4 -5 -6 2 19 -6 -32 -4 -23 -21 11
5606 11 9 0 12 6 3 -1 4 31 -14 25 -27 3 17 9 14 15 -2 -12 -7 -1 -9 -15 6 19 5 9 -11 -20 11 1 5 -2 23 34 9 -19 -27 13 -4
5645dK0k7J7kj1J9j4j7RJ7LKk2Qpq%J4Rj6M0qj9K8l0rJ8LnJj3kl1O2k7qK6j4K8
5684C0Kj3%kK1lk9J9k5JJ1Mpj6K5k6j7L3j7L0j4rM1ql6J9j1nPk4%M8m1L3J9j4
5720B6l8J0j6J6K1k2NkJ3k3K0o%l1M9l2J3oj4K8%Mk0K1j9MrLK6Pkk2K1kj6lnK1
5758B0Rk0kl4K2%J5qrJ5K3l5kJ2l8K2OOj8%PL1npnk3J6K0k1K6l0R%K2J4l3MJ7
5796B6l5K3K3o2NJM1j8K1l3k9O4m0L6m9L6L0k6k9Pj4J0L2l0L3l3J6k8L2kpJ1Q
5829B0m1K2Mnj1pL4j1k4L5j4nJ9o2P6j5pk4qK4j3mJ8Pl7N9k0okl0K5K0j9QJ3j8
5865Al2L3j0OJ5PMk8mLmj3oM7km7K8K4k5J0Oomk3L0kl4M6Rk5jkm3J3N2l3rK8L
5904A2Nnj4j0MK5qKJj0Oj4J7j5Kk5J4L9Ql2OJ0j7LMj0Rj0J4rL1m2J9k4j5K8j6
$$ plain form
5645 -4 16 -11 6 4 -7 12 -2 -19 -10 7 10 12 -10 -2 -9 -17 -17 -3 6 -10 30 22 3 31 1 -8 10 13 8 9 -4 -6 -37 25 -2 -10 16 2 30
5684 30 32 19 19 17 38 35 6 25 0 1 12 16 9 -7 18 -8 -25 8 -9 21 7 -2 39 31 -5 14 3 -2 5 -19 -19 29 -12 21 40 26
5720 26 -12 -2 -18 -2 19 -3 2 0 13 -10 10 4 4 -27 22 -10 3 -3 -17 11 11 15 -5 16 -3 1 -8 -5 21 28 26 4 25 23 7 4 -1 20
5758 20 29 9 7 -27 -5 -5 10 2 -7 8 31 -4 -6 6 -32 -10 -4 2 -16 -16 -9 22 17 10 5 -18 -2 18 -3 23 -7 2 2 24 38 5 9 26
5796 26 -9 14 37 -25 -20 -19 22 4 25 -8 -37 27 -13 23 -26 10 40 14 -15 -8 -22 -12 20 -10 23 -10 6 -22 10 8 1 12 20
5829 20 -21 1 5 0 -11 -18 16 5 -19 16 2 -3 16 -46 30 15 8 -16 -24 0 -13 -17 1 8 -29 30 10 4 2 -28 -3 17 -2 6 19 1
5865 1 -31 2 -8 -2 13 20 24 -4 -8 -5 -9 -22 -28 19 17 -30 -2 22 -3 7 13 7 3 -20 10 8 -26 20 29 4 3 1 -42 -29 23 -10 -19 9 12
5904 12 17 12 -2 -12 -8 17 9 11 12 2 8 -6 11 -4 -2 -27 -13 26 34 2 8 18 1 4 8 -2 7 -3 11 2 33 -9 10 -14 -29 -1 -17
5941a7L7Om9J1J3M3j5m4L6pk2K5J3j9Lj4K1kkRk7J8j3J8j6k6LJ3j9J1K7j2j5J7
5975Em%j4J0J3Nj1lJ4K7k2m0K5qNj4J7j8J7K4l9M5j8jj4J6k3L3j0nJ3m3K0k3K0
6010aK3k6LMJ1j6K2k4qL3k6K8l3RJ4j2j6PLJ3plL4l8J8j6K6j0k4PJ1Mj8J9j1R
6046IoKL9l4Nl2L4mkj8%J0l0L8l5K1%%oQJ5Pm3L9rj6jL2k0J3ol5qL7K9k4l1L7
6084A5j4JlK4k8OJ3qj2K3j3j8K6pJ0Nk7kL2rK4k1j5J2j1lJ1j5J8mplJ1j8KPPR
6122A8oJl4N0k9MJ5j8J9ll1j0kM0LRj1j8l3L3qK8j0J9k6oM8l0kLK1l6k2J6J3l9
6158c4M7pj3j1N1l1J1Ll0J8J9j1j6K6l8L1l3J9JLj0J2mj9J9L6k2%j0qmjK0qMk1
6194a1J1n1N4J7k1rK7jj6onpK8jp%jK8l1Rj1j2L7l2OK9jj1j3JJ6j1K1m2K2ORl9
$$ plain form
5941 -17 20 26 -23 -12 1 44 29 -15 21 14 -8 17 30 11 14 0 21 19 17 26 -1 17 4 22 6 -20 -17 -4 -23 -12 15 3 -12 5
5975 5 1 1 -13 -3 10 15 4 1 15 42 20 -20 5 -3 2 -12 5 -13 4 28 -11 34 16 15 1 17 -6 27 17 12 25 -18 2 -21 -1
6010 -1 22 -4 -1 3 14 -2 20 -4 -12 21 -5 23 -10 -1 13 1 -15 -8 -5 8 1 -2 32 -6 12 -4 22 12 -12 -5 6 10 -8 11 0 9
6046 9 3 5 44 10 15 -17 17 13 11 -7 -7 3 -27 11 -24 -3 -3 -3 -9 -1 14 21 -22 17 8 -8 -9 23 3 16 10 -25 -33 4 33 9 -22 15
6084 15 1 2 -1 23 -5 1 14 6 -6 17 4 -14 12 5 15 20 -7 -9 23 14 38 17 2 14 3 0 11 -4 14 10 3 0 11 -7 -5 2 9 18
6122 18 12 13 -21 29 0 4 19 1 20 17 -14 -24 -26 14 17 26 15 -3 -36 -3 -11 17 7 26 0 -6 42 12 10 13 34 -2 -24 -8 5 -34
6158 -34 13 6 -7 -18 33 2 13 16 -14 4 23 12 -4 22 -16 15 -18 1 2 5 -5 7 3 -16 3 39 17 17 7 -1 -5 -6 14 6 10 -11
6194 -11 0 -51 3 20 -1 -10 17 16 0 -6 -11 -18 10 9 2 2 1 29 -2 7 -4 -16 21 -11 -5 24 23 12 -1 0 16 5 26 -16 6 12 21 -18
6232a8L7J6l3J5Koml%k9K4J7K1k9J3j9Ok1oM3m2L0k4L7k1j5QnoQJ2kj3%L9k3l
6269FK1m1J5J6j5K6l9N4o9L5JJ3l5N1m3JJ8%m6M1noJ5k8L5kJ9m9J7J6k8J3J8k0
6303EJqKKMjj1J4j3l6N4k7qL1l7L0J5m1J4NK6j2l5KL6j8J0kRnqj1L2j3JmQJ1j2
6342A0j2j3J2%LLNmj3K3l7J5NM0m0rK0j0j5M6j9j2J3k1K9qJ6k5Ol3NL1Jj1j5k
6378a6L4rOPnj3j5M9o0M5j5j2L0prl5K8j1OJ7onJ4nk9L3l2K3Prj6K3rj1J8j2K6
6415B5j3Kj2j9L7m0M9l8J8L2j6m1L8k2j8l8L4k4N0j3J5J4k4pK5Jj1OJl0M0j9M
6448FqQ%j6L1j3rk5RJ4PqO%pML4pj3k9K1k7M4k4Rl8M3Mj0%j2J0j9L7k0PNj1RK6
6488C8k6l6K5lRK8k1j7mK4j6qJ3j2J5J0k7J2K1l2rNK1k8K2j1J2K2k0pnrJ7k1P
$$ plain form
6232 -18 19 35 2 17 19 13 9 6 6 -23 1 18 39 10 23 4 10 -11 -17 26 -16 14 -10 27 6 -9 -1 -6 -12 -4 8 6 -7 -7 32 9 6
6269 6 27 -14 1 17 2 28 -11 43 -26 9 10 23 -12 39 -4 -3 15 15 -31 10 5 -1 14 -14 21 19 38 -11 6 22 -6 7 25 5
6303 5 6 -2 0 2 6 5 -6 8 -5 -41 13 -14 -22 9 -28 2 17 -24 -10 -5 21 9 -26 -24 12 -6 4 2 11 6 -2 -13 19 6 7 3 11 22 10
6342 10 -2 -15 -3 -3 0 3 8 4 -9 14 -23 -8 -3 37 -3 -12 8 -2 -17 29 10 -2 11 -10 19 11 27 2 8 -25 -20 11 12 1 -14 -16
6378 -16 18 9 15 22 17 4 -11 38 -22 23 8 -4 26 19 10 -25 3 -8 -2 15 9 4 18 13 -16 17 -15 8 15 6 -10 13 4 -7 11 -1 25
6415 25 12 14 2 -17 20 -20 29 -9 9 41 25 -16 22 0 -18 -56 -22 -46 4 -9 6 20 -4 -11 14 15 4 10 11 -19 21 2 6
6448 6 -2 6 6 -10 21 8 -1 -26 -17 -3 4 -4 2 2 -5 -1 33 26 13 -16 5 -22 22 -2 7 -31 12 16 6 6 -6 4 -15 22 2 9 14 3 12 38
6488 38 12 -24 1 -2 7 35 14 -3 -7 17 1 -7 6 -6 9 19 -8 4 25 -7 -16 -11 10 -18 4 -7 5 27 7 0 -5 -14 3 -18 -11
6523a1j4L8K3o1lM6PLk5Oj7J6JjK4l3jJ7j3j3K7j9Pjj2POJ6j7j4J7lJ5rj9L0K0
6560D0n1JJ3lqK1oJj2jK2jk6M0l5J3l7N3NJ2m7J6Pl2K6%l1J9J8%j9pK1j6mj0M4
6597B6l7K1k0mJ4knj1L5k9LKLmJ5l2J8j8L1j1j1k0L6L0n3L0kk3K0Ol8J7NJ2QL5
6633D7j1n1K5k8L9J5l1k2RJ1l3K9qK2l2L0K2j6j5pM7m2j4RJ9k0LK3j2k9K5J3n0
6666c3L9qOj2j7L6j8KK8%k2MJ1j7LlMOjppJ1lj1KML5k1j7KJ9pnJ3qj6k3N2j3j7
6706iPNRnj8K2nj1J5qJj1M0k9nJJRK2p7N3m3K5qJ6J1l0K1%LL3m3j6L5k5L7k3j
6744aJ1j7oKK8pMjj2k3L4j%j5J2oj5J7l1L4k9J8qj7L6J1m1RJ5%j4%nK9nnJ9j5
6782EJ2j3joj2L4l0LJ6k9K2j0rK7j4K9l0j1J2K0k9M7rj3mk8L4J9m0J4orjK2j4
$$ plain form
6523 -11 -25 13 36 -25 -28 18 25 28 3 9 -8 8 9 8 32 -1 -2 15 2 -11 16 -3 4 3 -9 -2 4 20 3 -11 6 3 18 9 -10 20 40
6560 40 -11 -10 3 0 -8 13 7 8 -4 -5 17 16 -10 30 -5 8 -29 24 29 41 -6 10 17 -15 11 11 -20 -1 17 17 -2 -9 12 -4 -8 -18 26
6597 26 -11 10 -10 -14 0 -2 -7 -18 17 -12 -9 -7 -4 -8 7 -25 -7 -25 6 -5 -16 -36 0 30 -23 7 5 -18 2 8 -30 -13 -8 4 12 47
6633 47 36 -15 10 -18 21 36 5 -17 -8 3 -30 -1 -9 13 -19 11 33 17 2 -5 42 0 -14 -5 14 -6 -3 20 8 -21 4 17 -33
6666 -33 6 -2 4 -8 -25 11 -7 -5 23 23 1 5 16 -1 2 -1 3 9 8 1 -6 5 2 -9 -7 -3 32 11 -6 -4 15 8 3 16 8 -8 -31 21 8 -9
6706 -9 -2 3 12 7 -11 11 6 -5 10 2 3 -8 32 3 -2 -1 0 9 31 -46 7 -36 -11 -19 -3 8 -22 -1 -1 2 35 -8 -24 11 -14 23 0 -1
6744 -1 10 -7 -13 -11 17 10 14 13 1 -22 12 11 11 -4 8 2 -13 4 -27 7 -22 -4 -12 -29 7 18 -23 -14 1 1 -13 -13 -18 11 6 1 20 5
6782 5 17 4 3 -3 -15 19 -11 -8 8 -21 1 -9 -18 9 -5 24 -6 -17 -5 15 -14 33 24 11 7 -21 13 32 -8 6 0 -9 -10 12 -2
6817bK9l9qM2k5j8L7l3JJ3jJ7J1l9oL4j9Rl0J3L9k4j3J7k2L2k1jkJ1rJ1Jj9MJ
6853iJ5Qj4J4j6QrOKpJ0jk5M3PK8k3k4j1J1qQPk5lJ2Qj0J5k7lPKK2Jlj0rJ4%j0
6894AnRj1J7j4JJ2Ljj6J3Kj9Pk7J5J3RoJ8l1K2j7J2kk2nL6j6lrJ3Rk9J4j0K2%
6932EQk6k2N1j1K3j4j4j0L0j8J7k5jJ7j7NjJ1pMR%K8l1Lk7QK7Mk1nLOj1qQJ7P
6971B2l4L2j2k0j9L0j6M3Jk6k2K3j0J6jj8J7ook9N0j7rJ3lj5L1j3k1L4kk4L3j9
7005Ck7N4m2j2L5Pm4L4j2j0K6j3jj2J9K3j4nj0J8l5J6J9j3nLK4j1j3Pk4L3j8K9
7039B9l0lj3J4K4k%MpkKl0K8j6K4k6Pj4J8Lk5L5rj3OJ6j4Mk6JM5k3mrM0m5J1k3
7077b3L8m8L7J2n0M2k5M1l5L0J5ql7qL8oJ6k4Joj6lM0Ml8OJ1k2J4kJ8Ll7K4J3
$$ plain form
6817 -2 27 -12 -20 22 -3 -21 16 -17 -16 -3 -4 13 24 -15 -21 13 -6 3 -27 -14 25 1 -12 5 -17 15 -6 -7 -9 2 -7 4 5 -14 -10 -9
6853 -9 6 14 0 14 -2 6 -3 3 5 -2 8 7 -18 25 32 60 37 13 2 13 5 13 20 -5 -8 4 12 2 17 -10 -13 -6 -4 18 19 16 6 -3 11 11 1
6894 1 -4 5 -6 11 -3 -2 10 13 12 -4 9 11 -8 -1 -28 -13 0 9 3 21 -10 12 -5 7 5 -17 -22 14 -2 -5 -14 -1 8 -21 -7 -17 5 5
6932 5 13 -13 -35 16 5 28 14 0 -10 20 2 19 -6 -7 10 -7 -2 -3 8 1 5 14 14 42 11 14 -13 -5 22 26 5 0 3 9 -2 -10 -2 15 22
6971 22 -12 20 8 -12 -31 -1 -17 26 27 1 -21 2 -8 8 7 -11 6 0 -6 -35 15 -2 -11 2 -1 -16 15 2 -19 15 13 -11 22 3
7005 3 -24 30 -12 -24 11 18 -26 8 -4 -14 12 -1 -2 -14 5 28 14 9 -1 17 -18 -2 17 4 -1 2 26 15 2 9 -15 18 0 29
7039 29 -1 -4 -17 -3 21 19 19 23 16 14 16 -14 14 -2 22 -4 3 -11 7 10 -15 20 11 -2 4 20 6 10 -16 -15 30 7 3 -6 34 -11 0 -23
7077 -23 15 -33 4 16 -34 8 -17 24 -11 19 34 26 -11 -19 19 13 29 5 6 0 -16 -19 21 25 -13 -7 4 -18 -4 -6 12 15 -22 2 15
7112A5j2j4JJ0J4k4J0RpMMJ7n8K8QK0j7J7nj3rn%lLmmJ4k0K9j9QlqK0mJ8k7K4
7151A7l2J2LJ8j8l2L2jmlK2j6LOjqJ0j1j1%K7j4oK2Kk7MjoK8k8nQN6m3j3J7KK
7190A1rK8j3Lm3K4oK3%l1J5Qj0pJ1J3j9M8m9K7k2J7On4J8J1l0K7nL1kk2K4%j3
7225A0j0jNK3m3K0qJ2j7J2Kj8J2J4j5L3j6j2Nj5J0pRk4L3pj0L4k9J8k4NJ4k9L9
7260B5k3k9K2J6k6QM0k8m1J9J2J7k1J8l5K3J7j2J6mkNm5K6J3K4pqJ3j9k7L7j0
7293A4%j7J6j7J0nk0M4l0JJJ2%k3J6K1n3L9rOpkmJ1K7j8rNj6lJ1K6m6J8J9j4q
7330dpL0J2jn9L4J1Kn3O7k1l4K9J1m4J6njN1m0Lk4K6%j2J4j5J9j2jlL8l4jJJ7
7366A0j7%K6k8pM1l1J2NMj5J4k7K3j4j2J3OJ4k1%pJ2qK7k8J3oJ7mPk4j4L3JmN
$$ plain form
7112 15 3 -11 -10 0 14 -10 0 9 2 6 10 27 -31 -3 5 25 8 25 20 7 -2 -7 -7 -10 -7 -11 -15 -1 -21 8 -11 -3 -6 -14 6 2 20 -7 17
7151 17 -15 -3 0 18 0 -32 0 -1 -5 -8 14 -2 1 7 6 -2 8 -3 -14 -14 13 -1 -7 15 17 -10 -6 -7 -13 15 -13 -18 -10 46 3 -10 7 9 11
7190 11 2 30 17 20 -23 1 -5 18 18 -13 2 10 0 -7 4 17 -2 46 -3 24 2 19 25 -29 -11 0 -30 -3 -8 23 21 -1 23 23 10
7225 10 0 -1 4 27 -16 4 -4 8 -9 3 5 -13 -1 13 -2 31 15 3 8 -7 3 -4 5 -19 14 7 -3 31 2 20 -4 1 15 -14 25
7260 25 2 -27 -5 11 -15 -7 33 5 -36 -17 -5 12 -9 9 -26 -3 14 2 18 14 12 17 -28 -2 11 35 28 20 33 14 -13 24 14
7293 14 14 -3 13 -4 6 1 -19 25 -5 -4 -3 9 9 -14 2 23 -30 9 0 6 -1 -3 -7 4 31 13 4 9 -7 -10 1 27 -19 -1 18 4 -4
7330 -4 -11 19 31 30 -29 5 16 18 -35 32 11 -23 6 17 -27 -11 -16 -17 34 -6 -3 -27 -1 -1 -13 1 -14 5 -7 -8 -11 27 -7 -8 -7 10
7366 10 -7 -7 19 -9 -16 25 -6 6 11 15 0 14 -13 10 -4 -16 -3 3 17 -4 -4 -11 1 -7 20 -8 5 -1 16 12 19 -5 -19 14 15 11 16
7403A6qj7K4k1J1pQRPj2J1j4J4j1Q%k4L8n3K0K2j8pNj3LOPK0n5O5m7j4J9QN%l4
7441b9J3NJ4J3mjPNPl6nJ8qJ2Rj2k0qOJ5MJ%lmKpNnK0k1KKJ8qJ0k9K7l2K7K%J3
7484B5k7J5j0JoK1j9lK9qj3%j8L0mMj5j3J8j8LQk0K8qj2J4k0J6J3K7n6K0joKl
7521fmPk1J8j1K6j4J2j4J4Rn0M3olk2K7rL1l1MJ4j1J5k5kNJ1k1L5j7J0okmLnJ9
7559A9qmj4J0JmJ3mLrj2J2j5K6%Rk5J1j6J5j7NKPL6n4J1RKJ2j3rJ7ok8J3J4pr
7598gj3L3kmjrK2j6jPMMl1K2lJ8pk1K2k9K0l4N7rl6K0npj1J9%N%J4j5J6j3m2L1
7637bNkK8n8M5l3j1J0L6k6j4M2l9J7Mk2J0rJ5K3n1L3jjRQKJ4j6oqj5J8Polkj0
7675ikK8%mj6Llj4J6Rm3L4Nq%j9j7M4jk7K0j1K2M1l2rmOj2j6j0K6J5k8kJ3J1j1
$$ plain form
7403 16 8 -9 15 -6 5 -2 6 15 22 10 21 7 21 10 18 18 -6 32 -21 -1 21 3 -4 1 -12 -9 -3 4 24 -31 34 -13 -27 -8 0 5 5 -29
7441 -29 -16 -11 3 16 12 11 18 23 30 -6 -11 7 -1 11 20 8 -12 -20 -14 1 5 6 6 3 -1 1 -6 -1 -6 14 -7 -5 -3 15 7 17 -12 15 -17 10 12 12 25
7484 25 -2 13 3 4 -2 19 0 -3 26 18 5 5 -13 17 13 17 2 -11 7 -11 -8 0 -20 8 0 -12 2 -18 -2 11 38 -18 2 1 -5 -3 -6
7521 -6 -10 -3 -24 -6 -17 9 -5 7 -7 7 16 -34 9 3 0 -22 5 -4 27 -4 0 14 3 18 -7 -9 -4 7 -14 21 4 14 8 6 2 5 0 19
7559 19 11 7 -7 3 4 0 13 9 12 3 -9 3 -12 14 14 23 -2 9 -7 8 -9 -4 -2 5 41 -13 -2 7 9 21 8 -1 16 10 -18 -5 9 2 -7
7598 -7 -20 13 11 7 6 -3 19 3 2 9 13 17 -14 8 5 23 16 -5 17 -12 8 -26 31 22 -14 6 1 -6 -17 2 2 7 7 21 6 22 9 -33 -2
7637 -2 3 1 29 -29 16 -17 -28 -18 18 -8 -22 20 -19 -2 2 -20 -10 -19 -4 19 -32 1 0 -1 8 16 18 32 16 10 2 -13 5 12 6 3 1 -9
7675 -9 -11 17 17 13 -3 0 -3 -17 -1 8 -35 -1 4 -4 -4 -23 -40 4 3 -24 -4 -15 7 48 16 7 3 9 -3 -19 -29 -3 12 -16 -18 -5 6 -5
7713ej4NKK6k8%oN2n0j4L3RJ1j1k0JQJKK5j8Qn1M1L0o7N5j9Qk5K4qpqj3lLL0J7
7752B4j5rKl1JM7j4J1pk7M2m5K9j4j5j7M4k5J1oJ9j9KJ1jnK9j1j8J7m4L6kjK1
7787B0Ojl4j9M3l5oL7j9L0l0Ljqj6J9J0J0m2M3l9J6ppJ9oK0l1rL1J9j5qRPk4P
7824hJ8K1l6LNj6K8l1rJ8J6l3O6l3j7J9mpRMnk7J9mK1j4Om6L1%lL6Kl1NJ2k5k
7862a2J9l0K1MnPk2K6J3j0J8k6j7OONJ3k0JJ0l7M7k4Qj1L9n1L1j8j7L3lRjj7j2
7898a7L6j3J6l6M6m0M1l4NnK9k8K5j3mQk0J0oL0j6j5rnJ1qK6j4%J5kj3l1M3j4
7933b%j5K0Ojj8K6j8NQpkMjnJ5k1J3J7Qj4Nj7l1K3K6j8J2MKj4nj8Pj5J5j2k5M5
7972Bj2K7l0N0m1j9K7j7J3rJM0m2K8l6J6j1J6j3JJ3qJ5J0j2njl3M6j3J8km9K7
$$ plain form
7713 -5 -19 -14 -12 14 -14 -14 -20 32 -18 -32 1 10 21 10 -10 -9 -1 0 2 27 9 17 -34 7 37 -30 25 6 14 -11 13 5 -2 -10 -23 -26 -23 7 24
7752 24 9 0 2 -29 -28 19 5 16 9 -18 24 -21 8 -6 -21 -38 6 -19 -8 -14 5 -14 -12 -1 -2 -7 22 11 -7 10 -34 2 0 -1 20
7787 20 26 25 -9 -28 15 -20 -26 11 -8 22 -8 -5 -6 -14 -30 -11 -1 9 -33 10 -29 -13 -20 -27 -8 -14 6 -25 -34 -3 16 1 -7 2 9 -15 -8
7824 -8 10 31 -5 -2 3 -13 15 -16 -25 -7 9 -24 42 9 -8 11 7 0 9 13 8 -19 0 -4 17 3 9 -37 -6 -6 -9 27 29 -2 3 15 -10 -12
7862 -12 7 -23 -2 2 -3 4 -18 8 21 11 29 3 -14 -8 -2 3 16 -4 -3 7 -30 17 -7 1 -10 29 -22 9 -9 -26 7 4 13 12 -5 -17
7898 -17 19 6 22 -14 32 -8 33 -1 4 -1 28 0 25 12 8 16 -4 6 0 30 14 -1 -10 -15 -4 -12 14 0 0 15 13 0 -31 12 -2
7933 -2 -2 -17 3 9 8 -10 16 -2 3 11 4 2 6 5 0 15 -6 7 24 32 18 23 6 -25 -2 24 6 18 22 24 10 5 -13 -6 -21 -6 -18 -43 2
7972 2 -10 17 -13 37 -4 -23 4 -13 0 -9 -8 32 -10 18 -18 -2 -13 3 -10 -9 4 -4 11 21 9 4 3 -30 16 3 21 19 -30 -3
8006cK1m0L9kj0Ok4L2Jj4k3J1JJ3j0QNm7J1K6J1j3J9j5j2OJ0Kj5JpOJK8rNm5K3
8044cQlJ1j7MJ7j3oJM6l2j0J0j6kO%k3J3pNJ9%PqlJ5oj8K7k8pJ8NPNj9rK3rj6
8085hJnJ2L2m5RL3k2oj7L9j7J2j5j3QKj6JJ5k5L3l5J7L1j2j8J2njj9J4rL9j2j8
8121hJK5j7J3J1Nj5pK9k5kqj2J4KJ3k9L1l8M2l0mKK5rl7J8L0nJj6j7J4pL2L2n7
8158cK5oPkk6M2n6J3KL2m9K8nj1M6j6kl2kRJ5Jk8qL0J3m6M4j7J1rl0L5
$$ plain form
8006 -3 18 -22 17 15 5 11 -13 19 20 6 -17 -6 -5 8 -2 6 11 -36 -25 1 12 -1 18 3 -9 -3 7 9 -6 -5 -12 -6 -5 23 14 19 -26 -3
8044 -3 5 2 13 -4 0 17 4 -2 -1 45 13 3 13 -3 -5 1 1 -22 -9 -16 -11 8 8 15 7 4 19 13 -5 22 -6 -13 5 10 17 22 3 -6 17 8 -8
8085 -8 -7 -12 0 32 -13 -4 29 7 1 -16 23 6 18 3 -10 -2 0 -16 -15 0 -25 8 -27 -10 21 9 -9 3 -2 -3 -22 -8 -17 22 10 -8
8121 -8 -7 18 1 14 25 30 15 8 37 12 10 2 -10 4 6 19 -10 21 -17 25 -5 -9 -7 18 9 -28 -10 20 15 16 0 -17 -3 -10 22 54 -3
8158 -3 22 16 23 21 -5 37 -19 -6 -4 28 -21 7 2 -9 37 21 19 -13 -15 -6 9 10 -18 -26 4 17 -29 15 -2 9 0 -30 5
8191E
$$ Imaginary data points
##PAGE= N=2
##DATA TABLE= (X++(I..I)), XYDATA
0@%%%%%%%%%%%%%%%%%%%%%%Kj0J6j6J6j6J6j6K2l0L2l2L6m4M8n2O0o5P3q1Q9j01
44e3J10j21J35j48J62j79J98k18K39k64K93l24L60m04M53n12N84o71P84r37J150
65F37j466J987k992N585k4299n1795O8892N0693l8351l5578K1079K0005r597j1221
79f421M385M9l427Q666J5268p818l0250l610L7439J0876l3692j4371K1232J3525
93A1851n942q548j302L79R44P881K435j4670n263J9336J1335j8425j6096J2236
107c849J0915p953J768P118j2282p806J3756P356r952q397O883J3372k166j5810
121g047l433J2263M532q632L46Q748p939r534J4167Q906j6210r028J3742J1004
135A1885r499j2152O202R021n215l589N353m27n565L502R148m528j4320K556J4953
$$ plain form
0 0 0 0 0 0 0 0 0 0 0 0 0 0 0 0 0 0 0 0 0 0 0 0 2 -8 8 -8 8 -8 8 -8 14 -16 16 -16 20 -24 24 -28 32 -33 40 -41 48 -53
44 -53 57 -64 71 -77 85 -94 104 -114 125 -139 154 -170 190 -214 239 -273 311 -360 424 -513 637
65 637 -829 1158 -1834 3751 -20548 -72343 -3451 47242 8891 -26687 -5608 14397 4800 -6421
79 -6421 -2036 -1987 -5414 3252 18520 10702 -19548 -23158 14281 25157 -8535 -22906 -1674 11851
93 11851 5909 -2639 -3941 -3562 -2618 5263 7698 -6972 -12235 7101 18436 11 -16085 -3849
107 -3849 7066 -887 881 7999 -4283 -12089 1667 9023 -929 -9326 -2443 10929 8763 -7047
121 -7047 -10480 1783 6315 -2317 -1971 6777 -1162 -10696 3471 12377 -3833 -12861 881 11885
135 11885 2386 -9766 -3564 5457 242 -3347 2006 1579 -3986 -484 8664 4136 -10184 -7628 7325
150G325N56j1482l858Q069O444p177o652O219L246m182K255L714n062m912N083
165d14N003n630k848P000M59o103J387L632k697m262K006P046n37q157J28O385
181B398l17m200M17L862p66m076L156M035n987m809O200O606m485q694L409R318
197F067k512o421J112P45m80L242J648m318m263L765O669k804p179P40O725L493
213F229n302o790K795N484l70r60j320k535J971M176r17n982j891P458M121o899
229g32m520L971M220q57l069J70J714j159P36J703k991j843K463J730p49k825
245b038l18M150O51l745o63K422R28j902%K940j877l380L375J793l593k19K682
262A206J80j922r76J917L57k149Q08J557q41p63j57J322J126k330o27K589j67
$$ plain form
150 7325 7881 -3601 -7459 610 7054 -123 -6775 -556 2690 -1492 763 4477 -585 -5497 -414
165 -414 4589 -1041 -3889 3111 3570 -2533 -1146 2486 -211 -4473 -2467 4579 4042 -4115 -3987 2398
181 2398 2081 -2119 -1702 2160 1394 -2682 474 4509 -1478 -6287 -87 6519 2034 -6660 -3251 6067
197 6067 3555 -2866 -1754 -1009 -1489 1753 3401 -917 -5180 -1415 5254 2450 -4729 -3989 2736 6229
213 6229 927 -5863 -3068 2416 2046 1086 -234 -2769 -798 3378 2461 -3521 -5412 2046 6167 -732
229 -732 -5252 -1281 2939 2082 -987 -817 897 -262 474 2177 -814 -2657 -194 1536 787 -2038
245 -2038 -2356 1794 2445 -1300 -1963 459 1387 -515 -515 2425 548 -2832 543 2336 -1257 -1476 1206
262 1206 1386 -536 -1512 405 762 -1387 -579 978 137 -626 -783 539 1665 -665 -1292 1297 1130
279A130j565j15Q93O22j723k86K417j311j895K622Q75k561r10J986J386k190j244
296a869K702L17j595Q68r4n00Q15k96k05q0r62P08R48q41q48r8J704Q18k531k11
316a250K445o67j046P32Q0k43k28P23N83j969k08K347p22j591L42M22O36j45j104
335h63N16P46L6j43p17M39P43r46N01M42j549O84J249j391p20Q52Q37m10j220
354i14P72Q31j169M18O71j088J17O47j35J41m84j7R40k79l63l02l37J277J62j615
374g27K38N63l35N11Mo38j95N16J153q75j663J447R23j059L15Q7n73P41M39n35
394C37q51l08J096J51m96L47r36n68J798L48j247k54J60J026O74j168j113J19
412h85J481J376j810j878J324J319K2r29j533M60J511O57l73j872m07K452M81
$$ plain form
279 1130 -435 -550 343 965 -758 -1044 1373 62 -1833 789 1664 -897 -1807 179 1565 -625 -1869
296 -1869 833 1150 -445 423 329 -171 644 348 143 63 -899 -191 757 -84 -932 -1030 674 1492 -1039 -1250
316 -1250 1195 528 -518 214 294 51 -177 546 1129 -840 -1048 1299 577 -1014 -672 -250 386 241 -863
335 -863 -347 399 435 292 -425 14 757 -189 312 754 -795 -111 1138 -253 -973 -121 716 306 -914
354 -914 -142 689 -480 -62 609 -479 -362 285 150 291 -193 -210 730 451 88 -214 -551 726 888 -727
374 -727 -489 74 -261 250 254 -384 -579 -63 1090 215 -1448 -1 922 -137 178 265 -308 433 872 337
394 337 -514 -822 274 425 -71 276 -660 -1228 570 918 -329 -583 -423 603 1277 109 -1004 -885
412 -885 596 1972 162 -1716 -392 927 949 20 -1513 -1053 458 1115 742 -1130 -1537 915 1396
429A396j600o48J24J369J158j324j596K9J162R73p13m60j5j034J019J888j783
446e5j984J085K049J069j791k642P46K839R41k461k336K348K826j525k031l68
462a290N57J343J01p51o7n19J13J142j09j066q98O86K716K82l119j091J728J612
480A370o03j668N72J123n59M43j20k154l11J891J545l5k408j245K477K005j657
497F66l355L77M450R56l292j202P78O48N21n86m20M22P7O19K38j460j123M3J952
516C09K377j556l087M74K411Q29j996k005J541K525J55j329k203n71K410J191
532A475j092j241o19J676J898j407k826l95K924K454k097k361J261J152l97m58
548e3m86J99K53L42J390o84k877m39K418J959j282k916P75L335P9k615j656J037
$$ plain form
429 1396 -204 -852 -728 641 1799 475 -1121 -1092 70 1043 330 -130 -145 -1179 -160 1728 -55
446 -55 -2039 -954 1095 2164 373 -2269 -1523 1316 2257 -204 -2540 -192 2634 1109 -922 -1290
462 -1290 -733 610 711 -40 -107 -626 -513 629 520 -546 -1444 -758 1958 2240 -879 -1970 -242 1370
480 1370 767 -901 -329 794 235 678 558 -1596 -1907 -16 1529 1494 -914 -2159 318 2323 666
497 666 -2689 -2312 2138 3094 -198 -1400 -622 26 547 -39 -459 -37 40 659 897 -563 -1686 -1643 309
516 309 2686 1130 -1957 -1483 928 1757 -239 -2244 -703 1822 1977 648 -1555 -2126 284 1475
532 1475 383 -858 -1477 199 2097 690 -2136 -2531 393 2847 750 -1611 -350 802 405 -53
548 -53 -539 -340 -87 255 1645 961 -1916 -2355 63 2022 740 -2176 -1401 1934 2013 -602 -2258 -1221
566a221K562L97j365n73m47L54J042m64j047m35Q80K217r1l082j398J851K445
583A625k69k592k2K411M01j418j297j28J486P27k93M8p47j039O29J202J04j956
601a128j033K934J976k559k368Q16K195O77j859q22J531R43o22j321m94J069L42
618B77o4O17o00j227M87O16L6l36m13O50N98k58k75o40k39J015L96k50k05m18
638b33K89L13n55j98j93J99J281r4j308k78L41N48K61o63p7P62M16l05r47k56
658f97N88r9O56Q14j379q86J084L84p67n63M46J082R6p04n16k88O11O67m47o1
678B1J33j39O13j85j162n7P19O39O6r39n1N28l44j50J63j55K79L29J40k47p41
699e40K80P09n81L7M48l97K10L44o18l70R7L00L31r2j6k89l21O46k2q35N93O05
$$ plain form
566 -1221 1341 1738 373 -200 -647 -293 749 285 -762 -1197 -317 1900 1809 -1273 -2671 -820 1625
583 1625 1356 -1236 -1258 1153 1554 136 -1161 -1289 197 924 631 679 -68 -1107 -478 724 828 -1128
601 -1128 -2161 773 2749 190 -2178 -1362 833 1510 -349 -1171 360 1303 681 -640 -1134 -65 277
618 277 213 830 230 -997 -510 106 142 -194 -607 43 641 383 108 -532 -771 244 640 390 185 -233
638 -233 56 369 -186 -384 -577 -378 903 809 -499 -777 -436 112 373 -290 -367 395 811 506 -441 -697
658 -697 -109 -208 448 1262 -117 -1003 81 465 -302 -865 -419 663 759 55 -461 -749 -138 529 82 21
678 21 154 15 628 443 -719 -776 -57 582 648 -291 -342 186 -158 -308 -145 -300 -21 308 448 201 -540
699 -540 -260 449 -132 -95 353 -44 166 510 -108 -478 -381 -81 250 158 142 -147 -468 178 156 -679 -86 519
721E19k70P5k29l30J74q5K34J27k72K44M1m60L7j75p1O31J26j71j41l16L82K08
743B78n26J98K18o1M50l77o64L61K79q2k04q8M72L0n24O4r8K8N86k80k61L83j01
766H1j8Q1l17J30K60m4N5l03j21L53j74j24J73k32J71J92k74nm6J3M46k97k02
789b02N49j77j47J36l73J17L74j99j51q6J15J58l95J09L83m22J71K95n07J17L60
810B25k47J59K2j87J44j42Q9O5l13K19J20l88K03L9k08K55j17p4K32k59J56L07
832C00m51N4K50p6R8j26j60K20o1l7l9k76L66J61m92K57L0l45L74Q2l13J80R4
855I0N2J4k80K06J6k07K59m3k53J78j62J03K20m36j22M67N1r4k70j23N14Q6l07
878d1P6j48J62L36k60k98mJ56L87l64m65M71J23j95J39k03n2J62r6K29J05l44
$$ plain form
721 519 249 324 95 -235 -61 -146 88 215 -57 187 228 -232 -195 -370 -441 190 316 145 4 -312 70 278
743 278 -248 -50 168 107 557 180 -484 -123 156 74 -130 -218 254 284 -240 -176 -274 -246 340 60 -201 182 81
766 81 63 144 -173 -43 217 173 228 -75 -196 157 -17 -141 32 -200 -29 163 -111 -116 -162 -149 297 0 -202
789 -202 347 170 23 159 -214 -97 277 78 -73 -159 -44 114 -281 -172 211 -211 -40 255 -252 -135 225
810 225 -22 137 159 -28 116 -26 63 128 -185 34 154 -234 -31 8 -200 55 -62 -136 96 -163 -7 300
832 300 -151 -97 153 77 175 49 -111 109 48 11 -28 -304 62 223 -269 -12 18 -327 47 129 -184 -4 90
855 90 142 156 -124 82 98 -109 150 107 -146 32 -130 -27 193 -243 -365 102 153 59 -211 -334 180 266 -41
878 -41 35 -113 49 385 125 -173 -177 -21 366 2 -463 8 131 -64 75 -128 -180 -18 -114 115 220 -124
900a24PJ98K01j07n94K92O16l71k35J59k75Q0L15r0j47l55K68O72l44n50J22L39
922G7L99l21n27L48L19j40q3k81L0L08k07J64J15m53l6K30R8P5k55j20M02K35
944C77o6n34m64Q86O27q14m13L35K92Km22j99L22QJ60K07l73k74O3L73M43p60
966b24m40R75M20o02n07O2N38l5m75M04K74n28j42K75J70k79n12N84Q68m33q02
987d09j38M65O54m49o70M78M90m8k88n40J21M86n0j14J9M3L1k91Q3L88o26k06
1009e71Q85L56m90n60j2P50j06o20K54L68kj08k18Jk00k89P13N31p55m80M60N75
1031D82k91r40L17J091k28m47O1q5l3k7K6L06k11j29L23m6l44k32k2N60L05l76
1053F0j9j01r8L14r5k87K26K05J80j23n22MJ87n1J88M0k11M5J56J80m36o07O58
$$ plain form
900 -124 -117 81 282 175 -419 -127 489 118 -117 42 -233 -153 162 72 -75 -430 -162 510 166 -384 -262 77
922 77 476 155 -372 -24 295 155 72 -209 -179 129 -78 86 201 -252 -288 -58 40 115 -140 -260 142 377
944 377 311 -223 -687 199 826 12 -401 -66 226 228 -194 -393 -71 -63 97 304 -69 -343 -280 93 536 -224
966 -224 -664 311 731 129 -378 -316 222 187 -288 116 390 -138 -280 -5 165 -114 -626 -42 826 393 -409
987 -409 -547 -82 572 123 -547 -69 421 373 85 -455 -334 152 102 -12 7 50 81 -210 -127 261 -365 -571
1009 -571 314 670 180 -380 -392 358 252 -368 -114 254 252 144 -74 -73 -273 -562 151 682 -73 -553 -93 482
1031 482 191 -749 -432 659 431 -16 45 -40 -73 -100 -74 232 21 -108 215 169 -175 -407 -429 131 436 60
1053 60 41 -60 -158 156 61 -226 0 205 385 262 -260 -256 -69 -120 68 108 -103 -58 98 278 -158 -765 -107
1076a07P56m99k86K45N3r9m07N4N32r3l00L02K69m12p26J99J008j81o39L53L02
1097C24k42j74l19J88M52k2k9j7k93Q3N7p9k6o4L29J56l87J6J5m04J83L93K4J1
1121A75k88M8L67m15l48M25L75n7k90L2J56m70o3N63j78k28L62P5j78k45k10L51
1143d1K52k66R5J97o5k43q5J75o3k41M55L28m74j12Lj1n0j45K32M34l37j26K43
1166A55j67l25K4M42K73l39j07L04j85l05nQ3K99N5j98J56j08l99J63J87q5J08
1188B6J69P1k42k42K53lk47K63K17j05r8k05J13J04m23O8N22ok69o2N5M6k63O4
1212a94M28r1j56J05K9j25j45K2L63k02k36M20k6m00L9J13J5j3p4K89jk82N2L7
1236c3N4N8j22J70J36l74j0K48k26m1J39N8J4j60j7J82k11j13L32Q4j02j10P8
$$ plain form
1076 -107 649 150 -136 109 162 63 -344 -290 242 149 -151 151 420 8 -718 -519 489 308 -331 22 324
1097 324 82 -92 -411 -223 229 207 178 161 -132 -49 8 -71 -97 -161 168 324 -63 -47 -32 -436 -253 140 164 175
1121 175 -113 -65 302 -113 -461 -36 339 282 -8 24 180 -290 -353 210 32 -196 166 241 63 -182 -392 -41
1143 -41 211 -55 40 237 172 -71 -156 19 -44 -285 170 498 24 -88 -85 -96 -146 -291 -59 375 38 -88 155
1166 155 -12 -337 -313 129 402 63 -44 260 75 -230 -235 -152 147 202 4 160 52 -347 -184 3 -82 26
1188 26 195 266 24 -218 35 32 -215 48 265 160 62 -143 -30 74 -349 -281 241 235 -34 -96 -41 5 -258 -194
1212 -194 234 143 -13 92 121 -4 -149 -127 236 34 -202 218 192 -208 -169 -56 -41 -54 -128 161 160 -122 -70 -33
1236 -33 21 79 -43 127 263 -111 -121 127 -99 -140 -1 57 71 -89 -106 76 -135 -248 84 168 66 -44 34
1259C4J49k83o2L83p8k37J81o3p8L8j66J70J04j99N2J28k0j56m2K63Nk69J79K09
1283B42l04l4J29k2K2j33O6K00k22j25K28J1j32j6P5J46j72q6K56r2j02J42j2
1306F5Jk0j63K27J2l06J19J91j29q0N2J14j04j53K35L2j98J45M6j21Q5m9o7J89
1330A23q9j09R1l9QKj5M4o2k9J94j68j00J65J7Pl8o0J60%j80J18Rj29J35m6oj
1358Br6N8Nk0P4p5J3J65j34p5J54j11M1J57j37n7P5j5K2q1o8J37l6m5N9j02M6
1385d4P7q2J16o3p9J34rl5P2j46L5J28j17LL6n5R3n8q9K7m3J14P7j66K9O1p6J63
1413A03r6j28J96N5j05on2M2N8j11Q4k0r8R8l6j0O1j41NJ97o7m6K6K8Q5m3j68
1440h9P3P6m8N9o5r9M4j7P4j7j21J56L4n3J4p8n2K44m9r8%L6P1r2j13J39K4j44
$$ plain form
1259 34 183 -100 -162 221 143 -94 87 24 -54 -16 -182 -12 92 -107 -55 73 53 -103 -145 118 123 -146 33 242
1283 242 -62 -96 33 11 33 -100 -34 166 -56 -181 47 58 -74 -90 -15 131 -41 -127 129 37 -65 77 65
1306 65 66 46 -117 110 122 -184 -65 126 -3 -83 -31 83 -21 -174 61 93 -105 40 86 -35 50 1 -66 123
1330 123 34 -75 16 -23 -15 -13 -28 16 -46 -75 119 -49 -149 16 33 40 2 -58 102 102 -78 40 49 -80 55 9 3 2
1358 2 -94 -36 -31 -51 23 -52 -39 126 -8 -83 71 -40 1 158 21 -36 39 24 46 -35 -103 34 -2 -47 12 -90 -44
1385 -44 33 -49 67 4 -75 59 50 15 87 -59 -24 104 -13 -10 26 -29 64 6 -83 -56 -99 15 92 -74 -45 16 -60 103
1413 103 7 -121 75 130 25 19 -33 9 67 -44 40 20 -78 20 -16 -26 35 -106 -101 96 29 -17 9 37 122 79 -89
1440 -89 -16 60 12 71 6 -93 -49 -66 8 -9 -130 26 60 7 21 -57 -109 135 86 -12 -12 24 95 3 -110 29 53 -91
1468i1J01L7Om3j91J18K62k47p6J14J81Lk85o4K67Qj10lJ0R3n4k07J26O1p7N4
1494gPK4lk02P0K03j17LK1P5M7j14j21J31jm5R7o5Q5p5j66J57K1j60K1J44J25
1521A55m7k44KK77j21q8N8N2J23j01k14P9J05r1K5J8R7n7j96J22Q1j77R5J28o5
1546A6Q6o9q3lj7J32L4j54Q3N5j01n9n0RK07l7m9L8o5J0l5m1N0J10j0Q9j39m6
1574c9R9j54jJ09M4L3q5r5J06m1j95J30J95lj24k6Q3n9j39J52R8o7P5j2Jo4j74
1601a53JK27l2o2N5P7o8j86k0J62OpJ07om7m2j51P0Q2m0J25K1n6o5j00k1L8O4
1629b1J35n7q4N4k3j20N9L5N8Q7q9K0M8j37r9J29L1omL9Oj50l8J04l1N4M7pL6
1658G6m4j30R0K4p1R5Q6l9p9j21Q5j6q7J35R4p7J7k6j9k8o7R5Q1n7O4j2o9k1j6
$$ plain form
1468 -91 10 47 53 10 -181 -63 199 -48 -124 -10 171 174 -111 -175 92 100 -10 -13 -3 90 36 -171 -45 16 -61 -7
1494 -7 0 24 21 -181 -111 92 -25 -22 -1 74 121 7 -114 17 16 -29 68 3 88 13 -153 4 25 -135 -114 30 155
1521 155 108 -136 -134 143 22 -66 -8 44 167 66 -148 -69 36 -55 -30 -12 85 28 -168 -46 35 -142 -47 81 16
1546 16 102 33 -50 -53 -70 62 96 -58 25 80 -21 -80 -130 -121 86 49 0 38 -27 -17 -52 -93 -43 67 57 146 7 -39
1574 -39 60 -94 -95 14 58 91 6 -89 17 -24 -219 -89 106 103 -21 -47 36 -23 -162 -10 88 21 96 84 85 21 -153
1601 -153 -152 75 43 -19 36 113 45 -141 -161 1 7 0 107 101 54 12 -139 -69 13 -27 98 119 63 -2 -102 -123 -85 -21
1629 -21 114 57 -27 27 4 -116 -57 -22 36 123 34 54 102 -35 -134 -5 26 20 16 55 61 -89 -127 -23 -54 0 47 40 76
1658 76 32 -98 -8 16 -55 40 126 87 8 -113 -28 -44 -131 4 98 21 38 12 -7 -35 -102 -7 74 17 81 69 0 -21 -37
1687c7j3Q4k9L2O2j18m0KJO6j0RJ32j29p1K4k4J2Q5K0mJ4j06J8L4r2M6P2Mj8r4
1718f8O1J6j09J14j4rK6RMK4r6OJ24o5l4P0j9n2o2J9N9n0RJ10q0j3Qn5Q7qm2Q6
1750E6K6j01L9kJ5l8l0Q5J5j13M1j3m2P9k4K2N0j15K6R8j30RJ00j1j7Lj4L9r5
1779d2l5P1koL8o8N6k5p2J23k4p9J21j0k5mm0M7Oo7R7Oq9j3M2k6N3j03L6R8o4
1810@o0O7j3j2LJ9P6p2mN2k1o8J3K9llo0R6m9n3N4nK2pl0K3K6o4P6J4q3N8k5J
1844cJ8n5K8L5q4M0L5l6Jk5K2R9j12jQ1j1n8L6j2J6J1k6M4q0NP3m5m3K5j1M1J0
1876A8q1K7K6k7N9Pj1Kn1L2M0l0J7J5m6L6j0m8N9o7J4R8j27%J04l9l1L4l7R5o8
1907A0k9j6J3O0l1n9L0K7n7L6M6m3J6j1j1J3k1M3j1l6L4L8o6L1L3n0M9n6j4O1
$$ plain form
1687 -37 -50 34 5 37 99 -19 -59 -57 -56 10 0 9 141 12 -59 -35 -59 -47 38 58 54 68 -38 -20 14 -78 -32 40 44 26 -68
1718 -68 -7 9 -100 14 0 -9 17 26 30 54 -42 -36 88 23 -11 59 40 -12 -74 -55 4 -46 -37 73 -7 -20 -12 -67 20 12 -30 56
1750 56 82 -19 20 18 33 -5 -35 50 65 -48 -7 -20 -62 17 -7 15 65 -50 -24 74 -56 -47 53 42 25 28 14 53 -42
1779 -42 -77 -6 -8 -14 24 -44 12 -13 -85 38 14 -65 56 46 21 17 -23 24 30 -37 60 66 -23 -36 6 -20 33 -70 -34 64 0
1810 0 -60 7 -6 -18 -15 4 80 8 4 56 35 -33 -20 9 6 3 -57 39 -10 -63 -9 -14 8 1 -29 -6 20 -44 32 46 -37 21 -4 -3
1844 -3 15 -40 -12 23 -61 -21 14 -22 -21 -46 -24 75 -37 -38 43 32 -26 10 -2 14 25 -1 43 -37 -32 41 -4 -47 -22 -33 8 18
1876 18 -63 -36 -10 -37 22 29 18 20 -31 1 41 11 28 43 -3 33 23 -25 34 -33 -19 79 -48 -48 56 17 -14 20 -17 78 10
1907 10 -19 -35 -22 38 7 -52 -22 5 -52 -16 30 -13 3 -8 -19 -6 -27 16 5 -31 3 41 -25 6 39 -11 38 -18 -32 29
1937B9l3k0N4n7J7J9n3P0n7M8J6l5k8J3L7J5l2o5R8j1o2PK4JMl4J8M2p9%N0K1
1969A7J9n1MM6n9j8R4l7JKk6NJ6m6J4J4pJ2j9N1nr8M4O3k3J2k3JO1n9o2O8l8P
2003b0L0k1M1jq5M6%qL5n1N1N2q3k7J4J2N3k9m0R1p2j2L1j5NLoM5k3m5J2J4oo
2037a5k4P4jo5J2L8j8k2ON4On6m4P6j8m0MK7L8ll8J9l7j8O7j7ML1Nl3Kn4jM7J4
2072B0qnm0M2o9K5M0kLN6l7j2ro6P7jj3N1o2JK7j4n8QM3P0l3n6L9l2m0L3J2M6
2106C6J7l1J2k4l5J2j1K2QQJ9jj10L7L7m2K9O9k0j0o0L5K9n7O8j2NJjl9Rm8K1
2139b7O6j3j0%j8j8Jl1Q7kk0J0Kl9k9K7rjL0L9k8m3Pj6j0L1oqQ4n4m9O1k7j0K8
2174E%L2l5LL8m2m1K0J0M8o1LK5l1k1L6J6J9k6L0k9l7K7LO0k6Ol1J8k5k2nK4K0
$$ plain form
1937 29 -4 -24 30 -27 -10 9 -44 26 -31 17 33 -2 -30 -17 20 35 3 -62 36 25 -37 -30 -6 -5 -1 -35 -17 25 -54 -54 -4 17
1969 17 36 -15 -11 35 -24 -42 52 15 16 18 -8 -3 13 -33 -19 -5 -12 0 -19 32 27 -71 -27 36 13 25 2 3 64 5 -57 11 -27 -20
2003 -20 10 -11 30 29 -56 -10 -10 -18 17 -34 17 69 -14 -41 -27 -15 38 9 -31 60 -12 -24 7 -8 -3 0 -6 39 16 -29 -17 -3 -9 -15
2037 -15 -39 35 34 -31 -19 19 1 -21 -15 39 45 -11 -55 21 3 -37 -33 -6 32 29 -9 10 -27 -45 22 5 9 40 45 12 14 -40 -41 6 20
2072 20 12 7 -33 9 -60 -35 5 3 6 62 25 13 4 -62 15 14 1 52 -10 -9 18 4 -54 -46 -3 67 34 -22 17 -15 -55 -22 -10 36
2106 36 53 22 34 10 -25 -13 -24 -2 6 14 33 32 -78 -41 -4 -46 -17 52 32 22 -38 -3 26 -31 37 25 30 31 30 -9 0 -48 -27
2139 -27 39 26 16 16 -2 -20 -19 -50 37 35 15 25 27 -12 -41 -14 -23 -24 6 45 17 -26 -19 -35 -45 -14 -20 -28 56 2 -47 14 -13 -23 5
2174 5 5 37 2 5 43 1 -40 -20 -10 38 -23 -20 5 -26 -47 -11 5 24 -2 28 -1 -38 -11 -8 52 26 32 1 19 -6 -28 -33 -9 11
2208A1j8L7n7PNJ1J4qRM0m2k1pj6N5m2K6J9Mm8L1qj2mL0OJ1n1M1k7m9O2pMqNO
2245Ij1m7L3K0l0K1J2jNl5J5jj5pL1J3j5PlK4k7l3P8ql4OK3Nl4rNJ0j9L9l8nJ5
2282aj1K1L5n0L4j7l4KK6j4Lk6%M8o1L1N0n8qK1K0J7j8l0K6j9L7rj4jKJK4k5k7
2317b5K5K8m9J7k2L6Mn5N5k1K8%n0L3K5ql6L2l7K5L0n1RLk4J5KL4j8l8J5K3mP
2351Hm1kN1J6o9M6j2qK1kJk0K5lkl4K4oj3L3j2jK2k8J9j5j9M2l7J9J8l7J1k6J2
2386a9J4L0m8M3kk1K7J1l1%mj3K3QKQl2k2J7K1%Ml2rLJ2KNj7K5j8N9l9mJ9k4J
2423aJ8j9lQJ7j8Kk6L3l5J8K9Mj0Ol4j1M0k6J0J2k1J6J0m8M8k6J5j8mJ1nl1O0
2457B1k1mLnK0l1J4mJ3L2p8P0l3M1m3l5L4L1k4nrK0K2n9M0j8kMOOnJ8k7j5JK9
$$ plain form
2208 11 -7 30 -27 -20 -15 -4 10 2 11 51 9 -12 -19 -35 20 -22 4 23 27 -21 10 2 -10 -14 16 22 33 -18 23 -4 -53 9 2 6 -2 3 9
2245 9 -2 -49 -16 4 -26 -5 7 6 11 -24 -9 -10 -25 -32 -1 12 -3 4 1 25 -2 -35 43 35 1 7 30 35 1 -8 -3 7 -12 27 -11 -16 -1
2282 -1 -12 9 44 -6 28 11 -23 -21 5 -9 -6 -32 -32 16 -45 -14 36 -22 -30 -9 11 28 10 -20 6 -13 24 15 1 0 2 3 27 2 -25
2317 -25 0 28 -21 -4 -26 10 14 -41 14 -7 21 21 -29 4 29 21 -15 17 -20 5 35 -16 -7 -4 -28 -13 -11 23 5 -33 -18 5 1 8
2351 8 -33 -35 16 32 -37 9 -3 -11 10 8 9 -11 14 11 9 -25 -1 -7 -20 13 1 0 22 -6 13 -2 -21 21 -16 3 21 -16 -5 -31 -19
2386 -19 -5 25 -23 20 18 -3 24 35 4 4 0 -13 10 18 20 28 -4 -26 -9 12 12 16 -16 -25 -22 -10 -8 -3 -20 5 -13 46 7 3 22 -2 -1
2423 -1 17 -2 -5 3 20 2 4 -22 11 -24 -6 23 27 17 23 -11 -22 18 -8 2 14 -7 9 19 -29 19 -7 8 -10 -14 -3 -8 -39 21
2457 21 0 -4 -1 -6 14 -17 -3 -7 6 38 -40 30 -3 38 -5 -40 -6 25 1 -4 -13 7 29 -30 10 -8 -10 -6 0 6 1 19 -8 -23 -22 7
2493Gl1N9l0Pj9K1Lo1K7K3Rj8J1Qj4kJ9j4k9N3l7L4on0L6j4J1Onj4K3l1J9Omj4
2529a1M1l1l7M8j7J7n5O0j4nj9M0k9jJ8k8K2j8J0M2oj8Nmj4ppJ6J8j4LqJ0k2J8
2564CJ3Jk7J5Qj0k7L1k4J1L0pnk7Qj5J1j6J9j5L3l0K1j3mJ1J9Km5L2JJ4j1k6L7
2599A8j2Lj8kK7k1mJ8K2n9M9k8NRl2K4K7mk6OQPQm8J0J5l9L5Nj9K4rqK7k0qQR
2637Gj5L0j9j4M0l5M3j4k5pJ5k2L2l9N1j6nlk0K8pJ5j5j9qJ3MqmmjJ4j2K6K4j3
2673A7rJqj5N4l0Lj6omL3Rnk2qJ4k4J5NJ8l8K7l3M1nj2k1pK5M4j6j4jk9OJ9j5
2710gJ7j2LJ0ol5M4plj1J2L0j6nol3J6J0jJ7l2J7j3k6M6k4K6nlLk2L7j7J1l9J0
2746a4J9Mm1J5j4J2J2Oj6L6k0K0lj9JRj1J1JoJ0j7J4j1O%jl2K0OQk6K2j4j2J8
$$ plain form
2493 7 -24 35 5 12 -7 14 17 -44 -17 6 15 -3 8 16 2 0 19 5 -24 29 -8 26 20 -30 6 -8 3 9 4 -10 13 -18 1 7 3 -11
2529 -11 30 -1 -38 10 -7 10 -45 15 1 -4 -23 17 -12 -13 5 -23 -1 -19 -9 33 27 9 14 10 -4 -11 -18 -2 16 2 5 -3 7 -15 3
2564 3 16 17 -10 5 13 3 -24 7 -17 -6 24 17 12 -15 -7 -22 -11 -27 -8 -23 10 -20 1 -12 -16 -5 14 16 -29 3 4 18 7 -19 18
2599 18 6 9 -9 -11 16 -5 -9 9 31 -28 21 -7 -2 7 -25 -1 26 22 -4 2 10 17 25 -23 -13 2 -37 -2 3 -16 8 -1 -9 18 -2 -10 -2 7
2637 7 -8 22 3 -11 29 -6 37 23 -2 -9 6 -16 16 -23 28 12 7 4 -16 12 5 20 5 -14 -22 -9 -5 -13 -17 -21 -22 -8 -20 6 30 17
2673 17 8 9 1 -14 40 10 13 -3 -9 -13 20 29 24 2 -6 8 -16 -1 4 22 -16 11 -22 19 14 2 -19 -26 -1 43 27 13 12 -17 -11 8 -7
2710 -7 10 -2 1 11 5 -30 14 7 4 -7 5 35 19 14 8 -25 -9 1 0 17 -15 2 -11 -37 9 -15 11 6 3 6 -16 21 4 15 -24 -14
2746 -14 5 9 -32 -17 -31 -19 -7 -1 -17 19 -1 19 16 -3 -2 7 -4 7 8 2 12 -5 9 -2 4 4 3 -29 -9 -3 5 -21 1 -13 -25 -7
2782gRmPlk3J4%k6J0KPKL9m2M0j5j9QJj%j2J4J4kJ4k1j4J7pJ5OnMk6Rj7qjJ0K6
2823A5l5LJlK4J4l7K3k2j5K0J2j5PpRJ6j6JJRK7n1L8m0M2kj5j5j0M2Qk0j8j0R
2859a0LJ2lJ4ok0L7k5%j6jj6K7JK3j3Nk0lNLJ9l2J2Oj1j2K3nKNk7J2M7k4joj0
2897eJnJ6jJk0J7J0j7j0K4j0ok3K3J1k4J7lK3pk0J2j0K1OMOj0k5mJ1j0jL1j5j8
2934a0j1K8qLJ2J9j1opj4j2J2OlJ3oLj4pJ1k6K5pNK3l4%rOL7k2K2k2NrQK1k7m
2973a0OK9k8J2k6%L7k8K4k2j8K3NoK6j8Pk5k4J0RL5l0J5j8j1J7QJ5l0L6l2k8O9
3007B9j8jkk2K6J4ok4K8n6N9ok9J0Rk3L0j8%J8k7rK7k0L7j9l3L8nk4j1N4k1k9
3041b4L4j3J9%Rn2K2k5M8l3jL7k3MNKj1O%j9K0K3Jl7j1nL8kn7O5j8Nj2Lj2J3l0
$$ plain form
2782 -7 2 -2 5 2 -21 -7 -7 -33 -23 -21 -14 -12 27 -15 25 10 -9 -1 0 -1 -1 -13 1 15 13 27 6 -8 9 2 17 23 18 22 -4 5 -12 -20 -21 -11 15
2823 15 -20 -17 -16 -19 5 19 -18 5 -17 -32 -12 0 -15 -8 -15 -6 10 -6 -5 -4 5 32 -19 19 -21 21 19 4 -11 -21 21 29 9 -9 -19 -10
2859 -10 -7 5 2 16 10 -10 27 2 2 -14 -15 -31 -4 -3 20 7 12 -8 -11 -6 -3 16 -16 -4 2 -9 -21 2 -3 -1 4 -23 -11 36 12 11 5 -5
2897 -5 -4 -9 7 6 7 -13 4 14 -3 -13 11 1 -5 -28 -5 6 -18 -1 -4 19 12 -8 4 -6 15 21 25 31 21 -4 -8 3 -7 -8 23 8 -10
2934 -10 -21 7 -1 2 14 33 22 16 9 -5 -17 -5 1 -2 11 5 8 -6 -13 -2 -28 -3 -10 -5 18 -16 -16 -25 -19 18 -4 18 -4 1 -8 0 21 -6 -10
2973 -10 -4 25 -3 9 -17 -17 20 -8 16 -6 -24 -1 4 -2 24 6 13 -12 -36 -26 -17 18 -12 3 -15 -26 -9 -1 14 -16 20 -12 -40 29
3007 29 11 10 8 -14 12 26 20 -4 24 -32 27 21 -8 2 11 -12 18 0 0 18 -9 -18 9 -11 26 7 -26 12 7 -17 -28 26 5 -24
3041 -24 10 -3 16 16 25 -27 -5 -30 18 -15 -16 21 -2 2 7 9 -2 4 4 -15 5 28 29 -8 -19 -24 14 12 -45 20 2 7 -5 -2 -14 -1 -31
3078c1K5KrrJ7j6J5RPRk3qJ2k2K2J0oOj0j6lM5m0rJ8J7K9l7j9nJ2Jk3K3K4l6N
3115a4qK2J4m2L0KK7o3K4LM5l1qK8jl8RJjQj5nNL5k4j2QK1n0K3K3rrkrpoj2K4
3154a4J7%llJ9j5k9L2J1l1rK5QNm7L3J5%K0j8Nk9kj6L9l1J5L3j2j0mPj0OkK1l
3191B3j4k2K8j7k4L0j0K5m0J3Ll9O2ol0pK6Rj8%J4mk5O2j9j6L8m7J4J1nj2K0j1
3225A2pJ7n3L7Lj8J4J6l0L7k3k7NJ8j3K4j1k8J2K9k8Jj4K3k9L9J6k8J7k6%K6j9
3258hMlJ9k5nlL4J0rLol7L8mmjJ2k0Oj4NLn6Q6j6j7Qk5J9NoLJ1j3%J0%k8K4J2
3298A2pJ5m0L9k9K6Nm3K6jJJj8Kj1Kk5N3k1Lj6J1J6K6Oj7Pm9L4J0Km2QKJ8k1J3
3335bppJ9n5K1K9k5PL0mj5j6K8J8j9lL2j3l0L9m1L3j1k2J3j3j3L6m6lO8k1L1j7
$$ plain form
3078 -31 -6 -4 -13 -22 -5 -21 -6 3 10 19 -4 -12 0 -22 0 10 4 10 0 -16 -19 26 -14 -23 -5 12 41 4 -15 -20 -8 -7 -30 -7 17 -19 -14
3115 -14 -22 0 14 -28 2 4 31 -32 -8 -5 40 9 1 29 28 -10 -1 0 -1 7 -8 -13 -8 27 3 -9 -1 20 -30 -7 16 7 -2 -4 -13 -20 -26 -38 -14
3154 -14 3 3 0 -3 16 1 -28 4 15 -16 -25 0 8 13 -34 -1 14 14 34 16 21 -8 -10 -26 13 -18 -3 30 18 8 4 11 1 7 5 26 23
3191 23 9 -13 15 -2 -26 4 -6 19 -21 -8 -5 -44 18 12 -18 -25 1 10 -8 -8 6 2 -23 39 20 4 42 -5 9 20 15 3 23 12
3225 12 5 22 -31 6 9 -9 5 21 -9 28 5 -22 -17 1 -12 12 1 -27 -15 14 -14 -13 -27 -4 -33 6 22 -6 11 -15 -15 11 -8
3258 -8 -4 -7 12 -13 -18 -21 13 23 14 17 11 -26 12 8 4 3 15 -5 1 -13 -8 -5 -61 25 9 -8 0 -25 -6 -1 -7 -4 7 -6 -6 4 4 -24 0 12
3298 12 5 20 -20 19 -10 16 21 -22 4 3 4 5 -13 -11 -22 -20 -45 8 -13 -10 -26 -15 1 27 33 16 23 -26 8 18 20 -22 -14 -12 6 -15 -2
3335 -2 -9 -16 3 -52 -31 -2 -27 -20 10 6 -9 -25 3 21 2 -1 31 18 -12 27 -14 19 8 -14 -1 -14 -27 9 -37 -40 28 7 38 21
3369B1l9PJ2k5J9J5j9mJoK6m8K7L0m9L5Ok0K7k1j9K3J0rK8Kj6j3j8L3J1l6M2n2
3403a9K0roj9O6m1kqpK9l9K6NKLJ0l7J0K4k2pL3j3qJ0j8J2J9j8Pj6J9K7l3K4k0
3439DoL6k7rM3m3pmJ9km2M6j8J1j0Nj8L6Ok2mrK1nk7J4K6mk4jKmqOL3J3l2L6l0
3478An1R5m3j1JJ9Nj6l7N0j6rOl7K3lLj4L8NOJ5o4N4l2lJ9kjL2m6lJ2j4M1l7N
3515iKK9j8j6M0Om8JJ4j1JMJ4m4L0K1Lm3mL1J6k7PQk1Qj1pJ5qJ9J3j2K3j3k5K4
3552A2J0m0JL8Nk1l4PM2m1J8K0pK1l6J1lj8J1K7l4Qk3K4k2M4m4K0K1o2L6k2Rj3
3586c5J4M8ok8J9j8Nj9K0jK0j0Nplk8J8LJ4npK2m7J6J5j8jJ6j0L0J0n0J5j9PL8
3622B3j9qkj3M0j6k6K8m5N2j9MJ0j0j1K3Ql6M0J1l3Nj5m7N2k2K2NJ3ol8j4QM3
$$ plain form
3369 21 -18 -11 1 -24 -5 10 -9 -13 -12 -18 8 -40 -13 17 -32 3 9 -11 16 -5 -24 -1 9 0 28 30 14 1 -17 16 27 -9 33 -19
3403 -19 1 -8 -14 -33 33 -8 -10 -18 -25 4 -35 -9 -4 -2 1 11 -26 -16 8 -14 -21 12 -1 -9 1 -17 -5 14 -4 3 -13 6 33 0 24 4
3439 4 -2 34 7 -2 41 -2 -9 -13 6 4 -38 8 -10 1 -9 -4 -22 14 20 -2 -6 -15 6 1 -26 -12 14 10 -14 -15 -13 -17 -25 -19 14 27 -5 31 1
3478 1 -50 45 2 -9 -8 11 16 0 -37 13 -3 -12 -6 -43 -20 -23 -20 -34 4 9 15 30 -34 20 -12 -15 4 2 1 33 -13 -16 -4 -18 23 -14 -9
3515 -9 -7 22 4 -12 28 34 -14 -13 1 -10 -9 -5 9 -35 -5 16 19 -24 -28 3 19 -8 -1 7 -14 -6 -17 -24 -9 -17 2 15 3 26 13 -12 12
3552 12 22 -18 -17 21 26 5 -29 -22 20 -21 -3 17 10 31 -5 6 3 -15 -4 23 -11 -3 -26 -2 -24 20 -24 -4 17 -45 -9 -31 -22 -35
3586 -35 -21 27 21 -7 12 -6 -1 -20 0 -1 19 9 14 7 4 -24 -6 -3 11 6 -1 21 -26 -10 5 -13 -14 2 -8 22 32 -18 -3 -22 -15 23
3622 23 4 -4 -6 -19 21 5 -21 7 -38 14 -5 -1 9 -1 -12 11 19 -17 23 34 1 6 -9 -56 -4 -26 -4 1 14 8 -30 -44 -36 7
3656Gj9PJ0Mj5j1pk2M6j2N9m1j7pj4M6qNMl6L2k6K8pJj2Nj4NN8n6rJ2J3rL3ql8
3694a3j2J4LPolJ0j9N9p8J2J6J3Rnj4M7n4qJ0K3k6RK1J8j8o6R0l3nrL6rQn4K0
3730gj0MnJ7J5K1l7l2nJ5J8J5LOj4Ll3MlL8lj9J2j4oj1J7L0ll3L4m0K8j8m7K0
3766d0N4knqQK8k5j4L1m2L2Pm5J2Kk4M1j1mJ6l0jJ9l5J5%M0J3j8k1L5l6lK9k4
3801fJ7ljRj9k0L3Kl1J7J0k6j5J7J1J8l1K4mk2J1L3n2L3qk6L8k7LQj0k5L1K8k
3836A5m8J7K5J1m7L9j8QK7n0J5J2l1N0mj8L0m0j7K6rmRl6N6plqQj1kpm1L8Pj8
3872b6jJ2K3k5NL2l1L0j4Rl1K8mK6k2k6M6Ml5J5J7j7k6J0qJ9m3K8kPRJ2j3j5L
3907dLj1k5M0J5l9LK5K6m3J1k0K9j3j7K5j2J8k3j6N2km1L1k3PN8n2l2L3j6PPj9
$$ plain form
3656 7 -12 -5 5 9 -6 -17 -24 -46 0 -12 47 6 -11 -18 -32 14 6 11 15 -21 11 -15 13 6 7 -5 0 -14 -9 49 -7 -16 -4 9 0 33 25 -13
3694 -13 -25 -11 -8 -1 -7 -10 0 -19 40 -38 -26 -10 3 12 7 -7 40 -14 -22 -12 11 -15 -6 15 33 15 -51 39 6 1 -8 28 19 27 -27 -7
3730 -7 -17 -13 -18 -1 14 35 -2 -34 -39 -24 -6 9 12 18 4 7 -26 -22 -25 13 10 -9 3 -11 -17 -28 -11 19 16 -17 17 -23 5 -13 -60 -40
3766 -40 14 12 7 -1 7 35 10 -4 27 -15 17 24 -21 -9 -7 -31 10 -1 -5 11 -19 -20 -1 -36 -21 -21 19 32 14 -7 28 -8 -11 18 -6
3801 -6 11 8 7 16 -3 -23 10 12 -19 -2 8 -18 -33 -16 -5 13 -18 6 2 -20 -9 24 -28 5 -3 -29 9 -18 -15 -7 -17 -42 -11 17 15
3836 15 -33 -16 9 20 -27 12 -6 2 29 -21 -6 6 -25 25 21 3 33 -7 -24 2 -7 -11 -2 -38 18 11 8 0 8 -3 -5 -12 -53 -15 -8 -26
3872 -26 -27 -15 8 -17 -12 20 -11 19 5 14 -17 11 7 33 11 -15 31 35 0 15 32 15 -11 -1 -9 10 -33 -5 -7 0 9 21 8 -7 -4
3907 -4 -1 -12 -37 3 18 -21 -18 7 33 -10 1 -19 10 -3 -20 5 -7 11 -12 -28 24 22 -19 12 -11 -4 54 2 -30 3 -13 -6 1 -18
3941a8K5J8o5K1OK0j6On2N4OOj9LL2m7Nnlk7L9l0N4k4J6l0K1J2K3k7j7K7k2L5
3975B7k3J7Kj6rKk2PN2n8M1m7K2K5m5lL9j6j2J9k3M1j5l9J5K8m6M5j4PJ4j6k9
4008c0L5j3Rlj8J4L9j6jjpM5m3k5J1oM7l8m5M6k9RK3l2J8J3rj9N5l5nK3m8Q3m5
4043Bk3OpK3J6k0QJ1j1k7J8j3K1Lm8M7pk0K8l1J4J8kmL0l2L1m3J5ol9L2Pj6J2
4078gK1j4Pl8K2L5k2j2J8l8L3J8l3LK0rpL0l8J5j4lN6n4j4L9k2M3j8JkJ1k3J6
4112B0j4k4K9K7m1Oj7kj2J9K9k9OMj7J6j0K0j6L0j0J3k2m2M9k5K0J4m6M3J8l2
4144DoKJ1Jj1l5O3m3M9l0oP%l0M3ql8K5k8J8J2k9L1Rl6LJ3mL7j4lJ4pj1j1nJ0
4181cMk1J5nK4qk2OL8n6N4l8RJ9j5j8K0j7NnjM1m7KoJ0rJ6MK0Qj6k8L1qNQk5K8
$$ plain form
3941 -18 7 25 -40 -19 -13 7 -9 -3 -55 -1 5 11 -8 -5 27 -20 -15 -20 -23 -50 -11 -41 13 -11 5 -25 -4 8 31 4 -13 14 -8 27
3975 27 4 21 23 7 -2 0 -22 -15 37 -21 20 -27 -5 20 -25 -28 11 -5 -17 2 -21 20 5 -34 -19 9 -37 8 -6 1 15 -1 -30
4008 -30 5 -8 1 -2 -20 -6 33 17 16 15 8 53 10 -15 -4 -10 37 -1 -46 0 -29 -20 3 -29 -11 2 -7 -26 29 -6 -11 12 -36 47 2
4043 2 -21 -15 -22 1 17 -3 5 16 5 -22 -4 -17 4 7 -41 6 -1 -21 7 -24 -10 8 6 2 32 0 31 -12 3 -3 -42 -10 -3 -19 -7
4078 -7 14 0 7 -31 -9 26 4 -8 10 -28 5 23 -10 -7 13 4 -3 27 -11 4 -10 -13 43 -11 -25 14 -8 35 17 18 16 27 4 20
4112 20 6 -18 11 38 -3 3 -14 -16 -28 -9 20 -9 -3 1 -16 0 -10 10 -6 24 14 27 5 -37 12 -13 7 21 -25 18 36 4
4144 4 -2 0 11 12 1 -34 29 -14 35 5 -1 6 6 -24 19 11 -27 -2 -30 -12 0 -29 2 11 -25 -22 -9 -13 24 10 7 21 14 3 -8 -13 -3
4181 -3 1 -20 -5 -10 14 6 -16 -10 28 -28 26 -12 -3 16 1 -17 3 -14 -9 -14 -15 26 -21 -19 -25 -15 -24 -8 -4 16 24 8 -20 11 3 8 16 -9 19
4220A9Jm4nK2J7LJ0k7mK7j3qk4K7K7pRm3pJ6j3J8qPnJ2k7PL4l0J6l2K0NlJ0j3
4257f%L9Ok1kJMj3k4J3K5l1jJJ6k7PjK8l3L3Pm4K2ok7J5kJJ0lJ8j4J0koJ3Pmk8
4297a9J1J4k2mJ1J7%K0k1J5n3O2Rl2Qn%Lj0k5J9k6K2QjK8k0m5J4K8Jj2lK6k0%
4333b%j2J7OMl1L1Qlk3j8K3J8k2K3j8lM2o1L3J7k3j3OqJ1KJ6k8Nl4M2l2LM4m4
4369b4MJ8J3j3LrJ3Ml5K2J4oJ3n8M8k7K0KRj7RkK0j0l7qO3j8qk9J4K2j3j4NLK0
4406A1Rn0K4knROP%mm4N2J3j9j6j1K5kk5J5Qk6K0poK8Oj7J5k2RM4n5L8k7oL8j5
4444A8k3L1k0mj8J0L8l9j3M0l6K2Jk5K7j1roK6k6J1K1j1J8k3J6j7M1l2K2j0lr
4477GQPRl3K1j2NJ5m3K2K4p9Q5k5l8N2m6L0k0J1k6K4k2J6K0k7J6K2j1k8J8qJ6
$$ plain form
4220 19 20 -24 -29 -7 10 13 23 -4 -8 19 6 -2 -26 1 28 21 30 -13 -20 -4 -17 1 -7 0 -5 7 -20 -13 21 -9 7 -25 -5 0 -3 7 -6
4257 -6 -6 33 39 18 16 17 21 8 -16 -3 22 -9 -10 -9 7 -20 -13 -14 14 -19 14 21 -23 -1 -7 -34 -19 -21 -20 -10 -13 5 -9 1 -1 -7 6 13 9 -19
4297 -19 -8 6 -16 -20 -9 8 8 28 7 22 -31 31 40 8 16 11 11 14 4 -21 -2 -28 -6 2 1 29 9 -36 -22 6 7 -5 -8 18 -2 -2
4333 -2 -2 -14 3 9 13 -18 13 21 18 -5 -23 0 18 -4 19 1 -2 40 -21 12 29 6 -7 -1 -9 2 4 20 -8 -3 -37 5 -27 -24 20 -24
4369 -24 -20 -2 11 -2 1 -8 5 9 -26 -4 10 4 17 -41 7 -20 0 2 11 -6 3 1 21 11 -26 -34 29 11 3 -26 -12 10 -3 -17 -12 -9 11
4406 11 20 -30 -6 -8 -13 -4 2 9 9 5 -39 13 26 7 -9 -20 5 3 -22 -7 1 -25 -5 -12 -18 10 16 -1 14 -8 1 45 -10 28 1 -5 33 18
4444 18 -5 26 6 2 -16 -6 32 -7 -20 20 -16 6 7 -18 9 -2 -11 -17 9 -17 -6 15 4 22 -1 15 -2 39 7 29 19 16 7
4477 7 15 22 31 -2 19 7 12 27 -16 6 30 -49 36 11 -27 25 -21 9 -11 0 -26 -2 -24 -8 12 -15 1 23 12 -16 2 -6 10
4510A0k0M0jj5mj3j0L1l3K2J1j3jPj1pLk7L3Qj0JJ0l5K6K6n3J9j6N9k2l5KJ1l3
4545d0K7pRK3j1L7rl9K2j1KpK5mnj6mK5k9J7J3l6K9k4kM1m2j1M1j6Omj8J5J1R
4581A7mk6J7Kl2QrN2o5O2j8J4lQj0kk5L1KKN5p2j2qjN6l7LK7l3j2K1j8j1O0n8
4617a9M2j9k0M8k2j2Oj3K5l1QKlmQj6MJ9nQLL%K7l5J6jl4L2rk2J8pK6Lj6knj3
4656a0J6rK5Mm7j1J3NK1J7l6L4m1j6N0Ml7NMJ6L2l7j7J9J3j5k9M1K6j5qj2RjK
4691A5l1J6J6r%jk7J4j5RJ0lQj6pK5kOok2J5mL3k8jpJ1K6l5M5k0l7K2J4k9J5J9
4728A9%J3k3nJ1m0L4rlJ0j3j0Mj5J4K1l0M6qk8PQqL2l0J8Rkn1L0QNlK5k2j7j3
4765a6MpRK4n9N7Ollk3K0Mj1j1PoJ2lrK9j2k1NJ6mmKk6L1K2j6nJ6k6J6kpl8L9
$$ plain form
4510 10 -10 30 29 14 10 -3 -13 18 -15 7 18 5 4 11 0 -7 -4 -31 2 10 0 1 11 -24 2 28 -25 -6 -22 37 15 -20 -18 -7 -40
4545 -40 -13 -20 -11 12 1 38 29 -10 12 1 3 -4 21 17 12 -4 -8 17 -12 5 18 -18 11 -13 -15 26 -16 -27 14 -2 4 0 -18 -3 8 17
4581 17 13 -13 4 6 -26 -18 -27 25 -40 22 4 18 15 23 13 11 -14 17 19 21 76 4 -8 -16 -17 39 2 5 32 -1 -13 8 -10 -21 39 -19
4617 -19 23 4 -16 32 10 -2 4 -9 16 -15 -7 -5 -8 -12 -4 -20 -16 3 -2 6 9 12 12 39 4 20 19 -15 17 8 -14 4 -3 23 26 10 8 3 -10
4656 -10 6 -3 22 26 -21 -32 -19 -14 7 24 -12 22 -19 -35 15 19 -18 -13 -9 7 39 2 -15 4 17 2 -27 14 40 25 17 5 14 13 15
4691 15 -16 0 16 7 7 6 -21 -7 -22 -13 -3 -6 2 -14 -21 4 2 8 2 -20 -5 -9 24 -4 -5 -12 -1 25 -10 35 15 -22 0 14 -15 0 19
4728 19 19 32 9 4 15 -25 9 0 -3 7 -6 -16 -12 -27 -13 8 -22 24 16 -12 -5 3 -5 27 -3 15 24 22 -29 1 9 14 11 36 14 -3 -16
4765 -16 -12 -19 -10 14 -45 12 18 15 12 -11 9 13 2 -9 -2 -8 4 1 -8 21 9 -12 -7 9 5 1 3 -23 8 30 14 9 25 -1 15 13 6 -32 7
4804GKK3m2NJ9m1J8mL0l7PljJ6J7OPk3J5pm6J4oJ3nJ3l0K6OK0j9j7j2M6m0K2k
4841ck1J9K6l5ML6k4PJ4pkk7J0K6m3K2L1n4M0pj6rK9Rmpj1MOk1K9Jk9nk5L4J0
4878Gom2K4OL1k6JJ2Ll1M8l4L4J0kk4j3pL7k6J8j4m0J8ORrmJ7L2m0K2jk1QQm1
4915c0K2Nk3ROKNk1M6k7J6j1Pkj9K6j0Rl0M8J2o1K7K3l7Nj1J7J4oKJj7k0K6j4
4951a1JRNKl1K6kRj9K3k1J0K8n2L7j4%rj8K6J8Nk1J3JnK3m3K9j4k5L1J6k4j1N
4987cJ3Mm2K2k0K3pJ6J2l8J3Rj6j5J0K7j5nL1j9L2j0j0j2pMK6k2%lqK5%k3L6j6
5023A2qlJ0J5k7k8L6lQk5ONRqkMk0K1rj4L6L3n2K%KJ8%l5L7j5J4k5K2Pk0J1pJ4
5062B1j4M4m7nNll4L6onLj9lNJ5j8L0qj2K1%j3jJ0K6l2K3j9Mj0nPK7k3K3nj5m
$$ plain form
4804 7 9 32 -10 -5 14 -27 -9 -13 17 -20 -13 -16 -17 -1 16 22 29 6 21 14 -32 -18 -24 -11 -16 -3 -33 -7 -1 19 0 -17 -29 17 -23 -1 -3
4841 -3 -24 -5 21 -14 -10 26 2 9 23 16 14 -13 -3 23 -20 2 33 -21 19 12 -4 -13 16 25 21 14 3 7 13 -8 21 22 -7 -12 -37 -3 7
4878 7 1 -41 -17 -11 20 -6 -5 7 10 -21 27 -7 27 37 35 11 -2 -9 28 2 20 6 -34 -16 -10 -1 -10 -14 3 35 -5 17 16 -5 3 11 -30
4915 -30 -8 -3 -26 -17 -11 -9 -4 -25 21 -6 10 -1 6 4 -15 11 1 10 -20 28 40 -21 6 29 -8 -3 -14 3 17 11 13 14 -3 -23 3 -11
4951 -11 -10 -1 4 6 -25 1 -1 8 -11 12 -9 1 29 -23 14 0 0 -9 -27 -1 17 22 1 14 15 10 33 -10 19 5 -20 11 27 3 -8 -3
4987 -3 10 14 -28 -6 -26 -3 -10 6 18 -20 -7 2 -14 -29 -19 8 -7 -12 19 0 32 22 12 0 -7 -3 23 1 1 -2 -10 15 15 -8 28 12
5023 12 4 1 11 26 -1 -29 7 4 12 -13 -7 -2 7 -1 -3 1 -19 2 -7 -21 15 48 -4 -2 -2 0 18 18 -17 20 5 19 -6 16 23 3 14 7 21
5062 21 7 51 4 -1 4 1 -33 3 -3 -8 -5 -24 -27 -22 -7 -25 5 -3 -15 6 6 -7 -8 2 28 -4 19 0 4 -6 -11 -4 23 0 23 18 3 -1
5100aqJ0j6K4nj4K3rkMrJ1Jj2J6Nn3K4Rj4%K0j0Kj5KK2k7J8rj3J1K6kJ8k7kL5
5138C3l7L7k3MLj0Kl1L4k2J1nJ6k7J1j0k3pK8N6n9N0k2J3k2l6L8J4j3l1PL1l1
5171b1K6ml9L9j2L9k6Lj3J3j6kL3RNj2k2J2J9m3J8j8QoL6l9J5k1J5jpN4l9pj4
5206a8MoRokL2k0J9k2kL4m6PJ0JL1Rl7K9l1j2K9rRj8OK1k1MQk4J4K3k7j8J6NK0
5244B1j4%qNOnQm4M2j7JJ4k9J4j5K1K8l1K6k4qL1Qrl2J1K2j4j1MJ1K3m1L2l6n
5280a5Jj3J0K4m4L3J3m2L6qKJ3m4M4j7Rj1jJ7%%k9N5l5KJ1Jlm4K2PM%K2j0r%J6
5318A7rOl%Jl4L7mj4J2k6J6J8j8J8j8jM0k4qj3K6k3J9m5L2j6J4J5lLkOj8L9k5
5354A5m0J0K1rJj3K6Kl9NJ1JNj0Rj5lNJ9qj4RJ2J0l0OK7m2O5n5M5l2K5j7jjK1
$$ plain form
5100 -1 -9 1 -15 9 4 -10 13 4 2 6 -3 8 9 -3 13 18 -35 -11 -2 -16 -16 4 -6 -4 -19 -17 5 -22 -4 -13 -26 -15 11 9 27 0 -2 33
5138 33 -4 33 10 14 17 7 9 -22 12 -10 1 -4 12 -15 -4 -14 -37 -44 -16 40 -19 31 9 22 0 -36 2 16 3 -28 -21 10 -21
5171 -21 5 1 -38 1 -11 28 2 5 -8 5 -11 -13 20 29 34 22 0 12 31 -12 6 -12 -4 -10 26 -13 2 -19 -4 -5 -12 42 3 -4 -18
5206 -18 -14 -20 -11 -17 -19 13 -7 12 -10 -12 22 -24 -17 -7 -6 25 34 -3 26 -5 -17 12 3 12 -6 0 21 0 4 12 -12 2 25 -2 -20 -4 1 21
5244 21 7 7 -1 4 10 5 13 -31 11 -6 -5 9 -20 -6 -21 0 28 -3 23 -1 -9 22 30 21 -11 0 22 8 -3 1 12 35 -6 26 -10 -15
5280 -15 -14 -27 -17 7 -37 -4 9 -33 3 -5 -3 10 -34 10 -7 2 -9 -10 7 7 7 -22 33 -2 0 11 12 9 -35 -13 -6 -2 -2 20 10 1 1 17
5318 17 8 14 11 11 12 -22 15 11 -3 9 -17 -1 17 -1 17 -1 -2 38 14 6 -7 19 -4 15 -30 2 -14 0 15 12 15 13 19 1 40 15
5354 15 -25 -15 6 -3 -2 -15 11 13 -26 -21 -10 -9 -4 -14 -5 -20 -23 -18 1 -7 -21 -12 0 10 -20 -14 13 -29 36 -19 26 -6 19 2 1 0 21
5391B1J8j7Jk7L6j0m8K4Kk0RKJJ1Lj7J5pk5J4J3j3MK9l2OlJ9j5Mj9J1J9J0j9J1
5427A1J4j2k5J3K2j5K1k2jm2K6L9l6J7%j2K6k6j4JJ4j5J1Kj6K7qpk3K0%j3j3L7
5461AJNj1k4L6J0k9J4J2l1K1j3J5LQnKNk5j2K2RPk9JJ4Jk3LJ4l1L3mJ6pnk1K8
5499A1Nj6L5k0j0k1K4K2l9J1J0j0L9l4m8K2L0qPjj0nj2PJ5J4j9lNJ4j1j5QJ4j5
5534dNl3L4J6o5N5K7j5l7NJ2jj5K9k4k2M7j8jK3l4K2KmqJM0j0Jl8L1l2L5j6%k2
5570a4kJ5j2nK3rOj4Pj3Kk1J3qJ7J6m0N4k6J2j5k0L0J9j3Jj4K0nk1L2JrK1j5J2
5606B5l1J8Kj6Rqk0L5j7k5K8k9K7J3j3J8l2%K1Mk0j2L1j7Rmk7K9mPoNL8m1J2r
5642@POqk6J9J8k4PPNo8M1L0pj8j1J3Nk5K1K0J2j9j4j4J1K4k8J9JNj4k1K4j7K4
$$ plain form
5391 21 39 22 23 -4 32 22 -26 -2 0 -20 -11 -9 -8 3 6 -11 4 -3 -28 -14 -1 -14 -10 19 -13 -7 -10 9 -6 -2 -21 -10 9 19 0 11
5427 11 25 13 -12 1 23 8 29 7 6 -36 -10 29 -7 10 10 -2 24 -2 -16 -15 -1 -16 -5 -3 -19 8 0 -7 -30 -10 -10 -23 -36 1
5461 1 2 7 -4 -28 8 18 -11 3 15 -16 5 -8 7 10 18 13 15 20 -5 -17 5 14 21 -8 -7 7 8 -15 -12 2 -29 4 0 16 9 4 -17 11
5499 11 16 0 35 15 5 -16 8 30 -9 2 12 2 41 7 -41 -19 11 3 10 9 -1 -6 -18 -11 4 18 -1 -4 1 15 4 -11 -3 11 -4
5534 -4 1 -32 2 18 -47 8 35 20 -17 -12 0 -1 -16 13 -11 -33 14 -4 -5 18 -16 6 8 4 -4 -3 37 27 28 -10 21 -11 24 8 8 -14
5570 -14 -16 -1 -13 -18 5 -4 2 -12 -5 -18 -16 -37 -24 -32 -15 1 -39 15 -11 1 -14 -34 -4 15 2 3 -11 9 4 -17 15 16 7 28 13 25
5606 25 -6 12 14 -2 7 -1 -21 14 -3 -28 0 -29 -2 11 -2 16 -16 -16 5 9 -11 -23 8 -9 0 -4 -31 -2 -6 1 -5 0 38 -3 9 0
5642 0 7 13 5 -21 -2 16 -8 -1 6 11 -57 -16 14 7 -11 -22 -9 -4 -29 -8 12 24 5 -9 -23 -12 12 -16 3 4 9 -5 -26 -2 -19 5
5678EJ0%Nj3kj7K7l1K6JJ4Pl2J8m7J9OJ1j2J7J5n0J3K2l5M6n8O0j6k5J1kpJ1k1
5713b4nM6l0L6l9K0LrJ5J3J0l9J1pJ7KLloj5pJ5KLk0Kj9L3k4Lj4K9%l%lkk5L3
5752Bk2J1j0K2%nK4rn9M3J6l9L1kK1j5jj4J8pk2J1MJj0j3M1j8J4k2L8k0j8L8q
5787B1j6Lj5Kk1L3Pl0J4j0MJ5j3NLkMk3NL3j0mK0j8J9k0j9lK4k3L6j4k0M0k6j1
5823a0K9l8oJ1K1n7M9Mrj0pJ5k0K5j1J2j8RJ5J0J6l7nK6NLj4LJ7n9N2j7j9J2J0
5858Gj0J8k3j0L9Lk1j5MMJ6l4K7l4L0kpK5l8L3qj8J4lK4k8J0nj8L3K0j9jj2K1
5893B2J2k9K5j8%pnkJ5PRk6nMj1Kj0j9M9kk3kqj5M1Kj8M4m8J4oOJ9l5K3KrOl3
5932b9M4J3rl1J2K8k5k2L3j3JL6k2j7J9m6K8lKj7K9nk3L5k4J1J4nj8JpK6k3lJ
$$ plain form
5678 5 15 15 20 7 5 -12 15 -16 10 11 25 32 0 18 -29 -10 -4 7 -5 12 27 -23 -10 12 -23 23 -35 25 9 -16 -5 -7 -14 -3 -24
5713 -24 -29 17 -13 23 -16 4 7 -2 13 26 36 -3 8 1 18 20 23 20 14 -1 -8 7 9 12 -8 -6 -25 8 -16 -13 -27 2 2 -1 -1 -4 -6 -31 2
5752 2 -20 -9 -19 3 3 -2 22 13 -46 -3 13 -26 5 3 24 9 8 -6 12 5 -17 -6 -2 -1 -11 -24 17 -1 13 -9 29 9 -9 29 21
5787 21 5 8 -7 -5 -26 7 14 -16 -2 -12 -8 7 -6 -1 2 0 4 -19 -14 19 9 5 25 7 26 6 -13 -16 8 -15 21 7 -13 27 1 -10
5823 -10 19 -19 -25 -14 7 -50 -1 3 -6 -16 -23 -8 -28 -3 -14 -2 -20 -11 4 14 30 -7 -12 14 19 22 8 11 28 -31 21 4 -15 -3 7
5858 7 -3 15 -8 -18 21 24 3 -12 -8 -4 12 -22 5 -29 1 -1 -8 17 -21 12 4 -14 0 -3 21 -7 3 -2 -20 13 33 14 13 1 22
5893 22 34 5 30 12 12 5 0 -2 13 20 29 3 -2 2 -9 -7 -17 -36 13 11 -12 -14 -22 -37 4 6 -12 32 -16 -2 -8 -2 17 -18 5 7 -2 4 -29
5932 -29 15 28 19 -12 0 28 3 -19 14 1 2 38 16 -1 18 -28 0 -3 -1 -18 11 6 -17 18 -6 5 19 14 -4 -3 -10 16 -7 -10 -9
5967il0M6J2Rm4J2J0oJ6Lk9M5l1j3M0j2j4lqk1N5k1j0J5m1L2m0L1J8l4K6k0J5
6000aJ2jjl0J3J7J4j4j8OLJ2k0J5JqJ3MNk1MLlj7J6k0M0k2PL1m8RoLloJ9kl4L0
6040Bj8J4KQoMNk0J3Mj4%JK0qJ4j3KjM%j0K2n1L5%j4lL1k6rj1J5J9j1kk0K0k8
6079c0K0kk5J5oPJ9J4mJ5j0rJ4j7mmL3j3pNk5%L4Ol9J2JJ7%k2J8k9J6J4j3j7N
6116a1RpL3j2j0Oj2K3k6rOOl4M9k9KL0Om0M2m5K4K1pj7K1k5MLj6K5KKk5M0k6j8
6153a5J0J0rnj1J7K1j8%j1J5j5jj%K0j8Nj2KPK8j2k2K4Qj5k0K7qK0J4k1j0J3J3
6189C0j7PKj6j3K7l5pNK3j4pKnK6k8K5MJ9l0j5RJ0J8m2L9k1Mj5K7ppNqL7l1J0
6226A1Nl2K8K1j7pNrl5O0n0QJ9k9J4j1J3MMp%j1J6L5m9K6j3k1J9J%k0K7k2LQk9
$$ plain form
5967 -9 -39 7 19 28 -16 -4 6 0 16 19 -10 35 4 -9 31 19 5 2 -6 -27 28 7 -3 12 -29 3 -37 -6 12 -22 4 -16 -1
6000 -1 11 10 9 -21 -8 9 23 9 -9 -3 0 12 -8 7 8 0 13 17 22 1 5 8 5 -12 4 -16 24 2 9 40 -8 1 -5 -2 -5 -11 8 6 -28 2
6040 2 -16 -2 0 8 2 6 11 -9 4 8 -6 -6 -5 15 7 21 8 10 9 13 13 3 25 -26 9 9 -5 -8 23 -3 -12 -23 -8 11 0 -2 -22 -2 -30
6079 -30 -10 -12 -37 -22 -28 -21 -2 12 8 23 13 4 18 1 -3 -7 26 13 6 11 -14 -14 20 26 -13 -1 0 17 17 -5 13 -16 0 14 1 -16 -11
6116 -11 -2 -9 24 12 2 8 -4 19 -7 -16 -10 -4 -38 11 -18 -16 14 20 -20 22 -23 1 22 15 -2 19 -6 -2 1 -15 10 12 14 -11 29 3 -15
6153 -15 -5 5 -4 -9 -20 -3 18 0 0 -11 4 -11 -12 -13 -13 7 -11 -6 -18 -16 -9 19 7 -15 9 17 2 -18 9 1 21 35 14 4 17 30
6189 30 13 20 22 6 -7 20 -15 -22 -17 6 -8 -15 -13 -18 8 -20 5 9 28 -2 -17 -8 2 20 -22 17 -4 0 -15 12 5 -2 3 -5 32 1 11
6226 11 16 -16 12 33 16 9 14 5 -30 30 -20 -12 7 -22 -8 -19 -6 -2 2 -5 -5 -16 0 35 -14 12 -1 -22 -3 -2 -2 -22 5 -17 -14 -6 -35
6263c5N2oJ9k3L6k6Jk1jNj0L8n3K2j5L6l1J3k6K4nnK1k4K1n4L3J1j3QlNK7qml2
6299b3M6ok1QJj0K1k1kOj3J5mL0rm9K8K4qJ3j8k1K6j3MJ3l5NLqL1j2J9l1Nj7L7
6336A4kj8K3J1n0K4j2K6k6pK8mmrOJ0kJ5k3j1J3K1%j9J5j9L9lp2K4Oj5J8J5Nk5
6372hqJ1RJ2k8J3j2oJ7qL7k2k6M3pl4qM0Lk1j9L4j4J4n%j2RNk7J4J2kk2M0m0n
6409b1j8N3k7J7j3JJ1k1K2j9J6KJ3k7pL2k2K0k0qK5qJL0lmk7L2m8L9m5K3OmOP
6445A4kJ0pl2L2ormj0LJ9MJ3k9J2%qoK5mj9JJ1LrlJ1k6oL6Kk8PrK8lj4J3k9K6
6485GJ2j4j5k6M3nJ7mk7J1K6j3k9L1k5jLrOOJ9j0J0j3m%j1RL3ol9L3klj5J8j1
6522BQrK2pPj1Pl1K4Nj9%j2J4J5MJ2m3J6j9mJ3J0l3M2Kk1lJ7Jonj8J3J1pkK5k7
$$ plain form
6263 -35 17 11 30 7 43 17 18 -3 -4 1 -9 29 -24 -2 -17 19 -12 1 -25 -1 -6 -11 10 -14 7 -47 -14 -3 -16 -8 -11 -6 21 13 9 -23
6299 -23 23 17 -4 4 5 -5 16 -5 -7 -1 -14 1 -3 27 18 -31 -3 21 13 26 8 -13 13 0 4 17 -18 -13 -10 -18 13 1 20 -11 -6 -23 14
6336 14 12 -6 17 28 -22 2 -10 16 -10 -17 11 7 3 -6 0 10 8 23 0 -11 2 23 23 4 19 0 39 36 -36 -12 -6 -21 -3 12 17 -8
6372 -8 -16 -5 4 16 -12 1 -11 -17 0 -8 29 7 -19 24 17 -17 -25 15 18 -3 -22 12 -2 12 7 7 -5 4 9 -18 -4 8 6 -16 24 -16 -21
6409 -21 -39 14 -13 4 -9 -8 3 -18 4 -15 1 3 16 -11 -18 14 -8 12 -8 -16 9 1 2 32 29 25 -2 30 -18 21 -24 -1 5 1 7 14
6445 14 12 22 15 -17 15 9 0 -4 -14 -11 8 12 25 -4 8 8 0 -6 19 15 -4 -3 8 11 2 -1 10 -16 -22 14 16 -12 -5 -14 14 11 -3 10 -19 7
6485 7 19 5 -10 -36 7 2 19 15 -12 -1 25 12 -17 14 -11 -12 -9 -18 -12 -6 13 3 13 0 -4 -4 -15 -6 27 21 -18 15 13 10 -5 13 2
6522 2 10 1 23 16 23 12 19 -12 12 17 -2 -2 -14 0 15 19 31 -12 4 -15 -19 -6 4 -29 13 15 -6 -9 8 9 3 -2 -20 -7 4 -3 -5 20 -7
6561gNmK3Mk0Kj5Lj7J2K0j5J4j8K7k1NKk9K7j1K5j2J0l6L1k3NrjMPOJ0mj%L0k6
6600Cj7J6K9k9rkL7m4J6j7L8j8MKqkk4J5j2RN1m4j3%K0Lj5K6n7K9Rj1NLJ7roJ
6638dJ4JlmMOj4J8j6J5jk3J7J2k1K4l6Qj7RK5j2mj5L2Nk4Ql7L0J7mrPpl1J4K9
6676A3nj4J8Ll0J5J1Ok2JnJ6kj8M2kl0j2K3J1pj6LJ3l8J5jl0L3J5k7k5O1j8J8
6711A5l3M5m0qJ1rK0qJ0J5J2rKnjrJ0m3N0l3kJ6Ok9J5mJ1K6j5j1o%j0RLOJ0lk2
6750hJ1l1nK6qQK5l7J7J0n1O9j5j9NPJ5K5m3kK7n1J0K2mj6K1K1k0l4L9k1RJj3
6785a0J8lLJk4PK6lm2J0K9jk0%J1ok4L1j5L1k1j0J3J7j4lnJ1j5M3l8rM3m7JqL5
6822A2k4pL0l3M0n4L9l5J1J6Ok0J2qlK3j7lrJ6J8rJ7k1OJ5k6qK9rl0J5M5l3j4
$$ plain form
6561 -7 -2 -6 17 21 1 3 -12 -9 -26 -14 6 -9 5 -13 14 -7 -2 0 -29 -2 -13 12 0 10 -26 5 -18 -13 -22 -23 -19 -12 -6 4 0 -1 -1 29 3
6600 3 -14 2 31 2 -7 -9 28 -16 0 -17 21 3 7 9 1 -1 -25 -10 -22 -13 38 -6 -19 -19 1 4 -11 15 -42 -13 -4 -15 -10 -7 10 1 -5 -4
6638 -4 10 11 8 4 8 14 0 18 2 17 16 -7 10 22 1 25 -11 -3 -20 -11 14 2 -2 -17 15 20 -4 4 -33 -3 14 10 1 8 1 -30 -16 13
6676 13 8 -6 12 15 -15 0 11 17 -5 -4 -9 7 5 -13 29 27 -3 -15 8 19 12 -4 -1 12 -26 -11 -12 -42 -9 6 -21 -46 15 -3 15
6711 15 -18 27 -13 -21 -10 -19 1 -7 3 18 30 21 23 18 17 8 18 -25 25 -8 -10 6 12 -17 -2 -6 5 31 16 5 -1 -1 -11 -2 1 7 17 14 -8
6750 -8 3 -28 -33 -7 -15 -7 18 -19 -2 8 -43 26 11 -8 -3 4 19 44 1 -1 26 -25 -15 7 3 -13 8 29 9 -25 14 -7 2 3 -10
6785 -10 8 5 8 9 -15 -8 18 15 -27 -17 12 11 -9 -9 2 -4 -28 3 -12 19 -2 -12 1 18 4 1 -4 7 -8 35 -3 -12 31 -16 -15 -23 12
6822 12 -12 -19 11 -22 18 -36 3 -32 -21 -5 1 -19 -7 -15 -18 5 -12 -15 -24 -8 10 1 18 -3 3 18 -8 -16 13 4 -26 -11 34 1 -13
6857a3J4MMJ9k7L0j3l0rJ5J9k0KnKJ2J5l6J9rj5K0J3m1N5j4l2L2l0MJ0LJ3L1m0
6892Bk2L7l5J1L3l8K0j9OJ2qQj4NJ8l6pjQK0l6K8kl0JPL7J0j7J1l9M1Oj6j4K8
6928A5k5QNJJ5j8J8l4K2j0L0l5K2jj5JJ0Lj6J1oLQj5ROQk7Mj9M6m9J3qRPL2mj0
6967A4K0k7K9j6nQNl9J9l9O3j9j1RlPqK5k8J4J4%l6QnRrJ4m3j0J3J3o%J0J8rj6
7005a7lL0p%k2mM1pQMlk2JRj6NmK2m3J7K1J3k6k6M1j9K0k2kJj7J7j2J1K3kk5L
7043a2nPL3m0K8m3M4K1j8j6MNl7N7j8j2oj2K7k1L4J3j3k6J5l9M8j6pJ4j7K1mj6
7077gj6J5nJ2Pjpj0J1RK%j9MJ6k1L2m1J8m2OJ2L4J0pNmjj5J7j0j1K1K3l0mj4%
7115a1jJJ1j9L2l0jL1l9KJ1qjj2L5J2j2knl1J6L4j1OlJ2l1J2Jj2J9J5k5K3k1J8
$$ plain form
6857 -13 1 5 9 28 1 31 18 -12 -21 -6 13 -7 -5 -10 -8 4 19 -17 2 -7 -22 -2 11 -30 25 11 -21 11 -19 -15 -5 -2 11 42 2
6892 2 -20 17 -18 -7 26 -12 8 -11 -5 7 -1 7 -7 -2 16 -20 -27 -28 -20 0 -36 -8 -10 -40 -39 -32 5 15 -2 9 -30 11 17 1 -13 15
6928 15 -10 -2 3 4 19 1 19 -15 7 -3 27 -8 14 13 -2 -1 9 12 -4 7 1 4 12 -3 6 12 20 -7 -3 -22 24 -25 -12 -20 -11 -4 28 24 14
6967 14 34 7 36 20 15 23 28 -11 8 -31 32 13 2 11 8 15 7 32 4 18 32 32 -4 4 -1 8 -1 13 -30 -40 -27 -14 -20 -20 -10 8 -1 -17
7005 -17 -20 10 3 3 -19 -23 18 11 19 23 20 -2 -1 8 -8 -3 -7 15 -28 -11 10 23 -3 -29 12 -7 13 -9 -11 -10 -27 -10 -22 -11 12 10 -15 -12
7043 -12 -17 -10 23 -17 11 -32 12 33 15 -1 3 8 -29 28 10 -2 -8 -20 7 -14 20 33 20 -6 9 -30 18 2 -5 9 -8 13 9 -7
7077 -7 -23 -8 -13 -1 6 5 -2 -12 -1 8 10 10 -9 -5 11 -10 22 -19 -1 -43 -37 -25 9 19 12 17 13 12 -3 14 4 -7 14 37 7 3 -11 -11
7115 -11 -12 -11 0 -19 13 -17 -18 13 -26 -24 -13 -21 -22 -34 1 13 1 -1 -6 -37 -21 13 2 8 5 17 -14 -2 -1 -13 6 21 -4 19 -2 16
7151A6j9nK8k0Nj2J7j9J8j1J0j4j3j9J7J5rK6j7Rj4KJ1mj1J8Qk5K4l3L2k9K2J3
7185A7k2NmJ8k5RJ0k2lL1mj3J0Qk2mMKj0mKrJ5J1K0m0L5Kk7RnRNqJ0k9L5Kj2r
7225cNkJ5jj3k3L2j8QL6m5j1J0jK1j8jRm0K7K5J4l8k2L7%m1M9J8mk4J2J4j7Kj3
7261aJ2%k7K6J9l0PJ7j9JooNKJ7j0J5l3J4m5L2K2k5kM5m8kKJ7jl7M6k8J7%J6l0
7298a8L4%j9N1m6k3L7klj2Rj9M1m2K4mK9k6Njk9M2j9%%j7%pJ0j2j2M9k6J2mJ2
7334A4k4nMJ2j3OJ0rRLQk4JJ7j9K6k5K3j5oL1m0J4OrJ3K1k7j6J3J5nMj2rJ3j8
7371a3L1k6k1L5j5nKNpJ0jL0j2j1%l2N4Jl6qJ0J1J5J2j0k4KpL0l0J7k0Kj0LJ3
7407eJK1j1Rl7L8l0J4J4l1PQJ2kn%j7K7k8j2M0%kj6J2k4KJ3pQpL4rj5K3j5j5K
$$ plain form
7151 16 -3 -8 20 0 5 -7 10 -9 9 -2 8 -6 -19 -38 -21 -6 -15 11 -6 3 -11 -9 2 -2 -13 5 13 -12 12 -21 11 -18 4 17
7185 17 -5 0 -4 14 -11 -2 8 -14 -17 14 10 -3 7 15 -7 -11 -7 -5 -15 -19 -17 -26 -11 0 20 -20 15 17 -10 -1 -6 3 8 0 10 -19 16 18 6 -3
7225 -3 2 0 15 14 1 -22 10 -8 0 36 -9 -20 -10 -11 10 -8 -9 0 -40 -13 12 26 -12 -34 3 3 -38 11 29 25 1 13 27 10 12 -1
7261 -1 11 11 -16 10 29 -1 6 23 4 5 -1 -7 -2 0 17 7 22 -11 3 -42 -10 12 -13 -15 30 -18 -20 -18 -1 -2 -39 7 -21 -4 -4 12 -18
7298 -18 16 16 -3 48 2 -21 16 14 11 -1 8 -11 30 -12 12 8 37 11 16 15 -14 28 9 9 9 -8 -8 -15 -5 -17 -29 20 -6 6 2 14
7334 14 -10 -15 -11 1 -12 -6 4 -5 4 7 15 -9 -8 9 -10 16 -9 14 -1 -7 24 -16 -2 4 -5 8 29 2 -14 -1 14 9 13 1 -8 5 -13
7371 -13 18 -8 -29 6 -9 -14 -12 -7 -14 -4 -5 25 13 2 2 -30 24 25 -11 -19 -9 2 17 29 19 -5 -3 -10 20 -10 7 -13 -11 -21 -18 -5
7407 -5 -4 17 6 15 -22 16 -14 0 14 -17 -10 -2 10 8 3 3 -14 13 -15 -27 13 13 11 -5 7 -17 -15 -2 -9 -1 -8 26 17 2 25 10 -5 -3
7445cK3k2j4J5j0k8O4k4j3Kk1J2J7l8K9L9k1k0K9kk3j4L4qQk0J3l1O2k5k2K9l6
7478a9N4k6j4LL3k4j5Pj3J4JKOl1J8K1j1%okJ9j1Jj0QMl8K4J7j6RL6l1%pqKk2
7516b5L1mLJ2J3l5j2J6K1k6j7L1l1K8qk%j9LMJ1j6L4k3k0M8rj9K3rNmj7K5l8M6
7552B0jl6O0k3k3j8pN2qj6Oj6J6pqK9j8%mj5NJ1j7KpJ0K3j8j5K0k8L4J5m7J2J5
7588bJmJ2j3J5Nk6JRJ9j0k1K4k7L2j1j0K4j7nJ3l3L2QrJ2l4j7M3k5j4M3l4J4k
7623gpO%K5j6nR%J7k1MqmK0l1K5nJ3k2nO5l3l1ML9l0j3LJ4k5J7Pj4RL6m8K7qK2
7662B9m6K3j1Jl5J5PJ3KNj1Omr%L4jk1L8l8KRK8l0p%J4k8J4L2k6Kj2J0Jj8j3M1
7700A6j4j8J5j0J2J1Kj7k0L1l6L6l6ML5j3K3j2l5K8k5N3m5NK2j6Jj0K4k6OK1m4
$$ plain form
7445 -3 20 -2 -16 -1 -11 -39 25 1 -12 -10 -31 -19 -2 -40 -11 28 7 -13 16 14 -9 -23 11 3 11 -9 4 -27 35 10 -12 17 -19
7478 -19 35 9 -5 -2 31 7 -8 -1 -14 0 1 3 9 -22 -4 17 6 6 0 -2 17 6 7 -3 5 9 -29 -5 12 -4 5 41 10 10 3 -5 -3 -25
7516 -25 6 2 5 17 30 -5 -17 -1 20 -6 -23 8 -23 5 -3 -5 -5 -24 -21 -17 -6 -22 12 -11 -31 17 8 -11 12 3 8 4 -13 12 -26 20
7552 20 19 -17 43 20 -3 -21 -28 24 16 0 6 -10 6 -1 -9 20 2 2 -2 -17 -12 -1 -18 -16 -23 -13 10 -8 -23 -3 -31 3 18 -29 -17 -2
7588 -2 -1 -5 7 -6 9 14 -12 -11 -2 17 7 -14 10 -17 15 4 -6 18 1 -4 9 -24 8 16 7 19 -15 -32 11 -14 -28 15 -19 -5 -7
7623 -7 -14 -8 -8 17 1 -4 5 5 22 1 5 -3 -7 13 -18 7 2 15 -7 -12 53 20 -11 -7 32 2 -11 -8 6 -19 -2 5 -9 0 36 -12 15 7 29
7662 29 -17 6 -5 -4 -39 -24 -17 -4 -2 3 -8 -2 -6 -15 -15 19 18 -3 35 -3 -1 8 36 6 -1 -1 13 -15 -1 31 5 7 -5 5 6 -12 -25 16
7700 16 2 -16 -1 -11 1 12 14 -3 -23 8 -28 8 -28 -24 11 -2 21 9 -26 2 -23 30 -15 -10 12 -4 -3 -13 11 -15 -9 12 -32
7733c2J2L5j2j9J9Kllk8L8j5j9J7L2l8k4M6om6M4k3K9j6QK7j4J7n0J5J0J5j6K
7766DOJ2k1J5lj7LrJ2kONK%k7K3l6J3K0j5MKj1L3l0j8RJ6j3MNJ1qJ9J7k1J0l0
7804a0NOlJ5Ml0K8k5Qk7M8l1NL8k0k0J9LK4m6l2K1qK7%jJ3j9k0K7l0M1Jpjj2Q
7841aJ6Nk7k2K9K4J8m2k6J4J7k1K4rK4rj3lPj2K2J3l7qJ5j1L5pk3JK6l0NK6l5
7876a5lK2J6j4k2J2j9K3K9k6kj6J2Nk3L2l0K4J4oj5j1J6Ppj9Lk3J2L8l1oJ2k4
7910c5K0J2j0j0J8pMk3N1ok3jk5L4qJ7j2J0k5%K3k7JK0RMNoJ2k8Rj0MJ7k8J1K4
7947B1k9Mmj0RJ0Jj6rlj4L5J6n4M9l5L6j4p%K8k9K4J6l0oKJ7kJ0j3J1j5pj1J7
7983bj4MJ4j7J7J5KLpj1j8%J7j4J1Rj7JqqL0l4Qk2L2J0mkK3k4k0J6L4m3J8J5q
$$ plain form
7733 -32 -20 15 3 -16 3 5 2 -1 -29 9 -6 -25 -8 24 -14 -38 8 2 -44 0 -23 6 -10 -2 25 11 28 -22 -7 3 18 2 4
7766 4 10 22 1 16 13 -4 -1 -10 2 0 6 11 13 13 -14 9 -27 -14 6 -9 -5 -3 -14 19 -11 -29 -20 -4 -17 -13 -8 3 -5 14 31 10 20 -10
7804 -10 -5 1 -2 13 17 -13 15 -10 -2 -29 19 -12 -7 31 11 -9 10 13 37 -9 -41 -20 -28 -1 -1 -2 11 -8 -28 -1 -31 10 11 4 3 -9 -1
7841 -1 15 20 -7 -29 0 24 42 0 -26 -12 5 -16 8 -1 23 14 1 -2 5 -7 15 28 -9 -17 -2 -13 22 15 -8 -7 19 -11 -6 20 -15
7876 -15 -18 4 20 6 -16 -4 -23 0 29 3 1 -15 -3 2 -21 11 -19 5 19 13 -2 -13 3 10 3 -16 -13 -36 -24 14 -17 -23 -11 -35
7910 -35 -15 -3 -13 -23 -5 -12 -8 -31 20 14 -9 -10 -35 -1 -9 8 -4 6 -19 -19 4 -23 -22 -2 7 11 16 10 22 -6 3 -7 -3 14 -14 -3 21
7947 21 -8 -4 -8 -18 -9 1 2 -14 -23 -26 -40 -5 11 -43 6 -29 7 -7 -14 -14 14 -15 9 25 -5 -11 -9 8 6 16 3 14 -1 -8 -19 -2
7983 -2 -16 -12 2 -15 2 17 19 22 15 4 -14 -14 3 -11 0 9 -8 -7 -15 -23 7 -27 -19 -41 -9 1 -3 -5 18 -6 -26 -10 24 -19 -1 14 6
8020FJ4k3k0kM1%l5L8j6kk6L1Om1M0j0J7k2KoK8m6MkJ8qLKL0k7Nk2L5j8pL7l2
8057hJ1%J3jj1jJ8k1qK2k5jJL4n6K9l2N0Pk8k9LK6J3j7lJ2onPkj7L1k3J9J%j5
8095a2LqJ6PPk0J1nj%j5LJ2j7j6O0l6OpKPLKLk6nL6m0J1K7m5K3j4j3M6n%pj6K
8135b1J4PoJ8k5qJ5QkJ8l9J4%K1%k1Rj0JMj6nK7qj6J7J1j4K3k8JKnNJJKj1MrK1
8176@K6m6J9LmQj8J9J4l8%J9rJ7j6
$$ plain form
8020 6 20 -3 -23 -25 16 16 -19 19 3 1 -25 6 12 -29 11 1 18 -4 -2 -8 20 -26 -22 -24 -6 -14 -11 -9 21 -6 -1 -23 12 -6 -13 24 -8
8057 -8 3 3 16 15 4 3 21 0 -8 14 -11 -12 -11 23 -33 -4 -36 14 21 -7 -36 -33 -7 6 -11 -14 -2 -8 -13 -6 -8 -25 6 -17 2 3 3 -12
8095 -12 -9 -17 -1 6 13 -7 4 -1 -2 -2 -17 -14 -2 -19 -35 25 -11 -5 -12 -10 -3 0 2 5 -21 -26 10 -30 -19 8 -37 -14 -28 -41 5 0 0 -7 -23 -21
8135 -21 -7 0 -6 12 -13 -21 -6 2 0 18 -21 -7 -7 14 14 -7 2 -8 -7 -3 -19 -24 3 -5 -21 -4 7 -7 16 -12 -11 -9 -14 -9 -8 -7 -5 -16 -12 -21 0
8176 0 26 -20 -1 2 -2 6 -12 7 21 -17 -17 2 -7 10 -6
8191f
##END NTUPLES=NMR FID
##END=
