##TITLE=1H_LR-758-R6-3CR8
 CDCl3
 8 sc, 
 24.10.2023
##JCAMPDX= 6.0         $$ Bruker NMR JCAMP-DX V2.0
##DATA TYPE= NMR FID
##DATA CLASS= NTUPLES
##ORIGIN= UXNMR, Bruker Analytische Messtechnik GmbH
##OWNER= root
$$ XWIN-NMR		Version 3.5
$$ Tue Oct 24 14:25:54 2023 Russian Standard Time (UT+4h)  she@DPX200
##.OBSERVE FREQUENCY= 200.13135
##.OBSERVE NUCLEUS= ^1H
##.DELAY= (6, 6)
##.ACQUISITION MODE= SIMULTANEOUS
##.ACQUISITION SCHEME= undefined
##.AVERAGES= 8
##.DIGITISER RES= 18
##SPECTROMETER/DATA SYSTEM= spect
##.PULSE SEQUENCE= zg30
##.SOLVENT NAME= D2O
##.SHIFT REFERENCE= (INTERNAL, D2O, 0, 15.7039)
##AUDIT TRAIL= $$ (NUMBER, WHEN, WHO, WHERE, WHAT)
$$ ##TITLE= Audit trail, XWIN-NMR		Version 3.5
$$ ##JCAMPDX= 5.01
$$ ##ORIGIN= Bruker BioSpin GmbH
$$ ##OWNER= she
$$ F:/spectra/data/she/nmr/H-F/1/audita.txt
$$ ##AUDIT TRAIL=  $$ (NUMBER, WHEN, WHO, WHERE, WHAT)
(   1,<2023-10-24 14:24:31.56 +0400>,<she>,<DPX200>,
      <created by zg, POWCHK disabled, PULCHK disabled
       configuration hash MD5:
       00 E9 B6 7A A2 85 ED C7 34 08 36 98 17 FE 4E 26
       data hash MD5: 16K
       12 5F A7 23 2C 5A 63 24 7B 18 7A 6F 8A D9 C8 97>)
$$ ##END=
$$ 
$$ hash MD5
$$ 69 C9 0B 8E 62 4F 29 DB A2 BE C0 AC F2 D9 4C F8
##$RELAX= 
##$RELAX= 
##$RELAX= 
##$RELAX= 
##$RELAX= 
##$RELAX= 
$$ Bruker specific parameters
$$ --------------------------
##$DU= <F:/spectra>
##$EXPNO= 1
##$NAME= <H-F>
##$PROCNO= 1
##$TYPE= <nmr>
##$USER= <she>
##$AMP= (0..31)
100 100 100 100 100 100 100 100 100 100 100 100 100 100 100 100 100 100 
100 100 100 100 100 100 100 100 100 100 100 100 100 100 
##$AQSEQ= 0
##$AQ_mod= 1
##$AUNM= <au_zg>
##$AUTOPOS= <>
##$BF1= 200.13
##$BF2= 200.13
##$BF3= 200.13
##$BF4= 200.13
##$BF5= 200.13
##$BF6= 200.13
##$BF7= 200.13
##$BF8= 200.13
##$BYTORDA= 1
##$CFDGTYP= 0
##$CFRGTYP= 5
##$CHEMSTR= <none>
##$CNST= (0..31)
1 1 145 1 1 1 1 1 1 1 1 1 1 1 1 1 1 1 1 1 1 1 1 1 1 1 1 1 1 1 1 1 
##$CPDPRG= <>
##$CPDPRG1= <>
##$CPDPRG2= <>
##$CPDPRG3= <>
##$CPDPRG4= <mlev>
##$CPDPRG5= <mlev>
##$CPDPRG6= <mlev>
##$CPDPRG7= <mlev>
##$CPDPRG8= <mlev>
##$CPDPRGB= <>
##$CPDPRGT= <>
##$D= (0..31)
0 1.2 0 0 0 0 0 0 0 0.06 0 0.03 0 0 0 0 0.0002 0 0 0 0 0 0 0 0 0 0 0 0 
0 0 0 
##$DATE= 1698143071
##$DBL= (0..7)
120 120 120 120 120 120 120 120 
##$DBP= (0..7)
150 150 150 150 150 150 150 150 
##$DBP07= 0
##$DBPNAM0= <>
##$DBPNAM1= <>
##$DBPNAM2= <>
##$DBPNAM3= <>
##$DBPNAM4= <>
##$DBPNAM5= <>
##$DBPNAM6= <>
##$DBPNAM7= <>
##$DBPOAL= (0..7)
0.5 0.5 0.5 0.5 0.5 0.5 0.5 0.5 
##$DBPOFFS= (0..7)
0 0 0 0 0 0 0 0 
##$DE= 6
##$DECBNUC= <off>
##$DECIM= 32
##$DECNUC= <off>
##$DECSTAT= 4
##$DIGMOD= 1
##$DIGTYP= 9
##$DL= (0..7)
0 120 120 120 120 120 120 120 
##$DP= (0..7)
150 150 150 150 150 150 150 150 
##$DP07= 0
##$DPNAME0= <>
##$DPNAME1= <>
##$DPNAME2= <>
##$DPNAME3= <>
##$DPNAME4= <>
##$DPNAME5= <>
##$DPNAME6= <>
##$DPNAME7= <>
##$DPOAL= (0..7)
0.5 0.5 0.5 0.5 0.5 0.5 0.5 0.5 
##$DPOFFS= (0..7)
0 0 0 0 0 0 0 0 
##$DQDMODE= 0
##$DR= 18
##$DS= 0
##$DSLIST= <SSSSSSSSSSSSSSS>
$$ [...]
##$SUBNAM2= <"">
##$SUBNAM3= <"">
##$SUBNAM4= <"">
##$SUBNAM5= <"">
##$SUBNAM6= <"">
##$SUBNAM7= <"">
##$SUBNAM8= <"">
##$SUBNAM9= <"">
##$SW= 18.05172834244
##$SWIBOX= (0..15)
0 0 2 0 0 0 0 0 0 0 0 0 0 0 0 0 
##$SW_h= 3612.71676300578
##$TD= 16384
##$TD0= 1
##$TE= 0
##$TE2= 300
##$TE3= 300
##$TEG= 300
##$TL= (0..7)
0 120 120 120 120 120 120 120 
##$TP= (0..7)
150 150 150 150 150 150 150 150 
##$TP07= 0
##$TPNAME0= <>
##$TPNAME1= <>
##$TPNAME2= <>
##$TPNAME3= <>
##$TPNAME4= <>
##$TPNAME5= <>
##$TPNAME6= <>
##$TPNAME7= <>
##$TPOAL= (0..7)
0.5 0.5 0.5 0.5 0.5 0.5 0.5 0.5 
##$TPOFFS= (0..7)
0 0 0 0 0 0 0 0 
##$TUNHIN= 0
##$TUNHOUT= 0
##$TUNXOUT= 0
##$USERA1= <user>
##$USERA2= <user>
##$USERA3= <user>
##$USERA4= <user>
##$USERA5= <user>
##$V9= 5
##$VALIST= <valist>
##$VCLIST= <CCCCCCCCCCCCCCC>
##$VD= 0
##$VDLIST= <DDDDDDDDDDDDDDD>
##$VPLIST= <PPPPPPPPPPPPPPP>
##$VTLIST= <TTTTTTTTTTTTTTT>
##$WBST= 1024
##$WBSW= 4
##$XGAIN= (0..3)
0 0 0 0 
##$XL= 0
##$YL= 0
##$YMAX_a= 387550
##$YMIN_a= -551495
##$ZGOPTNS= <>
##$ZL1= 120
##$ZL2= 120
##$ZL3= 120
##$ZL4= 120
##$ABSF1= 10
##$ABSF2= 0
##$ABSG= 5
##$ABSL= 3
##$ALPHA= 0
##$AQORDER= 0
##$ASSFAC= 0
##$ASSFACI= 0
##$ASSFACX= 0
##$ASSWID= 0
##$AUNMP= <proc_1d>
##$AZFE= 0.1
##$AZFW= 0.1
##$BCFW= 1
##$BC_mod= 2
##$BYTORDP= 1
##$COROFFS= 0
##$CY= 11.3945322036743
##$DATMOD= 1
##$DC= 2
##$DFILT= <>
##$DTYPP= 0
##$F1P= 15.7292609196834
##$F2P= 12.9074282941183
##$FCOR= 0.5
##$FTSIZE= 0
##$FT_mod= 4
##$GAMMA= 1
##$GB= 0.15
##$INTBC= 1
##$INTSCL= 1
##$ISEN= 128
##$LB= 0.24
##$LEV0= 0
##$LPBIN= 0
##$MAXI= 10000
##$MC2= 0
##$MEAN= 0
##$ME_mod= 0
##$MI= 1.114404
##$NCOEF= 0
##$NC_proc= 0
##$NLEV= 6
##$NOISF1= 3.799351
##$NOISF2= 2.8
##$NSP= 1
##$NTH_PI= 0
##$NZP= 0
##$OFFSET= 15.70392
##$PC= 1
##$PHC0= -23150.31
##$PHC1= 9.252701
##$PH_mod= 1
##$PKNL= yes
##$PPARMOD= 0
##$PSCAL= 0
##$PSIGN= 0
##$REVERSE= no
##$SF= 200.130013532006
##$SI= 16384
##$SIGF1= 3
##$SIGF2= 2
##$SINO= 400
##$SIOLD= 16384
##$SREGLST= <1H.CDCl3>
##$SSB= 0
##$STSI= 0
##$STSR= 0
##$SW_p= 3612.71676300578
##$SYMM= 0
##$S_DEV= 0
##$TDeff= 0
##$TDoff= 0
##$TI= <>
##$TILT= no
##$TM1= 0
##$TM2= 0
##$TOPLEV= 0
##$USERP1= <user>
##$USERP2= <user>
##$USERP3= <user>
##$USERP4= <user>
##$USERP5= <user>
##$WDW= 1
##$XDIM= 8192
##$YMAX_p= 0
##$YMIN_p= 0
$$ End of Bruker specific parameters
$$ ---------------------------------
##NTUPLES= NMR FID
##VAR_NAME=  TIME,          FID/REAL,        FID/IMAG
##SYMBOL=    X,             R,               I
##VAR_TYPE=  INDEPENDENT,   DEPENDENT,       DEPENDENT
##VAR_FORM=  AFFN,          ASDF,            ASDF
##VAR_DIM=   8192,          8192,            8192
##UNITS=     SECONDS,       ARBITRARY UNITS, ARBITRARY UNITS
##FACTOR=    0.0002768,     1,               1
##FIRST=     0,             0,               0
##LAST=      2.2672688,     0,               0
##MIN=       0,             -551495,         0
##MAX=       2.2672688,     387550,          0
$$ Real data points
##PAGE= N=1
##DATA TABLE= (X++(R..R)), XYDATA
0@%%%%%%%%%%%qJ6j6J6j6J8k6L2l6M4n3O1p2Q5r7J12j29J47j69J93k18K48k81
$$ 0 0 0 0 0 0 0 0 0 0 0 0 -8 8 -8 8 -8 10 -16 16 -20 24 -29 32 -40 45 -52 60 -69 78 -91 102 -116 132 -149
34a49L15l52L93m37M88n43O03o70P39q15R01r94J094j204J324j458J608j771J954
$$ -149 166 -186 207 -230 258 -285 318 -352 387 -428 473 -521 573 -631 693 -765 843 -928 1026
53A026k160K392k657K960l311L727m230M845n618O618p964R875j2772J7619k7049
$$ 1026 -1134 1258 -1399 1561 -1750 1977 -2253 2592 -3026 3592 -4372 5503 -7269 10350 -16699
68a6699N1294k14820l71270Q00449o8581n04070N91513J19734o95055K54064L89302
$$ -16699 34595 -180225 -551495 248954 180373 -323697 267816 387550 -307505 -53441 335861
79C35861m01071P3755L50787l35359r9833L20368j37617j54018J87065n1779q7786
$$ 335861 -65210 8545 359332 23973 -75860 244508 106891 -47127 139938 88159 373
90C73J23702m6394j01475L2232k8681M2680O6679j32536j0413J11585j23068j0796
$$ 373 124075 77681 -23794 8438 -20243 22437 89116 -43420 -53833 57752 -65316 -76112
102g6112J46643j59669o1978K54642r6969j91013K19432j5768k24115K28332R8654
$$ -76112 70531 -89138 -151116 103526 6557 -184456 34976 19208 -204907 23425 122079
113A22079k92438J10411K04157k48511q562K38544j50000o1017K34405j13639
$$ 122079 -170359 -59948 144209 -104302 -112864 125680 -24320 -85337 149068 35429
123C5429j57855K09649J5609j52018J27788L4204j57087R9056J00277j48106r211
$$ 35429 -122426 87223 102832 -49186 78602 112806 -44281 54775 155052 6946 -2265
134b265J03680n1491q803N6392o9685m0889N5986R73k0474m088k7282Q414J1047
$$ -2265 101415 49924 41121 97513 27828 -13061 42925 43898 23424 19336 -7946 468 11515
147A1515m0718N640J6028l4875K6617K2365q6314P462Q9799m9417k9687O9899
$$ 11515 -29203 -23563 -7535 -42410 -15793 6572 -79742 -72280 17519 -31898 -61585 8314
159H314n2651m1071J21301j0787j05690P8993M2772r2052N8314O5649j06935J7893
$$ 8314 -44337 -85408 35893 25106 -80584 -1591 41181 -50871 7443 73092 -33843 -15950
171a5950J07473q2013m7357J07604k1318o1725P4256j5381q6831P1084N5232p7147
$$ -15950 91523 9510 -37847 69757 48439 -13286 60970 45589 -41242 29842 85074 7927
183G927p115L4041m2393R046N0919l7674l7589L0991L681k0537O896K317n600
$$ 7927 812 34853 -7540 1506 52425 14751 -22838 8153 11834 -8703 -1807 510 -5090
196e090R96l673o313r093N065L2338p618m7155J2249L1915j8501J4429K2241n5874
$$ -5090 -4094 -7767 -14080 -23173 -18108 14230 6612 -40543 -28294 3621 -14880 -451 21790 -34084
210c4084n887P3080j7862m3465M8744l382m5107N2993J8192p2212L2322O2384
$$ -34084 -39971 33109 15247 -28218 20526 17144 -27963 25030 43222 -28990 3332 65716
222F5716o3889j4118N8065l7963j8052P2132l3288o8434N9881K4525n5339K4792
$$ 65716 1827 -12291 45774 7811 -10241 61891 28603 -39831 20050 44575 -10764 14028
234A4028J7397o2279J7807N5678m4858k6401M2126j6725k7463L2676j262k8886
$$ 14028 31425 -30854 -13047 42631 -2227 -28628 13498 -3227 -30690 1986 724 -28162
246b8162K4814J0118l4131k491K4944N074l202l635j0179l800J2483J9427k797
$$ -28162 -3348 6770 -27361 -29852 -4908 166 -3036 -6671 -16850 -20650 -8167 11260 8463
259H463k2419M481K2300j0104r046J8548o899r188L0180q017m0881K5097L2637
$$ 8463 -13956 -9475 12825 2721 -6325 12223 5324 -3864 26316 18299 -22582 2515 35152
272C5152k9343l101J7370l0532K112M7536k4541m3508L1625J4447k6927J9869
$$ 35152 5809 2708 20078 -10454 -8342 39194 14653 -28855 2770 17217 -9710 10159
284A0159O192m5694J1855M4847k8677k3406L2945o364k4198K8408J853l4848K4218
$$ 10159 16351 -29343 -17488 27359 -1318 -24724 8221 1857 -22341 6067 7920 -26928 -2710
297b710L0521l6681j3489L3837n132j2682K4689j2323l3013L2688L0712l4715
$$ -2710 27811 -8870 -22359 11478 6346 -6336 18353 6030 -26983 5705 36417 1702
309A702j4160K1152j0424j652K9921j5340l6285K4554K3818k9308o057K0925j3179
$$ 1702 -12458 8694 -1730 -3382 26539 11199 -25086 -532 23286 -6022 -12079 8846 -4333
322d333l160K6427j9532l4782L0476K7596k5925n992J1278k1168L058L8161j3410
$$ -4333 -7493 18934 -598 -35380 -4904 22692 -3233 -9225 2053 -19115 -16057 22104 8694
335H694l4828K2371J6371k5273N865J8814k1483p91K9760j7048k7898K7527J7784
$$ 8694 -26134 -3763 12608 -12665 -6800 12014 -9469 -10260 19500 2452 -25446 2081 19865
348A9865k4838K282J3534k0334J737L2082j5957k9632K4525J7271k3341K069J3298
$$ 19865 -4973 -2691 10843 -9491 -7754 24328 8371 -21261 3264 20535 -2806 -737 12561
361A2561k3167m63L5067j3897l3277K2891J3538k6910Q899J7980k9010j998L4875
$$ 12561 -10606 -11069 23998 10101 -23176 -285 13253 -13657 -4758 13222 -15788 -17786 17089
374A7089j9851k8926L1754R584l0071J3555J5038l2040Q079L6951k6127k2761
$$ 17089 -2762 -31688 66 9650 -20421 -6866 8172 -23868 -15789 21162 -4965 -27726
386b7726L5437J579k6945K1069R763k9951J5944K9192l2676j5812L5834P79k0595
$$ -27726 7711 9290 -17655 3414 13177 -16774 -830 28362 -4314 -20126 15708 16487 -4108
399d108J6291l059k7919K2945K8691l0299j8759K3260m93j1605J7122l812k8959
$$ -4108 12183 9124 -18795 4150 32841 2542 -16217 7043 6550 -5055 12067 8255 -20704
412b0704J4366K7272k2811j8819K1522J243j4680J5659R47l0566J1697L3481k1523
$$ -20704 -6338 20934 -1877 -20696 826 2069 -12611 3048 3995 -26571 -14874 18607 -2916
425b916k2122K3917O51j7818K3596N506l6681J2633L6157k4999j7538K9334n444
$$ -2916 -25038 -1121 -470 -18288 5308 10814 -25867 -13234 22923 -2076 -19614 9720 4276
438D276j9433K9360K995l7867J7441L2600k9689j2999K9591j0505j5371K9326
$$ 4276 -15157 14203 17198 -20669 -3228 29372 -317 -13316 16275 5770 -9601 19725
450A9725n820l6852K1495K7651k8187r176K1680j4786j0321K9995o290l4310J9098
$$ 19725 13905 -22947 -1452 26199 -1988 -11164 10516 -4270 -14591 15404 9114 -25196 -6098
463f098K3271k7001n570K3329j5264q887K7382q318l1709K1339K3094k4251m818
$$ -6098 17173 -9828 -15398 7931 -7333 -16220 11162 2844 -28865 -7526 15568 -8683 -13501
476a3501J9274j7158o546L2241q356l0974K0698J9481k4610J055J8207j6417m694
$$ -13501 5773 -11385 -17931 14310 5954 -25020 -4322 15159 -9451 -8396 9811 -6606 -11300
489a1300K9418j0228k7962K2004J7043k1510J441J4312j8849J091K8306j0662
$$ -11300 18118 7890 -20072 1932 18975 -2535 -1094 13218 -5631 -4540 23766 13104
501A3104k8151J7041J5541j8275Q53J3746k0039n420K7015p493k7963J6328J6452
$$ 13104 -15047 1994 17535 -740 113 13859 -6180 -11600 15415 7922 -20041 -3713 12739
514A2739k3253O62J5810j9109n153L2511j0025l1566K0994J6524k1653O967J6125
$$ 12739 -10514 -9852 5958 -13151 -18304 14207 4182 -27384 -6390 10134 -11519 -4552 11573
527A1573k4731j904L4521j2555k5155K1477J1141k0569J0570J0546k4529J491
$$ 11573 -13158 -15062 19459 6904 -18251 3226 14367 -6202 4368 14914 -9615 -8124
539h124K9862j1643k3350J7174O303j7074J0238R881k3890M13K7610j1666k1140
$$ -8124 21738 10095 -13255 3919 10222 -6852 3386 13267 -10623 -10210 17400 5734 -15406
552a5406J7920O003j7935J2103J0491k3472J779K6764j5156j7459K1597K764j7416
$$ -15406 2514 8517 -9418 2685 13176 -10296 -8517 18247 3091 -14368 7229 9993 -7423
565g423J3411M322k4602Q537K5395j8053j5952J6787m58j0638J4060l91k2804
$$ -7423 5988 10310 -14292 -5755 19640 1587 -14365 2422 1964 -8674 5386 4995 -17809
578a7809Q211K1987j1974j3290J1440R91q178J3305L721k0653M339K3979r940
$$ -17809 -9598 12389 415 -12875 -1435 -444 -8622 4683 8404 -12249 -7910 16069 6129
591F129j6290J3768K473j1264J6280O215k8367L451K6986j4378j3382K0011p167
$$ 6129 -10161 3607 6080 -5184 11096 17311 -11056 -7605 19381 5003 -8379 11632 4465
604D465j6426K2818J476l0293J3944K3658k1807p252J8191j3071o588K6472n750
$$ 4465 -11961 10857 12333 -17960 -4016 19642 -2165 -9417 8774 -4297 -10885 15587 9837
617I837k6214J5591J5501j6371K26J0748j3044n30K0204o894j9918R017J2264
$$ 9837 -16377 -786 14715 -1656 -1430 9318 -3726 -4256 15948 9054 -10864 -1847 10417
630A0417r524k032O854r664m549J6251j195k0358N930J5160j0015m551J0882j0101
$$ 10417 893 -1139 5715 -3949 -8498 7753 6558 -13800 -7870 7290 -2725 -7276 3606 -6495
644f495q184K1557J202k2968R904J5440j5765L48J5486j4536n588K4904n356k2356
$$ -6495 -14679 6878 8080 -14888 -4984 10456 -5309 -4961 10525 -4011 -9599 15305 9949 -12407
658a2407J5430J0535j6888N588J0720j7897Q02K2402j2057j8367J5616N668j2033
$$ -12407 3023 13558 -3330 2258 12978 -4919 -4117 18285 6228 -12139 3477 9145 -2888
671b888P724M153j8568L666J9361r831j3651J1562L906r322O453L538j6250L032
$$ -2888 4836 8989 -9579 -5913 13448 3617 -10034 1528 5434 -3888 2565 6103 -10147 -7115
685g115J9204p595j5101R421M345r976P865O397j7970M45K0670q817j5659J3689
$$ -7115 12089 4494 -10607 -1186 3159 -6817 1048 7445 -10525 -10080 10590 1773 -13886 -197
699a97K973j2823J1492O176k0655L881K1932j1878j2402J5509l88j0691J4412
$$ -197 2776 -10047 1445 7621 -13034 -9153 12779 901 -11501 4008 3620 -7071 7341
712G341K615k0640P796J9298j2159r001J2561l566p309J4530p9j9186O121J6703
$$ 7341 9956 -10684 -2888 16410 4251 -4750 7811 4245 -3064 11466 11387 -7799 -1678 15025
726A5025j0755q329J0165m884p190J3620R5j9247N491J5291j1130o859J0159n090
$$ 15025 4270 -4059 6106 1222 -5968 7652 7747 -11500 -6009 9282 -1848 -8707 1452 -3638
740c638p257J4890L05j9779O618J6199j1525m604J1940q050o136J8445j348j9816
$$ -3638 -10895 3995 4300 -15479 -8861 7338 -4187 -8791 3149 -4901 -11037 7408 6060 -13756
754a3756R634J4473j2489j523J1175j0343m623J9760l993j9076J1138J1326j2904
$$ -13756 -4122 10351 -2138 -3661 7514 -2829 -7452 12308 8315 -10761 377 11703 -1201
767a201J050R535j2599k680J8883m892j7834J0454R182j2551K562Q863j3129j899
$$ -1201 -151 9384 -3215 -5895 12988 8096 -9738 716 9898 -2653 -91 8772 -4357 -6256
781f256J7871o343j7195J0998Q996j1883K572P537j4443j661J9483n324j7993
$$ -6256 11615 5272 -11923 -925 8071 -3812 -1240 6297 -8146 -9807 9676 4352 -13641
794a3641J0665P342j2189M813Q590j5803j673K0522o345j6302J2234N881j2238
$$ -13641 -2976 4366 -7823 -3010 5580 -10223 -11896 8626 2281 -14021 -1787 4094 -8144
807h144P652Q728j6825O21K0373p828j3802J3172L554j1251R428O617j7199J619
$$ -8144 -492 8236 -8589 -7968 12405 4577 -9225 3947 7501 -3750 5678 12295 -4904 -3285
821c285J8595q619j2376J2352J127j1293Q956M562j6817K059J6927r098j2403
$$ -3285 15310 6691 -5685 6667 7794 -3499 5457 10019 -6798 -4739 12188 3090 -9313
834i313J0685P09r903R497M302j7905K239J8227q721j1507J1165j59r327J1819
$$ -9313 1372 2081 -7822 1675 5977 -11928 -9689 8538 -183 -11690 -525 -684 -10011 1808
848A808M964j8759L007J8287r595r107J3291k604j0188J4326L445j9177N120J7355
$$ 1808 6772 -11987 -8980 9307 -288 -9395 3896 1292 -8896 5430 8875 -10302 -5182 12173
862A2173j1123o747J2991n545r207J5874J958j8813P041J4807j2363m971J2609
$$ 12173 1050 -5697 7294 1749 -7458 8416 10374 -8439 -1398 13409 1046 -3925 8684
875H684o506p709J5065k18j8267P261J3546j1914m829J0866p232o706J4856p91
$$ 8684 2178 -5531 9534 9316 -8951 -1690 11856 -58 -4887 5979 -1253 -7959 6897 6106
889F106j9200O366J3285j0748l367R430q405o908J6339J2j7856O548J2720j0606
$$ 6106 -13094 -6728 6557 -4191 -7558 1872 -6533 -13441 2898 2910 -14946 -8398 4322 -6284
903f284j851J0881q850n850J7817k93j7179P560J1737j0360K24J1200j0786n310
$$ -6284 -8135 2746 -6104 -11954 5863 5570 -11609 -4049 7688 -2672 -2448 8752 -2034 -7344
917g344J7574j248j6182Q521Q852j1838J973R597j2135m375J6886l862j5834Q741
$$ -7344 10230 8982 -7200 1321 10173 -1665 308 9905 -2230 -6605 10281 6419 -9415 -674
931f74P283j1645L132Q046j3856k604J6303m526j4048Q702M936j0697N112P269
$$ -674 6609 -5036 -1904 6142 -7714 -10318 5985 1459 -12589 -3887 1049 -9648 -4536 2733
945B733j3284j677J5818m449j2723R195M522r602N889O955j3160j153J6168m135
$$ 2733 -10551 -12228 3590 -859 -13582 -4387 135 -9467 -3578 3377 -9783 -10936 5232 1097
959A097j2048R585L900j0253P244P656j4836m55J6928o044j1330J0982J460j0277
$$ 1097 -10951 -1366 2534 -7719 -475 7181 -7655 -8110 8818 2774 -8556 2426 3886 -6391
973f391R400O185j6402Q88J6280p776r489J0563j392r506J0428L736j6332K583
$$ -6391 3009 9194 -7208 -6320 9960 2184 -7305 3258 1866 -7640 2788 6524 -9808 -7225
987g225J3824q416p487R261k763q147J0440K607j4966K718J2522o973o352Q584
$$ -7225 6599 -1817 -9304 -43 -2806 -10953 -513 2094 -12872 -10154 2368 -4605 -10957 -2373
1001b373k347p370J0667M038j4228K483J3585o565n919R931k397p983J2402M076
$$ -2373 -4720 -12090 -1423 2615 -11613 -9130 4455 -2110 -8029 1902 -495 -8478 3924 8000
1015H000j5574L648J3533q365m560J0399n442p753J3962J366j6313N416J0748
$$ 8000 -7574 -3926 9607 1242 -3318 7081 1639 -6114 7848 9214 -7099 -1683 9065
1028I065j0338j754R364q313n680J3758j072j4635O131Q418r217k01Q234q573
$$ 9065 -1273 -3027 6337 -1976 -7656 6102 5030 -9605 -3474 4944 -4273 -4474 3760 -4813
1042d813m448J3524q84j3493O459P744q616N04P848q118m527J3985j040j3497
$$ -4813 -9261 4263 3379 -10114 -3655 4089 -4527 -4023 3825 -4293 -8820 5165 4125 -9372
1056i372O002Q281q965J101Q741r725m720J5343j100j3773P368P378r571K798
$$ -9372 -3370 4911 -4054 -2953 5788 -3937 -8657 6686 5586 -8187 -819 6559 -3012 -214
1070b14R316j1493l463J5697k368j2760Q358N364j0372N104P685j2383k834J4879
$$ -214 9102 -2391 -5854 9843 7475 -5285 3073 8437 -1935 3169 10854 -1529 -4363 10516
1084A0516m292j1670Q506K675r947N364O758j3053j443J3837n157j0293Q234K320
$$ 10516 6224 -5446 3060 5735 -4212 1152 7910 -5143 -6586 7251 2094 -8199 35 2355
1098B355r193O485N948j2302r99J3900m041r240Q375K028q870P544O097j2722
$$ 2355 -6838 -353 5595 -6707 -7706 6194 2153 -7087 1288 3316 -5554 1990 8087 -4635
1112d635l61J4023m741q884Q931K53q926Q307O219j4186j26J3908o327p761R828
$$ -4635 -4996 9027 4286 -4598 4333 4586 -4340 3967 10186 -4000 -4126 9782 3455 -4306 5522
1127E522j551r143R823M699j4334J892J2909p597o290J0089k921q965J1703K873
$$ 5522 3971 -5172 4651 9350 -4984 -3092 9817 2220 -4070 6019 3098 -5867 5836 8709
1141H709j4162K860J1605q240m570R299m615p942J1670J950j4164L299J0558p857
$$ 8709 -5453 -2593 9012 772 -3798 5501 886 -7056 4614 6564 -7600 -4301 6257 -1600
1155a600m114R251n286p069J1752K365j3654L238J0840p819k695R922n523p157
$$ -1600 -5714 3537 -1749 -8818 2934 5299 -8355 -5117 5723 -2096 -4791 5131 -392 -7549
1169g549J2769K207j3567M557R950q242j613R595o938o628J2948J133j3706M819
$$ -7549 5220 7427 -6140 -1583 8367 125 -1488 8107 1169 -5459 7489 8622 -5084 -265
1183b65Q619r045q61R114q610n831J3087l82j3342N534P374r295N63Q902r040
$$ -265 8354 -691 -1552 7562 -1048 -6879 6208 5826 -7516 -1982 5392 -3903 -3340 5562 -3478
1198c478n101J3607j072j2497O581O157r587L040Q263j0085m140J3844j776j1456
$$ -3478 -8579 5028 3956 -8541 -1960 4197 -5390 -2350 5913 -4172 -8312 5532 3756 -7700
1212g700P166M878r339L646P882j0641l042J3260k505j0467P687L308q792M765
$$ -7700 -534 4344 -4995 -1349 6533 -4108 -7150 6110 3605 -6862 825 4133 -4659 106
1226A06P657j1327k547J3420l066r957P745K877r171O075O538j1275k269J2625
$$ 106 7763 -3564 -6111 7309 4243 -5714 2031 4908 -4263 1812 8350 -2925 -5194 7431
1240G431l867q974P872J558r468O225O429j2315j451J2664n088q514Q751l98r202
$$ 7431 3564 -5410 2462 4020 -5448 777 7206 -5109 -6560 6104 1016 -7498 1253 855 -8347
1255h347Q019N549j2631J00J2143n359o686Q857m37q531Q895M979j1980O63J1824
$$ -8347 -328 5221 -7410 -7310 4833 -526 -7212 1645 1208 -7323 1572 6551 -5429 -4766 7058
1270G058n391n936R047j682p946Q739N214j3017J167J0732o344m844Q818l456
$$ 7058 1667 -4269 4778 3096 -4850 3889 9103 -3914 -2747 7985 1641 -3203 5615 2159
1284B159p968R483L543j2564J354J0084o917l707Q641m295p356J0053L063j2143
$$ 2159 -5809 3674 7217 -5347 -3993 6091 -826 -4533 4108 -187 -7543 2510 5573 -6570
1298f570K705R172p315k427R063n033o725J0534K368j1893L543Q437p632j290
$$ -6570 -3865 5307 -2008 -4435 4628 -405 -7130 3404 5772 -6121 -2578 5859 -1773 -3063
1312c063Q369n912n771J0891Q11j1121L801P343p297k48Q166o941n684J1526N27
$$ -3063 5306 -606 -6377 4514 5325 -5796 -1995 5348 -1949 -2197 5969 -972 -6656 4870 5397
1327E397j0739M589O510q100R02Q024p578n111J1523n7j0843N228N282q139J566
$$ 5397 -5342 -753 5757 -2343 -1441 6583 -995 -6106 5417 5360 -5483 -255 5027 -3112 -1546
1342a546P930q583m736J1587j175j0060N930M439q993L121P285q796l569J1518
$$ -1546 6384 -2199 -6935 4652 3477 -6583 -653 3786 -5207 -2086 5199 -3597 -7166 4352
1356D352j785r271O758L254p822M311O493r311k241J0970k302p933O286K080p624
$$ 4352 2567 -6704 54 3308 -4514 -203 6290 -3021 -5262 5708 3406 -4527 1759 3839 -3785
1371c785M570O225r946j990J0630k982p666O302R47p882N338N222r630j618R973
$$ -3785 785 7010 -2936 -4926 5704 2722 -4944 1358 2305 -5577 -239 4983 -4647 -6265 3708
1386C708l380o924P077L52p862O558N382j0239k97J0116m352n272P518j002o908
$$ 3708 328 -6596 481 833 -7029 -471 4911 -5328 -5625 4491 139 -5133 2385 1383 -5525
1401e525P369M300j0106P01R476n427m115P118k364o494P753L150j0160J106P993
$$ -5525 1844 6144 -3962 -3261 6215 788 -3327 3791 1427 -5067 2686 5836 -4324 -3218 4775
1416D775n140l478P046l094o258P708K650r749J517P624n466k544P156l861n757
$$ 4775 -365 -3843 3203 109 -6149 1559 4209 -5540 -4023 3601 -1865 -4409 2747 -1114 -6871
1431f871Q545K177r841K263P210n856j764P421m246n725Q846K130r708L255O589
$$ -6871 1674 3851 -5990 -3727 3483 -2373 -4137 3284 -962 -6687 2159 4289 -5419 -2164 4425
1446D425o483p48P706n404n052R330J042r278L804N863o708N22P333o300m718
$$ 4425 -2058 -2806 4900 -504 -5556 3774 4816 -4462 -658 5205 -1503 -981 6352 52 -4666
1461d666R852j21q895M034M816p043J202O393o984l903Q787o66q298M445L169
$$ -4666 5186 5065 -3830 204 5020 -2023 -821 5572 -1412 -5315 3472 2806 -5492 -1047 2122
1476B122o509J807N854p126l360R150j161p230M750K785o339L039N810o618k485
$$ 2122 -4387 -2580 3274 -3852 -7212 1938 777 -6453 -1703 1082 -5257 -2218 3592 -3026 -5511
1491e511Q749n15o910N258K792o581L936O074p953k126R619k071o877N948J580
$$ -5511 3238 2723 -4187 1071 3863 -2718 1218 7292 -661 -2787 6832 4761 -2116 3832 5412
1506E412p242M323N453q863k019R043l371o346O477k93p356N306M420r389o51
$$ 5412 -1830 2493 7946 -917 -2936 6107 2736 -3610 2867 2574 -4782 524 4944 -4445 -5096
1521e096Q428m026m915O334r95n858N616L616q306K71P745l482l587N886j169
$$ -5096 3332 -694 -5609 725 -270 -6128 -512 3104 -5202 -4931 2814 -668 -4255 1631 462
1536D62n426N866L534p416m1P542l338l516O197j542n751O416M176q519K16P347
$$ 462 -4964 902 4436 -2980 -3021 4521 1183 -2333 3864 2322 -3429 2987 7163 -1356 -1140 6207
1552F207l958l410O688k222o414P253K653q765K065O204n431k655P037m537n145
$$ 6207 2249 -1161 5527 3305 -3109 4144 6797 -1968 97 6301 870 -1785 5252 715 -4430
1567d430P277J132q367J981N038n549q02N729m230m558P420P66p323K465M748
$$ -4430 2847 3979 -4388 -2407 2631 -2918 -3720 2009 -2221 -6779 641 1407 -5916 -3451 1297
1582A297m691j96N740l595m066P260J961p181K508N195m654l3O422m567m065P652
$$ 1297 -3394 -3590 2150 -1445 -5511 1749 3710 -3471 -963 4232 -422 -455 5967 1400 -2665 4987
1598D987J249p505L336M220o233P81O130n797m192P948p40p561M150K823o718
$$ 4987 6236 -1269 2067 6287 54 835 6965 1168 -3024 4924 4184 -3377 773 3596 -3122
1613c122J820N365o831k647P807j569o234M292K087o063L111M618o531j629P462
$$ -3122 -1302 4063 -2768 -5415 2392 823 -5411 -1119 968 -5095 -1984 2634 -3897 -5526 1936
1628A936j513m769M090J666n231L072M733n973j996O777m73n172L918J974n384
$$ 1936 423 -4346 -256 1410 -3821 -749 3984 -1989 -3985 2792 2319 -2853 1065 3039 -2345
1643b345K952M913o020k506P207j180n240M500J303o015L291N445p319j757P245
$$ -2345 607 5520 -500 -3006 4201 3021 -2219 2281 3584 -2431 860 6305 -1014 -2771 4474
1658D474k106n258M940K19o366M850L771p305j323P132l496l770N306j192n719
$$ 4474 2368 -2890 2050 2269 -4097 753 4524 -2781 -4104 3028 -468 -4238 1068 -124 -5843
1673e843N404K910p063M57O034k995k974N135j357m285N158K864o042J15O001
$$ -5843 -439 2471 -4592 -4135 1899 -1096 -4070 1065 -292 -4577 581 3445 -2597 -2482 3519
1688C519k897k135M876j423m608M956K906o579K36N452l148k428M757j787n195
$$ 3519 622 -1513 3363 1940 -2668 2288 5194 -1385 -1149 4303 1155 -1273 3484 1697 -3498
1703c498N196K589p020N78N439m206k106N494k782n223O230K321p169J504N203
$$ -3498 1698 4287 -2733 -2155 3284 -922 -3028 2466 -316 -5539 691 3012 -4157 -2653 2550
1718B550m715q05N797l558l959O170J744o803K588L648m176L86N206m313l507
$$ 2550 -2165 -2970 2827 -731 -4690 1480 3224 -3579 -991 2657 -1519 -1133 4073 -240 -3747
1733c747N953J148o106K285L408m677O09M587l860l602O102Q52o051K361L328
$$ -3747 2206 3354 -2752 -467 2941 -1736 -1127 3460 -400 -4002 2100 2952 -3099 -738 2590
1748B590m494M06N045m028l565O007N75n528K561L082m927Q63N119m580l083O061
$$ 2590 -1904 -1498 3547 -481 -4046 1961 2536 -2992 -431 2651 -2276 -1413 3706 -874 -3957 2104
1764B104m5n238L238K383n198J892M659n226k568O497q76m883L900J451m870K517
$$ 2104 2059 -3179 59 2442 -2756 -864 3795 -1431 -3999 2498 1622 -3261 639 2090 -2780 -263
1780b63L967m909j987O041j226l878L776P54m624K792L672n379j136N358j521
$$ -263 3704 -1205 -3192 2849 1623 -2255 1521 2275 -2349 443 4115 -1264 -2400 2958 1437
1795A437m001L547N01m575K611L776n218j707N153j586l418L917L57m657K915
$$ 1437 -2564 983 1484 -3091 -480 3296 -1922 -3629 1524 -62 -3480 437 794 -3863 -948
1810i48M180n090j540O003j833l437M569k4m842L907L796n783o02N540k908k612
$$ -948 3232 -1858 -3398 2605 772 -2665 1904 1880 -2962 945 4741 -1042 -1644 3896 988 -1624
1826a624M683j059m676M225K773n982rM891l419k308M837k083m201M104K264n870
$$ -1624 3059 2000 -2676 1549 4322 -1660 -1669 3222 -197 -2505 2332 249 -3952 152 2416 -3454
1842c454J074M115l494j188M375j561m089M725J700n049R95L893l036j188M745
$$ -3454 -2380 1735 -1759 -2947 1428 -133 -4222 503 2203 -2846 -1851 2042 -994 -2182 2563
1857B563j918m055M737K375n684J207L725l478p46M671k558l991M814J694n474
$$ 2563 645 -3410 1327 3702 -1982 -775 2950 -528 -1274 3397 839 -3152 1662 3356 -2118
1872b118J553L880m336l92M871l206l588N216Q22n240K196K981m709O93M728m127
$$ -2118 -565 3315 -1021 -1413 3458 252 -3336 1880 2702 -2538 -342 2639 -2070 -1377 3351 -776
1888g76l103N316J08n196K701K255m439J472L853m103k649N301J4m342K427J976
$$ -776 -3879 1437 1545 -3651 -950 1305 -3134 -1662 2191 -1912 -4561 740 754 -3588 -1161 815
1904H15l837J483L876l697k120N054J92l901K754J939m207J637M306m039k460
$$ 815 -3022 -1539 2337 -1360 -3480 1574 1766 -2135 619 2558 -1649 -12 4294 255 -2205
1919b205N150l80m184L128J652n002J613M367m994k000N365j463m014L429K76
$$ -2205 2945 2565 -1619 1509 3161 -1841 -228 4139 -855 -2855 2510 1047 -2967 462 738
1934G38m793K900L464n153j435N290j991l249M073J11m645L511L024m623p95N043
$$ 738 -4055 -1155 2309 -2844 -4279 1011 -980 -4229 -156 -45 -4690 -1179 1845 -2778 -3573 1470
1950A470j514k574L589k02m009L178L341m520p87M586j901k644M046m44m084K902
$$ 1470 -44 -2618 971 769 -3240 -62 3279 -1241 -2028 2558 657 -1987 2059 1615 -2469 433
1966D33L429m959n96M694k383k641M334r45m395L611K735n057M0M234l254j896
$$ 433 3862 -1097 -1693 3001 618 -2023 2311 1366 -3029 582 3317 -1740 -1700 2534 -720 -2616
1982b616M640j471m736M282K285n148N41M015l925q37M574k422l528M629J185
$$ -2616 2024 553 -4183 99 2384 -2764 -2223 1792 -2133 -2970 1604 -818 -4346 283 1468
1997A468m638J419L097l364k87M411k494l030M543R90l964J265L214l240k08M231
$$ 1468 -3170 -1751 1346 -2018 -2305 2106 -388 -3418 1125 2115 -1849 -584 2630 -610 -818 3413
2013C413k213l022M193J076m558J479K917l625j68M132l026l186M451N29m691
$$ 3413 1200 -1822 2371 3447 -1111 368 3285 -340 -508 3624 598 -2588 1863 2392 -2299
2028b299J699K799m230J54M181l202l101M884K58m725K785K077m290J289M372
$$ -2299 -600 2199 -2031 -1877 2304 -898 -3999 885 1143 -3582 -797 1280 -3010 -1721 2651
2043B651l970k092M890m1m036L022J748m503J975L940l858j797M524o41l047K727
$$ 2651 -1319 -3411 1479 1438 -2598 424 2172 -2331 -356 3584 -274 -2071 2453 1812 -1235 1492
2059A492P92l842J634L452l902j615M393r31l337L138O69l991J925L227l737j715
$$ 1492 2284 -1558 76 3528 -374 -1989 2404 1473 -1864 1274 1943 -2048 -123 3104 -633 -2348
2075b348M304p38l300L088P70m312K112L775m667j291M514j410l218L973r8m570
$$ -2348 1956 1218 -2082 1006 1776 -2536 -424 3351 -1316 -2607 1907 497 -2721 1252 1154 -3416
2091c416L076L121m565q88M859k326k639M361m16m197L271K735m366k22M174k232
$$ -3416 -340 2781 -1784 -2672 2187 -139 -2778 1583 1167 -3030 241 2976 -1390 -1612 2562 330
2107C30j997M083j037l702L442K367m318j00L757k492j728L830j120l973K909
$$ 330 -1667 2416 1379 -2323 1119 3486 -832 -932 2825 333 -1395 2435 1315 -2658 251
2122B51K519m435k21L509k354k034M266j464l735L293K068m305N11L795k709j289
$$ 251 2770 -1665 -1886 1623 -731 -2765 1501 37 -3698 -405 1663 -2642 -2131 1664 -1045 -2334
2138b334M059j540l635M074J913m801J538L406l678m71M404k404l337M463N94
$$ -2334 1725 185 -3450 624 2537 -2264 -726 2680 -998 -1469 2935 531 -2806 1657 2251
2153B251m428J797K708m001N93L648k746k750L936M93l751J769K056l444N18L275
$$ 2251 -2177 -380 2328 -1673 -1080 2568 -178 -2928 1008 1501 -2250 -481 1575 -1869 -1351 1924
2169A924k485k368L899K71l324J542J951k937j42M095k729k433L652P89m026K224
$$ 1924 -561 -2929 970 1241 -2083 -541 1410 -1527 -1669 2426 -303 -2736 916 1705 -2321 -97
2185i7K004l646L83L838l026k346M104k3l846K827J681m249J455L695l270j856
$$ -97 1907 -1739 -1356 2482 -544 -2890 1214 1191 -2655 172 1853 -2396 -941 2754 -516 -2372
2201b372M382q27l168L086P71m004J849L479l838j139L643j386k350K728M91l602
$$ -2372 2010 1183 -1985 1101 1872 -2132 -283 3196 -642 -1781 1862 476 -1874 854 1345 -2257
2217b257J402L060l402j117L545j299k461K834K93l286J949K821l249j303L757
$$ -2257 -855 2205 -1197 -2314 1231 -68 -2529 305 598 -2688 -739 2082 -1167 -2470 1287
2232A287j242k042K978L48l483K080K909l408r06L901j636k270L835m80l761K530
$$ 1287 45 -1997 981 1329 -2154 -74 2835 -573 -1479 2422 786 -1484 2351 1871 -1890 640
2248F40K481l877j49L514k327k012L406n87l641K906K007l975N16K770k690r86
$$ 640 3121 -756 -905 2609 282 -1730 1676 1089 -2552 354 2361 -1614 -1098 1672 -1018 -2004
2264b004L574j250l309L186J670l627P00K666k461p17L518j304k766K924J306
$$ -2004 1570 320 -2989 197 1867 -1760 -1060 1606 -855 -1572 1946 642 -2124 800 2106
2279B106l256N42K683k484q37L467j299k961L034J231l566J095K727k720o49L452
$$ 2106 -1150 -608 2075 -409 -1246 2221 922 -2039 995 2226 -1340 -245 2482 -238 -887 2565
2295B565k067k620L368Q46l397J418J939k805k93L689k041k619L391K77l392J725
$$ 2565 498 -2122 1246 2092 -1305 113 2052 -753 -1046 2643 602 -2017 1374 1651 -1741 -16
2311a6J745l381N74L106k495j802L335j04k940J511J369k777L75L135k174j854
$$ -16 1729 -1652 -1078 2028 -467 -2269 1066 962 -1978 -467 902 -1875 -1500 1635 -539 -2393
2327b393L309K91l012J854J571k750N75L144k267j949L413N9k871J801J424l077
$$ -2393 916 1207 -1805 49 1620 -1130 -555 2589 322 -1627 1786 1845 -1026 775 2199 -878
2343h78O95L042k526j735L057n74k745K473R63l887J550K586l188r47L264j262
$$ -878 -183 2859 333 -1402 1655 1081 -1664 809 1772 -2115 -565 2021 -1167 -2114 1150 -112
2359a12k341L023k2l252J871K748l444m69L222j499j811K936J13l152J826K340
$$ -112 -2453 570 548 -2704 -833 1915 -1529 -1998 1224 -275 -2086 850 963 -2189 -363 1977
2375A977k776n60K919j509j525K802j05l028J727K257k774k65K590j621j541K963
$$ 1977 -799 -1359 1560 51 -1474 1328 1223 -1805 -78 2179 -595 -860 1730 109 -1432 1531
2391A531j95l175J685K251k776l69K650j418j700L028n03l144K518J599l280J74
$$ 1531 1336 -1839 -154 2097 -679 -1048 1602 184 -1516 1512 1009 -2135 383 1982 -1298 -1124
2407a124K673k123j339L284j217k869K787J134l030P11K320k566n00K842j168
$$ -1124 1549 -574 -1913 1371 154 -2715 72 1206 -1824 -1113 1207 -1359 -1859 983 -185
2422a85k395K737J090k674N13K418k407j37K837j228k224K569Q95k524R94J773
$$ -185 -2580 157 1247 -1427 -914 1504 -903 -1040 1797 569 -1655 914 1809 -715 279 2052
2438B052k502j28K768j384k251K429P80k993J146J580k487k70L038k060j948K614
$$ 2052 -450 -578 2190 806 -1445 984 1764 -1229 -83 1497 -990 -1260 1778 -282 -2230 384
2454C84O05k948J598J434k571K4K922j829j916K761L60k613J752J523l023O88
$$ 384 989 -1959 -361 1073 -1498 -1474 1448 -381 -2297 464 824 -1789 -37 1486 -1537 -849
2470h49L082k360j595L011l21k457K086J014k875R34K529k242j421K795l10k053
$$ -849 2233 -127 -1722 1289 968 -1489 597 1611 -1264 -330 2199 -43 -1464 1331 1021 -1032
2486a032J775O75k729R15K542k259j089K575m99j977J915O55k663Q63K552k283
$$ -1032 743 1418 -1311 -396 2146 -113 -1202 1373 874 -1103 812 1467 -1196 -333 2219 -64
2502f4j477L029p87k233K271L91k684J380K054k419j084K727j228j581K374J72
$$ -64 -1541 1488 701 -1532 739 1130 -1554 -174 1880 -539 -1623 1104 -124 -1705 669 841
2518H41k802J717J912k404n16K498j377j280K888j04k793J777J930k567l57K418
$$ 841 -1961 -244 1668 -736 -1252 1246 -131 -1411 1477 1373 -1420 357 2287 -280 -637 1781
2534A781j550o82J538l2k301J568J002k649R73J769j679j507L204p15k787K130
$$ 1781 231 -451 1087 1055 -1246 322 1324 -1325 -352 1417 -262 -1769 1435 720 -2067 63
2550F3J640l055J35K030q96j759K487m29k719K954J242k811N14K111k011j315
$$ 63 1703 -1352 -1217 813 -83 -1842 645 216 -2503 451 1693 -1118 -604 1507 -504 -1819
2566a819K970J90k988K637M28k582R14J297k149l05L555j750j984K015Q4j761
$$ -1819 1151 1341 -1647 990 1418 -1164 -250 1047 -1102 -1407 2148 398 -1586 429 513 -1248
2582a248O67K058k463q1K777j410k161K355M3j850J355P09j568L58J691o35j837
$$ -1248 -581 1477 -986 -1067 1710 300 -1861 494 537 -1313 42 751 -817 -459 1232 597 -1240
2599a240K752n11k171J359P77k119J86K361k026r27K182K1k478J750J275k670
$$ -1240 1512 1001 -1170 189 966 -1153 -967 1394 -632 -1559 623 644 -1834 -84 1191 -1479
2615a479M99K399j514j201K482q46k430K618K73k065J139J713j351j123J914m03
$$ -1479 -980 1419 -95 -1296 1186 340 -2090 528 801 -1264 -125 1588 237 -886 1028 625
2631F25k280K285O14j930N71J872k389l11J867n78j498J674J29k131R45J971j928
$$ 625 -1655 630 1244 -686 -115 1757 -632 -943 924 346 -1152 522 651 -1480 -535 1436 -492
2648d92p67J791p90r64J756K33k113J181J830k132l08K030r58j150J841Q6k286
$$ -492 -1259 532 -258 -1222 534 767 -1346 -165 1665 -467 -775 1255 297 -853 988 1074 -1212
2665a212J100J574k326M25J866j633j143K273q0k403J431J443k501K98J918j576
$$ -1212 -112 1462 -864 -439 1427 -206 -1349 924 844 -1559 -128 1315 -1186 -888 1030 -546
2681e46q87K262o31k147J926J111j690j70J680j403m75K020n91j714J480J154
$$ -546 -1433 829 198 -1949 -23 1088 -602 -772 908 -495 -970 1050 459 -1255 225 1379
2697A379j850L65J452j909j36K109q61j837J617P36j731P03Q85j571J24J789j399
$$ 1379 -471 -106 1346 -563 -699 1410 549 -1288 329 1065 -666 37 922 -649 -525 1264 -135
2714a35j287J898L0j783P45J721k021k20K666j654j266J852N27k082R28J115k022
$$ -135 -1422 476 506 -1277 -532 1189 -832 -1052 1614 -40 -1306 546 1073 -1009 -81 1034 -988
2731i88J98J850q58j424J700K01j862J140Q22j751M96J558j255j206J948k79j234
$$ -988 -790 1060 202 -1222 478 679 -1183 -43 779 -972 -476 1082 -173 -1379 569 290 -944
2748i44J047J002k103N71J992j465j330J945L1j654J636N61j953M31J819j442
$$ -944 103 1105 -998 -427 1565 100 -1230 715 746 -908 728 1289 -664 -233 1586 144
2764A44r16J743k06k008J657N74k181Q07J609j477j237K180p27j292J522M57k123
$$ 144 -772 971 765 -1243 414 988 -1193 -386 1223 -254 -1491 689 -38 -1330 192 649 -1474
2781a474J038J336j372n67K045p33j157J351O25k233J114J338j578m07J922q55
$$ -1474 -436 900 -472 -1039 1006 273 -884 467 1092 -1141 -27 1311 -267 -674 1248 393
2797C93j359J884o8j685J260Q93j636l63J689p11j564J856q4j743J119J073j435
$$ 393 -966 918 850 -835 425 1318 -318 -681 1008 297 -1267 589 505 -1238 -119 954 -481
2814d81j11J584j181j066K241m37j935J175J632j780j67J751j691l11J759m77
$$ -481 -592 992 -189 -1255 986 549 -1386 -211 1421 -359 -526 1225 -466 -777 982 505
2830E05j685J316J075k088N76J481j641n19J887m20j818J538O63j536M89J044
$$ 505 -1180 136 1211 -877 -301 1180 -461 -980 907 487 -1331 207 870 -666 -177 867
2846H67j306m31J969p75j398J550O68j807P50R31j336j05J792r66j549J560J17
$$ 867 -439 -870 1099 324 -1074 476 1144 -663 87 1018 -318 -423 1369 403 -1146 414 531
2863E31j390Q96P57j499k44J929r63j351J547L08j534P59Q89j577J88J748r66
$$ 531 -859 37 794 -705 -949 980 17 -1334 213 521 -1013 -254 635 -942 -754 994 28
2880B8j385J881J90j710J329P12j695K19J499j048r73J757o0j589J247M02j313
$$ 28 -1357 524 714 -996 333 1045 -650 -431 1068 20 -953 804 744 -845 402 804 -509
2897e09Q2J550j424n45J354n12j072J400J61j215M35J324j363o42J597o03j060
$$ -509 -427 1123 -301 -846 508 -4 -1076 324 485 -730 -295 1029 -334 -976 621 18 -1042
2914a042J384L62j767Q03J293j294m76J532n03r22J268J62j873Q89J452j429m25
$$ -1042 342 704 -1063 -260 1033 -261 -737 795 292 -630 638 800 -1073 -184 1268 -161 -586
2931e86J434j047r11J578J39j758Q00J204j277l25J623j200o03J572k61j636J442
$$ -586 848 -199 -1110 468 607 -1151 -351 853 -424 -749 874 -326 -929 643 382 -1254 188
2948A88P03j450J81J230j035q43J666j8j274O29J167j590OJ103j090k27J258m17
$$ 188 891 -559 -378 852 -183 -1026 640 622 -652 -23 1144 -446 -440 663 -427 -654 604 187
2966A87j199J048O80j308N4J403j208m02J563m88j328J018Q35j471L74J070j114
$$ 187 -1012 36 716 -592 -538 865 -343 -745 818 330 -998 20 855 -616 -242 828 -286
2983b86m23J698n26j216J254M14j316M43J222j653k49J525n52j559J465L17j241
$$ -286 -709 989 463 -753 501 915 -401 42 1264 -389 -638 887 335 -1224 241 558 -683
3000f83N71O43j131j07J438o67j357J428K89r98N26J074j848M15J587j005j116
$$ -683 -112 531 -600 -707 731 64 -1293 135 424 -574 -48 1026 -822 -407 1180 175 -941
3017i41J547L43j542R23M35j049j0J440r78o48J069j78q85N79P46j567M14J115
$$ -941 606 949 -593 330 765 -284 -294 1146 168 -480 589 411 -474 105 851 -716 -302 813
3035H13j001o92J314k19q63Q72M95j595L60J556j187p25J513n41p33P02O52j400
$$ 813 -188 -880 434 215 -648 224 719 -876 -516 1040 -147 -872 641 100 -633 69 721 -679
3053f79M56J160j022p54J622m63j211J326J59j447O86J136j281m90J564p37r54
$$ -679 -223 937 -85 -839 783 320 -891 435 594 -853 -167 969 -312 -802 762 25 -929
3070i29J601l66j288P81J105j198r3J116p63o20J278K23j455O57O59r53k39Q97
$$ -929 672 306 -982 -201 904 -294 -387 729 -34 -654 624 847 -608 49 708 -245 -484 413
3088D13m90q02J498k4j620R99Q05j299k63J201p39o39J306j22j429R63P38j197
$$ 413 -77 -879 619 595 -1025 -26 779 -520 -783 418 -321 -960 346 224 -1205 -242 496 -701
3106g01k4J359q55m20J614m04j295J059O94j602M83J112j278k88J436o84j221
$$ -701 -725 634 -221 -641 973 569 -726 333 1027 -575 -92 1020 -258 -546 890 206 -1015
3123a015J316J45r92L51O19q56m46J517o20j179J114K78j112N26Q09j038j40J212
$$ -1015 301 446 -546 -195 424 -432 -878 639 19 -1160 -46 232 -880 -354 455 -583 -723 489
3141D89m78r71J062M28j274M50J161j475l0J599q68r66J387K10j474R26N37j037
$$ 489 11 -960 102 530 -744 -294 867 -608 -638 961 93 -873 514 724 -750 176 713 -324
3159c24k47J210n69j035J178K26j194Q18O06j578N52J131r56q45J609j68j061
$$ -324 -571 639 70 -965 213 439 -755 63 669 -909 -357 774 -182 -1027 582 414 -647
3176f47P08O79j132j70J490q54o57R38J60j164R94L76j207j07J183q34n93J446
$$ -647 61 740 -392 -562 928 74 -583 355 515 -649 345 721 -486 -593 590 -244 -837 609
3194F09l56j398J263N92j416L47J234j051p82J381l43j164J435M35j414N58J088
$$ 609 253 -1145 118 710 -706 -359 875 -176 -958 423 80 -1084 351 786 -628 -70 1018
3211A018j350OJ073o07q57J300L18j492N71P84j027l36J067n65o59J103N6j126
$$ 1018 -332 -326 747 140 -717 583 901 -591 -20 764 -263 -599 468 -97 -756 347 403 -723
3229g23Q45M77q27l28J069o02m39P83J52j094O34R55j146j22J099m57q46J258
$$ -723 122 599 -228 -556 513 -89 -528 255 407 -687 -53 902 -244 -366 733 276 -570 688
3247F88j14j100Q33M41r05o1R81q63p69J533k27j268R10O19j423O63O26j005k75
$$ 688 574 -526 307 748 -157 -218 763 -100 -869 664 437 -831 79 698 -725 -62 564 -441 -716
3266g16J184n06q69J134K04r63M30Q71j051k69J270m31p64R66m4r69L83J095j041
$$ -716 468 -38 -907 227 431 -532 -102 769 -282 -551 719 288 -476 490 446 -523 -140 955 -86
3285h6k73P82j07j185R78L56j164L29J228j106l42J208n50p76J199k63q37O38
$$ -86 -359 423 316 -869 109 465 -699 -370 858 -248 -590 618 68 -708 491 228 -609 29
3303B9Q38j311K38R83n67o69J053j12r98O16M61q42n8J210q29p24J117k74p61
$$ 29 867 -444 -206 777 210 -459 594 482 -516 100 561 -281 -339 871 42 -682 435 161 -600
3322f00P25K50j006J37J221j069l03J015j79r73Q21M73j229M41J001p76l32J030
$$ -600 125 375 -631 -494 727 -342 -645 370 191 -782 39 512 -717 -276 725 -51 -383 647
3340F47m52m21O68N65j706N20J036p49n91J219o91q38J059L09j374M30R20j038
$$ 647 195 -226 442 1007 -699 -179 857 108 -483 736 45 -793 266 575 -799 -369 551 -487
3358d87j37R26m96n68Q35L78j285N07J022j041j79J028m16o30J190j78j157Q51
$$ -487 -624 302 -194 -762 73 451 -834 -327 695 -346 -525 503 87 -543 647 469 -688 163
3376A63L98o97j86R81m90n37R13j56q99N95O22j250N03M50p04j90J014M1j325
$$ 163 561 -136 -322 659 169 -368 545 389 -510 85 707 -543 -40 410 -294 -484 530 571 -754
3395g54P92O01r64Q2R24q61l70R29K1j122N64P35j013J03J259j066k43P68o4r48
$$ -754 38 639 -325 -243 681 -180 -550 379 400 -722 -158 577 -436 -333 926 -140 -383 385 321 -627
3415f27O51L95j042J36R86q19k80J310o14p49O82M46j043N05P47q26k92J129n87
$$ -627 24 419 -623 -487 499 -320 -600 710 96 -653 29 475 -568 -63 684 -142 -434 695 108
3434A08m05P64p5n45J19Q75j194N7J027n59n72P82k9o88N80J04p06k68J181n93
$$ 108 -297 467 392 -153 -34 841 -353 -296 731 172 -400 382 353 -335 245 349 -357 -625 556 -37
3454c7k68M26j05q86N72Q92r67r3J113p45l89N21L17q15O50L69r74J56P95m18
$$ -37 -305 121 16 -870 -298 594 -373 -466 647 -98 -487 34 351 -464 186 555 -419 -263 532 114
3474A14o42J089m49o99R74M42j211J37J012r50l19R78m73o07Q67M40j351L92Q11
$$ 114 -528 561 112 -587 387 829 -382 -245 767 -183 -502 476 3 -604 263 703 -648 -256 555
3493E55m92l24Q56n18m99O24K63r45L63N07o29R7O94n15p51J007J48q38L52O95
$$ 555 63 -261 595 77 -422 202 465 -480 -117 390 -239 -142 552 37 -714 293 441 -397 -45 650
3513F50j033O7O84k75r02J090p6j043O50P21j027J99Q36n42n44O52L25p67L00
$$ 650 -383 -316 368 93 -809 281 205 -838 -188 533 -494 -295 541 -1 -545 107 432 -335 -35
3532c5M77o87J35P72n08k22O67k03r42Q84K16q54k9R54j057m2R16l96n08L79K99
$$ -35 442 -245 -110 662 154 -68 599 396 -546 338 554 -300 -329 625 -432 -474 442 46 -462 -83 216
3553B16p36J77Q04q38k30J089m20p00M94L26m92L30N13q01l29J149j88q09P37
$$ 216 -520 -343 461 -377 -607 482 62 -638 -144 182 -310 20 533 -268 -597 552 364 -445 292
3572B92K30p46J34M96m45m92R79k01r89J018Rj051O36P96r97j12J192p42q75J019
$$ 292 522 -224 -90 406 -39 -531 448 247 -742 276 285 -766 -130 666 -331 -443 749 7 -868 151
3592A51j72m64P40J31o45m9P89n87l65R12l40n65O73L10r79K84P69q33j10O07
$$ 151 -21 -485 255 386 -259 -308 481 -106 -471 441 101 -464 209 519 -460 -176 593 -240 -350 257
3612B57j6q05N26M21p29l2P86m89n33Q56l18l16M72L33q46L76N75n90j64O37q3
$$ 257 241 -564 -38 383 -346 -378 408 -81 -614 242 -76 -392 80 413 -433 -57 518 -72 -236 401 318
3633C18n16N15K42j068N04O25p18k37P35k89p78Q42K3r15O49O23q86q3P49n41
$$ 318 -198 317 559 -509 -5 620 -98 -335 400 111 -667 175 198 -717 -68 555 -331 -414 335 -206
3653b06l22N78J43o36L19L58m85J57L00k83k76M03K43n24K63N64o87l23J174p56
$$ -206 -528 50 193 -443 -124 234 -251 -94 206 -77 -353 50 293 -231 32 596 -91 -414 760 4
3673Dl49P65j71p69M36J17l20%M91n26k08P58j4n72K94M90j022M19M47l08m89
$$ 4 -345 420 249 -520 -84 33 -287 -287 204 -322 -530 228 214 -358 -64 426 -596 -177 270 -38 -527
3694e27Q42m6o68N82J95p07L47N57o54j10O10m17l43N14J73p11N42J44p86JQ40
$$ -527 315 269 -399 183 378 -329 18 575 -79 -189 421 4 -339 175 348 -363 179 323 -463 -462 378
3715C78j87n94N76N7o94L73N87n80j32Q88n62l45K93J41n73N51K48o89N6Q34n01
$$ 378 191 -403 173 230 -464 -91 496 -84 -216 672 110 -235 58 199 -374 177 425 -264 -208 626 125
3736A25o07O79J49q17O35J85p19j06Q51m17o08O90j07l01L27L44q51L82O57n88
$$ 125 -482 197 346 -471 164 349 -370 -476 375 -42 -650 40 -67 -368 -41 303 -548 -166 491 -97
3756i7j81M08J11m70N17K18p70J58N85n36M2M53r8l17K37Np67O68L6n19j33P57
$$ -97 -278 130 241 -229 288 506 -264 -106 479 -57 -15 438 340 23 260 265 -502 166 202 -317 -450 307
3778C07l47l68L50L76p39R5N98m95k26Q65n43n09R60m5l73J35M59o62j18N57k10
$$ 307 -40 -408 -58 318 -421 -326 272 -223 -449 416 -127 -636 324 279 -94 41 500 -162 -280 277 67
3799F7l65O71r8o10J21M51n67N7Q25m70l55N90j78o76M65M72q50L66L35l66k35
$$ 67 -298 373 275 -335 -214 237 -330 -273 552 82 -273 317 139 -537 -72 400 -450 -84 251 -115 -350
3820c50N97J70q90N15L88p30N1M92l33k25N18o1m38M55J65n17L3L72n31k40O65
$$ -350 247 417 -473 42 430 -300 -249 243 -90 -315 203 142 -296 159 324 -193 -160 212 -319 -559 106
3841A06J68p87L74M45o60P7L83k61k36O95j74l81N79j00p70P58J00n30lM81j31
$$ 106 274 -513 -139 306 -354 -277 106 -155 -391 304 130 -251 328 228 -542 216 316 -214 -217 264 133
3862A33n78N07L32q09N81K65n76k34N27n9o15P41j41n12L82M53r07K33O73m06
$$ 133 -445 62 394 -415 166 431 -145 -379 148 89 -526 215 74 -438 -56 397 -510 -277 396 -10
3882a0m08O45K30q61J55P84n79k5M83m96Q4L96P9r22N95M67o95M1M77k35m84O51
$$ -10 -418 227 457 -404 -249 535 -44 -69 414 -82 2 398 477 -445 150 617 -78 -37 440 205 -279 372
3904C72k52n98N15M05q72K59N32m74l18O72m22k56O75P6m72p8N86n43j91O47k56
$$ 372 120 -478 37 442 -430 -171 361 -113 -431 241 -181 -437 238 314 -158 -236 350 -193 -384 263 7
3925Go00P09M0l38J53L27l05k22N86m15k31M71q4p02N81j3j88r3N09j57n26O51
$$ 7 -593 116 156 -182 -29 298 -7 -229 357 -58 -289 182 98 -604 -23 -36 -224 -317 192 35 -491 160
3947A60K47p21L22J81j88k47O67l11k34M58j31q52O79M68o36j11P16q21Q0M75
$$ 160 407 -314 8 189 1 -246 421 110 -124 334 203 -649 30 498 -138 -249 467 -354 -274 201
3967B01l15k16K91J76l35R4L91k35n39R85m91l23M68K07o92L71K32k95m57O99
$$ 201 -114 -330 -39 137 -198 -104 287 52 -487 498 7 -316 152 359 -333 38 270 -25 -482 217
3987B17l6m50N07J31p04L54N23o02j86O76m21k97M45l4p90Q59L8l23k84O58k36
$$ 217 181 -269 238 369 -335 19 542 -60 -246 430 9 -288 157 123 -667 192 230 -93 -377 281 45
4008D5k62K16J65l61M12J62n57j07M48m2n10N03J01n40K57M66l27l27O20l69r9
$$ 45 -217 -1 164 -197 215 377 -180 -287 161 119 -391 112 213 -327 -70 396 69 -258 362 -7 -106
4029a06J40p2k47L70K31k93n9K53j65k70K81K2m10K70J74m77K94L27l13m1J42
$$ -106 34 -38 -285 85 316 23 -36 217 52 -218 63 85 -325 -55 119 -358 -64 263 -50 -91 51
4050E1J6m54P01K49q80l3O54k62k41L65n6m53N19o3n22K01M22m01m8L55l28l38
$$ 51 67 -387 314 563 -317 -350 304 42 -199 166 110 -343 176 113 -409 -208 214 -187 -235 120 -208 -546
4072e46N85Q3n07K41M30o63L85K58l40j62M08r8l23L70K70m95J27J60l03k23L72
$$ -546 39 122 -385 -144 286 -377 8 266 -74 -236 172 74 -249 121 391 -104 23 183 -120 -343 29
4093B9L45o91M85J46o07j7M72k19l64K56K51m49K34K69k53q6O15n84k30P48l15
$$ 29 374 -317 168 314 -293 -310 162 -57 -421 -165 86 -363 -129 140 -113 -199 416 -168 -398 350 35
4114C5l85M46J96l90J10L86m57j90J77M57o74M20J45m50n7N18k02m40O17k93k10
$$ 35 -350 96 292 -98 12 398 -59 -249 -72 385 -289 131 276 -174 -231 287 85 -355 262 -31 -241
4135b41M09J8m00R1L48l17m9J99J7m05L21K03m93J60M47m13j66N86m60j16N14
$$ -241 168 186 -214 -123 225 -92 -141 58 75 -330 -9 194 -299 -139 308 -105 -271 315 -145 -261 253
4156B53J15o78M06M12o43m20P70k65l06K52L33m43N4L39n38L72L12n14j5L99o
$$ 253 368 -310 96 508 -135 -555 215 -50 -356 -104 229 -214 -160 179 -359 13 325 -189 -204 195 189
4177A89m18K89L3l27M33J89m94k13N49j6j65J71K2l84mK22N2l57K83K36p19L02
$$ 189 -229 60 93 -234 199 388 -106 -319 230 214 49 220 242 -142 -146 76 128 -229 54 290 -429 -127
4199a27L56n44L28L40n82Q3J38J46m82N81m2l75Q4M97n24m8L75j13l92M25P2m54
$$ -127 229 -315 13 353 -229 -146 -8 138 -344 237 195 -180 -96 401 -123 -171 204 91 -301 124 196 -258
4221b58L20J05k45J44K99j79m81M06J06o12J54N27m92J1K24j86q3K26K50l95q4
$$ -258 62 167 -78 66 365 186 -295 111 217 -395 -241 286 -206 -195 29 -157 -240 -14 236 -159 -243
4242b43N77l43k42M70k16j83K92M3l95J40M24o04J34M52k68m32N62j37k67N0M73
$$ -243 334 -9 -251 219 3 -180 112 155 -240 -100 324 -280 -146 306 38 -394 168 31 -236 -186 287
4263B87n55K5L86j79j53L03O0l72K25M64n25jM72l17j73J42J43l08K45J89p26
$$ 287 -268 -243 143 -36 -189 114 174 -198 27 491 -34 -35 437 120 -53 89 232 -76 169 358 -368
4284c68L13M59l87k91M87k41k99K96K05l96J55L12k07j76K67r2k93L34K50n43
$$ -368 -55 404 17 -274 213 -28 -327 -31 174 -222 -67 245 38 -138 129 37 -256 78 328 -215
4304b15K42J58m31K58N1ql21K93K5l20M25K50o18l1P47m92o0K92k03l27L76L10
$$ -215 27 185 -246 12 63 55 -266 27 52 -268 157 407 -211 -242 505 13 -47 245 42 -285 91 401
4326D01o45lM01j59k40Q9L19n89K63M88n61K14L13l57j32L16j01j98L25J09m47
$$ 401 -244 -247 154 -5 -245 -156 163 -426 -163 325 -236 -22 291 -66 -198 118 17 -181 144 253 -194
4347a94L13J2k36j20L96j01n80P11l4m25K42K31l62k2M42k35k73L41m3k2l2J06
$$ -194 119 131 -105 -225 171 70 -510 201 167 -258 -16 215 -147 -169 273 38 -235 106 63 41 9 115
4369A15o9k66M69j41n04O63J14n08J65L34m90K44Q4k99o6M22j38l48K83P1l78
$$ 115 46 -220 249 108 -396 267 381 -127 38 372 -118 126 210 -89 -155 267 129 -219 64 135 -243
4390b43q5N41k86k31L35N8k10J09J86k83R1K13l50O4OJ52k36J11K68l65j27P19
$$ -243 -328 213 -73 -304 31 89 -121 -12 174 -109 -18 195 -155 -91 -85 67 -169 -58 210 -155 -282 437
4412D37m76P7j33K98k68Q5L47l56J40J83l42l04N94j81m08M90O2n18K12L01k26
$$ 437 -39 38 -95 203 -65 20 367 11 151 334 -8 -312 282 101 -307 183 245 -273 -61 240 14
4433A4n45P21o4l97L70O9l31L20K16n85J55K14j17l05N27J4k43oJ57k80j69M80
$$ 14 -531 190 126 -271 99 168 -163 157 373 -212 -57 157 40 -265 262 276 33 27 184 -96 -265 215
4455B15k20k10N53j68m74K85K7j12Q8m6Qk21K93O5k76N66l2n20J15L87n90k19
$$ 215 -5 -215 338 170 -304 -19 8 -104 -16 -62 -54 -275 18 83 -193 373 341 -179 -64 323 -267 -486
4477d86P45k07j22J45P9k24n9L75k27j70J75Kj78Q3Jr3K2K60l02P9L60k42n6K51
$$ -486 259 52 -70 75 154 -70 -129 246 19 -151 24 26 -152 -69 -68 -161 -139 121 -181 -102 258 16 -40 211
4501B11j67k27Q2J88j54j18L78k09r2J41%k36N01j88p2r3J66j21j83N29k97j36
$$ 211 44 -183 -101 87 -67 -185 193 -16 -108 33 33 -203 298 110 38 -55 111 -10 -193 336 39 -97
4523i7M9J78l42J40J24K2m37N86l56j05J69K08j41q2L06l49L1n6K06k11O9J00
$$ -97 -48 130 -212 -72 52 74 -363 223 -133 -238 -69 139 -2 -84 222 -127 -96 -152 54 -157 -88 12
4545A2m08L17J1j6j96M77r8j82k3L38k16j15L17k08k03J92K7k71K35J14m22L10
$$ 12 -396 -79 -68 -84 -280 197 99 -83 -106 232 16 -99 218 10 -193 -1 26 -245 -10 104 -318 -8
4567hJ23k22M5R6J90l56K70P2j89j83K35K06m09K43J2n69L53K38m18J28K60L3
$$ -8 115 -107 -62 34 224 -132 138 210 21 -162 73 279 -130 113 125 -444 -91 147 -271 -143 117 150
4589A50l54L34J81l99L37j66k66K33K17l28K46m4j03j29J86K5l22K02K40j67m21
$$ 150 -204 130 311 -88 249 83 -183 50 267 -61 185 141 38 -91 95 120 -202 0 240 73 -348
4610c48N95l06m5L46k39j57k9M52n11l8L68l2l08M96k92PJ05K59k76R1p7M5j43
$$ -348 247 -59 -104 242 3 -154 -183 269 -242 -280 88 56 -252 244 -48 -41 64 323 47 138 61 106 -37
4633c7J04J95k91J20J14n4k79L36l22J86J40l60j5KK47m56K75M20k92j52K97k10
$$ -37 67 262 -29 91 205 151 -128 208 -114 72 212 -148 -163 -161 86 -370 -95 325 33 -119 178 -32
4655c2k16J49J14j58j41L10j18j56M68l18J86J13l79K3M2L10k27j48K27l6p6J7
$$ -32 -248 -99 15 -143 -284 26 -92 -248 220 -98 88 201 -178 -155 -113 197 -30 -178 49 13 -63 -46
4677d6J41n3N6k32O3R2J71l83j21L69rk54J35J57j04o2N08m80j49J61j22r4K79
$$ -46 95 42 98 -134 -71 21 192 -191 -312 57 48 -206 -71 86 -18 -80 428 -52 -201 -40 -162 -256 23
4700B3L86o74J70J95k21r2M61k13nm6M8p0k2J80j78l53K73J32l77L91K02l71J90
$$ 23 409 -265 -95 100 -121 -213 248 35 30 -16 32 -38 -60 120 -58 -411 -138 -6 -383 8 210 -161 29
4723B9K68l44j53K57j4r2K95J0l00O8J68j57k30N41l18j93J80Jk8J05J21l09k69
$$ 29 297 -47 -200 57 43 -49 246 256 -44 24 192 35 -195 346 28 -165 15 16 -12 93 214 -95 -364
4746c64M20j59J5J16Q5k25J15J63k47p9L15m60K71J33J48m19J14L51k93pK92k23
$$ -364 56 -103 -88 28 113 -112 3 166 -81 -160 155 -305 -34 99 247 -172 -58 293 0 -7 285 62
4768F2j66m2M85m57J97J39k46K26j33l1k57N48m72o6K49j40R9k7J09j91k44L57
$$ 62 -104 -146 339 -118 79 218 -28 198 65 34 -223 325 -147 -213 36 -104 -5 -32 77 -114 -358 -1
4790aK03m11J19L8R4k43J00J43r7J45J98k91L88j45n38J75L37l10j42K17n0j33
$$ -1 202 -209 -90 -52 42 -201 -101 42 -55 90 288 -3 385 240 -298 -123 214 -96 -238 -21 -71 -204
4812b04J47Q7j59J51P6l31K34m3R1k17J49O7k64J52J54k35n9L90k3m71O05k96
$$ -204 -57 30 -129 22 98 -233 1 -42 49 -168 -19 48 -216 -64 90 -145 -204 186 163 -308 297 1
4834Aq9J08Q1k48j35L20l61K60N2J4j51L5M31k16k10J40J1n8J39l22j14L74L51
$$ 1 -88 20 101 -147 -282 38 -323 -63 -11 3 -148 -113 318 102 -108 32 43 -15 124 -198 -312 62 413
4857D13n55J97N3k35l0%R7k00K40J28l84L39R7j21k30M90k62j30N6J01j48K04
$$ 413 -142 55 108 -127 -157 -157 -60 -260 -20 108 -276 63 160 39 -191 299 37 -93 -37 64 -84 120
4879A20J00l75K51J23p9k39J46j1k90j25N88k67k30P32l00k23k2K44j84j18K47
$$ 120 220 -155 96 219 140 -99 47 36 -254 -379 209 -58 -288 444 144 -79 -101 143 -41 -159 88
4900H8k70L5K07k07j2R8K12k99j06M04k72K55J64j36j35J07j15l41L80ok22J54
$$ 88 -182 -147 60 -147 -159 -61 151 -148 -254 150 -122 133 297 161 26 133 18 -323 57 51 -171 -17
4922a7J83M7l28O4M6R4P2j2l0r9K59k63l09M25O3l05K03K33n04M9J28K44k18j76
$$ -17 166 213 -115 -51 -5 89 161 149 119 20 279 16 -293 132 195 -110 93 326 -178 -129 -1 243 25 -151
4946a51K67k38q2K04j93J84J45l22K81O6j5m45N45l55J4Q0J35j36l67O33j47l36
$$ -151 116 -122 -204 0 -193 -9 136 -186 95 161 146 -299 246 -109 -95 -15 120 -16 -383 250 103 -233
4968b33J95J61l35K36r9K65k64j8j47J64N5kj39Q6K19j40k19J55J57j39K71o0
$$ -233 -38 123 -212 24 -75 190 -74 -92 -239 -75 -20 -22 -161 -75 144 4 -215 -60 97 -42 229 169
4990A69l04J25J59j89R9r7J4r2J21Q2l92N21j31m73K25K07j32J35Q5M9m09J80
$$ 169 -135 -10 149 -40 59 -38 -24 -116 5 87 -305 216 85 -388 -163 44 -88 47 132 181 -228 -48
5012d8J9k52P0L07k74J19Q6r7j49M65j53j66K25r4k0j28K86l80j0K14Nl59K86
$$ -48 -29 -281 -211 96 -178 -59 27 -70 -219 246 93 -73 152 58 38 -90 196 -184 -194 20 25 -334 -48
5035d8K2O8j84J77R4K2j57k9m3o5M14l14j32J75K54q2k01J60j21J58j16j65L99
$$ -48 -26 42 -142 35 129 151 -6 -35 -78 -143 271 -43 -175 0 254 172 -29 131 10 168 52 -113 286
5058B86k51j91J99LL8k11K79j93%J47nn7k44K07J5k59M84j16l34J95M02l52o0
$$ 286 35 -156 43 46 84 -127 152 -41 -41 106 101 44 -200 7 22 -237 247 131 -203 -8 394 42 -18
5081a8N9J81k12J7O4k78P7K66K44n97N18j80m4j52K10j52j03J63M1k84J38L3j26
$$ -18 41 222 10 27 91 -187 -110 156 400 -197 321 141 97 -55 155 3 -100 63 104 -180 -42 -9 -135
5104a35J23n8k59K64L89k19j31k5K37j16j5K8j67K8R2j83J05J27j08R4l4q6m0
$$ -135 -12 -70 -329 -65 324 105 -26 -51 186 70 55 83 -84 -56 36 -147 -42 85 -23 71 37 -49 -89
5127h9M8J37K6k92L90m45p9J30M82n17K26k12J38m2K14Q9k30L10l85rJ34j2k60
$$ -89 -41 96 122 -170 220 -225 -304 -174 308 -209 17 -195 -57 -99 115 204 -26 284 -101 -110 24 12 -248
5150b48J70j5J46j67M27k54k40M95k44Q0k77J80O5q1K6j7j13j87K89j54R5J48
$$ -248 -78 -93 53 -114 313 59 -181 314 70 150 -127 53 118 37 63 46 -67 -254 35 -119 -24 124
5172A24k16M8J29Q7j48L4l2j04K18n6j22J11J15j8l03L14p5k94J94P9K96m30K53
$$ 124 -92 -44 85 172 24 58 26 -78 140 84 -38 73 188 170 -133 181 106 -188 6 85 381 -49 204
5195B04j15j3q5J05j37k99M51p9n1r2K36k45J72M4k3j32K02k90j95M74l78Q2M51
$$ 204 89 76 -9 96 -41 -340 111 32 -19 -111 125 -120 52 96 73 -59 143 -147 -342 132 -246 -164 287
5218B87k71k15N20k31j04j64K36P2l66L04J4j55J08R2m0l83K78k03J66K93r9k09
$$ 287 16 -199 321 90 -14 -178 58 130 -236 68 82 -73 35 127 87 -296 -18 -221 -55 238 139 -70
5240g0J49K5j61o3%p1K26J76j96k38L40j11p1j05L83k91J61R7j17q7J67j06j15
$$ -70 79 104 -57 -120 -120 -191 35 211 15 -223 117 6 -65 -170 213 -78 83 180 63 -24 143 37 -78
5263g8J80r8j67P4L07j1l55j13M06m07J78L44m30J54J2J24j98m3J36Nn8K50q1
$$ -78 102 4 -163 -89 218 207 -148 -261 145 -262 -84 260 -170 -16 -4 120 -78 -121 15 20 -38 212 131
5286A31o5l4J35j89r7K54l92L42j84r5J11J76k68or5L00k62K31L6j64PL21l44
$$ 131 66 32 167 -22 -119 135 -257 85 -99 -194 -83 93 -175 -181 -276 24 -238 -7 29 -135 -128 193 -151
5309a51K61J35j02j97J84n9r9j54N99l25l68M77p0j72J46K7k10O6K98l25R7K42
$$ -151 110 245 143 -54 130 71 -28 -182 417 92 -276 201 131 -41 105 132 -78 -12 286 -39 58 300
5331C00o05K06M97k19l50J06j6K05k26L17l48M6J78nj30J44k8o1J31J48k77j56
$$ 300 -305 -99 398 179 -171 -65 -81 124 -102 215 -133 -87 91 86 -44 100 72 11 142 290 13 -143
5353a43J40K42k44%K51k61k4K55k79l0K05l15K33j18O4j22K82J55k22p4R4J98
$$ -143 -3 239 -5 -5 246 -15 -39 216 -63 -93 112 -203 30 -88 -24 -146 136 291 69 -5 89 287
5375B87m24K26r3J74J27r8J48j98R5k14K1p7K17m61J70M84l46k89K75J16l94M29
$$ 287 -137 89 -4 170 297 199 347 149 244 30 51 -26 191 -270 -100 384 38 -251 24 140 -254 175
5397A75k11l5P4L8p6q7L10k73j23K16R7p5q9L37k46R1jr2m3J34m2J06r0J61l42
$$ 175 -36 -71 3 41 -35 -122 188 -85 -208 8 105 30 -59 278 32 123 122 30 -13 121 79 185 95 256 -86
5422h6K0R2k9Pr2JK26j85O4q6r4K03J0n3Q9jk67K63j6p8j99O03n66M1K77j20k65
$$ -86 -66 26 -3 4 -88 -87 139 -46 18 -68 -162 41 51 -2 87 86 -181 82 66 -12 -211 392 -174 -133 144 24 -241
5449b41L35K3k86lJ78J72m39L76K3l32L69j14r7K25k70P4l50L58q2j09K06J36
$$ -241 94 117 -169 -172 6 178 -261 115 138 -194 175 61 -36 189 -81 -7 -357 1 -81 -190 16 152
5471A52j75j01P6O2j56J97J26j63l9P2m1R4Qj02o5N4R3k07K93J71o93O83j3j54
$$ 152 -23 -124 -48 14 -142 55 181 18 -21 51 10 104 112 10 -55 -1 92 -115 178 349 -344 339 326 172
5495A72j08p2J1j41K27J8l39K11m7J16j65K11j23j30L60k87O6j01M53m04l1P6
$$ 172 64 -8 3 -138 89 107 -232 -21 -68 48 -117 94 -29 -159 201 -86 -20 -121 332 -72 -103 -27
5517b7l2J3j4Q6l71N6J60J00j04K18o3j04K17l67L2J54K95k09J5l4o0K14j58R1
$$ -27 -59 -46 -60 26 -345 -289 -129 -29 -133 85 22 -82 135 -232 -200 -46 249 40 55 21 -39 175 17 108
5541A08k0j63K96k36J12J0o3O0j71r5o4L12k96Q8K57j64Q0j72M86m52L0j61K8
$$ 108 88 -75 221 -15 97 107 44 104 -67 -162 -226 86 -210 -122 135 -29 51 -121 365 -87 -57 -218 -190
5564a90K47N8L1l79M74j34r5j94L00M2k93K23j10L7j56L00j62j7J87k15m3N8K66
$$ -190 57 115 146 -233 241 107 12 -182 118 160 -133 90 -20 17 -139 161 -1 -18 169 -46 -89 -31 235
5587B35k58j67M98k34n2K2J02j77J6J37l03O5j13K81j45J53J23k79J89j59l3J26
$$ 235 -23 -190 308 74 22 44 146 -31 -15 122 -181 -116 -229 52 -93 60 183 -96 93 -66 -99 27
5609B7P9l08K20K53k64k56L10j71K5j20M87m13q0K38q9m2j1R6P9j07N7J2J4M4
$$ 27 106 -202 18 271 7 -249 61 -110 -85 -205 282 -131 -211 27 -62 -104 -115 -19 60 -47 10 22 36 80
5633H0j08kk42K97j14J6K37m11r5M91j69k33J80m9Q5k9J56k02m4N7N1P5M1k13
$$ 80 -28 -30 -272 25 -89 -73 164 -247 -342 149 -20 -253 -73 -122 -37 -66 90 -112 -156 -99 -48 27 68 -145
5657a45J84rJ2N0p8J32qk10J40o8J47p69K6P22l72Q9N18j25m91N0L7o8K36n1L35
$$ -145 39 30 42 92 14 146 138 -72 68 0 147 -622 -596 126 -246 -157 361 236 -255 -205 -168 -236 0 -51 284
5682B84M79m00j51n17k1L44J032j923L08O54n55Q28n75mL62j80k71J19L45K16
$$ 284 763 363 212 -305 -326 18 1050 -873 -565 89 -466 362 -213 -217 145 -35 -306 -187 158 374
5702C74J21n69k53M3M80k75M79L57j717O92L24m84K58j99O18p73N21np06Q93q3
$$ 374 495 -74 -327 -284 196 -79 400 757 -960 -268 56 -428 -170 -369 249 -524 -3 -8 -714 179 96
5723I6J82k55k60N9k75N21J69k57k2M9k07j98L06R7J61l75M54k64j54M70k64j19
$$ 96 278 23 -237 -178 -453 68 237 -20 -42 7 -200 -398 -92 5 166 -209 245 -19 -173 297 33 -86
5745h6n45J01O04Q2j26n79K84P80j006R3N72p08N13L77m03k73K15J49L2q62R76
$$ -86 -631 -530 74 156 30 -549 -265 515 -491 -398 174 -534 -21 356 -47 -320 -105 44 76 -786 190
5766A90j64J37j18J3J74j30k47L46k84J99k7j77K41p10j22nP52K18m36j19N72
$$ 190 26 163 45 58 232 102 -145 201 -83 116 89 -88 153 -557 -679 -684 68 286 -150 -269 303
5787C03p21R5J71Q3L04n97o5K50J78L01k98l45R77o66k27j52K66J32K33l60L99
$$ 303 -418 -323 -152 -69 235 -362 -427 -177 1 302 4 -341 636 -30 -257 -409 -143 -11 222 -138 261
5808B61K7n82J28M77L4m87J13n7l8k07P76p22j0K05Q2P3k17J79o8K93j92J79k82
$$ 261 288 -294 -166 311 345 -142 -29 -86 -124 -331 445 -277 -287 -82 0 73 -144 35 -33 260 68 247 -35
5831c5J03j33L18m43J2Q2J18M01q43P69N2p20o7L62M31q24P07nn28J87R1Q2J08
$$ -35 68 -65 253 -190 -178 -96 22 423 -420 349 401 -319 -386 -24 407 -417 290 285 -243 -56 35 117 225
5854B25k15n7q3J28l42J52R15l65k96J04j63N4m61L33l51N11n02J16J39j50M68
$$ 225 10 -47 -130 -2 -344 -192 723 358 62 166 3 57 -404 -71 -422 89 -413 -297 -158 -308 160
5875A60m00L90j78R8k26K70N43p60M07l45j71l1K11N80k87k13j41r2O6L1j54M5
$$ 160 -240 150 -28 70 -156 114 657 -103 304 -41 -212 -243 -32 548 261 48 -93 -185 -119 -88 -242 -197
5897a97ok1K58j02K6j83J47L43k3j06j95L6J00l8j4j15j89J65o6L3M11j07k26
$$ -197 -203 -224 34 -68 -42 -225 -78 265 242 136 -59 -23 77 39 25 -90 -279 -114 -180 -147 264 157 -69
5920f9K00q1j63l52L83j26J75k5P8pj72J82j73P2j9J94j45N1J98n55L20K1J8q
$$ -69 131 50 -113 -465 -82 -208 -33 -58 20 13 -159 23 -150 -78 -97 97 -48 3 201 -354 -34 -13 5 -3
5944cj54K70k81R9M9K6P3m0j97K27p2j48K13J8R4m82J52J08O6p6L2j39J01K00
$$ -3 -157 113 -168 -69 -20 6 79 39 -158 69 -3 -151 62 80 174 -308 -156 -48 18 -58 -26 -165 -64 136
5968A36Q0l54Q1K1k11J61K18L1k00J87m19L27J76M0k90q9q1J07k3J78j10R8j6
$$ 136 216 -138 -57 -36 -247 -86 132 163 -37 150 -269 58 234 274 -16 -105 -186 -79 -102 76 -34 64 48
5991D8o0j3j19L47l99m5M56j64j42J86o8j53L20k61K55j56O3j80n2L62k99j59
$$ 48 -12 -25 -144 203 -196 -241 215 51 -91 95 27 -126 194 -67 188 32 95 -85 -137 225 -74 -233
6013b33K85m9j63K45O1k32O3J7M9l8K64r8j76q1J73j18j44J87j54Q6k81L20j26
$$ -233 52 3 -160 85 146 -86 -23 -6 43 5 269 171 -5 -86 87 -31 -175 12 -142 -56 -337 -17 -143
6036a43J3J47J80n19K40R8k77L28P9k13J37m9o2Pq0K27l10R7J02K02k55J48j5
$$ -143 -130 17 197 -322 -82 16 -261 67 146 -67 70 21 -41 -34 -114 113 -197 -100 2 204 -51 97 82
6059H2q0K09j27k6j38J26k15on8J54J61m05p0M33O1k22K42l01P9K34j79L30l02
$$ 82 2 211 84 58 -80 46 -169 -175 -233 -79 82 -323 -393 40 101 -121 121 -180 -101 133 -46 284 -18
6082a8j8k3P3L9j37QO2J43k19mJ68k24J41k13O4J39Jj1P1M3O2j66k0N9j55Q6q6
$$ -18 -36 -59 14 53 -84 -76 -14 129 -90 -94 74 -150 -9 -222 -158 -19 -18 -29 42 85 147 -19 -39 20 -135 -49 -135
6109a35K5R0R1K9M3R5q5L3p2n5o3R7Rj45L02k66J09k02Q5k12J23J31j07K4J79
$$ -135 -110 -20 71 100 143 238 153 186 114 59 -4 93 102 -43 259 -7 102 -100 -15 -227 -104 27 -80 -56 123
6134A23m01J02L29Rj58j00J00j59J28K04j79p6J55j73J11p5N9J13k53K32j79J
$$ 123 -278 -176 153 162 4 -96 4 -155 -27 177 -2 -78 77 -96 15 -60 -1 112 -141 91 -88 -87
6156h7j04n8J36J38P5k59J14q5N6J27Rk35O6J36K2M3k33P0K4N6k3N05p12J04J55
$$ -87 -191 -249 -113 25 100 -159 -45 -130 -74 53 62 -173 -107 29 51 94 -139 -69 -45 11 -12 493 -219 -115 40
6181D0qO2J05j48n0K56l92k58N02j6j50M5J36p2k54K68J66l60N2L48k89k76J79
$$ 40 32 94 199 51 1 257 -135 -393 109 93 -57 -12 124 52 -202 66 232 -128 -76 272 -17 -293 -114
6204a14J63l1K41k04r3J23Q2j52j7K4K89m07K39O3j29K36j42l13J46L02l53j05
$$ -114 49 18 259 55 -38 85 167 15 -2 22 311 -96 143 206 77 313 171 -142 4 306 -47 -152
6226a52o3L02k2k81K4L05j18L4nk38L34j06j7K65o68J88M06P4l36J79k84j90K30
$$ -152 -215 87 65 -216 -192 113 -5 29 24 -214 120 14 -3 262 -406 -218 188 262 -74 105 -179 -369 -139
6249a39j43K67K46p9l55m3K12n6L8j23j1o1j7J11qP3J62L55m73j48J07p9J02j5
$$ -139 -282 -15 231 152 -203 -246 -34 -90 -52 -175 -186 -247 -264 -153 -161 -88 74 429 -44 -192 -85 -164 -62 -77
6273g7O8O0j5J37K5j86K64p4j31q8K52j44j50J54J00j70m1L26n55J92j34r9O26
$$ -77 -9 51 36 173 198 12 276 202 71 -17 235 91 -59 95 195 25 -16 310 -245 -53 -187 -286 340
6296C40M8p29M74k36J78l70M57n37K12N7J07k16O17k89m3k27J58j01j72L84k91
$$ 340 388 -341 133 -103 75 -295 162 -375 -163 -106 1 -215 402 113 70 -157 1 -100 -272 112 -179
6317a79M51m68O24j14n53L45M02m30R8k25k23K56K21N39r15J3k32J14N11l67K97
$$ -179 272 -196 428 314 -239 106 508 78 176 -49 -272 -16 205 744 -171 -158 -390 -276 235 -132 165
6338A65p0q2n57K75O17l16R3K83k44On30L79L25o21P7J57k67P22k16l48KL43L3
$$ 165 95 13 -544 -269 348 32 125 408 164 170 -360 19 344 -277 -200 -43 -310 412 196 -152 -150 193 226
6361B26j94M08l06o03J27N69k6k14M6k9K43k23%j77j3J54J2j66J45M6j06j22J7
$$ 226 32 440 134 -469 -342 227 201 -13 33 4 247 24 24 -153 -166 -12 0 -166 -21 25 -81 -203 -186
6384a86Q4J05J55j37k89K57K30l51K26r1M9j81L21j95l01N02k59OK43j84J09k78
$$ -186 -102 3 158 21 -268 -11 219 -132 94 3 52 -129 192 -3 -304 198 -61 -55 188 4 113 -165
6406a65K05k10K10Jj33J07J80j37j34K77N2k29N8j14j58J15J79K8j63L0J4L0n3
$$ -165 40 -170 40 41 -92 15 195 58 -76 201 253 24 82 -32 -190 -75 104 132 -31 -1 13 43 -10
6429a0J65k31r6K66N7O8j42J97j80k30N13k96q5J34j69j35L53l82J72R4K3j30
$$ -10 155 -76 -172 94 151 219 77 274 94 -136 377 81 -4 130 -39 -174 179 -203 -31 63 86 -44
6451d4j33L77l61l7J21K34l59L24j94Q9J06l09m6K88J36k38r8P7M6J71k14K30
$$ -44 -177 200 -161 -198 -77 157 -202 122 -72 17 123 -186 -232 56 192 -46 -144 -67 -21 150 -64 166
6473A66k08l1j2k5k4J74J97j45j9j71%L5K12q6j74L36j18l46O8Q7m0N3N9J9q1
$$ 166 -42 -73 -85 -110 -134 40 237 92 73 -98 -98 -63 149 63 -111 225 107 -239 -171 -84 -124 -71 -12 7 -74
6498g4K02j83m8Nn8J11O8J79j97j73M4K60k16K36j44jO1j52P6j67J75K9j54L72
$$ -74 128 -55 -103 -98 -156 -45 23 202 5 -168 -124 136 -80 156 12 11 72 -80 -4 -171 4 33 -121 251
6522B51k99O0M4j43q2q6M22j22j22q6J43J39j40K8R9k74O0K65p0P8K7k13K45K6
$$ 251 -48 12 56 -87 -169 -255 167 45 -77 -163 -20 119 -21 7 106 -168 -108 157 87 165 192 -21 224 250
6546B50k63p6j15L22m0o6J19L3k75Q8J25r4J05N2k47L7J28l7L4J15or4j08k7R6
$$ 250 -13 -89 -204 118 78 12 131 164 -111 -23 102 8 113 165 -82 -45 83 46 80 195 189 95 -13 -40 56
6571E6j77K54L0q8k0J1k5p3o5J36K8J21k29j15J41j04J03K54j33r6l1O9j22j7
$$ 56 -121 133 163 75 55 66 41 -32 -97 39 67 188 -41 -156 -15 -119 -16 238 105 9 -22 47 -75 -92
6595i2K31l05N5J1Qp9J85k5j78L17Q7l21J08l0n0j26K51R7l21K24o9J61r8m4J27
$$ -92 139 -166 -111 -100 -92 -171 14 -11 -189 128 215 -106 2 -28 -78 -204 47 144 -177 47 -22 139 41 -3 124
6620A24J52m14K33O9m16M26mm1j63kP6j69J38q3M1Q0k16K07j7m3K2O8K00m35L30
$$ 124 276 -138 95 164 -252 174 170 129 -34 -36 40 -129 9 -74 -33 47 -169 38 21 -22 0 68 268 -167 163
6645A63k00j29q4L12R6k43K51r9l30L97l22J82j24R3L00j36j49r7J98j0K0j36
$$ 163 -37 -166 -250 62 158 -85 166 67 -263 134 -188 -6 -130 -37 263 127 -22 -119 79 69 89 -47
6667d7K7rL7K34l58L64j55j74n8J39pJ91l39M20j21j73o7M0J46J5r9K4j22N8K7
$$ -47 -20 -29 8 242 -116 248 93 -81 -139 0 -7 184 -155 265 144 -29 -96 -56 90 105 6 30 -92 -34 -7
6692gj05J21j3j09J69o8j04R5LO8j63J39J09k2k04J36o5N0k55J24o3J37J92j56
$$ -7 -112 9 -4 -113 56 -12 -116 -21 -18 50 -113 26 135 113 -91 45 -20 30 -225 -101 -164 -27 165 9
6716Im7J2K05L1l40K5p3J57M09k09j55k6j7J7j6n6L06j46j16L53k13k50j29K23
$$ 9 -38 -26 179 210 -130 -105 -178 -21 388 179 24 -2 -19 -2 -18 -74 232 86 -30 323 110 -140 -269 -46
6740d6K59K5j64k00J72J23P8J26k96O6l46N57j81o0J46j23j40M87l30q9o5N49
$$ -46 213 238 74 -126 46 169 247 373 77 143 -203 354 173 113 259 136 -4 483 153 64 -1 548
6762E48j61n39m06K47m0N92J75n25j80M21j58J83K12m48L22J14p11J09N1k15J202
$$ 548 387 -152 -558 -311 -351 241 416 -109 -289 132 -26 157 369 -79 243 357 -354 -245 -194 -409 793
6783G93n84n98M39K96n78O53m17k08M87n90K79R70j165n49Q83L06l94l35M38n94
$$ 793 209 -389 50 346 -232 421 4 -204 283 -307 -28 942 -223 -772 111 417 23 -312 126 -468
6803d68P88l79M0O2L9n79O94n13M48n86Q25l40J04M7J03p17K56K33o2L02n06N84
$$ -468 320 -59 -19 43 82 -497 197 -316 132 -454 371 31 135 182 285 -432 -176 57 -5 297 -209 375
6825C75p99P92m65J74J75p58R11l68l2P85k31p26k1O65m08p00N08O36k84K03n87
$$ 375 -424 368 -97 77 252 -506 405 37 5 790 559 -167 -188 477 69 -631 -123 513 229 432 -155
6846a55N16n66P40l36q2L49n29O0l4l29L68K89j0k41j86J81l62J3j60N14J53j44
$$ -155 361 -205 535 199 117 466 -63 -3 -37 -366 2 291 281 40 -146 35 -327 -314 -474 40 193 49
6868D9P1o39R93j57l83N44o50L97m26K9J38l67P49j93K88M01r51J75k7l08L34
$$ 49 120 -519 474 317 -66 478 -172 225 -201 -172 -34 -401 348 155 443 844 -107 68 41 -267 67
6889F7k06J60M8J30n72K85j12O4J48J10l84L63k75K64p3j38K93m3L2k26J05J0
$$ 67 -139 21 69 199 -373 -88 -200 -136 12 122 -262 101 -174 90 17 -121 172 129 161 -65 40 50
6911E0j23K33k11J92k57j21N46j28k21n2rL83J52m73L6O3K0m06K80K50k03ol2
$$ 50 -73 160 -51 141 -116 -237 309 181 -40 -92 -101 282 434 -39 -3 60 80 -326 -46 204 1 -5 -37
6934c7o4J15j54L78j00j77R9p0j3P2Q8k6j75j05K46jk5j25K27k72QL5J52m3KN6
$$ -37 -101 14 -140 238 138 -39 60 -10 -23 49 137 111 -64 -169 77 76 51 -74 153 -119 -111 -76 76 33 35 91
6960I1J5j26J06Mj38o1J88j83L28l8k12J29r4L5l22K75J96j52k31R9J5Q6j22L01
$$ 91 106 -20 86 90 -48 -109 79 -104 224 186 -26 103 9 44 -278 -3 193 41 -190 -91 -76 10 -112 189
6984A89q7j61K62o0k76J13J18j45j47K72J00k04L78l94N0O8k2r3j73L51j94K9
$$ 189 102 -59 203 143 -133 -20 98 -47 -194 78 178 -26 352 -42 8 76 54 -39 -212 139 -55 -26
7006b6j20K5k3j69M63k67J64J1p8j54J14K50j09L6k11j39L38l34L04m15M36k59
$$ -26 -146 -121 -144 -313 150 -117 47 58 -20 -174 -60 190 81 117 -94 -233 105 -229 75 -340 96 -163
7028a63L42j39K2l4K06j55k15J18J25k74K06j75K12r3j71J81o1l7J45N0l12L35
$$ -163 179 40 62 28 234 79 -136 -18 107 -167 39 -136 76 -17 -188 -7 -68 -105 40 90 -222 113
7050A13N1k03k42L61p3M2q0m3J79O6q3r7L1O2j41L6J27l81J99J64J07j62j08J06
$$ 113 164 -39 -281 80 7 49 -31 -74 105 171 88 -9 22 84 -57 -21 106 -275 -76 88 195 33 -75 31
7074C1j39K16n0k24K57O9j73l9J28p2j26Q1M4PO1r1l7J7J94j21on4NJ70R9l08
$$ 31 -108 108 58 -166 91 160 -13 -52 76 4 -122 -41 3 10 71 -20 -57 -40 154 33 27 -27 -22 148 247 -61
7100f1K7L97k31q6L3Nk97K15K4R3p3r5L3K09r7k26K43j53K05l23J03J81k21J42
$$ -61 -34 363 132 46 79 84 -213 2 26 119 46 -49 -16 193 96 -130 113 -40 165 -158 -55 126 -95 47
7124D7l00K47J75k80R7N4j55L02j07j00O0L2M6K02j19m24o5K81n9J29n9K25j64
$$ 47 -253 -6 169 -111 -14 40 -115 187 80 -20 40 72 118 320 201 -223 -288 -7 -66 63 4 229 65
7147F5j23J28j75J1k10M25k35j29M73k37j28J44j69M3M9q3K98j42p5j03ML41k96
$$ 65 -58 70 -105 -94 -304 121 -114 -243 230 -7 -135 9 -160 -117 -68 -151 147 5 -70 -173 -169 172 -124
7170a24K54q3J98k36N5j1NJ36k26K03j76O9k50l7L16L4k08K77P5j04j46LJ2Jl
$$ -124 130 47 245 9 64 53 58 194 -32 171 -5 64 -186 -223 93 127 -81 196 271 167 21 24 36 37 34
7195C4l6j5n5J8K44m55K73j53j3k24M66j60n0J73j50J58j44J10l25O40j14k42
$$ 34 -2 -17 -72 -54 190 -265 8 -145 -158 -382 84 -76 -126 47 -103 55 -89 21 -304 336 222 -20
7217b0l8J8K46l10K47j43j45P9P6P4j53O6k20L63k9N6p0J52k95L4J68L8k0k63
$$ -20 -58 -40 206 -104 143 0 -145 -66 10 84 -69 -3 -223 140 111 167 97 249 -46 -12 156 194 174 -89
7241h9K58r3j03p0J32l28K44R2pO3j42J69n3o2Q3n0j05r2L18k5k45M34k83p1J64
$$ -89 169 76 -27 -97 35 -293 -49 43 36 99 -43 126 73 11 94 44 -61 -153 165 140 -105 329 46 -25 139
7266A39l70J81l1M9n4J79n9J51j73M6r5j06J38Q3o7M6J63k88NJ32j17m4J18p6
$$ 139 -231 -50 -81 -32 -86 93 34 185 12 58 -37 -143 -5 78 11 57 220 -68 -63 69 -48 -92 26 -50
7290e0J1nL6o3J09j22j64K76j0j65k9j32L89k35K86k52P9K03k08N7p2OPJ28J6
$$ -50 -39 -44 -8 -71 38 -84 -248 28 18 -147 -176 -308 81 -154 132 -120 -41 162 -46 11 -61 -55 -48 80 96
7315I6j54N7J32j68J59k92K54p7n4J07N5k48L33j50j29P5q2J95j39k00L12j80
$$ 96 -58 -1 131 -37 122 -170 84 7 -47 60 115 -133 200 50 -79 -4 -86 109 -30 -230 82 -98
7337i8R6O7k48j4K36k39J21J03j12K50j57j24mP3K13J49j19k46K55l96L08k07
$$ -98 -2 65 -183 -197 39 -200 -79 24 -88 162 5 -119 -123 -50 163 312 193 -53 202 -194 114 -93
7359i3o0Q6o4J90j51J17k32J16R5o5J60l33L30jol2n3R0k09K42k34K8j51L10L0
$$ -93 -153 -67 -131 59 -92 25 -207 -91 4 -61 99 -234 96 95 89 57 4 94 -115 127 -107 -79 -230 80 110
7384A10q5j72kL43n4j43N9j05J25j74J50p9j36Q7J16k0k04L44j79J34q5Oj81K66
$$ 110 25 -147 -149 194 140 -3 56 -49 76 -98 52 -27 -163 -76 40 20 -184 160 -19 115 30 36 -145 121
7408A21j7k80K63M1l54K49j17J77j36j08J16N3p4Q8j46J68P2Pl35P0K47k42L93
$$ 121 104 -176 87 128 -226 23 -94 83 -53 -161 -45 8 -66 22 -124 44 116 123 -212 -142 105 -137 256
7431B56k01J07n8K3k73q5J58J04J21m88L17j84J1K30j57m0j08J09K24K9j32RL2
$$ 256 55 162 104 127 -146 -231 -73 31 152 -336 -19 -203 -192 38 -119 -159 -267 -158 66 95 -37 -28 4
7454DR0Qj5q0k7j46L05l55Q4J28k8%LJ80j78L04j77j32j17J23P9Mj32o7L3J66
$$ 4 94 102 87 7 -20 -166 139 -216 -132 -4 -32 -32 -29 151 -27 277 100 -32 -149 -26 53 57 -75 -142 -109 57
7480E7R1j94K85k02j48M3K37j96k4M5n5L3n5k6J03J57l69K70k40K34j96K53j45
$$ 57 148 -46 239 37 -111 -68 169 -27 -51 -6 -61 -28 -83 -109 -6 151 -218 52 -188 46 -150 103 -42
7503d2L42j40l98J66N6j54J33J80r0J31l73L11j29m7K74j55k8M4jm0l6J49k80
$$ -42 300 160 -238 -72 -16 -170 -37 143 53 184 -189 122 -7 -54 220 65 37 81 80 40 4 153 -127
7526a27J25j12J95m3J33l93K84O6Qqj44K08r2J37l63QK87j62k3J52j19k80L34
$$ -127 -2 -114 81 38 171 -222 62 128 136 128 -16 192 100 237 -126 -118 169 7 -16 136 17 -263 71
7549G1j47J3Q5jl04J21k4J92k5k81J52L0J50j53J14j06j60L48j98N7K15j0j99
$$ 71 -76 -63 22 21 -283 -162 -186 6 -19 -300 -148 -118 32 -121 -7 -113 -273 75 -123 -66 149 139 -60
7572f0P1K08l27L4J56o3K5p6J4n5j85M01r7n5o2L10m08q1L33m02M47r7pk44R5
$$ -60 11 219 -108 -74 82 19 44 -32 -18 -73 -258 143 46 -9 -71 239 -169 -250 83 -319 128 31 24 -220 -125
7597a25M6p7K61k28K4J35K08l9l82L08j02m2J97k0Q6j10j51M6j41L31l12J08j8
$$ -125 -79 -156 105 -123 -99 36 244 205 -177 131 29 -13 184 164 250 140 -11 35 -106 225 -87 21 3
7620Cnp8J46j43k8m3K34P8R8j56j58R4l2R8j49Q8K00k62mn8J81r3j09N9O5l8r9
$$ 3 -2 -80 66 -77 -105 -148 86 164 262 106 -52 42 10 108 -41 47 247 -15 -19 -77 104 11 -98 -39 26 -12 -111
7647a11J59J60k57K1k01K33j6r0J83j91J58k34K32L4k74K59jK0l09M12%l02J03
$$ -111 48 208 -49 -28 -229 4 -12 -102 81 -110 48 -186 46 80 -194 65 64 84 -225 187 187 -115 -12
7670a2jJ37j50mL3m0j4J74k38M17m32N5K29k24J1P9j8P0k10J72O2j5k91J85Q1
$$ -12 -13 124 -26 -30 3 -37 -51 123 -115 302 -130 -75 154 -70 -59 20 2 72 -138 34 96 81 -210 -25 56
7695E6R7p7R3k32J96j23K6q6J52k25P6P0L9l09K74L9j55O2j33J10n7P1J53o4Q2
$$ 56 153 76 169 -63 133 10 36 -50 102 -123 -47 23 62 -247 27 66 -89 -27 -160 -50 -107 -36 117 53 135
7720A35j49J66n8l32l8M84l55K84k23k6J6Q1j08j39L78k84J79k2k06L62j62j5
$$ 135 -14 152 94 -238 -276 208 -147 137 -86 -112 -96 -15 -123 -262 116 -168 11 -11 -217 145 -17 -32
7742c2n2Q4p5O6J6P8q0j55J40L9J48k03L4R1n3K45n20K69n3j52K52k36K0M62l15
$$ -32 -84 0 -75 -9 7 85 5 -150 -10 29 177 -26 8 99 46 291 -229 40 -13 -165 87 -149 -129 333 18
7767A8R6o1j13Kj05L52l17n3J59k20K04j31K65j45o3R7%L31m26L24l60R7J14L9
$$ 18 114 53 -60 -58 -163 189 -128 -181 -22 -242 -38 -169 96 -49 -112 -15 -15 316 -110 214 -146 -49 65 104
7791A04j36r7N6J69N4k16K81k99K41k38O0J77q4j32J29L0q1pk63J31J49o4O4k33
$$ 104 -32 -129 -73 96 150 -66 215 -84 157 -81 -21 156 72 -60 69 99 18 11 -252 -121 28 -36 28 -205
7815b05J67K8K31m23M11j42n1oJ40j57l9J02M6l8m2n4J62k9k00J11Q6n9j01M3
$$ -205 -38 -10 221 -202 209 67 16 10 150 -7 -46 56 102 64 22 -32 130 101 -99 12 98 39 -62 -19
7839a9K00j95kJ10k89J82j26J06L4q2l0J57o5JR8l26L60j57J57k08m1L44j48n6
$$ -19 181 -14 -16 94 -195 -13 -139 -33 1 -81 -111 46 -19 -18 80 -246 114 -43 114 -94 -135 209 61 5
7863Er1J57j22K22j82J06k3j21MJ90k94L05k59J88k55M7K04j99K63o2j3k28K40
$$ 5 -86 71 -51 171 -11 95 72 -49 -45 145 -149 156 -103 85 -170 -123 81 -118 145 83 70 -158 82
7886H2q9q5R5J40j43j4R4j02K1K07r2k85N01l84oK4J15N8j16r8J56Jn7k0o2K4
$$ 82 -7 -92 3 143 0 -14 80 -22 -1 206 114 -171 330 -54 -60 -36 79 137 21 -77 79 80 23 3 -59 -35
7912c5O4p0J1J84k30R2r4R2N6k20J14J4L52m51J84j38K26j79P1K5k5j32J46k91
$$ -35 29 -41 -30 154 -76 16 -78 14 70 -150 -36 -22 330 -121 63 -75 151 -28 43 68 43 -89 57 -234
7936b34L45J1j31n3OP0J22k63J06l0J11L9k64K10l5k21J35K62m6j14L73n20O3
$$ -234 111 122 -9 -62 -56 14 136 -127 -21 -51 60 99 -165 45 10 -211 -76 186 140 26 399 -121 -58
7959e8Q2P3q7J98q8k3m6j36LO5j06J79j10K58j05j09K8l06J12J96M0Q3J25k84
$$ -58 24 97 10 208 120 97 51 -85 -82 -17 -123 56 -54 204 99 -10 18 -288 -176 20 60 143 268 -16
7983a6j6%J40p3J53k2r0N2o6k36K69K37k97Q1j86P7J1k14O2J68m9K66j51O9j83
$$ -16 -32 -32 108 35 188 166 76 128 62 -174 95 332 35 116 -70 7 18 -196 -134 34 -15 251 100 169 -14
8008a4PN3j4k54J01J07J51l90J96J54Rq9j30J98K2n8l1j04K92j30j65l8J00K08
$$ -14 -7 46 32 -222 -121 -14 137 -253 -57 97 106 17 -113 85 107 49 18 -86 206 76 -89 -127 -27 181
8032A81k87j80L49Lk53K65J1k81J36Q6j1n0QK2k35L1K35j93M9K49j44K05l22O6
$$ 181 -106 -286 63 66 -187 78 89 -192 -56 30 19 -31 -23 -1 -236 -205 30 -163 -114 135 -9 196 -126 -60
8056f0K40k66M6l4p4J69J51k30J59Lj34J83j58K5N0J3p7k04P4K05q7M2j46K68
$$ -60 180 -86 -40 -74 -148 21 172 -58 101 104 -30 153 -5 20 70 83 6 -198 -124 81 -6 36 -110 158
8080A58k1O4l04R6qJ61l12J75J42l37L5L3Q0QJ65p7J4q8J62P7k73J92J18j79o8
$$ 158 137 201 -103 -7 -15 146 -166 9 151 -186 -151 -118 -38 -30 135 58 72 -16 146 223 -50 142 260 81 13
8105A3j73J49J41j40o3j30K33J94j48o7j23J84r7K07j76N3J44j70k21J62J6K63
$$ 13 -160 -11 130 -10 -73 -203 30 224 76 9 -114 70 -27 180 4 57 201 31 -190 -28 -12 251
8127B51j75k0r3n8J70k57K78l1j74K35j60J07q3J85j16J69k34j4N6j2j1m0l0k09
$$ 251 76 56 -37 -95 75 -182 96 65 -109 126 -34 73 -10 175 59 228 -6 -20 36 24 13 -27 -57 -266
8151b66M80l75L24J8l97J98k06K14j23J02k2J88k20n1L20l53K77K9k50k2L89l60
$$ -266 214 -161 163 181 -216 -18 -224 -10 -133 -31 -53 135 -85 -136 184 -169 108 137 -113 -135 254 -106
8173a06K43j56J91m1q4p4N5J86l81M2J45m3j26J73J11j30K23k53
$$ -106 137 -19 172 131 47 -27 28 214 -167 -125 20 -23 -149 24 135 5 228 -25
8191b5
$$ Imaginary data points
##PAGE= N=2
##DATA TABLE= (X++(I..I)), XYDATA
0@%%%%%%%qJ6j6J6j6K4m0M9n7P2r6J20j44J76k08K47k94L43m00M65n38O24p19
$$ 0 0 0 0 0 0 0 0 -8 8 -8 8 -8 16 -24 25 -32 40 -56 64 -80 96 -112 135 -159 184 -216 249 -289 335 -384
30c84Q24r43J071j215J374j549J744j954K187k442K721l029L363l726M124m559
$$ -384 440 -503 568 -647 727 -822 922 -1032 1155 -1287 1434 -1595 1768 -1958 2166 -2393
46b393N035n557O125o745P431q187R022r950J0985j2148J3464j4969J6706j8738
$$ -2393 2642 -2915 3210 -3535 3896 -4291 4731 -5219 5766 -6382 7082 -7887 8819 -9919
60i919K1153k4077K7709l2359L8548m7244O0454q3142J32599m30169K42316M01001
$$ -9919 11234 -12843 14866 -17493 21055 -26189 34265 -48877 83722 -346447 -104131 296870
72B96870p50913L87724K26715o48810J10419O46353l97549j56022M05705j69979
$$ 296870 -454043 -66319 160396 -488414 -377995 268358 -129191 -285213 120492 -49487
82d9487k23516L55048o4155k08993K36349P9873j84788P9944K0708p1681P1131
$$ -49487 -273003 82045 17890 -191103 45246 125119 -59669 20275 40983 -30698 40433
93D0433P126m7440P0864n4096k6085J02487r8191p8720J86700o1634j49986J77497
$$ 40433 47559 119 70983 16887 -9198 93289 -4902 -83622 103078 41444 -108542 68955
105F8955j7015k14111J84495O3631k82111J27702K14691k59963k5151K17939k04077
$$ 68955 51940 -162171 22324 85955 -196156 -68454 146237 -113726 -138877 79062 -125015
116a25015p6426K92670j00015k01739J99735P47j82213J66108O0858j96023R9389
$$ -125015 -201441 91229 -8786 -210525 -10790 -10043 -192256 -26148 34710 -161313 -61924
127f1924J26519j68730J0071J39780r4566k1445J27079n8170n6633J01727j894
$$ -61924 64595 -104135 -94064 45716 -48850 -70295 56784 -1386 -58019 43708 41814
138D1814n9319L7313J1305o148L6103j6082l2533Q621k096K3803K3933n9817j6038
$$ 41814 -17505 19808 31113 24965 61068 44986 12453 21074 18978 42781 66714 6897 -9141
151i141N0303l7952k3079N6574m9111m8377Q7859k1519r9217P2379L6312r5511
$$ -9141 41162 3210 -19869 36705 -12406 -60783 27076 5557 -93660 -21281 15031 -80480
163h0480M4091M7816j09376K8217J14729q9444n3281J02578l1155n0560J04786
$$ -80480 -36389 11427 -97949 -69732 44997 -44447 -97728 4850 -26305 -76865 27921
174B7921j3304j05522P5306N9456q1048K0383N6431o1892L314O7607m5525l2888
$$ 27921 14617 -90905 -15599 43857 -37191 -16808 39623 -22269 -18955 48652 3127 -29761
186b9761O1751L431l8302J4531M74j6846K8559J4399l2134j9655J1228K0689K879
$$ -29761 31990 35421 -2881 11650 12124 -4722 23837 38236 6102 -13553 -2325 18364 21243
199B1243k1419l802L118j3934J5244J7501m3157n555M9899k6043l9105M3338k428
$$ 21243 -176 -3978 -860 -14794 450 17951 -25206 -30761 19138 -6905 -46010 -2672 -5100
212e100l6997M7132N174p3786L4885O1524n5451j0123N0770m5469j2677Q1695
$$ -5100 -42097 5035 10209 -63577 -28692 32832 -22619 -32742 18028 -27441 -40118 41577
224D1577k7081o4981O2398J8540n6216L8446K7467o2224K3842N4669n8182k0908
$$ 41577 14496 -50485 11913 30453 -25763 12683 40150 -22074 1768 56437 -1745 -22653
236b2653O2835j3421k8715L2475j9391l8365N0762K5533m9228j2207J5023r128
$$ -22653 40182 26761 -1954 30521 11130 -27235 23527 49060 -168 -12375 2648 -6480
248f480J1750J8674k5081k2964J4307J3349o874j2080K867J0189m625m731K459
$$ -6480 5270 23944 -1137 -24101 -9794 3555 -3319 -15399 -12532 -2343 -6968 -11699 -9240
261i240j3077P27L3970m279l7349J3233K1323j6849J1712J6230l6334J96M7867
$$ -9240 -22317 -21590 12380 8101 -29248 -16015 5308 -11541 171 16401 -19933 -19737 28130
274B8130j7229l1227L1535K061k7053K8865R323m1958J7077L7080l7431j8614
$$ 28130 10901 -20326 11209 13270 -13783 15082 24405 -17553 -476 36604 -827 -19441
286a9441L5633p484j5629L0503j4325m4812L0954L4492l3243q762J8513k2029
$$ -19441 16192 8708 -6921 23582 9257 -35555 -4601 29891 -3352 -12114 6399 -15630
298a5630k474M0286j4271l8594K5669K0099k7382O100K1109k4453k962L2020j5980
$$ -15630 -18104 22182 7911 -30683 -5014 15085 -12297 -6197 14912 -9541 -12503 19517 3537
311C537k5556L2035J5059l0174J871J4931k0248O468L3670k1211l0994K5788J0797
$$ 3537 -22019 10016 25075 -5099 -3228 11703 -8545 -2077 31593 10382 -20612 5176 15973
324A5973k4382J1978J5998k6454j56K5494k2662k0288L6078J0928l2525L041R062
$$ 15973 -8409 3569 19567 -6887 -7043 18451 -4211 -24499 11579 22507 -10018 -6977 2085
337B085k0777J4853L2446k8308k9597K8514R930j9759J2097O440k6600R878L0167
$$ 2085 -18692 -3839 28607 299 -29298 -784 9146 -10613 1484 7924 -18676 -8798 21369
350B1369k3141k3105K8797R320k1625J0007O777k4255J1400L2278k3487k6026
$$ 21369 -1772 -24877 3920 13240 -8385 1622 8399 -15856 -4456 27822 4335 -21691
362b1691K8725J0893k1467J1866O012l0680J2770L7254k6405k7763K9188M130
$$ -21691 7034 17927 -3540 8326 14338 -16342 -3572 33682 7277 -20486 8702 12832
374A2832k1961J9915K595l7373J6010L5728l1896k2488L0676l191j7279K6163
$$ 12832 -9129 10786 13381 -23992 -7982 27746 -4150 -26638 4038 847 -16432 9731
386I731o316m0161K4540L4850l0361j3919K3780j2946p694L4376p451l6589K1319
$$ 9731 3415 -36746 -12206 22644 -7717 -21636 2144 -10802 -18496 15880 8429 -28160 -6841
399f841K4828k4734k186K2596j5405q564K7005o988k6713K1063K0287k4479o807
$$ -6841 17987 -6747 -8933 13663 -1742 -10306 16699 9711 -17002 4061 24348 -131 -6938
412f938J9316r490q660K3750n488k9510J5936K3251k4024j0163K2192r528j3961
$$ -6938 12378 2888 -5772 17978 12490 -17020 -1084 22167 -1857 -12020 10172 644 -13317
425a3317K4308l805l3995J9302K8251k9644j1442K5515j3482j2341L2707p205
$$ -13317 10991 7186 -26809 -7507 20744 -8900 -20342 5173 -8309 -20650 12057 4852
437D852l8738K4159K8208l0182m330K5112j9727p556L7215j0433l5770K6204K1415
$$ 4852 -33886 -9727 18481 -11701 -16031 9081 -10646 -18202 19013 8580 -27190 -986 20429
450B0429k8594L508K1449k1621m740L2719j3430l0738K6296J6308k6051K539J5472
$$ 20429 -8165 -4657 16792 -4829 -9569 23150 9720 -21018 5278 21586 -4465 -1926 13546
463A3546k3298J042L2443j5509l0654K2556J3932k3362O274J3874k4168j501L2160
$$ 13546 -9752 -8710 23733 8224 -22430 126 14058 -9304 -3030 10844 -13324 -14825 17335
476A7335j4963k7428K3596J1535k4039Q069J2336k5123L611L0566j7318k5098
$$ 17335 2372 -25056 -1460 10075 -13964 -5895 6441 -18682 -15071 15495 -1823 -26921
488b6921K2791R272j9121R643R767k4148L924K9255j4679k0692K0968Q153j6968
$$ -26921 -4130 5142 -13979 -4336 5431 -18717 -14793 14462 -217 -20909 59 8212 -8756
501h756R604R960k1381M161K8645j4410k3612J9853R929j6962Q800R118k6167
$$ -8756 848 10808 -10573 -6412 22233 7823 -15789 4064 13993 -2969 5831 14949 -11218
514a1218K082L0932j3819k4836J8734O310k1501J3473J0210k9878L247L2646j9118
$$ -11218 -9136 21796 7977 -16859 1875 8185 -13316 157 10367 -19511 -16264 16382 -2736
527b736k2532K4320J867j8869J8451P561k9772R351K8919j8814j6310K1644R18
$$ -2736 -25268 -948 919 -17950 501 8062 -21710 -12359 16560 -2254 -18564 3080 3998
540C998j4364J7302K793k6814Q845K7685j5903j7034J7340p75j2950J7368L132
$$ 3998 -10366 6936 9729 -17085 -8240 19445 3542 -13492 3848 3073 -9877 7491 10623
553A0623k8847Q252K8061j7134j5299J7382l913j0203K2255N03k9849J0080K4529
$$ 10623 -18224 -9972 18089 955 -14344 3038 -875 -11078 11177 11680 -18169 -8089 16440
566A6440j5525p224J5490j0642q360K3130j666k5377R844J6877j4395m191J1778
$$ 16440 915 -6309 9181 -1461 -9821 13309 11643 -13734 -3890 12987 -1408 -5599 6179
579F179r526p344J7006j356k1672P374J7904j2327q072J2479o443r249J9120L150
$$ 6179 -3347 -10691 6315 4959 -16713 -9339 8565 -3762 -11834 645 -5798 -15047 4073 7223
593G223k3734P747K0763j6031p634J8727q384j0110K5916l031l0887J5180K0720
$$ 7223 -16511 -8764 11999 -4032 -11666 7061 -1323 -11433 14483 11452 -19435 -4255 16465
606A6465k0429O0J7296k1013n832K8971q922k5034J9047J0104j9417O823J0420
$$ 16465 -3964 -3904 13392 -7621 -13453 15518 6596 -18438 609 10713 -8704 -1881 8539
619H539k0052J744K4129j0902j6325J5041N574j1712N837O144j2323J518J7485
$$ 8539 -11513 -9769 14360 3458 -12867 2174 7748 -3964 1873 8017 -4306 -2788 14697
632A4697o913j7330R728J0227r669K56P175j3196l013K0137n455k1713J0802J2230
$$ 14697 7784 -9546 182 10409 740 996 8171 -5025 -8038 12099 6644 -15069 -4267 7963
646G963j4140K756R106j9399j214K6835q369k2023J5191O596j4178J2146P499
$$ 7963 -6177 -3421 5685 -13714 -14928 11907 3538 -18485 -3294 3302 -10876 1270 8769
659H769k3855M127K5679j1544j4345J5246j286j1378J6185L219k1325P062J8351
$$ 8769 -15086 -10959 14720 3176 -11169 4077 2791 -8587 7598 10817 -10508 -3446 14905
672A4905j3081r417J2837k009p255J2681j72j8734N842J7245r762q747J0241j858
$$ 14905 1824 -7593 5244 3235 -4020 8661 8489 -10245 -4403 12842 3080 -5667 4574 2716
686B716p730J1934K135j8605M539J8521j0189j1391J2249k612r735J5034K005
$$ 2716 -5014 6920 9055 -9550 -5011 13510 3321 -8070 4179 1567 -8168 6866 8871
699H871k2710O214J9609j3841q574J3623p193q614J9097q12k3010R194J6390j3423
$$ 8871 -13839 -7625 11984 -1857 -10431 3192 -4001 -12615 6482 5670 -17340 -8146 8244 -5179
713e179l524J2922r742n356J8940k560j8840J0252J3550j1491j442R904q970l250
$$ -5179 -8703 4219 -5523 -10879 8061 5501 -13339 -3087 10463 -1028 -2470 7434 -1536 -4786
727d786J7356k812j7602Q538J2420j0640j236Q814j0768l977J7050l026j8039
$$ -4786 12570 9758 -7844 694 13114 2474 1238 10052 -716 -4693 12357 9331 -8708
740h708Q411J0864j2729o95R425j2079l284J8079n423j8871J0816R899j2596L175
$$ -8708 -297 10567 -2162 -2857 6568 -5511 -8795 9284 3861 -15010 -4194 5705 -6891 -3716
754c716Q463j5015j317K0573o479j7340J2537P185j2415O815P854j6326J050J9733
$$ -3716 4747 -10268 -11585 8988 2509 -14831 -2294 4891 -7524 -709 7145 -9181 -8131 11602
768A1602q201j4860J3023M842j1002P424N725j6392J765J9846q217j3896J1185
$$ 11602 3401 -11459 1564 6406 -4596 2828 8553 -7839 -6074 13772 5555 -8341 2844
781B844L269j0204Q658N929j6680J477J8026q387j3084J2403K300j1155R099M925
$$ 2844 6113 -4091 4567 10496 -6184 -4707 13319 4932 -8152 4251 6551 -4604 4495 9420
795I420j8249K156J8970r422j3060J2350J75j1429J0777M524j9067L204J9059
$$ 9420 -8829 -6673 12297 2875 -10185 2165 2340 -9089 1688 6212 -12855 -9651 9408
808I408j1457j1300J3738j499j0297J3523L031j9262N945J8240j0989q584J2735
$$ 9408 -2049 -13349 389 -1110 -11407 2116 5147 -14115 -8170 10070 -919 -9503 3232
821C232k860p384J4867J631j8822O012J6527r599o097J1040n227p580J3873J819
$$ 3232 372 -7012 7855 9486 -9336 -3324 13203 3604 -2493 8547 3320 -4260 9613 11432
835A1432j8263M781J5005j0428o683J1112n810q687J4553J286j8863N931J4139
$$ 11432 -6831 -2050 12955 2527 -4156 6956 1146 -7541 7012 8298 -10565 -4634 9505
848I505j1951n605J2290o904p643J6289k93k0091Q276J4245j2517k558J1853r773
$$ 9505 -2446 -8051 4239 -2665 -10308 5981 5688 -14403 -6127 8118 -4399 -6957 4896 -4877
862d877n929J8456k433j9010R533J2675j2310M26J0424j2073m300J9423k550j7326
$$ -4877 -10806 7650 5217 -13793 -4260 8415 -3895 -3469 6955 -5118 -9418 10005 7455 -9871
876i871R647R824j1572K434J0092j2393l618J8464l103j6181Q861Q757j1786K492
$$ -9871 -224 9600 -1972 462 10554 -1839 -5457 13007 9904 -6277 2584 11341 -445 2047
890B047R999j2822m372J6696l670j6049R014P355j2163K440Q710j3177l881J7028
$$ 2047 12046 -776 -5148 11548 7878 -8171 843 8198 -3965 -1525 7185 -5992 -9873 7155
904G155m378j5743R573O554j1635M075Q522j3653k122J8156m826j4425J0623N890
$$ 7155 2777 -12966 -3393 3161 -8474 -4399 4123 -9530 -11652 6504 1678 -12747 -2124 3766
918C766j0838O952P655j4753j76J8208n458j2651J0601L673j0156Q528O329j5713
$$ 3766 -7072 -120 7535 -7218 -7394 10814 5356 -7295 3306 6979 -3177 5351 11680 -4033
932d033K64J7069p170j0665J0451K57r813R137M981j5970R36J5224p363j0094
$$ -4033 -3769 13300 6130 -4535 5916 6173 -3640 5497 10478 -5492 -4556 10668 3305 -6789
946f789R679r20r116R542L914j5685J261J4711p443q810R555j257q952J0560M410
$$ -6789 2890 1970 -7146 2396 6310 -9375 -8114 6597 -846 -9656 -101 -1358 -10310 250 4660
961D660j6123J921J5295p802p881J1020k939q839J2955L861j6930L829J4920r204
$$ 4660 -11463 -9542 5753 -2049 -9930 1090 -1849 -10688 2267 6128 -10802 -6973 7947 -1257
975a257n562J1593n267p850J4737J702j6484N712J2332r663k603R813p067o222
$$ -1257 -6819 4774 -493 -8343 6394 8096 -8388 -2676 9656 -7 -2610 7203 136 -6086
989f086J3747k0j5293N259J0370r136k810Q179p070o010J2550L5j4990M033R750
$$ -6086 7661 7641 -7652 -2393 7977 -1159 -3969 4210 -2860 -8870 3680 3715 -11275 -7242 2508
1004B508q603k632Q969p612o674J3664J099j5068N194J0586r469r59J0350q646
$$ 2508 -6095 -8727 242 -7370 -14044 -380 719 -14349 -9155 1431 -8038 -8997 1353 -7293
1018g293n296J5788o87j4625P708Q736r790K310R316j1093l610J6121k995j3297
$$ -7293 -12589 3199 2512 -12113 -4405 4331 -5459 -3149 6167 -4926 -8536 7585 4590 -8707
1032h707Q750N049r922M170P013j1612k135J4257l861j2114P832L840q845M501
$$ -8707 43 5092 -4830 -660 6353 -5259 -7394 6863 3002 -9112 -1280 2560 -6285 -1784
1046a784O272j1991k182J3944l118j1008P092L869r265M661P333j2227k352J4638
$$ -1784 4488 -7503 -9685 4259 1141 -9867 -2775 1094 -8171 -3510 3823 -8404 -10756 3882
1060C882m261j1449Q679L141r898O316P223j3730j159J5150n056j0546R680J741
$$ 3882 -379 -11828 -3149 -8 -9906 -3590 3633 -10097 -11256 3894 -1162 -11708 -2028 -287
1074b87r771Q760O197j3955P88J5041o294q058J0170m72q765R906M875j4736J723
$$ -287 -10058 -1298 4899 -9056 -8268 6773 479 -7579 2591 2119 -6646 3260 8135 -6601 -4878
1089d878J3744o480p418R240k396q381R714L975j4146J378J1649o767o412Q831
$$ -4878 8866 2386 -5032 4208 1812 -6569 3145 7120 -7026 -5648 6001 -766 -7178 1653
1103A653k921q287J0272L582j4319J978J2163o994n421R632k738q218J1060L446
$$ 1653 -1268 -9555 717 4299 -10020 -8042 4121 -2873 -8294 1338 -1400 -9618 1442 4888
1117D888j3936K912J2329p908m472J0208n017p358J2609K028j4588M267J0872
$$ 4888 -9048 -6136 6193 -1715 -6187 4021 -996 -8354 4255 6283 -8305 -4038 6834
1130F834q647k580R630o589o831J3851J116j4480N594R389r267l40R619q332n499
$$ 6834 -1813 -4393 5237 -1352 -8183 5668 6784 -7696 -2102 7287 -1980 -2320 7299 -1033 -6532
1145f532J3896j93j2969N584P904r134K82R207r228n157J3271q65j3159N946O815
$$ -6532 7364 7171 -5798 -214 7690 -1444 -1162 8045 -1183 -6340 6931 6066 -7093 -1147 5668
1160E668r499Q96Q452r661m972J3671j219j2939O248P074r433K391Q708j0152
$$ 5668 -3831 -2935 5517 -4144 -9116 4555 3336 -9603 -3355 3719 -5714 -3323 5385 -4767
1174d767m025J4090j492j1931P500O105r366L473Q768j1008l382J4335k296j1247
$$ -4767 -8792 5298 3806 -8125 -625 5480 -3886 -413 8355 -2653 -6035 8300 6004 -5243
1188e243P770L880r444M709P457j1321l118J3822l766j0442P718K645r463N451
$$ -5243 2527 6407 -3037 1672 9129 -2192 -5310 8512 4746 -5696 2022 4667 -4796 655
1202F55O962j2246j714J3412m493r535Q660J035r198O993N969j2067q42J2945
$$ 655 7617 -4629 -6343 7069 2576 -6959 1701 2736 -6462 531 6500 -5567 -6409 6536
1216F536n355q262Q916m4q970Q149M803j2530M27J2376n869o788Q797j151q364
$$ 6536 1181 -7081 1835 1791 -7179 970 5773 -6757 -6330 6046 177 -6611 2186 1035 -7329
1231g329Q724N225j2713Q60J1826n627o001Q992j642q144R634M482j3006J326
$$ -7329 1395 6620 -6093 -5233 6593 966 -5035 3957 2315 -5829 3805 8287 -4719 -3393
1245c393J1759o690n355R509l321q749J0599L532j3499K072J0259p511m034R118
$$ -3393 8366 1676 -3679 5830 2509 -6240 4359 7891 -5608 -3536 6723 -788 -4822 4296
1259D296n005p650J0554K768j3139K642R702p496k846R404n403p031J1547J990
$$ 4296 -709 -8359 2195 4963 -8176 -5534 4168 -3328 -6174 3230 -2173 -9204 2343 4333
1273D333j2068L663R021p170j759R440n764o322J1645J294j1993M707P972q295
$$ 4333 -7735 -4072 4949 -2221 -3980 5460 -304 -6626 5019 6313 -5680 -973 6999 -1296
1287a296n39Q789p232n783J1861L24j1917M883O751q921J283P789q202m907J1741
$$ -1296 -1835 6954 -278 -6061 5800 6124 -5793 -910 5841 -3080 -1797 5992 -2210 -7117 4624
1302D624l66j1021N418N578q156J843Q020q879l981J1506r38r887N781M396q323
$$ 4624 4258 -6763 -1345 4233 -3923 -2080 5940 -2939 -6920 4586 3648 -6239 -458 3938 -4385
1317d385K912P648r312l212J1348j946r152O338L572q404L800P126r671k622J1754
$$ -4385 -1473 6175 -3137 -6349 4999 3053 -6099 239 3811 -4593 -793 6333 -3338 -5960 5794
1332E794k519r172P119K904q320M754O866j0484j731J1726l184q436P396J297
$$ 5794 3275 -5897 1222 4126 -4194 560 7426 -3058 -4789 6937 3753 -4683 2713 4010
1346D010q572O041O007j1025j463J0997m107p519P784j8q163O569N191j1258l83
$$ 4010 -4562 1479 7486 -3539 -5002 5995 1888 -5631 2153 2135 -6028 541 5732 -5526 -5909
1361e909J0642m634n440P603j250p362P522M592j0329O98R758m802m731P540j554
$$ -5909 4733 99 -5341 2262 1012 -6350 1172 5764 -4565 -3867 5891 1089 -3642 3898 2344
1376B344o821P490L927j0054O82R064n319m464P408k510p250Q085L265j0913J415
$$ 2344 -4477 3013 6940 -3114 -2432 6632 1313 -3151 4257 1747 -5503 2582 5847 -5066 -3651
1391c651Q396o118l155P521l902o417R076K490j0715K466P791n955j601P563m642
$$ -3651 4745 -1373 -4528 2993 -909 -7326 1750 4240 -6475 -4009 3782 -2173 -3774 3789 -853
1406h53n541R530J497r519L266O597o448l99P460n663m854R277Q78r630L860N741
$$ -853 -6394 3136 4633 -4886 -1620 4977 -1471 -1870 5590 -73 -4927 4350 5228 -4402 -542 5199
1422E199o947J46O982o222m767R228K78r258M229M844o737O64O805o945m107R798
$$ 5199 -1748 -1602 5380 -842 -5609 3619 3897 -5361 -1132 3712 -3025 -2361 4444 -2501 -6608 3190
1438C190p29q766M555M461p019J748O907p932l506J0024q22q673N229L357o972
$$ 3190 2461 -6305 -1750 2711 -4308 -2560 4347 -3585 -7091 2933 2111 -6562 -1333 2024 -4948
1453d948L045O431q187k620J0006j779p232N973K456p419M357N999q310j818R467
$$ -4948 -1903 4528 -3659 -6279 3727 1948 -5284 689 3145 -4274 83 6082 -2228 -4046 5421
1468E421k407o480N936J332o603M427M829q523j537Q586k840o221N447J92o608
$$ 5421 3014 -3466 2470 3802 -2801 1626 6455 -2068 -3605 4981 2141 -4080 1367 1559 -5049
1483e049M514M438q663j171Q062l390n231N705O9o886N310M705q648m27Q616l229
$$ -5049 -535 3903 -4760 -5931 2131 -1259 -6490 -785 -716 -7602 -2292 2413 -6235 -6662 1954 -1275
1499a275m894O952p33o289O844M363q855P42Q508m371l680P542k130o575P695
$$ -1275 -6169 783 50 -6239 605 4968 -3887 -3145 5363 992 -2688 4854 2724 -3851 3844
1514C844L291r757J778P116n704j991O513l730n677P500J661q948J577O156n521
$$ 3844 7135 -2622 -844 6272 568 -1423 5090 1360 -4317 3183 4844 -4104 -2527 3629 -1892
1529a892j495N833l649n137O971J726q041J603N767m625j443N970l545m972P540
$$ -1892 -3387 2446 -1203 -6340 631 2357 -5684 -4081 1686 -2939 -4382 1588 -1957 -6929 611
1544F11J989q193K110O148n267q79O724m405m876Q627J429q311L354N615o168
$$ 611 2600 -5593 -3483 2665 -2602 -3481 3243 -1162 -6038 2589 4018 -4293 -939 4676 -1492
1559a492N24O465n832l625R029K8p393L788M189o277J914N499o512l426P972q67
$$ -1492 -968 5497 -335 -3960 5069 5097 -2296 1492 5681 -596 1318 6817 305 -3121 4851 3984
1575C984o918L761K161n819J861M580o141l212P206q55o389L588K328n292J503
$$ 3984 -2934 827 2988 -2831 -970 3610 -2531 -5743 1463 608 -5781 -2193 135 -5157 -3654
1590c654N811n975l375Q238k67o403M337L145n911K826O192o450k382Q730j331
$$ -3654 2157 -3818 -7193 1045 778 -5625 -1288 1857 -4054 -1228 4964 -1486 -3868 4862 3531
1605C531o225N589J763o618M139N219p736j655Q319l083n173N548l71o126M736
$$ 3531 -2694 2895 4658 -1960 2179 7398 -338 -1993 6326 3243 -1930 3618 3247 -2879 1857
1620A857L856q047o25O755l075m155N074j461m906M722K933o742k82O147k682
$$ 1857 5713 -2334 -2959 3796 721 -3434 1640 179 -4727 -5 2928 -3814 -4096 2051 -631
1635f31l800N003l99n164M572L357o356n65O595k695l457N035o55n250N135L649
$$ -631 -4431 572 173 -4991 -419 2938 -3418 -3983 2612 -83 -3540 1495 840 -4410 725 4374
1651D374p227J56O663l077l054N687j623n580O046L470p700R50O301m610j889
$$ 4374 -2853 -2697 3966 889 -2165 3522 1899 -3681 2365 5835 -1865 -915 5386 776 -1113
1666a113N943k921n214O419J970p676J177N180m870q96N101l835m059N843J478
$$ -1113 4830 1909 -3305 3114 5084 -2592 -1415 3765 -1105 -2001 3100 -735 -4794 1049 2527
1681B527p011J942M085m173p17N044l470l807O046J544o004J953M292l908k81
$$ 2527 -4484 -2542 1543 -2630 -3347 1697 -1773 -5580 466 2010 -3994 -2041 2251 -1657 -1938
1696a938N205l120l908O375J494o456K139M310m649JN609m302m112O657Q94o976
$$ -1938 3267 147 -3761 2614 4108 -2348 -209 4101 -548 -547 5062 760 -3352 3305 4199 -2777
1712b777K853L479n374L37N814n121l820O902j40o299L784K541n536J750N026
$$ -2777 76 3555 -1819 -1482 4332 -789 -4609 2293 2153 -4146 -362 2179 -3357 -1607 3419
1727C419n195k971P040q33n244L743K163m948K203M184m761k164O031p32m523
$$ 3419 -1776 -4747 2293 1460 -3784 -41 2122 -2826 -623 3561 -1200 -3364 2667 1935 -2588
1742b588L125J563m768K163M340n360k164O270n78n147L805J489n039K664M398
$$ -2588 537 2100 -2668 -505 3835 -1525 -3689 2581 2003 -3144 661 2150 -2889 -225 4173
1757D173n542k059O054j002m259L979P83n314L105M138o090j220O459k585l723
$$ 4173 -1369 -3428 2626 1624 -2635 1344 2127 -3187 -82 4056 -2034 -3254 3205 620 -3103
1772c103M491k37n083L955L423o121k26N435k937k651M603o64m777M382K988n777
$$ -3103 1388 1151 -3932 23 3446 -2675 -2901 2534 -403 -3054 1549 885 -3892 490 3478 -2299
1788b299k1N146k588k274M308j128m185M437K375n113N0M344k744k178M335j530
$$ -2299 -2320 2826 238 -2036 2272 1144 -3041 1396 3771 -1342 -1292 3052 308 -1870 2465 935
1804I35m397M221K217n326j56M705l075k309M629j623m580M949K395o218R56M882
$$ 935 -3462 759 2976 -2350 -2506 2199 -876 -3185 1444 -179 -4759 190 2585 -3633 -2677 2205
1820B205l406j423N081k231m336N770J621n597J949L928m070j65M709l005l743
$$ 2205 -1201 -2624 2457 226 -4110 1660 3281 -2316 -367 3561 -509 -674 4035 1030 -2713
1835b713N238J297n438J782L032l845k46M613l820l252M892P59n048J897K690
$$ -2713 2525 3822 -1616 166 3198 -647 -893 3720 -100 -3352 1540 2299 -2749 -852 1838
1850A838m022K96M158l055l326M946P56m955K325K858m242P85M559l808k827N479
$$ 1838 -2184 -1888 2270 -785 -4111 835 1591 -3364 -1039 1819 -2423 -1638 2921 -887 -3714 1765
1866A765L20m607K485K458m398J393M395m335k671N689k71m677L378J649m547
$$ 1765 2085 -2522 -37 2421 -1977 -584 3811 -524 -3195 2494 2223 -2454 924 2573 -1974
1881a974J789M467m761j951N765j146m307L717J091m688K317L902n180j531N386
$$ -1974 -185 4282 -479 -2430 3335 2189 -2118 1599 2690 -1998 319 4221 -959 -2490 2896
1896B896j552l681L721K28m725K879L180n045j168M919j863l089L344K00m224
$$ 2896 1344 -2337 1384 1612 -3113 -234 2946 -2099 -3267 1652 -211 -3300 44 244 -3980
1911c980K722L474m777q21N104j847k572M083K89m725L356L675m949o85N075j895
$$ -3980 -1258 2216 -2561 -3382 1722 -125 -2697 1386 1675 -3050 306 3981 -968 -1653 3422 1527
1927A527k810M473n36m638L772K914n024n72M384k673k437M530j686m577M067
$$ 1527 -1283 3190 2654 -1984 1788 4702 -322 -894 3490 817 -1620 2910 1224 -3353 714
1942G14K247n599M43L755l041j350M129j945m057M183K048m783O62L816l061r08
$$ 714 2961 -2638 -2195 1560 -1481 -2831 1298 -647 -4704 -521 1527 -3256 -2594 1222 -1839 -2747
1958b747M286k025l827M610J954m696Q86L441k930r08M495k015l957M853J537
$$ -2747 1539 -486 -4313 297 2251 -2445 -1559 1882 -1048 -1956 2539 524 -3433 1420 2957
1973B957n038J300L638l860l10M630k849l488M865J048n132J948L270m447M83
$$ 2957 -2081 -781 2857 -1003 -1313 3317 468 -3020 1845 2893 -2239 -291 2979 -1468 -985
1988i85M492l704l103N092qm636K659J820m082P48M038l918k453M739j65m298
$$ -985 3507 -197 -3300 1792 1784 -2852 -193 1627 -2455 -1707 2331 -1587 -4040 699 534 -3764
2004c764K746J533l933J266L557l314j999M541kl929K804J796l551J005M035l251
$$ -3764 -1018 515 -3418 -2152 1405 -1909 -3908 633 631 -3298 -494 1302 -2249 -1244 2791 -460
$$ [...]
8191C
##END NTUPLES=NMR FID
##END=
