##TITLE=1H_Hex-Dep2
 200.13MHz, CDCl3,
 8 sc
 
 14.8.2025
##JCAMPDX= 6.0         $$ Bruker NMR JCAMP-DX V2.0
##DATA TYPE= NMR FID
##DATA CLASS= NTUPLES
##ORIGIN= UXNMR, Bruker Analytische Messtechnik GmbH
##OWNER= pz
$$ XWIN-NMR		Version 3.5
$$ Thu Aug 14 16:25:21 2025 Russian Standard Time (UT+4h)  she@DPX200
##.OBSERVE FREQUENCY= 200.1313
##.OBSERVE NUCLEUS= ^1H
##.DELAY= (6, 6)
##.ACQUISITION MODE= SIMULTANEOUS
##.ACQUISITION SCHEME= undefined
##.AVERAGES= 8
##.DIGITISER RES= 18
##SPECTROMETER/DATA SYSTEM= spect
##.PULSE SEQUENCE= zg30
##.SOLVENT NAME= CDCl3
##.SHIFT REFERENCE= (INTERNAL, CDCl3, 0, 14.3821)
##AUDIT TRAIL= $$ (NUMBER, WHEN, WHO, WHERE, WHAT)
$$ ##TITLE= Audit trail, XWIN-NMR		Version 3.5
$$ ##JCAMPDX= 5.01
$$ ##ORIGIN= Bruker BioSpin GmbH
$$ ##OWNER= she
$$ F:/spectra/data/she/nmr/H-C/1/audita.txt
$$ ##AUDIT TRAIL=  $$ (NUMBER, WHEN, WHO, WHERE, WHAT)
(   1,<2025-08-14 16:24:13.78 +0400>,<she>,<DPX200>,
      <created by zg, POWCHK disabled, PULCHK disabled
       configuration hash MD5:
       00 E9 B6 7A A2 85 ED C7 34 08 36 98 17 FE 4E 26
       data hash MD5: 16K
       A4 C7 F5 79 C6 73 D4 C2 39 26 01 A7 3D FA E5 97>)
$$ ##END=
$$ 
$$ hash MD5
$$ 9B 0C 8C E7 39 87 40 A0 5E F1 DB 7B B3 A0 44 1B
##$RELAX= 
##$RELAX= 
##$RELAX= 
##$RELAX= 
##$RELAX= 
##$RELAX= 
$$ Bruker specific parameters
$$ --------------------------
##$DU= <F:/spectra>
##$EXPNO= 1
##$NAME= <H-C>
##$PROCNO= 1
##$TYPE= <nmr>
##$USER= <she>
##$AMP= (0..31)
100 100 100 100 100 100 100 100 100 100 100 100 100 100 100 100 100 100 
100 100 100 100 100 100 100 100 100 100 100 100 100 100 
##$AQSEQ= 0
##$AQ_mod= 1
##$AUNM= <au_zg>
##$AUTOPOS= <>
##$BF1= 200.13
##$BF2= 200.13
##$BF3= 200.13
##$BF4= 200.13
##$BF5= 200.13
##$BF6= 200.13
##$BF7= 200.13
##$BF8= 200.13
##$BYTORDA= 1
##$CFDGTYP= 0
##$CFRGTYP= 5
##$CHEMSTR= <none>
##$CNST= (0..31)
1 1 145 1 1 1 1 1 1 1 1 1 1 1 1 1 1 1 1 1 1 1 1 1 1 1 1 1 1 1 1 1 
##$CPDPRG= <>
##$CPDPRG1= <>
##$CPDPRG2= <>
##$CPDPRG3= <>
##$CPDPRG4= <mlev>
##$CPDPRG5= <mlev>
##$CPDPRG6= <mlev>
##$CPDPRG7= <mlev>
##$CPDPRG8= <mlev>
##$CPDPRGB= <>
##$CPDPRGT= <>
##$D= (0..31)
0 0.7 0 0 0 0 0 0 0 0 0 0.03 0 0 0 0 0 0 0 0 0 0 0 0 0 0 0 0 0 0 0 0 
##$DATE= 1755174253
##$DBL= (0..7)
120 120 120 120 120 120 120 120 
##$DBP= (0..7)
150 150 150 150 150 150 150 150 
##$DBP07= 0
##$DBPNAM0= <>
##$DBPNAM1= <>
##$DBPNAM2= <>
##$DBPNAM3= <>
##$DBPNAM4= <>
##$DBPNAM5= <>
##$DBPNAM6= <>
##$DBPNAM7= <>
##$DBPOAL= (0..7)
0.5 0.5 0.5 0.5 0.5 0.5 0.5 0.5 
##$DBPOFFS= (0..7)
0 0 0 0 0 0 0 0 
##$DE= 6
##$DECBNUC= <off>
##$DECIM= 32
##$DECNUC= <off>
##$DECSTAT= 4
##$DIGMOD= 1
##$DIGTYP= 9
##$DL= (0..7)
0 120 120 120 120 120 120 120 
##$DP= (0..7)
150 150 150 150 150 150 150 150 
##$DP07= 0
##$DPNAME0= <>
##$DPNAME1= <>
##$DPNAME2= <>
##$DPNAME3= <>
##$DPNAME4= <>
##$DPNAME5= <>
##$DPNAME6= <>
##$DPNAME7= <>
##$DPOAL= (0..7)
0.5 0.5 0.5 0.5 0.5 0.5 0.5 0.5 
##$DPOFFS= (0..7)
0 0 0 0 0 0 0 0 
##$DQDMODE= 0
##$DR= 18
##$DS= 0
##$DSLIST= <SSSSSSSSSSSSSSS>
$$ [...]
##$SUBNAM0= <"">
##$SUBNAM1= <"">
##$SUBNAM2= <"">
##$SUBNAM3= <"">
##$SUBNAM4= <"">
##$SUBNAM5= <"">
##$SUBNAM6= <"">
##$SUBNAM7= <"">
##$SUBNAM8= <"">
##$SUBNAM9= <"">
##$SW= 18.0517328524113
##$SWIBOX= (0..15)
0 0 2 0 0 0 0 0 0 0 0 0 0 0 0 0 
##$SW_h= 3612.71676300578
##$TD= 16384
##$TD0= 1
##$TE= 0
##$TE2= 300
##$TE3= 300
##$TEG= 300
##$TL= (0..7)
0 120 120 120 120 120 120 120 
##$TP= (0..7)
150 150 150 150 150 150 150 150 
##$TP07= 0
##$TPNAME0= <>
##$TPNAME1= <>
##$TPNAME2= <>
##$TPNAME3= <>
##$TPNAME4= <>
##$TPNAME5= <>
##$TPNAME6= <>
##$TPNAME7= <>
##$TPOAL= (0..7)
0.5 0.5 0.5 0.5 0.5 0.5 0.5 0.5 
##$TPOFFS= (0..7)
0 0 0 0 0 0 0 0 
##$TUNHIN= 0
##$TUNHOUT= 0
##$TUNXOUT= 0
##$USERA1= <user>
##$USERA2= <user>
##$USERA3= <user>
##$USERA4= <user>
##$USERA5= <user>
##$V9= 5
##$VALIST= <valist>
##$VCLIST= <CCCCCCCCCCCCCCC>
##$VD= 0
##$VDLIST= <DDDDDDDDDDDDDDD>
##$VPLIST= <PPPPPPPPPPPPPPP>
##$VTLIST= <TTTTTTTTTTTTTTT>
##$WBST= 1024
##$WBSW= 4
##$XGAIN= (0..3)
0 0 0 0 
##$XL= 0
##$YL= 0
##$YMAX_a= 325010
##$YMIN_a= -370642
##$ZGOPTNS= <>
##$ZL1= 120
##$ZL2= 120
##$ZL3= 120
##$ZL4= 120
##$ABSF1= 10
##$ABSF2= 0
##$ABSG= 5
##$ABSL= 3
##$ALPHA= 0
##$AQORDER= 0
##$ASSFAC= 0
##$ASSFACI= 0
##$ASSFACX= 0
##$ASSWID= 0
##$AUNMP= <proc_1d>
##$AZFE= 0.1
##$AZFW= 0.1
##$BCFW= 1
##$BC_mod= 2
##$BYTORDP= 1
##$COROFFS= 0
##$CY= -3
##$DATMOD= 1
##$DC= 2
##$DFILT= <>
##$DTYPP= 0
##$F1P= 0
##$F2P= 0
##$FCOR= 0.5
##$FTSIZE= 0
##$FT_mod= 4
##$GAMMA= 1
##$GB= 0.15
##$INTBC= 1
##$INTSCL= 1
##$ISEN= 128
##$LB= 0.25
##$LEV0= 0
##$LPBIN= 0
##$MAXI= 10000
##$MC2= 0
##$MEAN= 0
##$ME_mod= 0
##$MI= 1.114404
##$NCOEF= 0
##$NC_proc= 0
##$NLEV= 6
##$NOISF1= 3.799351
##$NOISF2= 2.8
##$NSP= 1
##$NTH_PI= 0
##$NZP= 0
##$OFFSET= 14.38212
##$PC= 1
##$PHC0= -1561.593
##$PHC1= 11.59228
##$PH_mod= 1
##$PKNL= yes
##$PPARMOD= 0
##$PSCAL= 0
##$PSIGN= 0
##$REVERSE= no
##$SF= 200.129724274929
##$SI= 16384
##$SIGF1= 3
##$SIGF2= 2
##$SINO= 400
##$SIOLD= 16384
##$SREGLST= <1H.CDCl3>
##$SSB= 0
##$STSI= 0
##$STSR= 0
##$SW_p= 3205.1282051282
##$SYMM= 0
##$S_DEV= 0
##$TDeff= 0
##$TDoff= 0
##$TI= <>
##$TILT= no
##$TM1= 0
##$TM2= 0
##$TOPLEV= 0
##$USERP1= <user>
##$USERP2= <user>
##$USERP3= <user>
##$USERP4= <user>
##$USERP5= <user>
##$WDW= 1
##$XDIM= 8192
##$YMAX_p= 0
##$YMIN_p= 0
$$ End of Bruker specific parameters
$$ ---------------------------------
##NTUPLES= NMR FID
##VAR_NAME=  TIME,          FID/REAL,        FID/IMAG
##SYMBOL=    X,             R,               I
##VAR_TYPE=  INDEPENDENT,   DEPENDENT,       DEPENDENT
##VAR_FORM=  AFFN,          ASDF,            ASDF
##VAR_DIM=   8192,          8192,            8192
##UNITS=     SECONDS,       ARBITRARY UNITS, ARBITRARY UNITS
##FACTOR=    0.0002768,     1,               1
##FIRST=     0,             0,               0
##LAST=      2.2672688,     0,               0
##MIN=       0,             -370642,         0
##MAX=       2.2672688,     325010,          0
$$ Real data points
##PAGE= N=1
##DATA TABLE= (X++(R..R)), XYDATA
$$ [...]
1829a29p4J20L98n86N0j3M43j27k24L56l1j29j09J36J28j62m1q5J50l1k21L66
1851A85q5l64j6J65j25R5J08K00q2m27L00M04m33j0K06k59M13n87J21L99q3n79
1873d54N33m00M53m77R2l8J37K28J37p5O1m7j87K47k73j44K90j78l64O23j68k91
1895b95k18M52K13p1j26K51J40n17O1J93J03j80j57J92N24m75M0k37ok9j82L14
1917a0M8j79j58K84L3K10J13n95K46k38J75L4N0k72L24j77J05JQ4J13k47k9L06
1940B21l40K98k48j93N09j17l08O4K86r0l03K74J45n6k77j30M54r5k59R1k94L79
1962A1p2k02K54KJ33p8j9j76Q3N7J88l80J90L68m61Q4L6K4o7k5L8J14r9k55K67
1987A5R7l19J65j69L72l28r5K0M40j34j3j10N4J68k51p7K39J51l16K93j00J0n5
$$ y = [-129, -203, -83, 315, -271, -221, -234, 209, 82, -142, 214, 183, 54, -55, 81, 209, 47, 6, -79, 71, 40, -181, 185, 100, -264, -280, -115, -240, -145, -37, 163, 81, -346, -46, 358, -75, -85, 121, -138, 275, -312, -191, 208, 125, -454, 79, -321, 132, -345, -253, -291, -154, 74, 211, 136, 197, 150, -37, 210, -63, -207, 83, -95, -459, 164, -4, -295, -513, -61, 152, 81, -45, 206, 346, -171, -110, 83, 186, 6, -151, 41, 565, 90, 130, -107, -113, -142, -324, -10, 38, -141, -299, -15, 18, 228, 341, -254, -8, -246, -71, -37, 13, -259, 65, -112, -7, -6, 78, 191, -56, -85, 221, -119, 179, -69, -262, 247, 130, -178, -114, 172, 82, -221, 53, 198, 142, -135, -265, 189, 94, -165, -74, -368, 11, -61, -263, -9, -7, 126, 48, 29, -147, -64, -7, 181, -199, -9, 359, -102, -18, 18, 42, -25, -50, -12, 102, 3, -252, 15, 112, -207, -42, -211, 161, -167, -262, -242, 198, 64, 51, -59, -5, 163, -88, -165, 74, 225, -91, 202, 102, 112, 57]
2010E7k3k08L8J97m8j83R5K35m08K24J59n4J90k28j89K78J33k36J37l67P7L49
2032B25m40l6K71J15k28J79m7R3J32l6n1k90K21Kk67M8j76P36n70q5N8J20j69
2055a95K3J53j85L60m94K65K53m02r0N64m73P0n0J88Qj1j20M35J42o06K2J56Q5
2078I8j17k91M20n5l02M05J01j82R5O6j57o6l08L70j60j26j25L06J14J44m81K09
2100d2q0nj26K77J02k73J14o6L04k44k07N16j49l01K5M3Q0j22p2L91k73k72K27
2123a53Q5J00o6o7J60P8l62K85j36J15J7K28k68L6k74K83J66m21L13P5j88lm9
2146d6q8K18l75K9M49j36j31K33j18K9K4l34O43m98j70K67J00m22K72J87j17k9
2168a3j62K04j0L12l78J82K9Rm76M02M7j02j9K9J23m9j55J44j99J69l58L41p0
$$ y = [57, 34, -174, -136, 61, 13, -170, -75, 160, -248, -24, 135, 81, 271, 43, -146, 132, 265, 29, 166, -201, -124, 225, -215, -251, 20, 135, -93, 86, 39, 132, 264, 228, 177, -113, 108, 110, -157, -109, -285, 451, -119, -204, -146, -26, -195, -172, -19, -204, 156, -338, -73, 180, -222, -312, 252, -221, -151, -201, -13, -5, -16, -136, 299, 441, -165, -143, 13, 98, -19, -310, 110, 55, -247, 158, 259, 77, 172, 238, 81, 15, -293, 77, -83, -209, -334, -28, 86, 230, -251, -42, -122, -127, -253, 24, 126, -147, -33, -99, 205, -39, -246, 270, 121, -180, -155, -112, -32, -154, -226, 165, -108, -380, -153, -68, 32, -34, -101, 59, 137, -225, 60, -76, 39, 56, 284, 16, 52, -222, 61, 227, -194, 119, 194, 6, 3, -46, -134, 84, -291, -262, 187, 51, -80, 153, 35, 64, 88, -246, 397, -101, -271, -4, 96, -326, -54, 133, 16, -13, -175, 29, 19, 331, -47, 135, 164, 173, -303, 99, 146, 44, 25, 54, 177, 128, -27, 117, -82, 87, -271, 70, 0]
2191@r4J62j53L12j52j25K10J07p9k06o7K70q6k42L09R8l53n7P3K51k71r8M16
2214B25l72o7K48K02l65K53k90L70K41m97j93L92k53R8M0J09k22P6J16Q2j64j90
2236a61L06L0j41j38Q2j02J7j15K59K18j51j28J11o4J7l11L48M4l12K35P9r9J36
2259A60k13q1L18j00j51J96k53l3M73n11M85k69j69K50k27L67j53j96L17l65r6
2280b51N13j87k30L91j09k06L67n30M87p6j1j9l76J76K11k61L00k23l14M51j21
2301a8j06K44j19J4N1P2k19J51p2J40k56J64N1K95l23r7J82k12K01j87J27n0j00
2324f7N7P0j19q8nJ07J97j19M3j55j52K37p2o3M7K4l2k01L43j06l2J70K2r7j18
2349a09K89p6j72J53J46l47L52l37R5J71k91J64j16R4j53k77M82q8j61L26k17
$$ y = [0, -94, 68, -85, 227, 75, -50, 160, 267, 188, -18, -85, 185, 99, -143, 166, 264, -89, -146, -73, 178, -93, -191, 225, -147, -214, 34, 236, -129, 124, -166, 204, 445, -52, -245, 147, -106, -8, 32, 141, -81, -5, 111, 193, 29, -161, 145, 175, 34, -104, -22, -124, -107, -222, 37, 255, 104, -24, 87, 23, 40, -271, 77, 121, -191, 44, 123, 24, 160, -53, -134, 184, 84, -67, 129, -124, -157, 316, -195, 290, 21, -148, 102, -125, 242, 89, -107, 210, -155, -251, 262, 75, -155, 236, 127, -79, 288, -242, 245, 169, 158, 139, -237, -61, 150, -111, 189, -34, -348, 103, -18, -124, 120, 1, 15, 66, 138, -81, 70, -2, 138, -118, 46, 97, 392, 69, -28, 154, -58, 143, -44, 83, 33, -67, -10, 60, -59, -147, -152, -45, 152, 33, 76, -79, -231, 6, -66, -129, -82, -58, -90, -291, 52, -54, -86, 84, 106, 9, -109, 180, 104, -68, 85, 231, -116, 236, -101, -6, 165, -126, 38, -78, 16, -137, -414, 68, -20, -181, 145, -72]
2370g2l7J52J20k68R6M3k53L94k34l6K22k28K03k09LJ44O6j30q0J20O1J8k38j70
2394c13N84j21k77J80k65L66l0n9O2k39J33J75l52Q2P6L4j44O3m6r5J58L0k9J
2418b6j8M6J45M3ok12l9Q6j19L3KL05j56n9r2L3m3j12J24p1K13k92L27m05J10
2443a83J27K61l09K22ok7P3r4j47J97l99R5M63m53O9J01k80P8P6l0M6k0j3J20
2467c3n0P2j01l2J35Kk4N3J16k26L90n17J14M9N8l04L66j68J23n7j8R9r1j07K09
2492E8k07P6k4Q1l6k51L69m8n8J4m8N7k18O6J2J25k26J76L60j81q8Or9K27j21
2517B2j94K77m0l3j5k15M20l64J20J2R7k43L89j26p8j11J03k0N5j51K3K29k34
2540g7l8L50j48k18K23k53J38j54k9K11q9l0L11j10J96l78L39N5k63j36r2J28
$$ y = [-72, -109, 43, 163, -105, -9, 34, -219, 175, -59, -95, 127, -101, 102, -107, -104, 40, 106, -24, -104, 16, 77, 95, -143, -313, 271, 150, -127, 53, -212, 154, 124, 65, 127, -112, 21, 196, -156, -74, 2, 36, -108, -45, -91, -186, -28, 2, -27, -26, -44, 2, 147, 190, 184, -28, -67, 19, -100, -67, -65, 240, 84, 25, -67, -34, -77, -189, -65, -136, 77, -215, 112, -293, -183, -56, 205, -104, 118, 112, 85, 158, 64, -83, 114, -285, -190, 273, -180, -111, -10, -290, -212, -136, -166, -120, -140, -153, -33, -83, -11, -112, -144, -9, -7, -31, 22, 138, -88, 302, -215, -101, -52, 6, -298, 68, -100, 23, -34, -52, 47, -44, -151, 58, -149, -73, -97, -16, -52, -303, 66, 18, -40, -26, -74, -17, -235, -169, -157, -32, -258, -82, 278, 97, 9, 15, -84, 143, 22, -172, 105, 65, 32, 17, -198, 222, -142, -22, -10, 87, -156, 233, 107, 29, -82, 21, 1, 56, -95, -72, 157, -77, -115, 235, 87, -131, 92, -161, -23, -177, -206, 5, -84, -114, 197, 87, 283, -95, 244, 299, 36, -100, -192, -64]
2562f4K46l01J84j56p6M68j62J0m05J30J54J96l39O7ML48l44j34K42K71j22k74
2584e7P8L33j91j94k46Q1J44j8R6r8J12N5L3p6l72K98j67P2j00L52n0j64n7K93
2608A57J12l77k14N5L35J16k46J14J53l07J5K66j76N1j11L01k77L7N4P8l8o9J28
2631A57J8l7k20M55k01k84K44j67K64q0j47J51r7j99K54k10K64j63K37l40N8K31
2653A88k87L58k89K7k39N38k38n3r2k22L45R2oj84j18J44M5L40j95j19Q9o9j71
2676a16K65J87j80j47lJ94Lj56j57J64M5j11n8P4r9J76k12L22O0l94J53l3p5K97
2700A99j97k43L60j65Q2k30J00P6P9k25L71k15j67L05k70J75k00J70p6K48l23
2721a46L09k65J93n2J6j65L4n3J65J9j30J8oK60k97p7J88qM3J48j55j62j68L51
$$ y = [-64, 182, -119, 65, -91, -167, 301, 139, 149, -256, -126, 28, 224, -115, -48, -44, 304, -40, -174, 68, 339, 217, -57, 21, 354, 163, -31, -277, -196, -52, -70, 26, -72, 40, 95, 128, 52, -320, -22, -189, -117, -217, 135, 85, -79, -136, 157, 269, -108, -322, -267, 68, 184, -62, 52, 205, -102, -87, 179, 3, 54, -57, 244, -33, 4, 58, 136, 98, 29, 157, 175, 138, -82, 373, 172, -112, 132, -35, 229, 149, 2, 153, 56, -143, 111, -99, 165, 2, 239, -101, -43, 188, -99, 259, -30, -3, -242, 296, 58, 5, -87, -309, 36, 128, 122, -62, -180, -36, 9, 349, 154, 35, 124, 55, -116, 149, 336, 156, 9, 6, 200, 203, 47, -110, 54, 99, -12, -70, 4, -95, 81, -131, 191, 251, -143, 10, -23, -98, 199, 2, -241, 119, -46, 36, -194, -94, -18, 61, -164, 207, -8, -175, 130, -140, 35, -165, 5, -71, 177, -146, 163, -102, 91, 39, 55, -110, -76, -129, 36, 55, -75, -57, -63, 197, -100, -177, 11, 3, 46, 194, 39, -123, -291, 60]
2745F0J29l64K20j60J52j26r4J93M2j64J17L24l47k7Q6j36j14J42K96J27k65l09
2767b18L34J23m08K92Q7p1k42k05J38K26J02k16K21j47K1q0j57J30J61R4q7j20
2789b2Q9k44L04m52Q5J74K34l03O1Q0K32n17L18J97l11J48m40L86k1N3J9k62r0
2812b82J86K9O6J1J22j18j30Q5J16m9J71j69P8J69k22j20N26l33R9P6p4l45L65
2835B57l02L1J18r8j13o0J60J10j69j33P9J4k6J75K0j44L65k02j52O4P3J08n7
2858A18r8k08J62N2M1k17R1N9Q2K02j83K6j35J20n9J06j62J00j37l6k46L70J07
2881A55l5k16r2K32J26P2j43m55M43j5K1j25K58r5k83J80j34J40L5q6J52m5j66
2904g6R6j54L22j93j26JJ73j69m9J2K7J56O3k96J82o5L2J16K6J48p9l9p6r1J99
$$ y = [60, 189, -175, 45, -115, 37, -89, -183, 10, 52, -112, 5, 329, -18, -45, 41, -95, -209, -67, 229, 356, 91, -218, 116, 239, -169, 123, 210, 139, -103, -308, -170, 56, 158, -58, 163, 16, 37, -43, -200, -70, 91, 185, 98, -22, 67, -177, 127, -325, -240, -66, 168, -135, -74, 6, 238, -279, 39, 236, -75, 73, -367, 19, -2, 51, 70, -192, -282, -96, -67, -1, 10, 132, 14, -116, -31, 85, 36, 207, 38, 116, 285, 63, -57, 469, 136, 235, 311, 237, -108, 257, -45, -14, 104, 6, -107, -167, -7, 103, -66, -199, -120, -106, -132, 43, 63, -81, 284, 82, -70, -6, 67, 175, 118, 20, -188, -26, 26, 67, -150, -59, 0, 82, 284, 101, 127, -8, 112, 53, 159, -3, 97, -40, -76, -322, 48, 155, 120, -96, -188, 44, 170, 242, 99, -356, 87, 72, 93, -32, 226, 131, -152, 28, -106, 34, 69, -17, 135, 90, -76, 20, -134, 188, -5, -131, -130, 43, -126, -175, -163, -136, 20, 83, -213, -31, -96, -64, 52, 78, 226, 147, 108, 32, -59, 140]
2929A40m70L83j63q8M13k34K6j14K19l35M68n4J47m79J49N8j41J34l16L57J50
2950B50k37n8J42J36k72j6J55j91K20j09j24k0K3J09l3m2J26m8j47K56j98J5K33
2973A70p1n6J18k36j02J11K44j78p4K8O8M00l34n7J21k14nK38k20Mo7M9K32l75
2997b06K61J49k89J27k46K69k45J72J57Kj62J37k97J36J0O5j12J54j56L7K7r2
3019a02L48l50rR1J50n0L7K9k21R1l2o4j64J36K30j19K0J56P0m52K31J05k86K10
3043E5J4lj2K16m49K80k73K20r2L37l13K61l65L2P7r0k4L13j66j46J69Q3j10j13
3067i9J16q1K11j95K13j55M7j48M5j31N4l44K88J66Q4j26p4j29nK27N1O3o3pj07
3092i9J25j21j76K43r8K68n0j38J41j54K1p5K67j47J80o2L5j64o4l3M2j85P1L66
$$ y = [140, -330, 53, -110, -198, 215, -19, 7, -107, 112, -223, 245, 191, 338, -141, 8, 66, -75, 59, -257, 100, 250, 13, -45, 97, 233, -39, -55, 100, -91, 129, 20, -104, -124, -101, 8, -25, -67, 59, 11, -136, 120, -78, -63, 170, 99, 43, 161, -75, -177, -66, 178, 0, -74, -46, 22, 422, 88, 31, 152, -62, -67, 171, -49, -45, -112, -63, 169, -206, 55, 204, -85, 42, -204, 65, -180, -8, 149, 151, -11, 126, -171, -35, -25, 40, -72, 82, -74, -37, -10, -102, 246, -104, -113, -22, 128, 78, 115, 144, -77, 14, -18, -82, -246, -110, 120, 1, 21, 177, 247, -205, 26, 131, -155, 55, 69, 66, 54, 270, -179, 101, -172, 48, -44, 293, -20, 241, -124, -92, -15, -105, -129, 184, 18, -128, 41, 124, 14, -99, 17, -64, 147, -48, 165, 10, 57, -91, -46, -177, -123, -467, -179, -13, 71, -55, -129, -258, -263, -36, 15, 78, 15, 8, -99, 26, -95, -271, -28, -126, 142, 92, -46, 95, -59, -38, -113, 154, 7, 187, 125, 160, -4, -68, -101, -59, -244, -173, 193]
3116A93Q6m82PJ09j08K73K7J06j68q6k7q8K73l53L82m0j35J49l34J84q8M9J71
3139A00j72Q9N0j34n1J14j38P3J03n7k3R8J38k29j7j01M83k84M1Q9k97O5J37L1
3163A08l30J78N8J31k73J43O8k7l29L32N7j61j04M3K86q6l1o2l0O9N6R3l24Q8
3187d7j25J49K52m29L08j34k33J88L27k70l9l2L3J53k85J21J42n3N4j26j48K13
3209A9L10l45M99o46K78n2j71m8K54l40K19K41k60M02l64J83j23k73J69M0j53
3230a61P3J49lL7j67K32Nk45P0j18K85k64j47K38K28k19k00J08P0j04J28j38M
3253a39J83q3L49l08k09r0L81l26K45m3L10j58j07m5j41K4M31m12QJ99l80M68
3275A57j05j7O1l2n8K37j02l21Q0J00J09R7k66L5n4J15j40R7j99K24j07L00M0
$$ y = [193, 279, -203, -196, -87, -195, 78, 105, 211, 43, -43, -70, -158, 115, -238, 144, 104, -31, 118, -216, -32, -120, -71, 100, -72, 17, 67, -67, -118, -4, -142, -69, 34, -23, -46, 52, 190, -39, -56, -157, 326, 42, 83, 172, -125, -60, 77, 108, -222, -44, 14, 145, -128, 15, 83, 56, -273, 59, 116, -45, -149, -106, 180, 94, 63, 1, -29, 40, 96, 189, -135, -47, -172, -23, 229, -200, 108, -26, -259, -71, 256, -14, -53, -85, -52, 101, -184, -63, 79, 26, 80, -46, -194, 19, 329, -16, 483, -163, 115, 63, -108, -156, 98, -242, -23, 218, -42, 360, -4, 179, 56, -217, -48, -8, -161, -88, 61, 58, 95, -72, 160, 165, -80, -10, -128, 157, -107, -254, -16, 212, -7, -207, -99, -29, -133, -5, -143, -139, 44, -39, 310, 2, -207, -297, 84, -242, 3, -40, 270, 112, 5, -40, -181, -157, 274, -138, -130, 69, -311, 157, 52, 35, 96, 64, 6, 243, 141, -180, -100, 0, 109, 206, -60, -25, -79, 36, -104, -7, -206, 18, -89, 211, 251]
3298B51n10M30k94O4O6j70m9L96k69J02J32n40N55l54P9K31l4j52K40o3j36M17
3320C92n74J44Ml8J15j3k18K54j06N4n7J85l09J63J30P6m33R0J69j3K60o02M08
3343H1J1J8j06J06q3j3j99M1J20m6po8J24K8m3J65j98j73K40l51K92J29j20J16
3367F4m1J14o3j19j60L21Q5k68l4M6J2J40J57l72M0j02J59J73j42L6k59K72K27
3390B86l70K32j96M31j55j92M3J82l54k7J03L7J16j82J39lJ17k04L1%j21K18j9
3413A12n8j35J37k72K49J16k49L35n82M71j38L76m20n9P8K25M4l55J65P1o9J72
3435B14k93L07l3m54L28K2l59J99J4j4o2K07k9j97K08ln7k40K96k93L14O7j62
3458b0k9O5K15l87K44M0J20l98l6J57k75L45O4n3L9n9J23l8M9q5O4j99K21nl9
$$ y = [251, -259, 171, -123, -59, 7, -163, -212, 184, -85, 17, 149, -391, 164, -190, -111, 120, 86, -66, 174, 111, -25, 392, -182, -38, -34, -72, 43, 30, -188, 66, -40, 14, -43, 142, -167, -4, 126, 202, -231, -141, 28, 15, 275, -327, 81, 92, 110, 4, 110, 27, 14, -185, -144, -24, -70, -77, -145, -21, 7, -36, 129, -69, -242, -2, -353, -61, 68, -52, 64, 23, 137, 74, -45, -205, 116, 201, -67, -101, -55, -43, 97, 254, -118, -78, -180, -21, 152, 10, 46, -213, 59, 286, -84, 148, -48, 383, 228, 36, 79, 261, -93, -120, -17, 20, 136, -46, 93, 90, 207, 3, 34, 34, -87, 131, 112, 54, -81, 56, -216, 33, 149, -100, 235, -347, 124, -14, 362, -58, -117, -39, 186, 230, -125, 40, 111, 42, 214, -79, 228, 195, -259, 69, 91, -268, -69, -55, -69, -131, 76, 47, -150, 58, 55, -2, -242, 54, -239, 75, 142, -20, -49, 16, 231, -156, 88, 128, 248, -150, -186, -29, -304, 41, 105, 52, 91, 32, 155, 117, 166, 81, 145, -54, 167, 162, 123]
3483A23n6m0O4J88j37j31J12j25k26K74j28J65l38K99j78K97k67K74k09M0KK30
3505B33l68K01p0R2J91k98K7n0J05o2j55R3m1J35J72m76K49p9J10J36l38L16M5
3528A68m4L1j69O2j88j61J88L4j06QL1p0K09n0j03L90o4j43J57k88j70L16k28
3551a90K38J27k31RJ47j57J0K8j19K10l66M39o8j1R0J68l89K20k33J00j60j65
3573c03M56j39L0j2O8k4k3l12J80L25k11l6Q3P5L4j77j03J80j01j29K21l25J71
3596g2J21k90J27n4M8K4m5J02j75L16J8P2j71J4J82k74K60k68O1M2O5k13k84K44
3620a50J60J10l26K14P7n07M66MP4l24K80j9J83l31j47J00J87J5r9j93j22L82
3642C4J48k32K38j24j79J40o2J41J53k80K6O6j25R5Q5j07j54O1j25L2L08j0j49
$$ y = [123, 67, 27, 91, 279, 142, 11, 123, -2, -228, 46, -82, 83, -255, 44, -134, 163, -104, 170, -39, 1, 3, 233, -135, 66, -4, 88, 279, -19, 8, -42, 63, 1, -154, -61, -102, 33, 205, -271, -22, -101, 9, 145, -193, 123, 168, 124, 155, -14, 48, -140, -301, -113, -79, -185, -177, -146, -216, -7, -57, -160, 230, 166, 23, 180, -108, -278, 38, -190, 48, 175, -56, -47, 100, -57, -47, -19, -138, 72, -294, 145, 77, 66, 156, 324, -65, 155, -78, 22, -138, -303, 153, 14, 44, 32, 100, 76, 53, -259, -79, 246, 35, -1, 82, 157, 191, 14, -89, 91, -10, -139, 82, -243, -72, 49, -241, -114, -168, -120, -96, -141, -39, -214, 102, 120, 192, 21, 35, 217, -57, 203, -65, -4, 38, 103, -110, -394, -150, 10, 120, -206, 8, 85, -422, 44, 48, 122, -202, 78, 59, 242, -89, -236, -136, 51, 66, -33, -226, -348, 34, 182, -50, 188, 64, -115, 25, -37, 104, 257, -23, 3, 69, -56, 39, 124, 17, -137, -76, -201, -169, 139, 129, -20]
3665b0k09L93k98k18M3J23K45pL6q9j26RML7K31l15K14k78J0J65j45J84MK11k62
3690e8l48N04j85Q2J32l33j6K09N8J6j46O8m2M4M5m41O06j03k45J61j57L00J9
3713A70m07J65N2L07m56K02l0J48K57m97R2k95M95k51L9j91n5K04j70L42k67K72
3735A26l42K72J76k42o0K45k77K1K1J68l27J02J83k8P5j33M2j54K99l46N8J19
3757bJ41j53J52j18J98j19j17J45j6j42j36J70k33K51o7J18k91Q5j19J40L02n1
3779A38j90N4J02j82K00j79k93N16k22j69J01J91j98r1L07l04K55O1m5j91L23
3800A84l43J29j69O2kJ8J71j13J02k11L03J6j69J09k06L28Q2k14L3j79Q9j26M8
3823e8M3k16K22j69N9K73l37R6K0k68K61Q1R8k50K61j65J38r6P9j67J29J61k29
$$ y = [-20, -229, 164, -134, -352, -309, -186, 59, 52, 88, -1, -127, -118, -114, -77, 154, -161, 53, -225, -215, -50, -195, -11, -7, 204, -58, -406, 98, -87, -5, 127, -206, -222, -13, 45, 61, -85, -17, -59, -15, 30, -411, 195, 92, -153, 8, -149, 151, 170, -237, -72, -20, 287, -169, 33, 3, 151, 408, -89, 3, -292, 203, -48, -9, -200, -255, -51, -221, 121, -146, 126, -216, 56, 232, -10, -70, 175, -102, -81, -60, 108, -219, -117, 66, 38, 113, -20, 22, -132, 167, -179, -121, -2, 139, -14, 138, 20, 218, 99, -18, 127, 111, -31, -167, 3, -230, 21, -46, 72, -219, -134, -253, -113, 189, 138, -52, 2, 104, -78, 122, -57, -350, 166, -56, -225, -124, 67, -131, -222, 85, -219, 36, 97, 52, -139, 184, -159, -30, -199, -137, -139, -121, 50, -63, 39, -172, 131, 147, -22, 87, -119, 209, 291, 77, 110, -69, 20, -106, -58, -15, -231, -9, -178, -119, 154, -183, -87, -67, -335, -74, 7, 105, -145, 116, -49, 89, -7, 72, -95, 34, 195, -34]
3846c4k41L93P5l56L67j87R6K4j15o6k0M2r2j47L22q2M17m21J58j54K92j36m82
3869c47K49J27o5j25Q7J12J89k57K88k01p6k58L18J74l33j0KOP2k20L44j21R0
3892D5L10j72j54N5j28J07j10P7J26k87K68k19R9J0Q5j21J53p1j51M1J48j84j90
3915b63P8K97p0k41K79K5o0j4n5R2L3k58J5N2K86k34p6j70N04Pj65j27Q8J50k50
3940g7j40L35p6J61k83J81m2k00K92l23J37l7k1lj69L54l02L4L62N1j48k5q3k60
3964b82K75p2M4K48%j47p4p4K38l35J48j34M82l43N2r7p2j31L15j99K02k7J10
3987A27k18q9M40l39J42j00O2j3J46q2j99J18Q5n0j85j89L49j17M51m72J98n5
4009A0J34k64K41mp1j26J20j29m8J56J26O4j84j17o7K24Qj89J58m3Jj66K13k30
$$ y = [-34, -275, 118, 193, -163, 204, 17, 113, 137, 22, -44, -64, -22, -114, -261, 61, -21, 396, -25, 133, -21, 271, 135, -347, -98, 29, -36, -161, -74, 38, 227, -30, 258, 57, -19, -277, 41, 215, -118, -128, -126, -120, -48, -268, 76, -45, 45, 355, 183, 29, 84, -44, 63, -47, 30, 156, -131, 137, -82, 17, 27, 112, -9, 144, 73, -78, -37, 111, -73, -263, -185, 112, 42, -199, 80, 105, 45, 31, -24, 68, 101, -157, -142, -90, 196, -38, -114, -284, 220, 227, 62, -65, 23, 173, -77, -217, 118, 42, 203, -80, 101, 59, -141, 151, -172, -35, -72, -93, -96, -265, 89, -213, -179, 183, 234, 86, 61, -22, -282, -7, -79, -35, 213, 213, 66, -8, -82, 156, -179, -31, -165, 317, -26, 26, -71, -143, -274, 41, -158, 44, 17, 127, -91, -180, 260, -79, 63, -37, 25, 12, 158, 76, -123, -5, 80, 30, -155, -344, 5, -112, 339, -133, 65, 10, 144, -120, 121, 117, 46, -80, 40, -89, -137, 19, 145, 209, 25, -92, -159, 65, 73, -116, 42, -1, 0, -166, 47, -183]
4033a83K42L1j90L53k34J28l7q2l3J95j38K8l39PL40q2Q6R8n41K00Q5J87m2M8
4057A27j59J30k66J39m1J48k81K1L58k25m14O49m9r8j79N9n0J83Qj00Q8K0o3J52
4081A57J1j52j36J51j18j83J25R5K30l97J41L2L39l34J3K13l12J52K9k18l5L41
4103A44j1q9J28k9r5m3j67J9J2K10p2L40j79k34L0P5J35k42j27J51J24j77K8r
4127g8R6J28j48r7j57K38K2L9Mj81m4L74k61J50j16J04j66Q4j7J3K25j4j07k43
4151a52l8J31O0J08j60J91l6Q0k31J81l07L12j39M1PJ1L4q8L5j00P4J31n3j52
4175f0K17m0j65J23J53l38L47m31M78l62J88j67j84K59l8L2o9P2K1N6P2j14P4
4198A24k3k43L34k75J71j64P2K28l10N7N7j92K21j26P6o1P1n5r3M11k88J98l65
$$ y = [-183, 59, 90, -100, 253, 19, 147, 110, 28, -5, 190, 52, 80, -259, -252, 88, 6, 92, 190, -351, -151, -66, 121, 79, 127, -32, 98, -168, -29, -70, 78, -203, -182, 176, -49, -463, 186, 137, 39, -140, -81, -131, 52, 60, -40, 48, 68, 5, 157, 168, 16, -120, 31, -87, -270, -145, -50, 180, -217, -76, -44, 295, -39, -26, 187, -125, 27, 56, -162, -197, 144, 133, 44, 172, 143, 48, 5, -162, -143, -131, 79, 7, 347, 168, -66, -36, 39, 174, -68, -195, -44, 80, -97, -69, -78, 18, 146, -2, -99, -256, -18, 4, 43, 47, -134, -178, 196, -65, 85, -31, 73, -93, -9, -26, -13, 212, 198, 91, -152, -190, -59, 1, 109, -51, 140, 104, 184, -47, 134, -173, 139, 0, 41, 48, 59, 93, 5, 40, -60, 14, 145, 92, -60, 157, 117, -48, 75, 228, -110, 237, -194, 284, -78, 110, -57, -241, 18, -20, 12, -57, 15, 36, 92, 164, 50, 124, 101, -142, 192, -83, 88, -76, -4, 224, -86, -29, 28, -164, 57, -69, 7, -54, 17, -38, -131, 280, -8, 190, -175]
4221a75J98J75n2k22K28l28L09m5j37j61J03J94j5J15J52k99L0j18o0K7P9k15
4243b17M06j75J02j53%J79n00J36J24k07N77l77J26m0J85j64r2R8K7l28K93J72
4265A72o1j38m9J30j41J42k9j40L37j67P7j74r1P1L3j8j13j64K78J48k54J95n6
4288a2K14k59o9p2K06j36O6O9R1p8k71K92j15J26LQp4k3J00l26K72Q4j6k67K64
4313G7j98Q8oj06Q0j09R4KQ6k00P9N9j61J1K98P3k2l00l6k7N07k97R4j77J81j61
4339g1J63j43q0L19o04L80j02L75j99J40l91J97J0j41J40lj52N7j86L66k63O8
4361a20J75j71j1r8l8K95p5K9J63j18J0j37L1R0J16j0k94L6J28r9K68k32J83l0
4385I1k86K85o57M26K95k68J79o6m7l38N11lq8K45l52mj0K09j17j1j81L44j51
$$ y = [-175, 23, 198, 146, -76, 152, -176, 133, 88, -49, -210, -107, 87, 72, 187, 339, 40, 70, -48, -108, -81, -2, -217, 189, 14, 116, -37, -37, 142, -358, -222, -98, -305, 272, -105, 21, -19, 166, 2, -90, 8, 35, -293, 0, 172, 111, -27, -76, 54, -87, 55, 26, -114, 223, 56, 133, -41, -132, -61, -28, -46, -159, -323, -45, 103, -151, 44, -12, 202, -57, -126, -198, 8, -128, -62, 7, 98, 20, -251, 41, -74, 52, 55, 63, -11, -34, 66, -260, 12, 96, 80, -187, 77, -121, -33, -39, -145, -65, -174, -80, -78, 8, -192, -113, -54, -215, -204, 94, 167, 145, -155, -191, -218, 289, -8, 86, -91, 90, -71, 92, -51, -131, 188, -416, -36, -138, 237, 38, 178, -213, -16, -6, -147, -7, -10, -162, -105, -291, 75, -188, -120, 55, -116, -127, -225, -263, 32, -43, -14, 149, 31, 41, -96, -65, 25, 141, 131, -163, -127, 1, -98, 170, -62, 121, 91, -195, 90, -567, -141, 154, -114, 65, -1, -48, -386, 125, 122, 34, 279, -73, -77, -87, 122, 5, -6, -187, 157, 6]
4408Fj18J26qj82M30Lo6l83K47J87k29j87J24J34l11K21O4j6O9j21k1P1J27k87
4432a20K70j20j56K04Nn3j3k40K17J39k14J34K09k99n1Q3j11J38l52K99J9k07
4454b19R4P6m1J82l0p9j01m7K98l9j47k6M26p19N93r3m2n9j13j05K0K12k44N29
4478C26l95J87q1p6J08l13J32L59j92j43R8l5rl9M80l58j41M2N7K73l61j16J94
4501cJ23J83l02k68K23j77L38K40j92j73j02J33P7o9J05j65n7r8M38k92lJ7K58
4524B34j05r0j43K39p9j70J48k8J16Nl72j18K69K05m3j58L1J6l2R8l1K66k46o4
4548e2J27k52L91j4k87J34k22N39l73N7k2k6J26k64L06k74J23J77j18j7l69M88
4570A78j15m3M0P3O5o3o3J74l4l59kJ07r8J33L46l33k3K80p8r9k80n4L83k23M4
$$ y = [6, -112, 14, 6, -176, 254, 257, 191, -192, 55, 242, 13, -174, -50, 84, -227, -6, 58, 42, 111, -10, -31, 40, 167, -120, 150, 30, -126, 78, 83, 30, 17, -223, -6, 133, -81, 53, 262, -37, -88, -5, -116, 22, -330, -31, -12, -219, -125, -49, -90, 92, 62, -17, -118, -165, 133, 94, -53, -79, 347, -372, 221, 128, 86, 27, -86, -191, -171, 41, -203, 326, -69, 118, 37, -39, 69, -244, -112, 247, 55, -88, 10, -25, -34, -73, 407, 49, -92, -50, 7, 280, -81, -197, -3, 120, 303, 1, -267, -44, -221, 117, 357, 165, -8, -110, 23, 100, 31, 136, -29, -86, -184, 254, -38, -41, -24, 234, 129, 39, -104, 135, 56, -114, 34, 6, 122, 127, -245, -363, -94, 111, 68, -90, -59, -43, -75, 23, -8, 258, 12, -52, 75, -177, 214, 200, -87, 47, -175, 364, -9, 48, 26, 0, 126, -138, 168, -106, 17, 194, 76, 59, -310, 178, 63, 20, 60, 133, 198, 135, 72, 246, 212, -147, -149, -42, -140, -7, 339, 6, -17, 263, 185, 86, -194, -248, 135, -88, -44]
4595d4RK03lj81k26K76j69O6j30K9M49m06oK2M5Q5N6p9L7J29J03l48L34k50J53
4620A54l58M52q6k05L21m89J55O7Q2j13K60r9l72L62l46J86j67J83n1l0J5L60
4642B81j92j34K44o4j11k01J67j6J35j0k10n2o0K85M8k98M33l12K14k37j95L23
4664C8q2K23l94K50r9o3K62q2Q6j7k9p6O7rJ4k30J87l8kj97L43o0j59K31l43k8
4690b07Q8j09P2M12k40k11J99J62k64K41l63K11j30KK54R0r9L5K8j94k15MK66
4713C2k93L41k48K05k81K06o0N6j2K55k55j08L37j69O5k42M22J6m51M77m21N4
4735g4L43l71j83M12l32J98K35n45J43L95k69J03j24J32J1j36o5J65P9o9l38M65
4757A75l98L21k19j30N5L24j46j6J18j37Q3J18P0k74oK9O1N7n8j72J35n2K6k9
$$ y = [-44, -35, 168, 165, -16, -242, 34, -135, -69, -199, -170, 279, -127, -133, -111, -66, 19, 75, -4, 33, 162, 265, -83, 251, 1, 154, -204, 248, 162, -43, 278, -211, -56, 11, 93, -20, 240, 141, -231, 131, -215, -29, -196, -13, -64, -94, -79, 281, 89, -45, 199, 135, 24, -177, -10, -26, 109, 99, -111, -163, -223, 62, 110, -188, 245, -67, 147, -90, -285, 38, -44, 179, -215, 35, -64, -127, 135, 53, 139, 122, 93, 17, 84, 75, 89, -141, 46, 8, 6, -191, 152, 92, -67, 164, -179, -207, -119, -228, -156, 256, 16, -195, 4, 166, -98, 143, -220, -9, -139, -137, 117, 207, 108, 143, 171, -23, -238, -234, 32, -261, 80, -168, 37, -244, -38, -98, -42, -54, 201, -54, -162, 175, 6, 71, -171, 251, 267, -184, 293, -128, -74, 269, -102, -285, 127, -205, -7, 228, -317, -174, 221, -48, 55, -69, 63, 74, -62, -127, 38, 117, 48, -290, 175, -223, 98, -121, -251, -196, 128, -18, -34, 84, -53, 30, 148, 218, -56, -62, -33, 28, 85, 27, -145, -10, -62, -36, -65]
4781f5N5j14N2K4J21k95M12o7k32J17m3j20N4K0PL29k01k54J14k9P0J61o2M3J26
4806B23n19L05K7l88N10j90JJ33Q1j3j41pj16K58k72J19q3L18k99Q5K2k59K97
4829I2O8o4j75R1k23nK32RJ20O1n8j51N7K54k98J27j16pk58K04k17R5K82j72k6
4854g8L20k83K77o1j42O0J8m27N51r4j47M5j68r2J47K12j78L08l6j75j54m4J14
4877b7K25j06P5l22J23J51j3l70K77J10n6lO2j41j65J06N9o7j11K11l01L94j37
4900b6K22l67L56l10kK10K5K0Q3o1q0L1k01J09J55m93N82m53L70j05m7K7j37l1
4924a23P6R9p8M2J16N3l01K36l21L22l60J70R1j98J26l38L24J00J20l49J62j28
4946a59N4j58L30k49L50j10j5j12K00J8j55l8J20j21o4J07j89L56l9j63o6N3P1
$$ y = [-65, -10, -124, -72, -48, 73, -222, 190, 123, -109, 8, -35, -155, -101, -81, -74, 255, 54, -200, -86, -115, -45, 116, 54, 97, 223, -296, 9, 36, -352, 158, -32, -31, 102, 183, 170, 29, 22, -94, 164, -108, 11, -72, 246, -53, 32, 54, -205, 92, 160, 96, -79, 12, -211, -216, 16, 25, 145, 206, 148, -3, 54, 308, 10, 137, 21, 14, -244, -40, -257, -162, 120, -52, -78, 242, -41, 236, 175, 33, 93, 111, -316, 235, 141, -6, 39, -129, -221, -74, 138, -40, 268, 232, 57, -97, -141, -27, 198, 92, 167, -155, -32, 119, 106, -264, 13, 123, 67, 64, 126, -15, -180, -74, -15, -82, -193, 18, -283, 111, -26, 196, -171, 185, -125, -127, 83, 108, 128, 211, 150, 70, 101, -100, 9, 164, -329, 253, -200, 170, 65, 18, 45, -92, -123, -47, 52, -26, 16, 132, 185, -116, 120, -201, 121, -239, -69, 22, -176, -50, -388, -64, 36, 156, -193, -31, -159, -105, -263, 67, -182, 168, 58, 43, -69, 131, 149, -6, -44, 76, -45, -109, -2, -191, 165, 126, -37, -103, -50, 21]
4969B1j47K50r3l18M57j66k63k1J55r8J89R8k04K22k58L84j54j57K5Q4lj10J02
4992eJ59j89L0K06k03J41j94j0K07K3r0l26L50J04l51J55L1j39j84L80J06l53
5014a52K34j06P8j77K39J88m66J8K09k0j16p7K42n8m8l45P5L93l70R6k8K31n5
5037a5m2M24k46K24l11L1o3j12L36j45j54o2OK64j13Q2n3K3Q8j89J60k58J99L4
5061A08k30l0J66j15J28k68K13J78k96J17P0k25J66J22k5j6J59j90r8K00k70Q6
5083e0J1L53k53j88J46m0O2J39k54K4L4k47L02p6P5k39K08K06j43j09Q4J95j69
5106G1K2j38J34j33J05j99k0J94j59j89K03K91q8l28J13O1%J76l1j97J13l8q3
5129a20M38n24K58k49K30N2k9q3l0K13m75J11K04P6l33L20J34J39l63j07J47J9
$$ y = [21, -126, 124, 31, -287, 170, 4, -259, -280, -125, -223, -34, 64, -140, 82, -176, 208, 54, -103, -78, 6, 3, -107, -5, 154, -35, -5, 201, -2, 139, -55, -65, 142, 165, 75, -251, 99, 203, -148, 7, 38, -101, -285, 95, 201, -152, 82, -24, 54, -123, 116, 304, -162, -144, 65, 45, -71, -148, 94, 36, -12, -357, -282, 111, -259, -163, -191, 40, -15, -57, 367, 121, 345, 34, 65, 2, -110, 226, 81, -73, -135, -129, 135, 22, 104, 51, 74, 162, -27, 133, -125, 74, 108, -122, -152, 14, -101, 27, -241, -28, 150, -146, -29, 41, -184, -18, 104, 79, 63, 222, 32, -66, 134, -136, -50, -39, 314, 61, -127, 19, -21, 41, 180, -74, -50, -16, -263, 39, -37, 38, -201, 7, 213, 70, -39, 45, 240, 71, 93, -45, 89, -44, 61, -138, -158, 36, -123, -312, -109, 182, 94, -234, -121, -60, -60, 116, 85, -112, 1, -37, -120, 318, -206, 52, -197, 33, 85, 56, -27, -57, 156, -319, -208, -4, 72, -261, 59, 193, 332, -31, -138, 9, 28]
5151B8l6J5N8L9o6n5q9N0J33j58J1M0N3K6J14j71L3p9L2k0J10RJ02k82j9J73l27
5178b76L38L73m84nl6L49O5j13m46J42RO4k3J3j92L01j21N6k7j36N6L8j40K13
5202A8k26L48k09j68N77m16K54j75o9K42k35q4J7M18j96P0j42n8K79j46k64J36
5224b9L29k44p0n7o2K12r7n5k48M90k62M27k69j01j46K75K37k58k32M49k63r9
5246g3J37o2j86L64j64j54J40k75N29l95L59j58l72M20N3l3k69J08K98j90j82
5267a05N9K16k11N2l16K34J4k17J86K45j65J00J0K3j06k02O9N31m32o7K53k83
5289a12N13k59j68P1k9q6p9J69j03Q5Pj21J67R0K65m58Q7j61j74K37K15l13J61
5312DL73k93K13l30J2M0O4j2j96R2k22L16l40M84k64r6K78m8k11P5L52n76K05
$$ y = [28, -8, 7, 65, 104, 38, -17, -106, -56, 77, -81, -70, -30, 23, 49, 163, -8, 25, -54, -22, -42, 68, 77, 179, -103, -122, 51, -276, 62, 435, -49, -54, -90, 259, 324, 211, -235, -93, -84, -20, -43, -30, -222, 79, -42, 14, -13, -149, -93, -55, -195, 18, -208, 140, -69, -237, 340, -76, 178, 3, -66, 176, -59, -143, -126, 292, 96, 166, 24, -34, 245, 99, -165, -29, 300, 56, -14, -71, -133, 79, -18, -73, -321, 169, -93, 334, 65, -36, -182, 93, 330, 72, -160, 289, 26, -73, 64, 2, -184, 180, 16, -138, 2, -273, 256, -139, 220, 62, -310, 110, 163, 130, -139, -31, 267, 77, -105, -46, 170, -41, 11, -305, -71, -57, -274, -88, 157, -8, 92, 102, 125, 19, -183, -114, 417, -15, -82, 171, -112, 401, 142, -26, 45, 16, -70, -149, 20, -83, 2, 9, -112, 55, 145, 410, -48, 39, -122, -296, -59, 156, -157, 4, 377, 84, 297, -33, -21, 19, 83, 71, -125, -33, -255, 61, -279, 205, -59, -155, 123, 75, -136, -61, 291, -285, -80]
5335h0K22j04L1PJ04l27J39l8p2M9k8J47Q0l7K3k36L39j39j08J06R7j75o7O7j25
5360a25L35l68M4J37J40l69L01j49k37J00K82l10M80j98r4Q1j32J20q5K56l31
5381a22N9M1L9m3j26J55J13r8j69M45m82k2L64m48J13J27K3j37P0K67n39M60k22
5404a32j26L35J25n2j54l24L75J18j17q4N4K2o4j67K26j70K49j11k1J2k86M85
5426A93k36j05K18j35J5j29J45mNpp1k6q8L43k3k5p3q2J64K0r1J0N5k17K30J37
5452B23P4j17l03P8j2K48k07K70k28O3l15K76J42k05K3J50j22J65j58r2p4K9k4
5475a16J22j17P1k18l4L32j81K56j71L48k50M5J39m30K80r1q8K81K4k51J55l38
5497b32J53J34l2k2p8o0K77k03J96o4J84j42N5k29p1K00p7j2J56P9k2l46qm2L8
$$ y = [-80, 142, 38, 69, 76, 180, -147, -8, -46, -118, -69, -97, 50, 130, 93, 116, -120, 219, 80, -28, 78, 175, 0, -67, 0, -125, 210, -158, -114, 23, 163, -206, 95, -54, -291, -191, 91, -219, 261, 63, -31, 50, -82, 38, -47, 209, -122, -63, -22, 17, -26, -152, 3, 116, 18, -151, 294, -188, -210, 154, -294, -181, -54, -31, -168, -98, 169, -370, 90, -132, -258, 77, 202, 150, -4, -328, 47, 165, 48, -36, 18, 40, -24, -191, 35, -135, 114, 3, -18, -6, -292, 193, -43, -148, 70, -65, -50, -179, -34, -38, -33, -40, -111, -137, -225, 118, 95, 70, -3, -85, 79, 99, 8, 18, 73, -144, 86, 223, 297, 180, -123, -45, -57, 191, -16, 254, 26, 89, -226, 50, 192, -13, 10, 160, 38, 203, 45, -47, -121, -92, -116, 6, -111, -40, -258, -292, 40, -141, 115, -56, 292, 42, 87, 226, -204, 76, -15, -103, 178, 202, -49, 106, -232, -79, 55, 23, 1, -77, -137, 140, -63, 133, 69, 253, 111, 166, -63, -134, 66, -11, -23, 133, 212, 190, -156, -164, -206, -168]
5522a68J59n0J85l42L47l2k55K55j65k5J02L3k78K99k02L89k80k17J47J60k40
5543a78M4R7O0j00J84J00J06m00O9Q6m42L66J63K5j15j9Nj11J03j34j4J99l52
5566b58K00j09M91k20Pj40J47jj73J3j33K59L16n22K17j25J24j59L23k07l96L14
5588c2k78J43O1J44j20J17J1m1m4p2k8K79j46j45J30K24l27K39N8k69J27j16K69
5611A84k49Q5kM9l33K85J26l54K62o9J06l4M9k5K20m24j50K79J18j1nj24k2m6
5635h5Rl2L02o7q0k0k17L95n4J54k28L6n8OJ8n1j6k5m6j77K13j46K49Qj61N4j43
5662a62K90M1k86L8R9M0l33O6J35J20m9M4k09K26K7k43K28P6j30o7k00K58j7j59
5686a67K16P1q2m3q2O8K2J39k19P4q9J1K16rk37J35n8K18k87O9j5M4J65k34l2
$$ y = [-168, -9, -59, 126, -216, 131, 99, -156, 99, -66, -91, 11, 44, -234, 65, -137, 252, -28, -245, -98, 62, -178, -134, -37, 23, -77, 107, 207, 313, -87, -18, 68, -374, -8, 155, 180, 65, 46, 51, -60, 43, -91, -105, 94, -258, -58, -167, 324, 104, 111, -29, 118, 117, -56, -43, -176, 83, 399, -123, 94, -31, 93, -66, 257, 50, -346, -32, -310, -167, -106, 38, -82, 35, 46, 5, -39, -111, -139, 140, -6, -151, -21, 203, -124, 115, 173, -96, 31, -85, 184, -65, 20, 18, 67, -266, 19, 145, -209, 53, -16, 90, 56, 105, 80, 300, -124, -274, 5, 123, 112, 107, -17, -39, -85, -76, -108, 194, 127, 47, 27, -190, 205, 151, 305, 77, 113, 55, 61, 79, 28, 12, -13, -59, -236, -23, -169, 80, 88, -73, -19, -162, 128, 169, -117, -79, 20, 60, -273, -207, -72, 48, -1, 43, -166, 60, 87, -156, 72, 148, 18, -49, -249, 9, -8, -167, 49, 120, 38, -5, -87, -19, 3, 142, -77, -3, -92, -81, 135, 126, -111, 24, -34, 184, -103, -34, -49, -5, 160, -74, -106]
5711a06j6J88k42J89J38k69j51K75n9lK50k41J07j6R4Lm7j4p7KP3j19P5k16K67
5736H5J30k04J03k64J41J89m62L77J20j98j18J10K80m60j18M06l06P3k6kL29n
5758A80k98J79J74j10N3p7mk05l3K31J43j21M6k67K00m3M6L2j81P6J0J03ML3l69
5783a98K85j22j25J37n1R8J26Q1j47k31q5K9j89N67j32J49q9K01j87l09L99J43
5805C50j81j90o1j02K01q3K73l17K5K52j53rj15l1J67k60J90L7P1J6l12L22J29
5828B19k9k72m4P2r1J59J49k09J06j21J41K9O0j41M0j21j2J38j29L17l82K15k06
5851a12J39J43M0k87kN2j40J42J30k70L27j34j14J10j3N2j87J59r1k3m3O3j2J98
5875A27J6l54q6N64j46pq3m22L99M6j32R5R4k96K96q4J28k43J47j17Jl32L22J86
$$ y = [-106, -122, 66, -176, 13, 151, -118, -269, 6, -53, -56, 194, -47, 60, 44, 138, 141, 94, 80, 3, 5, 78, -41, 34, -182, 85, 215, 11, 114, -150, -9, 180, -282, 95, 215, 17, -101, 9, 289, -171, -289, 117, -189, -116, -142, -144, 185, 180, -118, 61, 235, 125, 178, 101, 97, -108, -141, 90, 233, 112, 158, -109, 91, 48, 94, 126, -55, 21, 31, 134, 138, 171, -198, 87, -35, -160, -23, -74, 24, 150, 231, 84, -147, -232, -203, -392, 175, 43, 192, 103, 304, 117, -192, 207, 350, 169, -21, -82, -184, 17, -66, 207, -110, -85, 167, 14, 5, -110, -141, 26, -234, -44, -7, 64, 80, -232, 90, 219, 190, -82, -126, -54, -145, 14, 163, -46, 60, -61, 80, 109, 169, 28, 68, -53, -65, 73, -56, 261, -121, 94, -112, 27, 170, 210, -77, -79, -27, -167, -25, 105, -165, 162, 28, -86, 24, 11, 63, -124, 35, -56, -79, -122, -59, -71, 127, 143, -211, -297, 267, 121, 114, 31, -391, 8, 54, -78, 17, 111, -185, 111, 27, 155, -88, 59, -58, -57, -389, -67, 119]
5899A19k50Q7N9j40K2r7R2L01n13N28r9j44j41J82m7J92l73N06k11j69r8L86L6
5922B28Km53K00jl52M03p9R4l29J05L42l55J49J42p4K28l7l62P1n3L9o2K68j83
5946f9K23j60k4p9J07O9K2j11j36L24k43K13m92N75k69J91j05N7o3N2R9j98k89
5969c06K37L2P2m1J3J83k86J9N7K26l87J98J57k90J51k15R1J46p3RJ10r7M8j81
5993a27k64L76%M2L14q0o3M8k54K58p1j60j4J15k26m5J07K12k80J66k26M54k18
6016F4K5J20P2r2k91K11O2j43J14R4j53j11o1J15l5J33l7k20J23lM8J09QJ35m75
6041a88P08n17q0K64j23j2r8o6KK9RK00o9j20J03L6K2j69j60M15j0l16J43k21
6065b18K15J70j43j76j07N4M02k22q2J14l6j47M10l86K41k04J69q4L0j14J8J01
$$ y = [119, -131, -44, 15, -125, -103, -200, -108, 193, -320, 208, 109, -35, -176, 6, -41, 151, -222, 284, 73, -96, -194, 192, 228, 230, -223, -23, -24, -376, 27, -52, 42, -287, -182, 160, -195, -46, 96, 22, 250, 213, -149, -78, -131, -92, -154, 114, -69, 154, -6, -30, -109, -2, 67, 89, -22, -158, 166, -77, 136, -356, 219, -50, 141, 36, 93, 30, 82, 181, -17, -306, -69, -37, 35, -6, 7, 190, -96, -77, -20, 206, -181, 17, 174, -116, 35, -180, -89, 57, -16, -7, 103, 6, 54, -127, -391, -15, -15, 27, 341, 261, 198, 246, -8, 250, 179, 19, 5, 120, -106, -151, -44, 168, -112, 54, -172, 282, 64, 89, 209, 281, 189, -102, 109, 171, 28, 142, 236, 83, -28, -89, 26, -9, 124, 87, -133, -10, -13, 35, 144, 152, 287, -188, 520, 3, -77, 187, 64, 52, -46, -112, -110, -81, -72, 128, 59, -61, 42, 78, 100, -69, -229, 186, 176, -140, 3, -218, -3, 167, 24, -152, -259, -205, 197, -25, -107, 7, -29, -176, 234, -152, 89, -115, 54, -30, 0, -114, -96, 5]
6087ER7J01j10P9j73q8Q7K84l50K92l43O2J33J2p9k34L97j56J62j61K56k13nj27
6111g2L9K48j19K08l67K00l51L39l36L76k12R6J03k10lR8K12l27m1P9KJ31M3R
6135A45p2k4k74mQ7L34k85j46K60k10K77j21Q2N4P5l68J52j22L4J41O1k83nK35
6159B3K05N8m06M77j25k31n0Q3M9j8k4k16Q9K00n7J23j42jK0K9k94L21M2m19L07
6184D3K47n06K44j20R9N4k6k32J1K65J07n80N57m63K16P2J47J50m29M1K06N2k04
6207d9k4J07j01k1j15K81k47L77k43o2J36r4j00q0K25p5j45pR5L61n30L28o6j26
6231a75N2J64Qk80J90K64j00l94L25l79O80l43J15p9k2ro5j08J73oJ67k95K38
6254A21k53Q0M6Q7k62Q4J01j82l0L27k10K07j34K79k07k44K65r1J6J6o6P2l22
$$ y = [5, 102, 203, 93, 172, -1, -89, -2, 282, -68, 224, -119, -57, 76, 88, 9, -225, 172, 16, 178, 17, 273, 60, 55, -72, -33, 215, 96, 304, -63, 137, -214, 125, -211, 165, -47, 49, 152, -58, -61, 37, 249, -78, -119, -40, -38, 93, 136, 145, 73, 49, -225, -229, -142, 192, -93, -239, 21, -189, 88, -33, 49, 103, 178, -190, -38, -160, -126, 15, 76, -207, -212, 23, 228, 286, -120, 357, 232, 1, -49, 34, 83, 65, 41, -175, -86, 114, 57, 180, 38, 37, 57, 86, -208, 113, 155, -264, 43, 290, -216, 28, -92, 7, 61, 35, -197, -186, 79, 186, -394, 163, -300, -84, -12, 135, 285, -144, -103, 103, 155, -49, -73, 34, -67, -88, -203, 78, -169, 208, -35, -97, 39, -55, -155, -235, -10, -85, -230, -237, -142, 219, -311, 17, -49, -175, -123, 41, 49, -231, -41, 223, 123, -271, 54, -325, 355, 12, 127, 48, 26, 17, -48, -156, 17, 11, 178, -117, 121, -132, -52, -6, 81, -181, -97, 4, -178, -208, 119, -91, 116, -18, 261, 54, -190, 75, -16, 0, 16, -50, 22, -300]
6277c00L34J15k67J49o9M8j59L12k27J21M16l49j72J80l8j70K22m0j35N5k40K82
6299F8j2l2m3k1J89j50j26J46j92K21p5j25L25l49R0r2K80k29m3K34m07K70j35
6322b08J14J56R1N5j27j59Q3O3J11j08k12J01J06M9r6j75M4K52k13P7j71k24N77
6345A86j10Mo5L6N6j26k3j43N2J15m6k02M0L83n1j34L65m02Q2k9k18J5J18K0K18
6370A41m15L44n2p9j44L53K20l68K26j12j71P4o6K5r9k61J76K85j09Q6m12L45
6392a3j32L00O8l90J90L3j14K56k50J7l8N5r3J09J87j68J36j57oj66K4K85J05
6415B38m45K67Jo6m2k2NK14J4J63L5l08n6j15k2J49O5R9j37o8J23J34k96L27k96
6440c9q1J88j95K43j72R4oj51N8J10Q5r3K2j42J02J59j03l12M55k31K77l57J18
$$ y = [-300, 34, 149, -118, 31, -38, 10, -149, 163, -64, 57, 473, 124, -48, 132, 94, -76, 146, 106, -29, 26, -214, 68, 56, 24, -19, -40, 149, -1, -127, 19, -173, 48, -27, -152, 173, -176, -86, -178, 102, -127, -170, 64, -343, -73, -208, -94, 62, 153, 208, 81, -78, 5, 68, 179, 71, -141, -40, 66, 115, 19, -156, -112, 140, -73, 4, -167, -391, 186, 76, 80, 15, 51, 107, -19, -42, -185, -133, -18, -64, -266, -226, 157, 106, -28, 337, -65, 17, -12, -230, -215, -97, -77, 141, -274, 70, 18, -61, -205, 148, 368, 0, 226, 114, -57, 17, -49, -24, -123, -384, -208, 77, -32, 54, -358, -13, -145, 155, 223, -167, 23, 56, -58, 198, -52, -35, -73, -18, -111, -2, 185, 17, 153, -4, -10, -176, -152, 133, 238, -207, 60, 61, -5, -47, -69, -64, 150, 164, 327, 362, 54, -2, -117, -139, 10, 75, 174, 37, -31, 92, 226, -70, 257, -39, -120, 68, -127, 116, -56, 38, 32, -119, -61, 49, 134, 41, 63, -79, 23, 182, 79, -233, 222, -9, 268, -89, 29]
6463B9J24J7l35j46L09J97l37J71j52j45K45N7R6L1j72j33m2K07j32J3j31J37
6485i2L29l75J61Q4N5k59K1L01l0l16J39o8K2j34K04K89n42R6K85j35Lk6oK38
6509B44o4o33M85L25n28Q4K08k06N7n1j00K02M5m02M42n7k00K37J6N2l19J14J53
6532A04j82J67Q8m33K00q6J88j88L05k44o2K79k02J47j80R8m8J56l32Q1jK42k90
6555a93J32j55L66k59KJ09l6j36K89O4n9J09j03j86J89p2j58J65j74J15l39J50
6577a80R7J35J8k23k22L28J89j03J49m55J51J66J57kk19R3k23J40J2K36j68j19
6599d3N6k2J12M6j4j67J8j09j10L17q4J96j67J17j28k42K75N1J45l14mj97M69
6622B01k04RP0k97J69j57K31J73k65J10j69m9L49j55J28p0l54L79l3m9m6J40n8
$$ y = [29, 153, 170, -165, -311, -2, 195, -142, 29, -123, -268, -23, 34, 130, 161, -11, -144, -186, 21, -111, -98, -229, -92, 237, -138, 23, 107, 162, -97, -76, 225, 195, -121, 18, -50, -28, -162, 42, 331, -211, -115, 170, 35, 38, 12, 6, 244, 180, -453, 32, 357, -171, -87, 121, -85, -28, -79, -179, 23, 68, -334, 108, 51, -149, 88, 104, 156, -163, -49, 104, -78, 89, 177, -256, -56, -142, 46, -142, 163, -81, -143, 136, -66, 81, -99, -1, -49, 107, -225, -144, -145, 97, -193, -61, -216, 150, -109, -107, 2, -34, -170, 119, 183, 124, 233, 130, -56, 133, 61, -97, 68, -106, 9, -330, -180, -83, 52, 70, -153, -375, -47, 142, 39, 188, -267, -116, 50, 207, 205, -14, 79, -144, -4, 8, 244, 76, -43, 13, -9, 103, 149, 135, -32, -14, -123, -233, 84, 0, 196, 29, 146, 18, -224, 51, 102, 247, -67, -71, -268, 201, -3, 6, 76, -221, -52, -209, 22, 195, -70, 40, -129, -178, 171, 16, 144, 74, -280, 99, 66, 17, -29, 111, 53]
6645E3j62J96j1q4l3K31k23lR6o0L29k16j54K41k35L3K4K52l00L9J78l27J1J51
6669B6J58O4p01N49Oj41P6l7m8R7k62K13L4j17j43L94j96J15j31R3J19j83J32
6692A17q3J61j14r6Oq4K34OM9l78L31j96o1J28R1Q4k62n2K9j4J50N6n9k6k74J88
6718f9J37j29J0J87q8k03J02nP1K31m98K09M6K1k45N56q6j59JQ8j53j63J23k93
6742c09L66j5L7m1J25k30J61K7k15M2l0j88K95o3j39K33m9r5Q9J89k89L64j64
6765A01j74q5J04j39l3M4q5J99j09K96j88L26m02K74j70l02O41l32K0O5J19j49
6787B1R6P9m52J79J34r3j47K17j49J36j37J21n7J36l6OK20m74J01J69r5j33J66
6810Hq6K10L4j12n9K3Q5n0L9O7k08K46k33j35j21K57M5l7K5j08P7nK51j92J73
$$ y = [53, -109, 87, 76, -8, -41, 190, -33, -36, 60, 0, 329, 113, -41, 200, -35, -2, 22, 274, -26, 13, 191, -136, -125, 26, 184, 248, -453, 96, 102, -39, 37, 0, -48, 49, -213, 0, 34, -83, -226, 168, -28, 87, -44, 49, 168, -15, 117, 34, 195, 81, -15, -9, -93, 141, 147, 196, -182, 149, -47, -108, 20, 111, 195, -67, -119, -90, -104, 46, 102, 43, 17, -257, -69, 68, -61, -51, 136, 48, -155, -53, -58, 13, 244, -254, -45, 1, 22, -223, 333, 247, 88, 89, 177, 24, -139, -16, -309, 57, 42, 79, 38, 163, -67, 94, 121, -94, -52, -82, -270, 25, -38, -177, 56, 7, -88, 1, 190, -99, 265, 101, -73, -158, -54, -193, -226, -182, -267, -68, -177, 119, -69, 257, -145, 129, -41, -343, 298, -34, -14, 51, 170, 21, 117, 196, -256, -77, 57, -36, -183, 34, -115, 21, -116, 5, -52, 84, 48, 54, 274, -200, -99, 70, -25, -158, 8, -78, 132, 166, 54, -5, 18, 103, 53, 92, 159, -49, 197, -36, -171, -292, -35, 10, -27, -2, -110, -33, -38, 213, 21, 194]
6835A94j90NK4J5J06k8j46K41n16K42J02J8n9j64J93Q8J00m46M88l23J08J65k26
6858ij26nL78k04j64K49k20K43k40J74J2k14o6J27N0j15R0J9k44L97q1j13J21
6881E9j69k05K68K79l08L88r2m90K43l7jm9J01Q9O0P6L6k48m7K38j39j84L37l01
6905i6l4K51l62P0j19L85j41L0j56N18l87K83m84K05L4j01J29m8J0K5r2Q1j75
6928a74J02K1L3J31j57R6nj82K23%j2p1J75R2k56n9OL70k92P8m2j65J70k04Q8
6953c4M5k2M5M0J08m14K62j98K51k37O2K09j02J66k28K8J92m10L07k61J4K31m6
6976HJ08l80M13k5m07K87J64J14n00J73j80J98j55o6K00j38K18lR7O7k81L21k0
6999B13m65K58q3rL34l65L0O4m6J14j28L8R1O5k07j07K75j4J45k02kp4J02K8k09
$$ y = [194, 4, 9, 33, 48, 154, 126, -20, 221, -295, -53, 49, 67, 8, -156, 37, 125, 225, -221, 267, -56, 52, 217, -9, -135, -140, 238, 34, -130, 119, -101, 142, -98, 76, 88, -126, -192, -65, -15, -130, -40, -21, -265, 132, 51, -62, 59, -110, -315, -47, 232, -76, 312, 220, -270, -27, -64, -65, -114, -13, 76, 136, 212, 248, 0, -47, 191, 52, -132, 205, -96, -130, 121, -241, -171, -290, 95, -46, -16, -172, 346, -41, 242, -242, -37, -3, -104, 25, -23, -13, 12, -80, 1, -174, -72, -51, -18, 113, -44, 52, 47, -135, 88, 88, 76, 5, 180, 272, 16, -43, -37, 333, 41, 119, 77, -88, 82, -122, -34, 11, -11, 34, 74, 182, -232, 30, -168, 83, -154, -92, 117, 15, 181, -47, -19, 173, -237, 70, -191, -177, 54, 8, 116, -264, 149, 124, -283, 4, 168, 282, -218, -45, -225, -27, -182, -248, -48, -186, 32, 29, 126, 193, -88, 233, 213, -252, 6, -77, -86, 248, -117, -87, -23, -69, 45, -83, -45, 46, 111, -96, -203, 72, 58, 203, 1, -1, -75, 27, 55, -154]
7024a54N46l32LJ54l60K38k8j20J69n9l11K51q9p8J91j79L7L35j60q1J42j63j91
7047b39K28R7l4l8l2j25K98j13j59N64m19k9j37p9M21k42M7R1k46k7L22J6l58
7070a93j41K59O0Q2j56R8q5j4j42OL15j77Q1J67j93O9j49J76l36L27j32O7J12
7093A01j96m0K76j38J6M10n94M60n55M24k52r6J47n1J1P0k15K32K49k94L8N9J66
7116B28j76K71k94p9J28l2J04l01R0J14j88K1k5J86o9K5J2J6j6Q2K17k34n9k90
7140b69J01L38k35J58L1j39n1J61j82J12J95q5o7k9m8Mk6j29L17j74J54J38k99
7163b4J9J37j75J54l21j41M52r1j32LJ16j14K29o7Rk93K78J21k14q3J76K63l14
7186a2J49l01P9K69m67L04q6N5Mp2p1J53J03j56J75k64j33N01k59j0K74m38M00
$$ y = [-154, 392, 60, 63, 217, -143, 95, 67, -53, 116, 57, -254, -3, -92, -170, 21, -158, -121, 214, 54, -27, 115, -48, -239, -11, 86, 52, 14, -18, -143, 155, 42, -117, 447, 28, -1, -138, -217, 204, -38, 9, 100, -146, -173, 149, 165, -193, -334, -75, -15, 67, -89, 9, -76, -90, -232, -226, 89, -88, -7, 160, -33, 36, -113, 63, -273, 54, -78, -11, 101, -95, -135, 141, 3, 19, 429, -165, 295, -260, 164, -88, -184, -37, -88, -77, -7, -222, 10, 259, -35, 3, 62, 228, 52, 323, 29, -50, 78, 46, 150, -151, -61, 53, -135, -114, -139, 47, -22, 3, 15, 31, 15, 97, 314, 80, 21, -269, -168, 170, -65, 93, 124, -15, -66, 95, -87, 25, 220, 135, 68, 39, -9, -5, -31, -160, 157, -17, 137, 275, -24, -5, 132, -43, 111, -210, -351, 101, 10, -122, -119, -3, -117, 112, 45, 54, -239, 39, 160, -54, -137, 39, 302, -12, 137, -164, -85, 184, -283, 21, -65, -10, -6, -78, -149, 4, 107, -49, 126, -138, -271, 230, -29, -39, 235, -203, 197]
7209A97j83j16K19m5K4Kk1m8r2j04K11j03r7J87PKj7K61l17J31j32J14j50K36
7233A66O2m19O1j8p3K38K79k79J93l81K49k76J29k5J1j24o8L26m5k99L02Om0k0
7257d5N2Q3J9j98j60R6K39pj39J32j24R6k24O2J49J88j57j02M5J93k79K81m20
7280b20J64k7J50k45L30j71J6P5L0r3k65K73R2K97l41L5J16k75J63lP5q0j34J27
7304H9M6M9j07r5j64J13L2l8J91j85Q8O0M5n4l6J74k51L4J00j35K04r6R9k0j39
7329DK61k13L0L3m6j42j20M90l77k70K71L24p6k25J80j03k31J87o1L55j66k12
7351a07J02K8p6j01Q5J15j73K54k43j7J24N8o3r3j9J02k37K73P3j66k8K99l75
7374a85K16J44j86J03J07j52J47j35nj10j27P7J95J41k57O5K9J29m7l19J08l3
$$ y = [197, 14, -102, 117, 72, 96, 98, 77, 29, -63, -167, 44, -59, -156, 31, 38, 40, 23, 284, -33, 98, -34, 80, -70, 166, 228, -191, -130, -148, -221, 17, 296, 17, 210, -171, 78, -198, -69, -94, -83, -207, -275, 51, 6, -293, 9, 15, -25, -45, 7, 90, 109, -89, -249, -153, 86, 79, -60, 72, -52, 44, -180, -118, 31, 219, 62, -40, 5, 198, -81, 200, -220, -56, -83, 67, -178, 152, -19, -3, 72, 102, 9, -256, 17, 109, 406, 65, 100, 216, -59, 104, 101, 176, 96, -38, 89, 135, 184, 77, -18, -182, -69, -37, -75, 116, -69, 19, 79, 124, 70, 34, 208, -43, -9, 91, -44, 160, 64, 163, 143, 4, 265, 52, 82, 115, 69, -73, -193, 297, -80, -350, -79, 245, 169, -56, 124, 21, -210, -23, -84, 271, 105, -107, -5, 23, -53, -154, -69, 46, -127, 127, -116, -133, -9, 49, -14, -107, -126, -24, -261, 12, 85, -81, -109, 190, -185, 31, 175, -11, 92, 199, 47, 194, 59, 54, -56, -183, -106, 89, 230, -27, 38, 67, 196, 149, -170, -62, -95]
7396i5m6p2L91j73J07O8l74J66J46l14j8J39j39J43Q6J24l75K89Mj43M06k13j26
7419a9kP6J19k96m8K04K42k04k14J75k94n6K74Oj6n3j32K37K3k29K41j4J87k72
7443f5J82j20jOk34r8L72k64M93j28j27J07n7OM6J3n8K2kj67lM13l41J2R8o6n0
7470a1L0j50L01l43J0lm1J42K5N4R0%j05J17j31k15K15O5m8K0j75K32Lj97Pj8
7496a26n2J38j03N12k73j73M4k1O3j51J78kk95M70k66M6K93l52o1K2l0j74N50
7519B37j80j55J06J87L4n05J81J55j04ok1J31j35L45k67J67j58J19j4k85L74j13
7541I3n3p4r4L25k41j36M94k60p6l76K79L03o8k16N0L85k42j86j36K30N8k19L00
7564A40J5j10K36k71K17k92j86M58P4j93j13J14n0R1J7k84N07l96K31l27o2RJ55
$$ y = [-95, -141, -213, 178, 5, 112, 180, -194, -28, 118, -196, -214, -75, -214, -71, 15, 139, -236, 53, 57, -86, 320, 107, -19, -21, 55, 174, -122, -170, 34, 276, 72, -142, 33, -261, -317, -43, -37, -53, -106, -238, -1, 22, -207, 34, 20, 207, -65, 117, -3, -4, 2, -232, -330, 42, -222, 271, 143, 16, 123, 66, 72, 118, 131, 73, 95, 93, -74, -77, 336, -5, 7, 105, 39, -11, 19, -131, 170, -173, -163, -166, -207, -65, -40, 14, 104, 104, -1, 116, -15, -230, -15, 50, 2, 22, -153, 79, 82, -115, -108, -126, -178, -40, -143, 369, 96, -77, -33, -54, 9, -142, 36, 34, -261, 209, -57, -11, 282, -70, -131, -109, -139, -313, 237, 57, -98, 8, 195, 229, -276, -95, 60, -44, -50, -71, 60, -75, 270, 3, 170, 12, 131, 117, -168, 206, 93, 40, -34, -128, 197, -44, -180, 314, 54, -22, -398, -119, 184, 116, -100, -50, 335, 93, -93, -229, 1, 59, -160, 140, 155, 45, 281, 10, 227, -65, -251, 207, 281, 88, -25, 89, 39, 130, 147, -137, 370, -26, 205, -122, -184, -175, -20]
7587b0r7m8R9K26j89J09j22pJ94K06l25m3JR9m7j76J09P1J66k47OL5J31k80J90
7612D1j19p2L15k94K49k80L58j85N7O2j81q8M7J20k13K04L6k06L84n0j75J03Q6
7635A99l9j87j63L97J4o3j10j05j0R0J85j82J5M4o9lo9J13K16j75K84m94k3j50
7659b85L58J31l0k04q9Q5J13j43J00O1l5j88k8K99k32J84j74j03L33k08q1k0J60
7682Dk21J06J77nj03K13J9K8m06J68J2p9M8j06L52j03L9l24P1R1J15j99k7q9L53
7707A34m4N1j12KL3L1K2l22L53j20r7J57r7j72J73k3J39j15M4M8k77J55O1PM2
7732G3n9j84L40j73j57J80k50K61M4j07K27j43N3N7k08RJ28J47m44K06j42K31
7754H9j26q5J18n8q1J10K23j55J15N0m9j59L55k45j69k51K61P5Ok78L30r7k09
$$ y = [-20, -117, -165, -66, 160, -29, 80, -42, -49, 145, 351, 26, -17, -16, 83, 36, -140, -31, 40, 206, -41, -35, 0, 131, -149, 41, -78, -150, 165, -129, 120, -160, 198, 13, 70, 132, -49, -137, -90, 30, -183, 21, 57, -149, 235, 185, 10, 113, 199, 160, -27, -190, 207, 221, 158, 48, -57, -67, 23, 208, 26, 41, 85, 16, 13, -56, 57, 273, 98, 382, -112, -135, -285, 73, 204, 174, -30, -119, -34, 79, -64, 36, 97, 62, -126, -154, 145, -87, 97, -77, -180, 153, -55, -136, -156, 4, -217, -111, 66, 61, -42, 171, 190, 218, -188, -20, -8, -87, -39, -145, 207, 104, 143, -181, -110, -19, 96, -103, -130, -219, 134, 90, 141, 29, 31, 64, 95, 117, -205, 148, 28, -69, 88, -9, -181, -8, -31, 108, -7, 37, 85, -192, -37, 24, 31, 73, 14, -170, 170, -3, -160, 20, -230, 31, 75, -32, 195, 52, 105, 162, -46, -37, 91, 238, -206, 0, -142, 89, -37, -122, -4, -62, -143, -33, 190, 35, 150, 200, 151, -8, 347, 102, -67, -318, -57, 18, 24, -254, 76, -21, -230]
7777b30L54Lp9M7j47j44N8K7J21o7qM5kmL0j1m5j08R8K42k14J77j64j24K81J8
7803A54j89rk7j61L09k11K6J54j27L38j71N3j76P8ml4j07k56M87j14Ro1j74L41
7827A28j52R9O3j20J83j84n9J95J26n29J70J79l53K59o9qK66m95Q2K32k1J43j05
7850C0j61K55j06j57M05l02j48K28k44R3P1P5P0J6j26L9N4j72j43J52j45J87J42
7873A13j54j70L62j91L31l09R3M2J42j71j73j22K31j03J98k15O1J54m39M32k45
7894a33Q7m44O10n4j43J60Q4j92pm7nL8J18P0j81j79K56J33l06J44k36M9L60j09
7918G3j64m5K89m6k72K24k27K66rj52K3oP3j72r6M30l25L54j08j46J55k28J86
7941G7k19J59k7nJ80l57L35o6k12JP0K72l06J16j65J21K00m37J17J07j17M90l59
$$ y = [-230, 124, 127, 48, 95, -52, -196, -138, -111, 10, -57, -65, -20, -22, -26, 4, -7, -52, -160, -62, 180, -34, 143, -21, -145, 136, 154, -35, -44, -71, -232, 77, -134, -108, 46, -81, 257, 86, 139, -37, 41, 37, 3, -104, -360, 127, 13, 22, -39, -213, 128, -24, 75, 138, 18, 201, 17, -42, 153, 279, -250, -80, 99, -254, 5, -64, -72, 194, -301, -219, 13, -8, 135, 30, -131, 124, 18, -139, 266, -36, -184, 44, -200, -107, -36, 39, 109, 125, -1, 38, 92, -80, -223, -71, -216, -29, 113, -41, -211, 151, -40, 291, -18, 75, 117, 259, 88, -85, -207, 24, -79, 119, -96, -35, 119, -320, 112, -133, -46, -490, 120, 66, -77, 83, 167, -25, -32, -79, -84, -46, 72, 142, -39, -218, 38, 171, -135, 9, -227, -178, 182, 73, -91, -136, 153, 107, -165, 59, -168, 98, 89, -63, -40, -46, 27, -145, -241, 189, -136, 218, 110, -36, 119, -109, 77, -142, 17, -10, -15, 165, -192, 143, 77, -135, -134, -64, 208, -98, 18, -147, -26, 174, -263, -146, -39, -156, 334, -25]
7964b5M9j42l8K37j00J22k32N2L3P0k94L95j85Q5J13l23K27m6R5j62J73N3k61
7987a04J49k08N7J2Q9r5J99j54r5J32J18k54K98r7j1J59j42K34j75J9n4lk93l3
8011b52J35M01k25j33J09J89j12j43L18m21O0q5J23J15PP8J2J6k35O0m8J68o6
8034G1oq0JJ75J4j68o7k05J99J62J5Q4k0l6q6j43m6J22k44J39n7J88N5k7n6L2
8060A6m2J65j18o5j56K94M6l05k0L02L02l36l3j78K36j21m9k1p0J0N9J10k80M3
8084b11K35j59J69n1j40L64j60j00P8j11K1K23k63K98k05J96k13J04l9q3j39N0
8106a36J07j98J48N3Q2j99M87j90k33J13K9j0R4J67n48L12J7k8J86p9k28O2L9
8129D7o3L54k71k9j67M72l33J45k32J16M4o2jJ51l80K12J71k53j70K03J10l9j17
$$ y = [-25, 24, -118, -156, 81, -19, 103, -129, -77, -44, 26, -268, 127, -58, 27, 140, -183, 44, -2, 93, -69, 104, 157, -104, 45, -163, -106, -94, -5, -100, 99, -55, -150, -18, 100, -154, 144, 47, 36, 195, 53, 287, 112, 131, 77, 74, -219, -252, -117, 284, 59, -74, 35, 224, 112, -31, 287, -134, -74, -159, -36, 79, 86, 164, 176, 192, -43, 17, -31, 137, 71, 65, -15, -14, 161, 175, 7, -60, -265, -66, 96, 111, 195, 175, 139, 53, -90, -136, -14, -258, -119, -176, 12, 67, 40, -16, 16, -26, 139, 21, -44, -200, 94, 140, -165, -185, 117, 419, 83, 50, -128, 108, -13, -62, -83, -153, -143, -84, 26, -254, -211, 24, -135, 34, -17, -157, 207, 47, -53, 25, -86, -65, 158, -105, 193, -12, 184, -29, 75, 36, -47, -186, -136, -29, -227, -79, -26, 56, -143, 344, 154, -79, 34, 63, 53, 147, 314, -234, 78, 95, 67, 253, 174, -54, 8, 47, -16, 338, 67, 38, -129, 343, 10, 155, -77, 39, 83, 21, 20, 171, -209, 3, 174, -79, -249, -46, 64, 25, -92]
8152i2m4J98K1k75K05Q9o8l1K89l44J58j10r6J00n7j42L7L32l05K38k35J63Qk69
8176b30q3L32J30J25k18j05J62j87mo0Q5J46r1Nj86
$$ y = [-92, -136, 62, 83, -192, 13, 102, 34, 3, 292, -52, 106, -4, -100, 0, -57, -199, -162, 170, -135, 103, -132, 31, 39, -230, -313, 19, 149, 274, 56, -49, 113, -74, -78, -138, -53, 93, 2, 7, -179]
8191a79
$$ Imaginary data points
##PAGE= N=2
##DATA TABLE= (X++(I..I)), XYDATA
0@%%%%%%%%%%Qj6J6j6K4l2M0m8N6p2Q8j04J20j37J61j92K24k57K97l44L93m47
32b38N08n77O54p38Q30r32J043j165J299j443J601j775J965k173K400k648K920
49A531l216L541l902M300m742N236n790O418p134P962q931J0083j1478J3208j5427
64h341J8387k2554K8904l9892O4167k16437J29912L70864k75933k44682N2870
75a42735K25346r384l5633k061n0197j15940P3872J80410l889j85789n7529J36512
87A2983P9179r1951j2559L4620l5155m6885P1699O8497o8455p8534N8918O9903
99F2260p0185l2624J00909M529j23509k1444J61959L5369j75601n0213J64406
110E5856N8449j48083o4438J15145P7368r3236q2621P8679N0567n4812j2207N5640
$$ y = [0, 0, 0, 0, 0, 0, 0, 0, 0, 0, 0, 8, -8, 8, -8, 16, -16, 24, -24, 32, -40, 48, -56, 64, -73, 88, -104, 120, -137, 160, -184, 209, -238, 270, -307, 347, -391, 439, -493, 550, -615, 684, -759, 842, -933, 1032, -1141, 1259, -1389, 1531, -1685, 1856, -2046, 2254, -2488, 2748, -3042, 3376, -3758, 4204, -4727, 5356, -6122, 7086, -8341, 10046, -12508, 16396, -23496, 40671, -175766, -45854, 325010, 49077, -195605, -142735, 82611, 73227, 37594, 35533, -14664, -130604, -56732, 123678, 119789, -66000, -123529, 12983, 92162, 211, -12348, 22272, -12883, -59768, 11931, 80428, 11973, -66561, -7643, 62260, -7925, -40549, 60360, 64889, -58620, -80064, 81895, 117264, -58337, -108550, 55856, 114305, -33778, -98216, 16929, 94297, 1061, -81560, -2881, 47686, -7126, -19333, 36307]
122C6307k3282q7011M4994J26079l5277j52410J1000J33361J5344q7043l4004
133e1942M7594J2044k6675K5051J7514n0682k0654O2657K0412o2360j9666P4463
145B7756K7865r7346l3652J02117N5197q1059p8152N1362P3248k6790m1796K8181
157F931m164n1569L0425P8564j2630r9066j7355R3574L6252n5036l1556K1403
169d227J0721r660R950K7941j6237n3973J2421N0412j030k5513k757J205k2268
182b3015M900N9616J2139q3764m1421P7442O4994m0774p3648Q898N6621K76j9420
195B844N388r899k3755J4272L8787o40m9478j8513M8081K4301l5851k2143K0773
208e833J9853j7503j2039K3925R58k7494R153K6309j2528k1003Q094K0118p560
$$ y = [36307, 13025, -73986, -28992, 97087, 61810, -90600, -79600, 53761, 69105, -17938, -51942, -4348, 7696, -18979, 6072, 23586, -27096, -47750, 14907, 35319, -27041, -46707, 27756, 55621, -41725, -75377, 26740, 81937, 878, -77274, -25912, 47336, 20546, -21250, 6931, 2767, -48802, -18377, 60187, 47557, -51509, -68864, 24710, 60962, 5926, -25630, -4227, 6494, -3166, 6784, 34725, 18488, -35485, -23064, 27348, 26318, 805, -1952, -747, -23015, -18115, 41501, 53640, -30124, -71545, 5897, 70891, 30117, -43531, -34633, 21988, 22264, 2844, 8232, -1667, -25422, -11150, 27637, 26997, -22481, -40994, 7087, 31388, -4463, -26606, -5833, 14020, -3483, -15522, 8403, 9361, -18133, -8980, 17329, 4801, -16202, -8108, 12010, 4450]
221D450k2581J3980J8881j9061j7397J8675K2378j4176l0760J0588L5160o165
233A3972k4192J645R789J837J83P685k096k4809M12L6266M467l5389j3648K5555
247A677J9885j7814j7773J4568P255j1404K383R155j443r657k178J3472K589j6201
261e486L342J3982p945j3973O073J8296m742k4893L940K1972l880j2570J565L828
275d91j007j927P956M506j6982n769J9821P676j4453j2485Q055J4866o286j2574
289i094O692M557o191j429N872L002q456m940J3021K606j2440K863R365m084p562
304f218L643J1568l129j5375M093J3397k330p849l448M647M560m640J18M813p091
319c241l244J0198M584o950q480N775J2035o762q548O804K683m118q78K132J971
$$ y = [4450, -18131, -4151, 14730, -4331, -21728, -3053, 19325, 5149, -25611, -15023, 20137, 13972, -10220, -8575, 1214, 3051, 3234, 10919, 8823, -15986, -15574, 20692, 25159, -10230, -23878, 1677, 21562, 3748, -14025, 543, 7798, -3606, -1223, 7932, 6489, -3168, -5346, 8126, 10715, -5486, -2144, 11838, 3893, -10080, -4007, 14289, 9547, -15346, -11406, 10566, 6686, -5884, -4319, -491, -1498, -3425, 4531, 9037, -7945, -13714, 6107, 13783, -670, -13155, -5100, 9766, 3480, -9094, -2402, 2155, -4036, -5465, 407, 3409, -5047, -9987, 3034, 5640, -6800, -3937, 5428, 1344, -6218, -2575, 8993, 5864, -9511, -5418, 7979, 5649, -2200, -5648, -1001, 3559, -1081, -963, 3850, -3241, -6485, 3713, 8297, 1347, -7133, -1358, 10677, 3915, -4633, 2171, 4854, 736, -142, 1990, 3961]
334C961n502k801Q172j20p986J934L857O65l777j775O299J774q926J315P369k21
350D238m422l904M373L774n343P28K482o589l67P197J223n612n748M146Q741l591
366A326m536J080M70J811R95n56J939l618l442O260J927m289q17l36J645j108
382a249j619N136l19o473J011L959K069M80l216o95L46J65N120J208o777j644
398b498J632K106L464l126k882l95j977L282N701j742o292m269M417R795j765
413E451o360j589n15M092N164j628m229m619q30Q259L055n518m744k586N614O032
429E049m398m719R81K262K874k629k300M300J567k735k887j139N906M169o217
444H4l905J11J216M144J430j946m391o329N485J1770L76q808r909K074J5649N983
$$ y = [3961, -1541, -4342, 3830, 3710, -4276, -2342, 1515, 2180, -1597, -3372, 2927, 4701, -4225, -2910, 4459, 4238, -184, -4088, 285, 4059, -1284, -556, 1926, -4663, -5030, 2167, 3390, -2222, -7970, -3824, 4917, 1326, -3210, -2130, -1660, 151, 1146, 590, 2529, -1089, -4531, 1729, 3656, -633, -1450, -1786, -141, -1249, -2868, 2268, 1949, -4524, -3513, 446, 2515, 2995, -221, -916, -570, -405, 4715, 5923, -854, -2498, -866, 1240, 4704, 1578, -1304, -1699, -3676, -394, 5307, 3565, -2727, -6996, -2579, 7216, 5451, -909, -2498, -3013, 1079, 6243, 4615, 386, -4233, -5063, 3196, 6251, 733, -4011, -6597, -983, 5049, 651, -4068, -3087, -825, 2049, -580, -2880, 1420, 2987, 252, -2635, -3774, 2132, 6301, 84, -3821, -3710, -2494, 1650, 3080, 1134, -3257, -9586, -4101, 7669, 8045, -763, -10672, -8598, 7051, 13034]
460A3034j0180r436q51P684P418j772m437n488m977O142J0421K051r283j3646
474a3320K454J7958P271j0927j3488K91J4364O493q333m770m51P83L207J212J747
489D491k542p952P61Q046K416n260o670L763R085n075q449N603Q599j76j1266
504d626o545J2356J1655p074j2398k323Q817P206m568l688p11l822K08P204O165
519G856k859j4335m203J5921J1499p296j4334l264J2425Q284o174n328N71k17
533a454j569J992P687n3j3041n593J1863J0013l851j3114j956J1980M182p454
547c68k520M420K462m718m031O020N786m780o366q77N629L937m058k635K229k369
563b239j825L719N643J224j0177p806J0057J3077k190j4240p315J0687J1311m296
$$ y = [13034, 2854, -6582, -7433, 251, 7669, 5897, 1460, -4028, -9005, -2863, 7558, 9609, 326, -13320, -10866, 7092, 14363, 3436, -10052, -9761, 4603, 11096, 2763, -2007, -2458, -1675, 1532, 2744, 4491, 1949, -6003, -5242, 2804, 5220, -40, -6710, -2947, 6138, 1063, -7386, -1783, 6816, 6640, -4626, -11171, 1185, 12840, 5766, -6632, -8955, -138, 7068, 2500, -1188, -1899, -5721, -5513, 1691, 7856, 4997, -9338, -13541, 2380, 13879, 6583, -7751, -11015, 1410, 9694, 3520, -1808, -1237, -1454, -3023, -1031, 6656, 6603, -6438, -12031, -168, 9845, 5994, -7120, -9076, 2904, 7086, -368, -2888, 1532, 3994, -724, -4755, 1265, 7051, 2271, -4095, -4972, 657, 4594, 536, -2099, 130, -2239, -4064, -345, 5298, 6522, -3655, -11461, -1404, 11673, 9483, -4757, -12072, -1385, 9926, 5630]
577E630q180k226J834K956O19J754P50p587l943Q240O937j792q796l518O832O168
593E678k016m176k613K557K574j883K60R68k038j072o43J681L554k226m572J960
609b007L542k7k592q68M436L02n368q78N685L531l839o972J639O527O5k345j873
626a042j809J180K538J529L67m806l275M110N282P04m862m300K815M079J150j268
642B392m566j267M508J095j240j176j144N9K53Q85J993j057l665J057K843J279
658B249j940k717K703K532l423k90J609N09n10k319K20K766j760r33J278l46r41
675a313R9J565J814k634j678J967Q04J067K34k990n47K109J276M32k580k774K520
692f29K243r50j213j297J363Q32j091J734l01k234P35J631Q12m39k499R24K174
$$ y = [5630, -2550, -4776, -2942, 14, 633, 2387, 3137, -4450, -8393, -153, 6784, 4992, -3804, -7322, -490, 5678, 3662, -514, -3127, -570, 2004, 121, 381, 1349, -689, -1761, -2404, -723, 2831, 605, -3967, -2007, 1535, 1508, -1084, -1952, 2484, 2786, -2582, -3460, 2225, 5756, 1917, -5055, -3416, 3111, 3176, 831, -1042, -2851, -1671, 867, 2396, 2763, -2043, -5318, -1208, 4074, 4778, -84, -4384, -1569, 2510, 3660, 2392, -2174, -3441, 1067, 2162, 922, -254, -1398, -1339, -1086, -201, 1792, 735, -2930, -1873, 970, 2249, 309, -2408, 295, 2827, -596, -886, 723, 1232, 722, -1597, -1377, 1389, -371, -1304, -26, -372, -1313, -1214, 351, 2165, -469, -2147, -180, 624, 1691, 1925, -1065, -1612, 497, 1773, 2205, -375, -3149, -629, 1614, 664, -549, -1846, -483, 349, -742, 992, 691, -1543, -808, 823, 1635, 1196, -1303, -379, 1795]
709A795j019r43P60j095J73R5L84O63k096P7J600k22m74n22K70J694l69j750K100
728A121p87j378J655O77p70j066q37K262L10k517K70Q61j2M03r61L55O71j297
746a040J483P75j930K82R85L00l16j482R31J856k005q20J139o7q1j014M14J394
764H04j869j90K064o94n96P58L46N57r15j001J711J53j383J29M03K72n82q62J509
783F14l29j711J279J096j531k56O82N72K44j223N08J375j170l09R00j03r8j176
801f36M60J276k096k2J656j029l58J38J56J168j191j032K488l98j498R08P53K63
819A006r21q44J600P0j814R36L61r15M50m28L82L16j705J124J074r77L4L70K38
838C57K9p06Q09R49j659m27J468m58j71n03K5R42j787l48K879j099j360K20L04
$$ y = [1795, 776, -167, 593, -502, -329, -234, 150, 813, -1283, -1206, 394, 172, -302, -824, -554, 1140, 771, -979, 1121, 334, -1044, 611, 1288, 518, -548, -1385, 877, 1187, -1330, -1060, -199, -211, 192, -769, -414, 257, -1040, 443, 1218, -712, -430, 555, 855, 539, -943, -12, 1844, -161, -981, 158, 91, 10, -1004, -590, 804, -1065, -1255, 809, 115, -481, 277, 623, 1180, 265, -736, 975, 1128, -255, -126, 277, 549, -33, -895, 614, 285, -1426, -147, 949, -582, -838, -156, 416, 660, -563, -55, 1320, 150, -159, 741, 638, 540, -636, -176, 1100, -996, -1018, 638, -391, -749, -611, -455, 713, -478, -1510, 978, 580, -918, -10, 743, 1006, 85, -759, 841, 911, -903, 33, 394, -521, -71, -499, -117, 199, -1506, -382, 692, -285, -251, 119, 357, 386, -320, 489, 1438, -221, -648, 820, 362, 191, -312, -287, 655, -1132, -1480, 1399, 300, -1060, -840, -536]
857e36J438l85p21M82k63l50J700l47q31r02k55J964N33k625L68O98j129J070
875i1L98j7p36j397J877J794j437p96L0L73P92o45J17Q91j555l77J285l98J3l30
895b09r90Q69l39l1J201o01p55Q16p7L47L33k1L59j473q18L167K72k562j154O92
915i74K274J32k559L03N45q94P89J224N30j379k649J966L538j301k248l18P10
932c11J898m98j286K95n18l44Q77q3k16L82j126o5L95J454O10k279j244L094M53
951A488j322m15Q41P89j723j816L381J706l274l034J793L429k41l760N43K439
967H24j464j50J009J537q41l394J010L790K16k365j910J78K496Q58j756j019o17
984a598P89J896j269p39J246p92m78L10J972O86l043j779M157K012l358j967J811
$$ y = [-536, 902, 517, -204, 278, 15, -335, 1365, 1018, 187, -715, -970, 994, 1527, -1098, -730, -32, -1161, -91, 307, 290, -446, -1843, 34, 1828, 391, -405, -375, -2, 790, 145, 262, 1153, -402, -779, 506, 108, 121, -209, -1199, -330, -669, -700, 501, -100, -855, -39, -116, 231, 564, 543, 902, -571, -1389, 1778, 2050, -512, -1666, -974, 1300, 1432, -1127, -824, -279, -1173, -384, 840, 1370, -9, -2658, -692, 2846, 1545, -703, -1021, -311, 1587, 1089, -197, 98, -420, -764, 113, 30, -186, 196, -930, -995, -600, 854, 1464, -815, -2059, 1035, 1488, 166, -249, 592, 1381, -342, -2158, 1223, 2929, -345, -3379, -1586, 1843, 1602, -2158, -1615, 824, -640, -790, 219, 1756, 915, -2479, -1469, 2321, 2537, 172, -1738, -1560, 936, 1794, 38, -981, -1598, -809, 1087, -182, -921, 325, -467, -945, -635, 1337, 2023, -1020, -2799, 1358, 3370, 12, -1955, -144]
1001a44K784k409l367L014L109k885l196J232L526o6l246M30K356j012j154J351
1017C23J044p07j803R3K569p7j203n90j194J015K170p32j598j681J431K840j425
1034D75j918K111M8j819J90K349J667l368l437M045L302l021k682M77L368n32
1050A255l390J626K311k386j024J435J235l08k297J135K082j516p08J653n91n27
1066a5k28J33O74j174N86J132k105j023K727J261j822k248R26L301j141k876K095
1083B03J309j902r90J773K599k608k948K383K757k224j698K52J795k34j927J387
1099g3J318k177m56K120L97p65j232Q51J178j616l7J637j124q35O85P22K14k035
1117a228o9K828j595j764J801J098q95j568Q37K137r24k185J883J268j573j122
$$ y = [-144, 2640, 231, -3136, -122, 2987, 102, -3094, -1862, 1664, 1598, -1648, -1218, 1138, 126, -1028, 323, 1367, 660, -1143, -1050, 1519, 1442, 239, -351, -1545, -530, 1640, 908, -690, -2371, -940, 1900, 475, -1443, 668, 716, -1103, -913, 1436, 3103, -265, -3702, 343, 3645, 624, -2058, -1581, 1787, 1255, -2135, -509, 1802, -584, -1608, -173, 1062, 754, -1543, -408, 1674, 158, -550, 1103, 512, -15, -243, -110, 564, -610, -24, 1108, -997, -2020, 707, 1968, 146, -2102, -1176, 2125, 984, -1892, 203, 1512, -390, -1380, 393, 2992, 384, -2564, -181, 2576, 352, -1346, -1094, 701, 467, -1460, -73, 1245, -932, -1388, 732, 1129, 364, -868, -17, 1161, -455, -492, 1145, 21, -814, -129, 593, 807, -1228, -1297, 1531, -64, -1828, -27, 1071, 176, -1392, -555, 1582, 658, -1527, 356, 1624, 51, -1071]
1133a071J195J704j410k615K081J719k176o75J282M80r70r64J785R38k175k08
1149a080K033J88j276p59J179R92k042j27K248q64j570N75J172k31j552j57K352
1166A081r85j526J242R69p40p21L65J771r62j902J673J116j590o83J132O95p15
1183B20j501J195J140j898n13J714O15j191p14J185J224k123j04K131q80p47J57
1200i0O09N38j568l06J495l12j340M09J056k78j080K53J744q48j691J679Q18j080
1218Hk37L08R65o26j658J488J110j647p22J071O93r40j094J381O78j451j57J302
1236D72J37q18n04P60J333j563l54J780p54p28k0O85K30j267K9J468o16j209Q54
1255h5M52k38o22J02J109l91j365J208R38q92o83M65Q92p44p55O92P95j386j54
$$ y = [-1071, 124, 1828, 418, -2197, -116, 1603, -573, -1248, 34, 514, -456, -1420, 365, 1303, -872, -1080, 953, 1141, -135, -894, 285, 1277, -765, -892, 1356, 492, -1078, -503, 669, 438, -1114, -1271, 1081, 96, -1430, -188, 781, 41, -680, -315, 1456, 494, -1408, 265, 1381, -209, -892, 240, 935, 220, -1281, -86, 1054, -844, -1357, 357, 972, -219, -933, 252, 1476, -647, -751, 1380, 500, -247, -90, 519, 1057, -511, -817, 678, 366, -974, -565, 491, 213, -867, -614, 1130, 282, -1409, 270, 1088, 8, -229, 79, 1044, 418, -1240, 248, 1358, -289, -1011, 60, 753, -187, -1281, 100, 778, -673, -830, 472, 609, -209, -713, 47, 1380, -183, -537, 1243, 489, -239, -259, 426, 656, -611, -582, 886, 270, -939, -85, 367, 129, -493, -391, 718, 327, -1038, 170, 1108, 216, -467, -2, 890, 146, -609, 83, 878, -508, -662]
1274f62R49P4k86q36O65Q27j342lJ339m50o83K61M07N25r14l47J316l80j019N72
1294A3K71K0j141J09R29k8j012R35L62l07m64M40L44j7j143Q74P17j263K29L15
1314A83J17j80o88M00Q47j279J77M87j89rl90K94R90q95j56R11j64p76K55K14
1334A49N95j055n38J384n52n52K46K09l64J65p1Q56k88q73O89N97o41n1L20J75
1354D00M4p95M48M24j040L11O6K74j70l63K56L77r05L85P65m06k6RJ12K55m52
1375c1j20L92j68m25P20k78k36K3l65J010l06j027P56L17j96m61MP99j89p93O32
1396E8N79n43q9j05L75j06k71j68N77m83J04J05l71L67K23l77Q5l25L05P49q51
1417a62j27K46K55J48n62K07P07o11m71O84R4m64l79q8Q88m08m35L54K60J23l04
$$ y = [-662, 287, 361, 75, -761, -96, 731, -611, -614, 725, 275, -408, -147, 260, 785, -129, -476, 840, 460, -559, 13, 284, 304, -837, -728, 201, 173, -839, 96, 458, 151, -313, 127, 471, 454, -689, 185, 902, -361, -132, 183, 300, 120, -568, -168, 679, -600, -423, 64, -125, -134, -524, -230, 760, -135, -291, 620, 456, -320, -65, 149, 744, -311, -849, 535, -17, -569, -323, -114, -478, -313, -384, 472, 184, -689, 0, 597, -44, -95, 225, 400, 444, -351, 97, 521, -519, -208, -142, 132, -38, -401, -145, 232, -673, -288, 477, 71, 45, 54, 166, 421, -31, -151, 241, 73, -352, 368, 90, -146, -123, -488, 522, 216, -811, -55, 262, 66, -395, -391, 408, 219, -574, 58, 637, 94, 5, -100, 275, 169, -102, -270, 307, -176, -72, 33, -338, 29, 252, -125, -40, -365, -60, 689, -162, -289, -43, 212, 360, -202, 5, 712, 101, -370, 314, 408, -56, -435, -523, 365, -43, -478, -124, 136, 259, -45]
1438d5k49O16K69r25L15M27m96L4K94m47L8L10k98l6PM14O0n98K22k4K35k40l96
1461e13O88O31q00o14J011k14Nm15J4R58n47p44K51O08l17m63j89P04J04p55M33
1482a64N32m51J82l86K14M38m64l9N47m49K01j08m58L25Q7Q9j64n39P32K01j26
1503B00o73M54M75o1o85L46M40m98j89N19L0Q2p85k69Q67j13o69K62N80j74k57
1524a18j19L28M49q53K91K11j75M83n48J43Jk24L26j98m74N85J3k05j05L52K69
1545D32l0q58L21O74o67k36N80J00j02k13j97P66n42l94L96L82l01n86k2O56j40
1566A9o26N69J73j40k41K62k2j2J21J62o2j72j57L64k81j68N1M03j60l84j32N42
1588A09k5l06J57K20j30o26N38K82J07o99N26M9O4l23k34P41k90l29K36K82o02
$$ y = [-45, -294, 322, 591, -334, -19, 408, -88, -54, 240, -207, -169, 141, -157, -193, -186, 228, 288, -310, -88, -112, 123, -117, -513, 175, 806, 6, -608, 403, 189, 194, -221, -207, 751, 204, -540, -289, 319, 2, -461, -650, 54, 158, -597, -164, 368, -83, 99, -287, -73, 365, -99, -138, 409, -40, 161, 53, -405, -80, 7, 96, -68, -607, 125, 326, 200, -473, -19, 456, 395, -290, 56, 496, -2, -191, 328, 358, 440, -345, -614, 253, 140, -529, -267, 313, 139, -118, -237, 91, 540, -313, -22, 189, 14, 497, -51, 92, 93, -131, 195, -3, -477, 108, 121, -84, -189, 163, 432, 402, -456, -135, 539, -128, -364, 216, 316, 214, 1, -196, 570, 28, -366, 30, 412, 111, -475, -497, 159, 19, -607, -38, 135, -5, -246, 16, -6, -18, 103, 265, 203, 31, -126, 238, -43, -211, -160, 243, 83, -301, -433, 109, 84, -222, -65, 155, 25, -601, -63, 219, 326, -373, 153, 202, 266, -57, -291, 450, 160, -169, 67, 349, -253]
1609b53J8J86J65J46m89N22o4l95l8J69O4K20l68J01K88m60J19K83j45n06M72
1630C5j14J95o46L46L47l31oj14L72J12l97o9O95m77l02O27l6k22k35oP21l00
1652A95p69L55K37j43j80K73M25k90l21J31K35j91m6L48O6j47o15O95O1o63K94
1673e0q1J84j79P2J40L7k92PO42o68Q4K12L58l79k63L5N02m67l89N08P2ln28N98
1697A52mj04k92K23J24k27k15N57r0j09l38L93K24k31j87M24l04j91j51L01J40
1718I5m58R8R5K34m04M58J23k5n45J41N30m06M6J60N5k42k07J17L87j19k87P8
1740g6J51O5n93L74K60k81K58j26j38r5J24K07j69p8o6O52j98l06L5l8K50m23
1762b11J18L94q5l28k80N43l54K33k78N37k79k43M12J74l51qK00r4L1k66J00J30
$$ y = [-253, -235, -49, 116, 262, -227, 295, 231, -164, -202, -33, 31, 251, -117, -16, 272, -188, -69, 214, 69, -437, 35, -79, 116, -530, -184, 163, -168, -174, -288, 84, 196, -201, -270, 425, -52, -354, 273, 237, 15, -220, -226, 495, 195, -574, -219, 18, -125, -305, -32, 393, 103, -218, -87, 148, -43, -89, 259, 325, 178, -437, 258, 319, -344, -50, -131, 53, -126, -54, 86, 123, -169, -162, 480, -188, -104, 108, 466, 87, -176, -141, 361, -106, -495, 13, 85, 82, -446, 152, 148, 44, -248, -25, 99, -128, -343, 214, 124, 15, -323, 70, 294, 63, -124, 300, -4, -195, -346, -45, 95, -363, -265, -170, 64, -340, 118, 241, 216, -329, -188, 342, -64, -18, 142, 197, -45, -252, -135, 252, 133, -154, -76, 75, 140, -453, -79, 181, -100, 158, 32, -106, -201, -77, 130, -39, -117, -183, 469, 271, -35, 0, -38, 212, -211, -93, 301, 216, -112, -392, 151, -203, 30, -248, 289, 10, -233, 179, 353, 2, -6, 194, 100, 131, -135, -35, 95]
1784I5k22M2M10l80j70K1L38k35R0o4L19J22o14L9Q6J58P4m14J99L53k32j31K01
1807H5K19k96k18J31J11k63J04J11j3M3M4K30k48k49K42J70j19m59N58L4p5j69
1829b7J6K42k24K8J35j87p4j2L00J17j39l74R6K69k29K14J27l22J83l20J74Q1
1851G4j43J87L62m38k74L71pk85q7K35J57l04p7K59k4n6j9k10O35l51j53J17J7
1874a4L3N7J5M4j03k98L94k18J22nK9l4r8K36j96M13n29L97j28j13M4j49J12O9
1898H0k63L5j22JQ1K52N1m52J41QJ75pl21M99j75J55l11J52R2j45Q2K07k82J07
1922D0O7J34j58j58j84K91j74r6M01j11j02M5M34l83l54J79J18K50k75M1J37j75
1944c3O6m29O63k68n6j58K88j01J62n44J12K96o5K05Q6j58Rp4q6j68L43P2jj96
$$ y = [95, -127, -85, 325, -55, -225, -204, 134, -101, -11, -75, 244, 366, -248, -209, -123, 35, 109, -305, -106, 247, 15, -116, 85, 304, 8, -210, -79, 32, -231, -127, -16, -29, 14, 58, 288, 40, -209, 33, 203, 84, -375, 183, 217, 142, -27, -11, 231, 7, 35, 170, -17, -91, -103, 197, 314, 175, -199, -103, 166, -63, 151, 278, -44, 139, -181, -7, 74, -69, 118, 480, 42, -232, 139, 132, -153, -240, -5, 152, -152, -229, 30, 6, -50, -69, -279, 356, 5, -148, -31, -14, 19, 76, 91, 135, 32, -266, 128, -90, 32, 27, 56, 22, -76, 160, -36, 377, -152, 245, 117, 4, 48, -101, 11, 80, -183, -148, -270, -269, -188, 64, 115, -337, -196, -188, -13, -20, -341, 158, -17, 138, -173, -21, 71, -74, 8, 215, -67, 40, 107, 241, 83, -75, -259, 32, -142, -238, 163, 52, -50, -5, 429, 46, -308, -129, -11, 239, -36, 5, 142, -33, 33, -396, 267, -1, -57, -215, 73, -28, 134, -410, -298, -2, -67, 138, 224, 66, 75, 1, -85, -253, 90, 162, 161, -35]
1968c5j90K12j9j79L27N5p6Jk84L03R0j9j5L1j30L1j59K37o4N7l15O20l58q8k51
1993b18j2K86j45L22l40q5M36J0m07K20r8J62j55l4k20M71j65R3k08O2k1k24%
2016b70M30j06n1m3LJ18j42k97N64j11mj3k25K68M5n76K76M00k30j73O6K92k94
2039g3o2J9J53l7K2J4m0K07m4m0j31j50J05N37m21j42J83J80k97k27K87J20j77
2062a4M9j97L56j30J85j79j8Qj87N8Q8k05Q6K85l10R5q4K60l23K86m5Q6j14j33
2086i7j64M0J26o2k8N21k34M5J30l03J37J09j85m2k17m0L86l7k22L7m2L48k94
2109h8N1J47j74J26j23L17p7m83pM46j73M7J7L6p7j60P6J17J56k34m7k6J61k0
2133Hl8J67j65p8KN81m25j26J00J19K2k96J65j12L4r9K26q1K6L0j85J22k2RJ01
$$ y = [-35, -225, -13, -32, -211, 116, 171, 95, 96, -188, 115, 205, 186, 171, 202, 72, 103, -56, 181, 117, 174, -141, 479, 121, 33, -218, -230, 56, -89, 233, -107, -192, 244, 254, -153, 67, -31, 131, -24, -58, -278, 193, 28, 121, -87, -25, -46, -270, -270, 160, 54, 3, -40, -37, 81, -61, -358, 206, 95, 91, 78, -147, 121, 166, -410, -134, 266, 36, -137, -71, 221, -73, -135, -116, 37, 0, 22, 36, -4, 203, 159, 119, -12, -162, -57, 480, 59, -83, 100, 280, -17, -244, 43, 163, -14, 35, -162, 194, 64, 249, 70, 52, 60, -127, -69, 19, -186, -100, 185, -125, -30, -114, 146, -177, 109, 64, 150, 36, -97, -261, -221, -95, -157, -185, 336, 102, 147, 277, -26, 111, 220, 35, -7, -224, -264, 122, 85, -137, -100, -142, 206, -88, -37, 110, -64, 62, -61, 256, 179, -304, -311, 135, -38, 9, 26, 62, -15, -175, -99, 18, 174, -60, -107, -133, 28, 8, -30, 137, -28, -106, -104, 477, 52, -74, 26, 145, 167, -129, 36, -76, -42, -141, 85, 4, 30, 60, -125, -3, -25, -16, 85]
2158H5n2k38L37j56oJ06J40j56Q1j84k17N36l55J6r1N2m9L64j35L16j45l62pJ33
2182A3L60k58P7q9n6k77L54m5k64k21M63K46k41k75J17k1L15m2j79N8K16l9o3
2205A49jj39O8j02L0j14j03L94k38j93J97Nj1j28J84K18P7n60n0K93j44o2J31
2228i9l9R6k00K36O0J6l58K65lj43N4N5K25k57O2L01k09q7j25K60j70k9P5J27
2252A13J66j63k31l5J71O0k15J61n4j22L99km12K54L4m0J61m33N7L47m90K14L6
2275b4Q6k03M9PM19o32J13L85l34j29J77P7o3R7j21J56J44l27K86J09l01r1Q9
2298c1J48K75p16K39J35l39J88J59pM1l85M6K66j26n5L49j94K84m82J43L13j22
2320A29k76L71j81j82m4K08J7j87O2J97p2k65J76J2L95P1l78R7r2j23K82jk20
$$ y = [85, 33, -205, 132, -24, -30, 76, 216, 60, 141, -43, -260, 276, -79, -63, -154, -102, -151, 213, 78, 394, 249, -113, -120, 13, 373, 115, 192, 103, 47, -230, 124, 79, -185, -406, 57, 303, 62, -213, -96, -117, 198, 156, -23, 35, 251, 212, 149, 148, 9, 77, -25, 5, -109, -212, 182, -56, -249, -52, -47, -58, -186, -2, 216, 293, -267, -317, -24, -168, -230, -99, -138, -42, -242, -6, 54, 70, -288, -23, -26, -169, -115, -60, 165, -92, -30, 271, 62, -25, -150, 110, -60, -89, -14, 113, 279, 116, -115, -150, 21, 81, -134, 27, -27, -149, 250, 248, -164, 90, 124, 84, 245, -188, -131, 216, -274, -60, -24, 62, -141, -92, -85, 334, -298, -185, 200, -134, -263, -86, -9, -72, 25, -96, 60, 204, -123, 163, 272, -29, -120, -31, 117, 392, -324, -85, 50, -289, -101, 58, 51, 92, -293, -247, 19, -107, -162, 187, -7, 277, -205, -62, 251, 129, -147, 224, 43, -139, -183, 25, 42, -145, -83, 114, 42, -223, -47, -35, 360, 431, 53, 150, 58, -65, 217, 216, -4]
2343dPq0L43r2p2k93J78k30N8M70k62J28r8J63n2l15K06J98p6o3j77q8J47R3j72
2368h3N3J08j72L75o9j84kL5l68K39j91K26L05k66M1n2J12K07l91j26K41Kj86
2391a46O22l99j49K3J2j25J25j24L97k1p0q1k1L9k34j0L71nl71M2J47J57l02j33
2415b56O0RJ87m5J38J4Qj92L66l43K21k90p7R3J52P2k40k2J32j68M92m54J4j0
2439a39M90j90j78J91q2j47J64o8O5P8j31j52Q4k1L4K53o6N7k30o3j0K6Q5J83
2463B33o2q5j70J53k19J57J5l2K81l12j3N1rJ34l3N6j9l54K29N7k6l8L1R2k68
2488a51K39kj35l41N55J2k43R1j63K03K1j37J9K00l17J29K99k76j07J22l64O43
2510B97j53j50J8k47L90l59O1J30j55K58l0p5j9K6o8K05m91L03j05L57j24Oj45
$$ y = [-4, 3, -77, 266, 174, 102, -191, -13, -243, -185, 285, 23, 151, 53, 216, 164, -151, 55, 253, 177, 114, -63, -151, -4, 89, -83, -30, 78, -94, 281, 212, 28, 26, 61, -307, -68, -259, -33, 272, 6, 47, -5, 107, 314, -77, -203, 38, 40, -146, 476, 77, -72, -49, -37, -162, -37, -161, 236, 215, 145, 64, 43, 82, -152, -162, 209, 204, -167, -125, 22, 179, -123, -256, -196, -187, 0, -45, 93, 107, 115, -77, 289, -54, 167, -123, -200, -107, 45, 117, -123, -145, -13, -181, 311, -143, -129, -139, 351, 161, -17, 174, 92, -55, 109, 41, 106, 184, 53, -99, -15, -36, -2, 251, 185, 242, 12, -51, -61, -35, 50, 233, 171, 86, -84, 69, -150, 7, 22, -10, 271, -41, -54, -3, -12, 122, 89, 145, 126, -228, 1, 58, 32, -6, 25, 117, -151, 88, 86, -49, -390, 165, 177, -66, 25, -138, 65, 86, -51, -32, 168, -149, -20, 279, 3, -104, 18, -346, 297, 144, -6, 12, -235, 155, -204, -143, -13, -168, 90, 60, -15, -34, -8, -76, 129, -362, -59, -164, 193, 69, 75, -70]
2533g0k6J28J03j14P3l52M8M82j64k1j43K62l98n2K9M04l2k81K1n1N4J54j93K13
2557G4l06J70K16l38M32l10K03j35J31k25j29K02J54j51m3M5M9K4Nj81K13j64
2579f4N8J55p0j77Q6M5k9k05K53j90N2L58m07L67k40j10J62j27P6l23K70M48n19
2602a31K27k01K29q6Rl5lo2J72K1N7l04L31l62K51p2M7k3q4l8m0m4K24p7J69o4
2628A11K6k95L8L01p4k12N10k22k07K40r1k5j3O2p5j21j48jK23N8k98K99o1Kl7
2653a0r3J61M1j37J40o2Q6j38o8K42j88L8K40l84J9j41K85R6k19k6J98o7k54K38
2677ck9J69n6q5M03n65J52J57k71P2J69j61K07k95L9J14l4J09k12J31j05J05p9
2700f8J49p9L0k0J47K0k62j6J06k82K98k38J45J89j72K07k68K54k2l69L54J64
$$ y = [-70, -96, 32, 135, 21, 94, -258, -210, 272, 108, 87, -56, 206, -192, -244, -215, 189, 157, -124, -103, -154, -100, 54, -139, 74, -232, -62, 154, -184, 248, -62, 141, 6, 137, -88, -217, -15, 139, -12, -55, -10, 39, 63, 68, -113, 100, -64, -6, 149, 79, -98, -12, 33, 4, -201, 52, -138, -86, 272, -135, 232, -8, -118, 44, -83, -7, -330, -60, 388, -131, 96, -105, 124, 38, 47, 12, 9, -53, 119, 140, 197, -107, 224, -138, 113, 41, 88, 65, -19, -57, -97, -141, 83, 6, 175, 111, 137, -158, -120, 181, 107, -105, 405, 183, -24, 216, 125, 100, 87, 149, 74, -47, -195, -196, 27, 85, -213, 86, 25, 27, -10, -103, 58, 99, -38, 102, 40, 126, -12, -80, 162, -26, 12, 252, -132, -113, -254, 31, 127, -92, -118, 80, 13, -241, -3, -32, 137, 81, -4, 399, -166, -14, 143, -128, -56, 113, -48, 159, -136, -97, 17, -17, 92, -120, 11, -94, 11, -68, 81, 2, 32, 12, 159, 179, -83, -99, 7, -275, 23, -215, -70, 119, -53, 154, -114, 140, 118, -251, 103, 267]
2722B67k06l43K12J4l8n2J06J14k71L24J3m51J48J97j61p2k5M30m8j86j13J28
2744a3lP3K4n4L3j10l6K8k55L47K12k16R2r2L1J3r7j25K00j32K35j18O9l0j98
2769a22J21j12J70k15K46n5N0l04m0L92J95l71J8O5p4J63k7l7R8l93L36O3k50
2792h3J28R6K5l73K71k21L01Jk56K85k09O2j41q0K91J48m50l3K02J31k17o3K03
2815A8r5J06R8j04J7j10M5J03n7l17J26j02J44Q0J81L2j12l09L44k7k4k59J59
2838f3J44j36j76R9L4R4l58K64j9J95J21l15L35m57O6R3J25q5P1j91m3o6J98J80
2862A10l7J4M1l73N13l19k04L67l9k22j45L09n8j42J37jn8P1k33M15P8l38J4K20
2886A20L3k16J81k33p4M48j86j85L4%J61j45K6q3R2nk39L65j94J67j31J47P3j99
$$ y = [267, 61, -282, -70, -56, -94, -146, -40, 74, -197, 127, 140, -311, -163, 34, -127, -199, -224, 206, 158, -28, -141, -13, -16, 57, 81, 27, 60, -50, -86, -58, -313, 34, 246, 30, 122, 30, 61, 74, -23, -148, 52, -80, 155, 37, 106, 76, -122, -1, -113, 57, -158, 88, 33, 83, -221, -261, 131, 326, -45, -27, 38, -36, 127, 100, 63, 161, -232, 104, 167, -83, 45, 141, 166, -207, 64, -157, 144, 145, -111, 174, -35, 27, -114, -194, 97, 245, -205, -238, -36, 95, -122, -185, 18, -77, 29, 127, 23, 40, -70, -25, 78, 21, -296, -170, -272, -128, -48, 133, 165, 53, -256, 88, 61, 37, -222, -63, 81, -55, -231, -132, -98, -4, -362, -98, -117, 78, 199, -116, 219, -238, -172, -79, 46, -39, 32, -159, -202, -268, -70, 110, 73, 87, 128, -245, 268, -51, -255, 112, 73, -149, -294, 15, -43, -185, -48, -49, -107, -36, -269, 146, 224, -114, -100, 120, 153, -63, 118, -115, -189, 259, 73, -112, -78, -78, 83, -62, -36, -119, -27, -32, -271, 94, -100, 67, -64, 83, 156, -43]
2910d3P2J89l83qL98j59l7j95J67L37k45o1j9N2k01K71l1J37k70ol48N74k81P
2934h3J4p4j43K60J32j60qJPR0J20n0O1r7R4k05j47K47j26O7J51k8k60J53l03
2959b87L07O0p7P5q7M8j7R0J42j48o7J6J48l70R2P0l62K53M30k79o4k7K78k93
2983f9J92r3J62J35j42k82J41O5j61MJ3K48n60K60N01l39l55j32O51j76O5O0l3
3006A55l72k4J67mM60m58J26n5J1Q9k01J30k61O0J39p8K14j98l03K48m3K77q8
3029iK34k0j87j97N3m6n9L69m2k17P8O0r8L4J5J34k8%l3J2k23J73j27P4lJ6K97
3056B60j49j75j52J99J84j93M1j17n5J01j81N14l78J2O9J89j97m2J62j27K6j49
3078a58M23J7m05O6O6r8K07j09J02Q5j47O2j39k36M62n16L90L2k66J93m4J00Q6
$$ y = [-43, 29, 218, -165, -173, 225, 66, 29, -166, 1, 338, 93, 32, 13, 65, -136, 135, 104, 241, -29, -35, -383, 191, -90, -83, -69, -143, -286, -26, 106, -54, -62, -61, -54, 36, 156, 106, 167, 70, 164, -41, -188, 59, -67, 0, 151, 123, -137, 16, -287, 20, 80, 3, 78, -9, 39, 22, 112, 254, 106, 39, 55, 203, -167, -75, -5, -367, -114, 316, 37, -27, -54, 224, -69, 123, 30, 192, 327, 185, -97, 44, 109, -52, -48, -35, 213, -347, -87, 414, 75, -280, -412, 239, 63, 128, 188, 155, -217, -241, -74, -78, 382, -76, 50, -5, 6, 95, -106, 24, -237, -177, -38, -116, 98, -100, -403, -155, -198, 79, -9, 225, 205, 18, -179, -126, -172, -231, 138, 96, -121, -43, 17, -81, -47, -32, 102, 74, 74, 41, 53, -170, 3, -124, -50, -53, -37, 260, 111, -64, -216, -17, 167, -26, 15, -102, -157, -56, -237, 277, -101, -89, -20, 169, -28, -70, 92, -35, -9, -158, 265, 282, -123, -57, 9, -89, 118, 9, 111, 196, 49, 111, -28, -264, 198, -318, 72, 104, -162, 31, -13, 87, 173]
3101A73j55O1K4j52K6J64n7j72r3J40n6j18J09J80o7J9p2J49l8j63O5K28p3l2
3125I0l1k28L39k6q1j79N4J71m5m24L2L55j04J05r1k6J7j31J70J05k61K88J80
3148B79ol04J42J2k15L08k96K43j61j51mo4K60K22j45j7j99q2J91k05K78J38j70
3171E4k68N9r4K78k83K09J40k03K42j20j3q5Q3k54K07L27l06P7l13M64m04J63
3193d0J54l4j24m1l3j0J6K5J47j55J43k5o6L9n8K87j83N3j01q5J55M6k94J26K0
3218c8R8j83K08l28L49r8j04k3M6J82k13J59l08M76j06j06p8M36m67K10ll86K59
3241a8q2K30k31K93J08l97k21L63L3j74L3L24n23K65J38j06J7m1k94L41j3lR3
3264A35k44J33k91L34j81J43r4o9o9J56j08J60j18J47K25k46L1J03J6m8j79p8
$$ y = [173, 18, 79, 103, -49, -23, 141, 84, -88, -181, -41, -97, -215, -106, 74, 7, 26, -46, 103, 65, -98, -33, 195, 122, 90, 59, -169, 170, 144, 63, -116, -62, 109, 64, -360, -328, 27, -77, 28, -63, -89, -72, -203, -33, 72, -189, 99, 279, 273, -31, 111, 123, -92, 216, -80, 163, 2, -149, -153, -217, 43, 265, 120, 103, -96, -178, 13, -192, 86, 224, 54, -214, -155, -249, 29, -254, -45, 95, -108, 134, 14, 1, -84, -1, -255, -48, 279, -27, 50, -263, 201, -203, -40, 114, 80, -44, -85, -118, -128, -112, -87, 60, -95, 48, 23, -43, -4, -62, 225, 42, 95, -6, -91, 64, 110, -184, -58, -38, 60, -123, 85, -243, 106, 8, -96, -119, -73, 109, -104, 55, -253, 223, 117, 11, -67, 369, -98, 112, 109, -277, -18, -100, 130, -101, 192, 300, -97, -318, 45, 78, -96, -63, 261, -262, 3, 141, 35, 52, 11, -283, 58, 45, 42, 135, -109, 24, -267, 67, -114, 29, -65, -134, -203, -47, -155, 5, -113, 34, 259, 13, 44, 147, 163, 115, -64, -142]
3286a42P5J06o9J50O0k93J68q1N2J1j10m5K34J18k15o7N3n8Q7j8K02j25k37Q8
3310e6K63n0j67J09j5j21l2K6J68n3k33K78k44L07k0J43m31J56M7k7K3k01K04
3333G4j93M4K9J1J85k74k2P2l9K64k52j57K89K12m74Q1R7K8N2n1j30J79j20K17
3357A22j99J20J76l62J16J20l28J04K56j93l0J33K51K7l72K14k99M14l87Q5J9
3378a3J15j86j27J06J58P3r0J03l01M5L20m75K53Q0k35L12q9o1K82m10K81j46
3400ep1r3Q0J39r7J87j07n6L52n33O3J3JK70k84K43l7J5Po4P5k02q8J66p1J14
3426A7o2J71M8j7k00O7j9r2L2J18p6M2N2j47j03l0L53j8J27j93k14J66o9L7q6
3451i6J28k41R7J11K83k51O5J20k46J7J35J01N3m04PJ93j93J90k61M0K38k03O5
$$ y = [-142, -67, 39, -30, 120, 180, -113, 55, -26, 26, 37, -73, -118, 116, 234, 19, -48, 5, -53, 34, 16, 218, 93, -144, -56, 207, 157, -10, 99, 84, -37, -69, -43, 125, 72, -161, 117, -127, 180, 160, 303, -128, 28, 75, 48, 71, -130, 74, -119, -75, -46, -35, 150, -124, -146, -74, -113, 151, -101, -258, 31, 243, -231, -150, -53, -25, 27, -24, -154, 25, -95, 122, -77, 43, 219, -143, -27, 93, -235, -131, 125, -68, -98, 35, 286, 313, -59, 155, -144, 270, -117, -32, -13, 102, -84, -211, -105, 53, 126, 36, 139, -162, -117, 203, -272, -19, 61, -174, 138, 49, -12, 270, -140, 141, -5, -76, -169, -89, 50, -47, 140, 33, -23, 329, -204, -141, -128, -127, 143, -141, 102, 65, 80, 87, 23, 98, -104, -192, -26, -97, 17, -45, 126, 174, 157, -43, 24, 5, -87, -55, 63, -13, 29, 81, -66, -169, -199, 154, 136, 263, 70, -144, 22, -47, -10, -96, 32, -209, -112, -1, 282, 31, 96, 216, -30, -13, 122, 223, 276, -128, -121, 72, -121, 69, -192, -152, 86, -117, -52]
3474e2J33R5l0m6J35N8l45K30m49J58J55Q2q2P9k51J32J08o34O32k5l3M4q2N6
3498F8j52K53k98J20j03K31l6M6m3nk98K03p8K29m94L45K10m16M23n40O2k8K18
3521h3k5k0L23O1l21j34K10n1j03J65j84N1M01l26o2K17N6l60l6L47P7j73Q1p8
3545C3O3l77K80J89j36k20J67K05k99QJ87J39k23j93k9K17p0K60k01R1q2j02r6
3568a89J35K15j01M9j6j10L6l08K82k39K31J6l4J18n9q8j3L2j3P7k1j19J73J7
3592G1j35K98k13K9K4k00K96k27O4Q0p3j85l7L1K66k21K28l70K02j44K0K57Rl8
3616C2R8j7j22J73N1k09o2k70J75L52p7j27K0j11J22j07J26R0j68n4J93j8KJ37
3640B29k44J63J03m07J16J91k05m1K31j75J63k35rJ79J42k04K06l75K00k12K9
$$ y = [-52, 81, 176, 146, 100, 235, 293, -52, 178, -271, -113, 42, 124, 42, 121, -130, 2, 110, -524, 108, 83, 50, 94, 12, 68, -84, 169, -129, -9, -112, 119, 83, 129, 86, 81, -217, -14, -92, 137, -357, -12, 198, -218, 205, -335, -273, -301, -83, -108, -128, 195, 256, -65, -199, 11, -40, -143, 22, -162, -111, 290, -36, -98, 119, 175, -185, -221, 126, 203, 30, 111, 33, 96, -281, -1, 188, 52, -168, -1, 204, -95, -87, 100, 239, 16, -177, -206, 11, -59, 201, 0, 91, 9, -93, -189, -54, 161, 60, 109, 93, -17, 19, -289, -7, -246, -15, 1, -33, 85, 26, -62, -75, -43, -56, 21, 0, -119, 54, 71, -64, 234, 21, 50, 74, -126, 170, -57, 7, 87, 14, -171, -208, -177, 89, -132, 96, -274, -72, -216, -196, 61, 70, 32, 130, 113, -9, 164, 215, 6, -56, -326, -151, 201, 124, -3, 17, -94, 28, -79, 47, 137, -31, -85, 108, 90, 92, 229, -15, 148, 251, -156, -40, 151, -54, -95, 136, -39, 124, -111, -120, 59, 201, -3, 203, -172, 28, -184, -155]
3661a55L25J17k12j09O1K06q4j64p2j8J37j56J04l65N10n2k07J38L75l24R2J17
3683B64j1k7p0J9k24j06k57K68K38j42N5j10J80j25P9J44j06k29k6K54K4j99J83
3706G6l48L65J25m52N8J48J61k35R7K7J4j43M2n3J49j15L47j53M4k14M4Om7Q0
3730B3k30M07l34J49J04N1k85Q6N0J57k12L44k53J16m03o7K36J23J65l86n1L70
3752A60j13K10%l86q7J80N0K2m6J60j34J04j98q5l1J22j38L38k35J5N7q9M02k09
3776F9j80n0N16k41j46j6L18l15o5O9J78j69K53k95O5o6O9l4J37J75m00J55J2
3799C9l20K86m0J0k38J68l05N56m06K06J86k99K62k01k2N2j34O5K27k02J11O8
3821F9r3l72K55l84O34j41k53P4K74J15k36j71L45j17p1p3K30k89K03N0j1K90
$$ y = [-155, 170, 287, 75, -34, 27, 233, 149, -15, -87, -105, 32, -124, -20, -385, 125, 73, -134, 4, 379, 55, 147, 264, 253, 226, 156, 175, -49, -155, -412, -144, 94, -48, 7, -103, 77, -48, 31, 175, 69, -160, -186, 68, 92, -107, 76, -272, 93, 218, -234, -176, -28, 133, -102, -5, 22, 36, -107, -65, -118, 31, -84, 263, 110, 154, -60, -16, -10, -57, 23, -207, 200, -134, 15, 119, 170, -115, -29, 21, 178, -34, 310, 57, 173, -230, -297, -61, 62, 227, -159, -210, 160, 47, 257, 257, -129, -216, -36, 14, 36, -10, 150, 16, 120, -78, -163, -194, -72, -210, 128, -107, -92, -35, -124, 278, 69, -111, -161, 355, 114, -32, -48, 270, -45, -110, -41, 137, -32, 221, -74, -9, -75, -6, -40, 97, 272, -128, 27, 39, -281, 5, -35, -25, -263, -95, -400, 156, -250, -44, 142, -157, 105, -96, -118, -66, -200, -135, 92, -110, 1, 69, -24, -396, -141, -525, 109, -32, -285, -211, 63, 178, -58, -229, 116, -1, -72, -145, 85, -204, -1, 49, 38, 328]
3843C28p8J2k44L7J44j45o6Lmm6J08K4m33L32oL9j43O2j69L70j90L2J0L1j56R1
3869e7K3K46m3k22K68l17j01K78K9j33L5J06P6j73rj76J21Q7O2J57k2p1r6oJ03
3894A65l5J25l02L58n50M4K34j00J94J14k26j62L6J74J92k72M30m12K80o75L30
3915e8O1Q1j89J74R4j67J30l2nm03L22k62K99K8p7R3M6j71J10j57J52j37r2K78
3939A18l08k6P6K19r3J6j01j67L01j11J10J03j19r6J07O0O2k02P7J31l60K70K3
3962I0j09j84J68j60M8L22k08j2J68k98K02j12O5K11j50N7J2l31R4K64j25p7K3
3985d2K86k15J69j67j93p5L26l82J61K63k01j60K40J78j21j4N4j07O5k50K41q3
4007b7J65k77K20o4j40J70K7j65J00k5qj6lP3j0K84l86J54o1l8j1K37j07p7j0
$$ y = [328, 250, 262, 18, 55, 199, 54, -12, -9, -13, -59, 49, 73, -360, -28, -34, 5, -138, -76, -245, 125, -65, -33, -23, 8, -148, -57, -34, 212, 169, -53, 215, -102, -203, 75, 104, -29, 6, 112, 188, 15, 6, -170, -49, 38, 100, 257, 235, 164, 68, 62, 165, 130, 255, -47, 311, -239, -195, 39, -61, 133, 247, 21, -141, -105, 69, 261, -11, 419, 7, 287, -388, -58, 3, 84, -105, 69, 163, -4, 126, 94, 89, -314, 8, -254, 45, 73, -4, 89, 135, -36, 74, -83, 69, -68, -160, 118, -190, -216, -140, 79, -14, 2, -99, -266, 35, -76, 34, 137, 18, -78, 29, 89, 151, -51, 26, 157, -203, 67, 90, -19, -203, -35, -195, -147, 175, -33, -45, 123, -175, 27, -85, -20, 191, 41, 98, 110, -221, -127, 137, 12, -65, -42, 244, 29, 198, 31, -162, -237, 89, -293, -132, 131, -70, -230, 10, 188, 67, 53, 107, 0, 65, -185, 56, -27, 138, -139, 81, 17, -123, 47, 74, -91, 9, -16, -24, -40, -43, 30, 20, 304, -82, 72, 11, -27, -38, 199, 92, 15, 5]
4032EJ20K3j79k27L14l08Q6N1L46j84N5k9J57j57J09j28J88j51k27M67m51J4p6
4055a82J38J37l07J87j0J26P3p1K2NJ28m40M78l48j5K40j77J27l02j51L71J55
4077A84l0j10l05J00K62J9m9k61M02k91K90Q9p4m26J03K98m78J98K16j10j56k18
4099c47L34%j19R7k69M17j10P4M0m6j36N4N0K9J27j30j6p6j03J72j58M0P4K83
4123B81j90j39k10K59O6j70J13R1k7j37j3R2M4J13k01K2r7%Q4L0J06k15K10l02
4147a90J23q7K73M3k97J36j27K34J54n14K22l9L07k89J21Q3l50K46j09l58M95
4168G7k49L13l23L6M80n07K01R9j38pM15o02K73L8j70J34l04L27j13K7j66P7m2
4191a24j3J58O6L7k62Q6j65J64RMJ93j72j3k17Q7L26j98k07L8K1J80k4J10j46
$$ y = [5, 125, 148, -31, -258, 56, -252, -166, -115, 231, 47, 102, 73, 230, 73, 182, 54, 242, 91, -136, 331, -120, -106, -182, -44, 93, -214, -27, -37, 89, 162, 91, 113, 118, 246, -194, 284, -64, -79, 161, -16, 111, -191, -342, 29, 184, 154, 44, -261, -161, 101, 120, 71, -190, 212, -79, 211, 300, 226, -200, -97, 201, -277, -79, 137, 27, -129, -347, -13, -13, -132, -35, -304, 113, 3, 77, 117, 71, -65, -11, 39, 68, 195, 65, 49, -27, -130, 42, -116, -76, -2, 281, 91, -48, -258, 1, 67, -103, 10, 101, 74, -63, -76, 16, 60, 173, -28, -6, -103, -103, -19, 11, 117, -98, 112, -190, -67, -154, 119, 162, -135, 1, -126, 108, 262, -252, -30, -69, 238, -51, 70, 153, -197, 49, -60, -418, 77, -172, 141, -182, -146, 334, -173, 28, 127, -11, -18, 397, -205, 68, 106, -64, 70, -234, 93, -20, 7, -159, -82, -124, -137, 21, 87, 124, -138, -52, -217, -53, -44, -40, 153, -19, -32, -249, -162, 164, -34, -241, -203, -182, -2, -26, 84, -62]
4215f2k00K64qm7O4J56J70n82L77k57n7K40j2r2N9P1R6k72O7K9L92n33j02L55
4239A16o1J83m24K42j02P8j47J50j82M76k34P5j2l1k5j08q6Oj3J00M6j03j21L03
4263A26p7k06l6K74kk86J49J22N7j12k9O9k45J84r2J75k08J94q4R8j5N8o8l15
4287b69J83j4q8K16J36j5k88rj1k08L75j93L95k13j14K74q6l8J1j40o2K22j60
4310i6K6l11N33k80K8K22j37J20l10M65l93K04j54j56P8J55R3%o2j2j90J48j5
4333d4j39J11L08l28j31K54KJ5j71N45l67r1k63L44J14r0j38K01Jk2J22k09K7
4356E1o3l4lq4q9K35J28l78K96j94J10k05M58k26j93R5P6oM9K1R0k4j2j30J27
4381I5n66M71k90M27p5n3k5Q0Qo1j8k08K1J53j3l2O2q1K1J25j85R1j19M15j35
$$ y = [-62, -262, 2, -6, -53, 11, 167, 337, -245, 132, -125, -182, 58, 46, -46, 13, 84, 180, -92, -25, 4, 396, -137, -239, 116, 55, 238, -186, 56, -46, 32, -115, 35, -147, 329, 95, 170, 158, 127, 102, -6, -92, -86, -99, 1, 47, -56, -177, 126, 49, -157, -193, 81, 79, -207, -58, 64, 121, 9, -20, 49, -196, -12, -104, 71, -137, 57, -27, 71, 56, 114, 46, -269, -86, -100, -188, 28, 164, 149, -139, -148, -159, -367, 8, -185, 210, -3, -117, 157, 71, 33, 44, -96, -158, 64, -96, -70, -381, 152, -128, -100, 122, -15, 105, -205, 260, -133, 71, -83, -239, -161, -6, 87, 87, 25, 13, -177, -29, -44, -183, -72, 236, -92, -223, 31, 33, 48, -123, 422, 55, -36, -299, 45, 159, 69, -69, 132, 133, 111, 233, 24, 51, -12, -46, -49, -133, -222, 13, 141, -237, 59, -135, -25, -230, 228, 2, -191, -96, -20, -26, 23, 44, 134, 110, 98, -32, 95, -471, 0, -290, 137, 62, 9, -16, 64, 72, 11, -7, -215, -194, -41, -54, -86, -24, -105, -84, 41, -144, -53, -172, 243, 108]
4406A08o9rr4K67k40k11J01M6J35J06K55n15J40L3j26J14j8O0j56m7j37J86J25
4429E4k0l66L34k71J95o4L22l9r5r9J35l65K11J3M3J84j91n8L01l61K19k8J44
4452A98j70J4K28m27L25M7j74j09K34l47%L09j51j63J66K34k09k9K33k07J52j23
4474C1K06l13O9K23j69l13K8K83k42J90o7J58l33N25k73R9j79j55L63j81M2j85
4496a93j60K75Qj0J10lj47r6L10l56L06O9k64j32M26k30k65J49J05j0K21j72K16
4519A57j53j13K00j26m1K55m2m66L37k01J46J38p0K07l5m25L52j06R8q4J35l39
4541a76K76l78L54O3q4J35k52o6l2R6K02n6j32p5J15M0j08J8M4Q2k09K38Q6m23
4565b42J41J72j54r0J89K5j13P4j75J53j26P9j20K20k7k10J05K33J4l91M84j59
$$ y = [108, 39, 30, -64, 203, -37, -248, -147, -101, 34, 140, 395, -120, 20, 53, -73, 41, 23, 83, -73, -120, -257, -71, 54, 34, -332, 2, -269, -74, -138, 184, 145, 50, -49, 86, -279, -68, -55, -12, 172, -19, -77, 224, -137, 82, 54, 198, 28, 42, 270, -157, 168, 215, 41, -68, 166, -181, -181, 128, -23, -186, -20, 214, 5, -24, 209, 2, 154, 31, 237, -76, -7, 216, 47, -266, -238, 45, -197, -7, -74, 84, -249, 276, 3, 102, -77, -232, 131, -50, -8, -193, -353, -78, -70, -80, 30, 27, -120, -216, 94, -262, 44, 113, -151, -283, 143, -87, -352, -203, -98, -108, 113, -59, 157, 4, -109, 91, -35, -76, 179, 137, -329, 8, -193, -47, 91, 21, 228, 193, -232, 120, 14, 112, 28, 163, -176, 100, -278, 76, 139, 55, 190, -62, -128, -160, -64, 138, 82, -50, -125, -10, 30, -78, -60, -16, 66, -143, 95, 181, -242, -101, 71, -83, -173, 16, 41, -72, 2, -173, -20, -146, -67, -187, 33, 6, -204, -99, 134, 148, -243, 241, 82]
4587H2k2p2N8o7r6Q0K51j84N4j81k3J90j03L1K37k85k67L61j24J65k90n2k09O09
4611A43l29n9N0J41M8N7J81j92l4P8K0N0n09K29Q7N0M4K9O0j76lj0p2J64R9m9
4637I7q3p1j70N8M6J78J8k90O03n56L1R1K47n81N22R4Qj52J20n5j52o9K03l10
4661a73K82j16o2k52N15j05J65rm04K56n7j66J18l9j67J91J39k81K67k10j42K78
4683B8O2P9P3j37l19J04k9K37r2L16k24p2P2J64k57K84j25k88qJ61k15J31R7L1
4707G3J51k71R8j91K03J04j99m4K29jl32L70j79r4p5J20j4J61m27M80j89K1J14
4730A08m54L46J79j66K94k40J00Q3O3k04P9l01O8j45J94j24J27p0K51p8o0k9q5
4753f4L11k41j42J02O8J83k62J59m0L01m84K19n8J31m0j83O0J1l22M03K63l09
$$ y = [82, 60, -12, 46, -21, -117, -37, 214, 30, 84, -97, -120, 70, -33, -2, 235, -50, -317, 44, -80, 85, -205, -257, -466, 143, -186, -245, -195, -54, -6, 51, 232, 40, 6, 84, 104, 154, -355, -126, -39, 11, 55, 84, 144, -32, -35, -45, -117, 47, 146, 97, 14, -57, -227, -169, -123, 55, 73, -217, 386, -170, -139, -48, 199, -382, 140, 234, 242, 90, 210, 155, 3, -66, 137, -173, 109, -7, -69, -321, 194, 89, 254, 245, -159, 97, 40, -126, -8, -47, -214, -23, 116, -165, 102, -108, -250, 28, 90, 169, 242, 105, -214, -110, -139, 98, 6, 322, 98, 26, 98, 262, 5, 289, 164, -124, -132, 29, -186, -55, 42, 73, 224, -47, 51, -140, 63, 167, -32, -76, 153, 152, -180, 190, 11, -83, -158, -38, -52, 109, -318, 162, -27, -6, 108, -346, 0, 179, 13, 307, 67, 167, 250, 313, 109, 188, -113, -45, -190, 4, -120, 7, -63, 188, 110, 50, 21, -64, 247, 6, -136, -34, 34, 217, -45, 114, 74, 375, -109, 110, 52, 183, 143, -40, 20, 31, -291, 112, 375, 66]
4775F6q0J30Q2jm7k23J18j30k2K30k75P7P2L0l41J14J53n4j05m7j07L76K1j5L02
4800C24l73L03l93Q6J53J03l08o3L09j61J60k65M9k56M14q1P5j8p1O3l84L98N3
4823A17l02K53k38n9L72k94J09J75q1k25J62K68n02l2J48P9J52j98J57n0o9j0
4845f8j3r5N2P2J49J21Rm96M27l62J48o2M9K03k97J94N0J6j56j60Q3J84O6j32
4869a8n3m9j14K75L28n39K04p4m9L74l27J74k48K15p1q7J24j1K3NM4k5M9j61R0
4894G9q4j55QP9J5N7j48N5K0N5k1p7J71Q6n3r3mQ1k27M92j07L8j84l5K78m39j04
4921b17L81m09K18MJ9R5L1Kk17J14L37j63n6n3m21N92l17J24k51J5r8L43J39m84
4945b72K00K00l12L59k77O0J02j0L4o5k45J70M2j93J85K6M5j83J54Q8j41J48k6
$$ y = [66, -14, 116, 198, 197, 150, -73, 45, -85, -107, 123, -152, -75, -3, 27, -314, -200, -47, -101, -206, -253, -360, 16, 37, 22, 324, -49, 254, -139, -53, 100, 203, -105, -168, 141, -20, 140, -125, -76, -332, 82, 1, 76, 58, -13, 50, -334, 64, 117, -185, 68, -170, -229, 143, -151, -42, 133, 52, -173, -11, 257, -245, -277, -129, -50, 102, -96, 61, 11, -58, -68, -81, -176, -124, -52, 97, 218, 227, -269, 158, -204, -56, -118, -69, 134, -163, 31, 81, 97, -59, -219, -136, 48, 114, -18, -71, -120, -234, 41, 369, -170, 34, -40, -89, 285, -42, 132, -116, 99, 28, -59, 65, 54, 77, 82, 126, 101, 150, -11, 79, -5, -160, -152, -73, -58, -1, -149, -94, -74, -19, -40, -117, 54, 140, 87, -6, -10, 71, -156, 336, 229, 267, 83, 48, 326, -113, -217, 164, -245, -27, -23, -4, 91, 122, 124, -93, 21, 358, 195, 139, 86, -335, 257, -60, 64, -187, -172, -270, 73, 212, -272, -72, 128, -184, 175, -102, -42, 60, 50, 84, 19, -226, -56, -14, -207, -22, 4, 49, -134, 20, 108, -33, 115, 89]
4968H9j38J67j45L5q4j24K29P3k31l0K78j52Q7L02m77J54j31J30m3K33k42O9k05
4991a56K02j95J77l4j7o1N7J21L86k73k01q0K76j96k74K83L3j76K96k6r9J62j36
5014F9j66mp7J56m3MJ50K6j35k9L07k72L49k53L7j15j02J83q1j95J67J18jo8k66
5039b41K59J2K47m54L62l77K12J72k73K90j89J15q4J59J41m51K4J46l44J98J09
5060C3J78n3J06o14L46K1p8n9J20j40L50l17L46j63n46K72L46J10J2k41J62J3
5082B04L6n51N18r0k32R5j52J80j23L52j1K52k72j88j46J40n0j00K30r1r9%k29
5105c27M71j21j06M5o2K9K63m2j7m5j44P1j51J51n0J04J70j16J74r4n0k55r2K31
5129C7k28K86l33L08j02K14kk65l5J76j83j55J93K60L8k25j09M3nR2l7j20K77
$$ y = [89, -49, 118, -27, 8, -76, -200, 29, 102, -129, -159, 119, -33, 54, 356, -121, 33, -98, 32, -11, 222, -20, 49, -156, 46, -149, 28, -6, -23, -84, -27, 94, 480, 207, 6, -74, 202, 6, -268, 15, 48, -128, 168, 142, 43, 205, 69, -97, -101, -178, -22, -65, -61, 89, 115, -20, -49, 258, -14, 335, 82, 119, 4, -98, 85, 4, -191, -24, 94, 93, 25, -241, 18, 30, 277, -177, 185, -192, 20, 192, -81, 209, 20, 135, 51, 210, 351, -100, -76, 70, -274, -76, 33, 211, 158, 264, -350, -4, 17, -61, -120, 0, -140, 210, -107, 239, 76, -470, -198, 148, 258, 270, 29, 191, 204, 240, -311, 207, 117, -115, -20, -172, 8, -115, 237, 226, 478, 206, 18, -128, 12, -38, -138, 92, 1, -98, -98, -327, 144, 23, -83, -38, -100, -71, 192, 150, 133, 88, -56, 15, -136, 15, -35, 69, 239, 123, 297, 203, 153, -102, -194, 37, -191, 95, -238, 70, -32, 182, 180, -85, -120, 56, -127, -282, -89, 171, 209, -16, -125, -82, -87, 5, -32, -152, 125]
5152A25k52k0j11J79p4J25P3j57L36o4n5Q4j27k12K65l97L04k06K82j84J57N9
5174A30p6L1k08J13Q6r8O7K84m06l2j3R6L53l84J6J13j73N5K7K5J18K3n3N8j70
5199a8n6J24j59K08j32L5N7j9Kk28J98J03j09j50j05K36J22m6ORoQ1j05m41M34
5224D1J42m37OP1J69K98m59K69k19O1j5J17n3J20R2k43K49j13j60L9J31L03k97
5247A12j60j97L54k0kj61J58k30J70J0j9J08o7j12J16o7p8nL5Q7l7J91j72N9k41
5272a68K32j50q2J01J52Q5l38j9L79m56K73K72k63j32k43J75k27O21j36k7q9J04
5294F4j6k33R6L5R3j81K90k21k1L69m87L96l16k6K60L9jj7M7m64R4L19k12R6l4
5319c1j35JK9J31K6l04K00J26j3P4j09j27L32m13J47R0o1j8L31p6k63R7l5K08
$$ y = [125, -127, -147, -258, -79, -153, -28, 45, -112, 224, 160, 105, 189, 62, -150, 115, -282, 22, -184, 98, -86, 71, 130, 54, 85, -123, -10, 76, -22, 45, 329, -77, -109, -122, -26, 327, -57, -41, 72, -101, -46, -19, 6, 124, 147, 94, 152, -18, -74, 50, -109, 99, -33, 2, 59, 40, 42, -186, 12, 115, 6, -144, -249, -13, 109, 63, 69, 78, 72, 153, 48, -393, 41, 183, -254, -248, -177, -8, 290, -169, 100, -119, -58, -73, 44, -9, 111, 203, -40, 209, 96, -64, -25, 106, 409, 112, -48, -245, 109, 89, 87, -74, 84, -146, 24, 34, 15, 123, 56, -56, 60, -7, -85, -90, -55, 32, -5, 186, 14, 73, -168, 64, -86, -168, -67, 85, 170, -168, -187, 192, -264, 9, 281, 18, -114, -357, -182, -409, 212, 76, 49, -40, 64, 48, -185, -89, -54, 39, -142, 148, -73, -94, 275, -212, 184, -132, -158, 102, 141, 140, 123, 170, -294, -200, 119, -93, 3, -31, -166, -165, -136, -5, 21, -283, -83, 43, 30, 104, -5, -132, 200, -213, -66, 24, -37, -55, 276, 200, -63, 34, -1, 207]
5343B07j7k63M23l00P3l03N32j07j52j18M07l95J38Q2k03K8J35l02J16N9r4N1
5365cj09p3j51L40P6L5k19P6N9l39L23j8O9j98K36l41J75r1r6J86p1K69k65J02
5389b8o9Lp3m6j9K67J60j16Q6J67m78J74o3J31j2l0l34K46K30m11J61j94M37l19
5413a30nJ87Q0k2k3J49m79J24k64M15j11l7K41k39J19P1k05Q4J17l70K42q6J73
5436C1K08k61N9Q1k29K29P3l03p1K36k5m0N5j67L3m0M7l9K34k5p7o6P3oJ70l88
5462b08K8K12m2J44J25k37M35m92J8J32l3n3l8o0L29k26K4M0r9M1L6k19M25q7
5486A95j31L7j82J46K5j56p0N2L2l0R6L9j54q8p2J68j5J56j03J47j64k83L43J67
5510A55m4j20J4K03m48L63j61l1o9M8K24n55M54j88O5K01k87K72m18K99J52j05
$$ y = [207, 190, -73, 350, 50, 123, -180, 352, 245, 93, -25, 382, -13, 125, 207, 4, 32, 167, -135, -19, 40, -54, -3, -112, -185, -336, 4, 80, 115, -104, -28, 31, -308, 15, -3, 66, -132, 104, -237, -62, -153, -249, -63, -134, 135, -130, -28, -97, -94, -167, -213, -232, 35, 195, 79, 165, 332, -146, 28, -35, 96, 84, 54, -280, -34, 196, -215, -54, -248, 189, -130, -135, 52, 132, 110, 87, 236, -243, -119, -383, 32, -79, -116, 125, -114, 5, 76, -129, -45, 72, -298, -56, -142, 31, 239, -22, 37, 118, -111, 118, 191, -112, -183, 53, 28, -12, 43, -124, -91, -131, -84, -123, 111, 86, 9, -57, 16, 10, 180, -208, -180, 32, -10, 134, 259, 22, 457, -35, -17, 115, 82, 29, -9, -69, 260, 34, 58, 98, -1, 40, 76, -143, 282, 195, 64, 101, -81, 65, 90, -66, -136, -84, -52, -82, 14, 53, -101, -189, -261, -93, -108, 48, -55, 92, -72, -355, -12, 155, 111, -9, 5, 208, -240, 123, -38, -69, -138, -90, 134, -421, 33, -155, -90, 111, -176, 96, -322, -23, 129, 24]
5532B4R4o2O2j96K08j0k99J23l7L18lr9j50N5j40R7j95j0L26L8k00k16J26J64
5556A8j14N9K81l36j31J97p9j35J32M6L7j8j65K13J44l55L26%L4o1k08L5J89J03
5580B12j25n31M91Q6J3j73J83j59J01p9j09k06M90q3k70J85K80m06J12K23r0r5
5602E0L7r3k1J26j70J13J50o5p1L67l97K4j47K08n2Q8k60J93l14K76k11Q8Rp7
5626a49J11r9K22r4n5LJ90l3O7j71J02l3n5K1l0m5O8K28m4k86r1K32Rq3j3j3j22
5653a63M52k35qQ7ok14q1L88l94K96j16j02R9r6J37p5N3P5j78mJ00K7J00l60J19
5678i9N3j33L18j83m0r9K4J90k29N3J52mJ04M7q9l21L22k56M3K68p8K09k67J35
5702A20j48N2P0o7R1j38K02j89O0J35m8n0O8P9j10r3j08n4J78p7J77j02K1n5O3
$$ y = [24, 118, 56, 118, -78, 130, 120, -179, -56, -93, 225, 222, 123, -27, 28, -112, -15, -210, -220, 106, 144, -56, -272, -146, 18, -96, -37, 244, -92, -223, -26, -105, -240, -108, -62, -25, -43, -208, 5, 149, -206, 120, 120, 154, 93, -115, -80, 109, 212, 87, -444, 47, 133, 146, -27, 156, -3, 98, 19, -90, -296, 194, 111, -159, 26, 306, -100, 12, 235, 145, 50, 87, -6, -27, 99, -71, 42, 192, 127, 56, 423, 26, 50, -97, 111, 59, 147, -113, 80, -234, 42, -169, -81, -72, -149, -38, -137, 85, -9, -64, -61, 129, 96, 163, -8, 94, 61, 6, 27, -3, -48, 20, 248, 204, -82, -173, 59, 68, -15, -28, -41, -163, 289, 54, 46, 133, 127, -87, -168, 220, -174, 122, 6, -96, 3, -93, 44, -31, 22, 97, -81, -85, 15, 42, 142, -218, -99, -46, -179, 139, -44, -84, -183, -159, 31, -198, -145, 7, 3, 107, 154, 65, -256, 66, -190, -147, 121, 43, 252, -15, 120, -28, 24, 94, 27, 118, -20, 182, -7, 53, 188, 140, 90, 158, 237, 127, 34, -74, -128, 50, -27, 150, 48, 69, 14, 77]
5727G7k7R8m26K30n7k1L58j47j41N7K00j94LM9j76K70l07K98L8j56m73J79K92
5750B4J29q4k48K94j66R4j8Pj7r4L24k89P8m17K52J20J66j87kK4j71L91k34Po9
5775h6J53J52j36j41n1J40m0M6K24l54j13J59K55k30K74k39k15M81l33q3J47j44
5797a34K66j5l8j4j7L2k52P4K51k06K07j91K08m05J24J36m4K52l89j15J72R4J06
5820A02n6J2P6k12j6J08l46K11J35o9K23k63J56o5P7j01k15J85K76m89J82P0p
5843b6j81J80K31Pl3j83K1J43r5k51J12J81J28k75K51Kj28j66J54j83M67m34L34
5866B56l40J48R0k4Ml59J18J47P8r6N1o4J72k72N1L1N5k39J90K19k03k9Q1m34
5890c69O20J2k38J1j88L07l08J76n3K40j04j21l0k44M86O6l77K5J75J2j34k6k90
$$ y = [77, 50, 148, -278, -48, -105, -126, 232, 85, -56, 1, 201, 7, 10, 59, -117, 153, -154, 144, 182, 26, -447, -268, 24, 153, 69, -179, 115, -51, 43, 25, 32, 15, -79, 245, -44, 34, -383, -131, -11, 155, -32, -34, -10, -181, 210, -24, -17, -86, 67, 219, 83, -58, -109, 31, -9, 37, 261, -93, -206, -47, 208, -22, 252, 13, -202, 279, -54, -137, 10, -134, 132, 117, 79, 65, 48, 80, -172, -98, 153, -53, 154, -37, 171, -234, -110, 26, -18, 234, -155, -270, -98, -4, 102, 46, 58, 134, -78, -94, 14, -332, -121, 14, -55, 168, -95, 61, -4, 73, -28, -243, -58, 218, -271, -89, -19, -26, -207, -27, 204, 211, 178, -5, 16, 159, 64, -187, -75, 106, 234, -41, 210, 212, 84, -82, 72, -111, 356, -78, 256, -84, 64, 154, 130, 134, -225, -107, 40, 118, 22, 73, 9, 181, -91, -40, -9, 46, -193, -3, 216, 13, -16, 65, -369, 251, 263, 25, 36, -152, 155, -153, 23, -30, 210, 106, -15, -45, -289, 197, 263, -114, -89, 86, 98, -36, -62, -352]
5913c52J89J49j52J51J40k36q6J07O9M22m32J11j49k52N50l63K24j16J3j44j2
5934a69M74l56J29k22K93N3j87Lk04Q4J75k04L48j74J54j65P5l1l7K0K3Jj10m3
5958g0J3K04k25k0L93m07L93n2k60o6J34J02j60J6k37L90j70J29lm5l31K87n0
5981c5J20j31n3K24m56J42M59m77o3Q4K02Ok90M90l81L12j71J2P4k26J09K35N0
6004B36m61P3K66n0p6R3J67l22n7J56n5J81l02L95k76K69q1J9j39N1R3j61J15
6027A34l08J53J00p5j5k61N8K00j23K81k11J71O7m86K24J27p8J82l32N5K71r6
6049C8l2kK14l70K5N2o0L4J17k95L08o3J77j9j86k58N07j82J5J24j24p1j66K63
6073D6j27j02R1j30K26K01j84R5j08J05j06mj78J44k04O0K33Q0j74k9m0L1L02
$$ y = [-352, -163, -14, -166, -15, 125, -111, -197, -90, -21, 401, -31, 80, -69, -321, 229, -134, 90, -26, -13, -157, -169, 305, -51, 78, -144, 149, 202, 15, 18, -186, -102, 73, -131, 217, 43, 197, 32, 107, 76, 39, 59, 82, 83, -27, -70, -57, 147, -78, -98, 295, -112, 281, 229, -31, -97, 37, 139, -21, -5, -242, 148, -22, 107, 104, 59, -272, 15, -35, 85, -46, -99, 125, -331, -189, 270, -207, -270, -186, 16, 22, -268, 222, -159, 153, -18, -6, 68, -158, -49, 186, 236, -225, -152, 114, 64, -12, 81, 248, -74, -131, 25, -30, 151, -151, 244, -32, 237, 156, 175, 36, 87, 180, 19, 134, -174, -21, 79, 4, -11, -272, -214, -14, -137, 144, -67, 104, 171, -315, -91, 36, -42, 140, -192, -137, 134, 38, 6, 4, 218, -152, -127, -75, -135, -101, 16, -279, 29, -34, 143, 124, -62, -320, 187, 5, 20, 144, 20, -51, -217, 46, -81, -183, -92, -222, 4, 205, 21, 116, 8, 113, 7, 3, -175, -31, -235, -175, 58, 138, -36, -65, -105, -74, 228]
$$ [...]
8191H8
##END NTUPLES=NMR FID
##END=
