##TITLE=1H_GluCl4
 CDCl3, 8 sc, 
 29.06.2021
##JCAMPDX= 6.0         $$ Bruker NMR JCAMP-DX V2.0
##DATA TYPE= NMR FID
##DATA CLASS= NTUPLES
##ORIGIN= UXNMR, Bruker Analytische Messtechnik GmbH
##OWNER= root
$$ XWIN-NMR		Version 3.5
$$ Tue Jun 29 11:38:22 2021 Russian Standard Time (UT+4h)  she@DPX200
##.OBSERVE FREQUENCY= 200.131506
##.OBSERVE NUCLEUS= ^1H
##.DELAY= (6, 6)
##.ACQUISITION MODE= SIMULTANEOUS
##.ACQUISITION SCHEME= undefined
##.AVERAGES= 8
##.DIGITISER RES= 18
##SPECTROMETER/DATA SYSTEM= spect
##.PULSE SEQUENCE= zg30
##.SOLVENT NAME= CDCl3
##.SHIFT REFERENCE= (INTERNAL, CDCl3, 0, 15.7039)
##AUDIT TRAIL= $$ (NUMBER, WHEN, WHO, WHERE, WHAT)
$$ ##TITLE= Audit trail, XWIN-NMR		Version 3.5
$$ ##JCAMPDX= 5.01
$$ ##ORIGIN= Bruker BioSpin GmbH
$$ ##OWNER= she
$$ F:/spectra/data/she/nmr/H-F/1/audita.txt
$$ ##AUDIT TRAIL=  $$ (NUMBER, WHEN, WHO, WHERE, WHAT)
(   1,<2021-06-29 11:37:02.17 +0400>,<she>,<DPX200>,
      <created by zg, POWCHK disabled, PULCHK disabled
       configuration hash MD5:
       00 E9 B6 7A A2 85 ED C7 34 08 36 98 17 FE 4E 26
       data hash MD5: 16K
       0E D6 72 A9 08 A6 8B 45 5C 3A BA 06 25 0D D3 05>)
$$ ##END=
$$ 
$$ hash MD5
$$ C5 24 DB 82 3D 25 0A CD 3E 71 41 0C 5A 52 B5 71
##$RELAX= 
##$RELAX= 
##$RELAX= 
##$RELAX= 
##$RELAX= 
##$RELAX= 
$$ Bruker specific parameters
$$ --------------------------
##$DU= <F:/spectra>
##$EXPNO= 1
##$NAME= <H-F>
##$PROCNO= 1
##$TYPE= <nmr>
##$USER= <she>
##$AMP= (0..31)
100 100 100 100 100 100 100 100 100 100 100 100 100 100 100 100 100 100 
100 100 100 100 100 100 100 100 100 100 100 100 100 100 
##$AQSEQ= 0
##$AQ_mod= 1
##$AUNM= <au_zg>
##$AUTOPOS= <>
##$BF1= 200.13
##$BF2= 200.13
##$BF3= 200.13
##$BF4= 200.13
##$BF5= 200.13
##$BF6= 200.13
##$BF7= 200.13
##$BF8= 200.13
##$BYTORDA= 1
##$CFDGTYP= 0
##$CFRGTYP= 5
##$CHEMSTR= <none>
##$CNST= (0..31)
1 1 145 1 1 1 1 1 1 1 1 1 1 1 1 1 1 1 1 1 1 1 1 1 1 1 1 1 1 1 1 1 
##$CPDPRG= <>
##$CPDPRG1= <>
##$CPDPRG2= <>
##$CPDPRG3= <>
##$CPDPRG4= <mlev>
##$CPDPRG5= <mlev>
##$CPDPRG6= <mlev>
##$CPDPRG7= <mlev>
##$CPDPRG8= <mlev>
##$CPDPRGB= <>
##$CPDPRGT= <>
##$D= (0..31)
0 1.2 0 0 0 0 0 0 0 0.06 0 0.03 0 0 0 0 0.0002 0 0 0 0 0 0 0 0 0 0 0 0 
0 0 0 
##$DATE= 1624952221
##$DBL= (0..7)
120 120 120 120 120 120 120 120 
##$DBP= (0..7)
150 150 150 150 150 150 150 150 
##$DBP07= 0
##$DBPNAM0= <>
##$DBPNAM1= <>
##$DBPNAM2= <>
##$DBPNAM3= <>
##$DBPNAM4= <>
##$DBPNAM5= <>
##$DBPNAM6= <>
##$DBPNAM7= <>
##$DBPOAL= (0..7)
0.5 0.5 0.5 0.5 0.5 0.5 0.5 0.5 
##$DBPOFFS= (0..7)
0 0 0 0 0 0 0 0 
##$DE= 6
##$DECBNUC= <off>
##$DECIM= 32
##$DECNUC= <off>
##$DECSTAT= 4
##$DIGMOD= 1
##$DIGTYP= 9
##$DL= (0..7)
0 120 120 120 120 120 120 120 
##$DP= (0..7)
150 150 150 150 150 150 150 150 
##$DP07= 0
##$DPNAME0= <>
##$DPNAME1= <>
##$DPNAME2= <>
##$DPNAME3= <>
##$DPNAME4= <>
##$DPNAME5= <>
##$DPNAME6= <>
##$DPNAME7= <>
##$DPOAL= (0..7)
0.5 0.5 0.5 0.5 0.5 0.5 0.5 0.5 
##$DPOFFS= (0..7)
0 0 0 0 0 0 0 0 
##$DQDMODE= 0
##$DR= 18
##$DS= 0
##$DSLIST= <SSSSSSSSSSSSSSS>
$$ [...]
##$SUBNAM2= <"">
##$SUBNAM3= <"">
##$SUBNAM4= <"">
##$SUBNAM5= <"">
##$SUBNAM6= <"">
##$SUBNAM7= <"">
##$SUBNAM8= <"">
##$SUBNAM9= <"">
##$SW= 20.0188882624521
##$SWIBOX= (0..15)
0 0 2 0 0 0 0 0 0 0 0 0 0 0 0 0 
##$SW_h= 4006.41025641026
##$TD= 16384
##$TD0= 1
##$TE= 0
##$TE2= 300
##$TE3= 300
##$TEG= 300
##$TL= (0..7)
0 120 120 120 120 120 120 120 
##$TP= (0..7)
150 150 150 150 150 150 150 150 
##$TP07= 0
##$TPNAME0= <>
##$TPNAME1= <>
##$TPNAME2= <>
##$TPNAME3= <>
##$TPNAME4= <>
##$TPNAME5= <>
##$TPNAME6= <>
##$TPNAME7= <>
##$TPOAL= (0..7)
0.5 0.5 0.5 0.5 0.5 0.5 0.5 0.5 
##$TPOFFS= (0..7)
0 0 0 0 0 0 0 0 
##$TUNHIN= 0
##$TUNHOUT= 0
##$TUNXOUT= 0
##$USERA1= <user>
##$USERA2= <user>
##$USERA3= <user>
##$USERA4= <user>
##$USERA5= <user>
##$V9= 5
##$VALIST= <valist>
##$VCLIST= <CCCCCCCCCCCCCCC>
##$VD= 0
##$VDLIST= <DDDDDDDDDDDDDDD>
##$VPLIST= <PPPPPPPPPPPPPPP>
##$VTLIST= <TTTTTTTTTTTTTTT>
##$WBST= 1024
##$WBSW= 4
##$XGAIN= (0..3)
0 0 0 0 
##$XL= 0
##$YL= 0
##$YMAX_a= 592359
##$YMIN_a= -658051
##$ZGOPTNS= <>
##$ZL1= 120
##$ZL2= 120
##$ZL3= 120
##$ZL4= 120
##$ABSF1= 10
##$ABSF2= 0
##$ABSG= 5
##$ABSL= 3
##$ALPHA= 0
##$AQORDER= 0
##$ASSFAC= 0
##$ASSFACI= 0
##$ASSFACX= 0
##$ASSWID= 0
##$AUNMP= <proc_1d>
##$AZFE= 0.1
##$AZFW= 0.1
##$BCFW= 1
##$BC_mod= 2
##$BYTORDP= 1
##$COROFFS= 0
##$CY= 11.3945322036743
##$DATMOD= 1
##$DC= 2
##$DFILT= <>
##$DTYPP= 0
##$F1P= 15.9154993809931
##$F2P= -4.1035820241983
##$FCOR= 0.5
##$FTSIZE= 0
##$FT_mod= 4
##$GAMMA= 1
##$GB= 0.15
##$INTBC= 1
##$INTSCL= 1
##$ISEN= 128
##$LB= 0.24
##$LEV0= 0
##$LPBIN= 0
##$MAXI= 10000
##$MC2= 0
##$MEAN= 0
##$ME_mod= 0
##$MI= 1.114404
##$NCOEF= 0
##$NC_proc= 0
##$NLEV= 6
##$NOISF1= 3.799351
##$NOISF2= 2.8
##$NSP= 1
##$NTH_PI= 0
##$NZP= 0
##$OFFSET= 15.70392
##$PC= 1
##$PHC0= -11926.72
##$PHC1= 20.40101
##$PH_mod= 1
##$PKNL= yes
##$PPARMOD= 0
##$PSCAL= 0
##$PSIGN= 0
##$REVERSE= no
##$SF= 200.130013532006
##$SI= 16384
##$SIGF1= 3
##$SIGF2= 2
##$SINO= 400
##$SIOLD= 16384
##$SREGLST= <1H.CDCl3>
##$SSB= 0
##$STSI= 0
##$STSR= 0
##$SW_p= 3612.71676300578
##$SYMM= 0
##$S_DEV= 0
##$TDeff= 0
##$TDoff= 0
##$TI= <>
##$TILT= no
##$TM1= 0
##$TM2= 0
##$TOPLEV= 0
##$USERP1= <user>
##$USERP2= <user>
##$USERP3= <user>
##$USERP4= <user>
##$USERP5= <user>
##$WDW= 1
##$XDIM= 8192
##$YMAX_p= 0
##$YMIN_p= 0
$$ End of Bruker specific parameters
$$ ---------------------------------
##NTUPLES= NMR FID
##VAR_NAME=  TIME,          FID/REAL,        FID/IMAG
##SYMBOL=    X,             R,               I
##VAR_TYPE=  INDEPENDENT,   DEPENDENT,       DEPENDENT
##VAR_FORM=  AFFN,          ASDF,            ASDF
##VAR_DIM=   8192,          8192,            8192
##UNITS=     SECONDS,       ARBITRARY UNITS, ARBITRARY UNITS
##FACTOR=    0.0002496,     1,               1
##FIRST=     0,             0,               0
##LAST=      2.0444736,     0,               0
##MIN=       0,             -658051,         0
##MAX=       2.0444736,     592359,          0
$$ Real data points
##PAGE= N=1
##DATA TABLE= (X++(R..R)), XYDATA
0 0 0 0 0 0 0 0 0 8 0 0 -8 8 -8 16 -22 24 -32 40 -48 56 -65 81 -96 112 -133 157 -180 207 -241 278 -317 359
32 359 -409 464 -524 591 -666 744 -831 930 -1035 1148 -1276 1415 -1564 1727 -1908 2105
48 2105 -2318 2553 -2814 3101 -3414 3770 -4165 4609 -5111 5689 -6357 7145 -8086 9235
62 9235 -10672 12531 -15044 18642 -24244 34225 -57327 224562 -205103 -658051 208218 541275
74 541275 -39947 -460910 -38709 288364 154907 -117526 -209869 -84636 264141 250728
84 250728 -251883 -413064 220396 523117 -156552 -594154 85781 583815 429 -535863
94 -535863 -83319 428695 142859 -296890 -182623 120261 194006 44021 -187285 -208416
104 -208416 135471 335384 -69712 -446622 -14842 495830 87085 -505465 -165996 457745
114 457745 217073 -385043 -245316 265302 233276 -126813 -205925 -23882 148749 154258 -71399
125 -71399 -268606 -22857 351788 110816 -393131 -187733 388817 253585 -345949 -292713
135 -292713 280284 300614 -183196 -268993 75600 221477 38063 -143865 -125604 56237
145 56237 203987 49145 -248300 -133208 269845 212193 -245017 -264466 206576 303123 -143545
156 -143545 -297592 77986 271523 3982 -214419 -67120 147306 119054 -54663 -147089
166 -147089 -37697 164989 123748 -156091 -190681 127544 243152 -84637 -271127 38628
176 38628 267126 9571 -236531 -60426 184852 94467 -122849 -115016 41455 115786 36320
187 36320 -112596 -109965 86354 159552 -54609 -202230 9904 214782 22140 -209845 -61851
198 -61851 172587 88788 -133238 -112542 76922 110774 -21109 -105860 -40819 85949 83840
209 83840 -61498 -118402 20905 137063 15358 -145474 -48356 132019 75046 -105586 -97391
220 -97391 74181 108612 -38315 -103008 717 90309 38163 -68644 -62086 43425 79864
231 79864 -4517 -85955 -26031 90486 56389 -75065 -72310 58561 91815 -32794 -91113
242 -91113 15064 84919 13815 -63631 -33151 48137 51397 -20375 -54141 -4441 59603 31843
254 31843 -54386 -45244 44394 57698 -25609 -63337 10861 62726 3610 -50865 -19325 35807
266 35807 32970 -23086 -40429 6255 38941 8903 -39004 -24466 32089 27209 -23918 -33151 6105
279 6105 32850 1528 -34916 -13287 23536 18473 -18981 -29390 9630 26008 -6390 -25599
291 -25599 -6727 18047 10317 -17874 -15072 7106 13029 -194 -18419 -7515 16476 7402 -13363
304 -13363 -11989 8400 14306 -7374 -12748 4863 7953 1985 -4858 -5392 5934 7761 -1402 -6181
318 -6181 -387 10746 3312 -8677 1240 7765 2397 -1270 -1457 4228 4506 181 1432 -819 2838
333 2838 6317 -1922 -1628 4645 3401 661 -1563 2989 4809 -1962 1114 3219 -1561 1475 1898 -350
349 -350 126 79 2029 -998 -2605 3359 -1235 -2873 2695 -1239 -2862 220 418 -335 -4119 -314 2865
366 2865 -4160 -2758 621 -1696 -389 -2475 -3241 -282 -810 -750 -4377 -4084 4586 -311 -7819 -2081
382 -2081 3004 1587 -5364 -5798 3768 2348 -2976 -3868 -3968 4641 4853 -7298 -6708 4590 8517 -2455
398 -2455 -11913 2200 11965 217 -8328 -4912 7848 11469 -5263 -11208 3403 14617 5502 -14711
412 -14711 -7267 16958 12645 -8694 -13676 5356 21111 2714 -18497 -6148 18264 18330 -12638
425 -12638 -23179 11590 28377 -1903 -26203 -5502 27887 14927 -21430 -18576 12432 26191
437 26191 658 -29910 -10184 30543 21394 -25216 -32969 18360 40343 -10958 -42302 -1325
449 -1325 38806 14027 -35664 -26188 24726 30929 -11830 -38404 -7298 38161 19416 -36295 -35677
462 -35677 23494 46206 -14384 -57321 -931 55148 13797 -53229 -32254 42476 40591 -31901
474 -31901 -48211 10534 47300 8864 -45765 -29726 33088 45580 -16701 -62302 -2292 71132
486 71132 19501 -71414 -38082 64627 54613 -52438 -63003 35183 65002 -9538 -58606 -14394
498 -14394 49327 38387 -28268 -55304 5465 72880 22203 -78367 -42997 77698 66908 -64792
510 -64792 -81251 51802 90093 -27897 -83999 3586 74832 24815 -53999 -43211 28823 60885
522 60885 5783 -69684 -36863 73508 67193 -64181 -91300 49630 110292 -30886 -116050
533 -116050 8978 108264 14690 -91354 -37532 64264 51247 -29730 -60973 -12754 62227
544 62227 50907 -58110 -87375 40375 113824 -21279 -135189 -2966 137020 22806 -128873
555 -128873 -46597 103812 59335 -74183 -67365 30545 62733 13214 -55726 -58354 36972 92213
567 92213 -13468 -121679 -15950 137227 40834 -139733 -64478 125611 82464 -101976 -91859
578 -91859 70278 88701 -30541 -74494 -12128 53989 52349 -23681 -83000 -10693 108140 48499
590 48499 -119750 -77754 121150 104724 -105460 -119466 84736 126848 -54422 -114678 22074
601 22074 93977 16113 -60170 -44983 22263 70084 25301 -84578 -68391 93308 106811 -86969
613 -86969 -132596 72585 150101 -49525 -150866 25320 135464 2850 -106023 -28944 67235
624 67235 48283 -22173 -59172 -28168 61488 75082 -58342 -114672 43824 140025 -24910
635 -24910 -156790 1246 154609 17885 -139015 -39360 106815 52693 -70783 -61778 24058
646 24058 56518 21198 -48516 -67664 30915 101232 -10111 -127882 -17533 140338 40022
657 40022 -141613 -60297 125083 73010 -98950 -80462 64399 76405 -25648 -62526 -16034
668 -16034 42148 54540 -16480 -83597 -13067 103961 44817 -112947 -69702 111811 89021
679 89021 -95850 -97936 74142 101166 -44373 -88636 15357 69462 18530 -40315 -44576 11613
691 11613 65871 23864 -74485 -54736 78788 82002 -71303 -97114 57771 106771 -35735
702 -35735 -104566 15349 93229 7117 -69502 -27188 41755 43711 -10328 -51334 -22614 52327
714 52327 53642 -48673 -78734 37740 93264 -22533 -101453 3160 98459 12284 -87973
725 -87973 -28418 64491 39108 -40112 -47649 10062 45022 17715 -40294 -46611 28282 65836
737 65836 -16555 -79906 -2147 82549 17352 -81533 -32233 68418 40412 -50769 -47543 27576
749 27576 47036 -6335 -40942 -16587 29078 36541 -16495 -50730 1697 57387 14736 -58038
761 -58038 -29114 54799 40220 -43776 -44834 29294 48327 -11826 -44277 -1618 36603 18227
773 18227 -22559 -29068 10959 38474 4572 -38724 -18027 38967 32404 -32808 -38224 25783 43490
786 43490 -11749 -42300 1556 39959 9987 -30042 -17760 18965 26242 -6474 -28809 -4986
798 -4986 27935 17205 -24047 -27079 18833 32163 -11874 -33792 1605 32532 6277 -29070
810 -29070 -13361 20219 17286 -11680 -22317 1984 21243 5006 -19169 -14293 13071 19075 -10221
823 -10221 -22753 2156 20921 3012 -21023 -10262 16355 11737 -11872 -15411 4004 15614
835 15614 104 -15472 -5245 10941 9472 -7321 -13057 3715 13431 465 -12390 -5753 11560
848 11560 8717 -9069 -9525 5714 10470 -558 -10090 -1070 9781 4300 -5210 -5849 3715 8866
862 8866 -862 -7136 -252 7311 4907 -4853 -4876 5723 6158 -1572 -4283 242 6629 2179 -4547 -1488
878 -1488 3313 4207 -883 -4429 1460 4501 273 -2561 -1700 2787 2872 -2207 -1852 734 1793 945 -2899
895 -2899 -1051 2364 229 -1222 -2230 36 2060 -1371 -2270 -287 -164 156 -1590 -2103 524 86
911 86 -885 -1293 -1604 759 89 -1873 -682 -670 -50 -406 -1674 -751 -218 -14 260 -1623 -233 1198 -596
930 -596 -967 -738 78 1108 -925 -1264 376 624 1204 -641 -1392 1660 1663 -110 -1218 -182 2874 968
948 968 -1896 168 1830 2547 117 -2596 1259 3656 1115 -1719 -1599 3503 4051 -2014 -2563 1562
964 1562 4322 1718 -4113 -1703 4888 3964 -2314 -4796 1547 7183 -151 -6280 -1590 5714 4347
979 4347 -4762 -6586 3713 6839 -633 -7288 -3178 7437 4966 -7242 -8038 3654 9784 -1539
993 -1539 -12040 -1900 10356 3693 -9116 -8763 5727 9839 -4028 -11969 -2063 10506 5814 -10595
1007 -10595 -10838 7201 12307 -3765 -15944 -2191 16254 5109 -15506 -9641 11000 13424 -7502
1020 -7502 -15918 2120 15114 3839 -13709 -10558 11155 15477 -6087 -18016 -253 21339 7112
1033 7112 -21330 -11722 19218 17407 -13250 -20353 8425 22787 -617 -19408 -6338 16475 14991
1046 14991 -10167 -19311 3553 23699 6778 -24192 -14376 24819 21577 -19221 -25752 13453 29873
1059 29873 -5317 -28935 -1636 24477 10873 -17024 -17794 9358 22502 1154 -24254 -12969
1071 -12969 24291 23484 -22193 -31540 15474 36451 -7911 -39989 -1068 37101 8201 -30948
1083 -30948 -16868 20041 22481 -9614 -25867 -4784 23851 18472 -21948 -31838 15682 39657
1095 39657 -8222 -46618 -2909 47582 10493 -44859 -18707 35276 24716 -23912 -28456 9356
1107 9356 26934 6012 -22770 -22126 15228 35050 -6602 -44043 -5135 49154 17017 -49681
1119 -49681 -25926 45120 32944 -34712 -35804 22718 36352 -7687 -29935 -6917 21454 22483
1131 22483 -9001 -33611 -2884 41976 18448 -44513 -30976 45231 41740 -38664 -46177 29698
1143 29698 49340 -16753 -45825 4937 37235 8954 -23273 -21058 7845 30992 9776 -35170
1155 -35170 -27019 36873 42649 -34450 -53753 27974 59002 -17882 -60162 6184 54980 4238
1167 4238 -43847 -14924 26661 22666 -8985 -28156 -11543 26951 29960 -24995 -47875 18537
1179 18537 58024 -11183 -64228 -65 63715 8928 -58497 -17724 45020 22763 -28746 -26993
1191 -26993 9390 25409 9082 -20730 -28899 12557 44261 -3542 -55296 -7356 60034 18166
1203 18166 -59830 -27217 54053 32605 -42029 -34491 26295 33884 -8761 -27647 -7877 18128
1215 18128 25025 -5281 -38070 -6556 47408 20727 -49706 -32230 49672 41856 -42761 -45289
1227 -45289 33073 45970 -18503 -40785 5155 32118 9039 -17865 -20649 3678 30877 11798
1239 11798 -35385 -26153 35699 39452 -32474 -47901 27111 51207 -17457 -49860 6831 43873
1251 43873 3267 -33961 -12102 18948 19132 -3555 -24259 -12638 24303 26501 -22424 -39426
1263 -39426 17221 46773 -11394 -50205 2116 47513 5403 -43120 -13316 31981 17066 -19579
1275 -19579 -21141 3804 20694 9360 -18269 -23328 12112 33629 -6077 -41056 -1514 42569
1287 42569 9611 -40684 -17170 35133 21580 -26452 -23238 14529 23074 -2069 -20147 -8924
1299 -8924 14426 19323 -5984 -27182 -1284 32187 9837 -31595 -16668 29731 23285 -24240
1311 -24240 -25360 17753 26219 -7354 -23097 -933 19608 9420 -11587 -15431 4072 21093
1323 21093 4446 -22447 -11114 21944 18395 -18716 -23063 14553 25194 -8597 -23949 1643
1335 1643 21624 4982 -17155 -9894 10087 13443 -2714 -16133 -4691 15996 10353 -13952 -16217
1348 -16217 10080 19882 -6612 -21403 1446 19404 3507 -17383 -8487 12751 10105 -7745
1360 -7745 -12203 199 12211 4063 -11640 -9176 7874 12422 -4821 -15783 1008 15285 2357
1373 2357 -14244 -6760 11641 9131 -8676 -10302 4064 10141 794 -9704 -4430 8194 7126
1386 7126 -4938 -9200 1873 11081 1157 -10359 -3580 8935 6719 -6883 -8015 5083 8481
1399 8481 -1315 -7425 -1212 7750 4222 -5298 -4729 3343 7326 130 -7052 -839 6765 3225 -4612
1414 -4612 -4836 3616 5998 -2176 -5520 -74 5230 1985 -4313 -2881 3479 3670 -1347 -4092 -205
1429 -205 4472 1308 -3903 -2132 2289 3074 -1879 -4208 668 3060 119 -2982 -2210 2255 2156 -2410
1445 -2410 -2614 443 2280 180 -3358 -1130 1886 1020 -1788 -2415 488 2446 -872 -2352 -810 1334
1461 1334 1190 -1794 -1757 889 1309 -283 -1671 -842 1865 645 -1542 -716 381 1625 207 -1736
1477 -1736 215 1291 398 -588 -1032 784 1711 -57 -676 144 1312 982 -885 -508 931 1085 457
1494 457 -758 -38 1913 586 -499 -377 612 1940 -67 -1424 419 1157 1128 -559 -1348 1195 1433
1511 1433 -144 -1063 -185 1608 1153 -1594 -1032 528 1754 -54 -2152 -456 2521 666 -1568 -1874
1527 -1874 888 2140 -1038 -2456 -497 2005 1156 -2655 -2402 1560 2416 -783 -3593 -852 3348 1166
1543 1166 -3497 -2678 1711 3047 -978 -4080 -435 3397 1187 -3333 -3598 2533 4083 -1734 -4809
1558 -4809 -541 4900 2040 -4944 -3349 4088 4246 -2132 -5455 857 6133 1131 -4825 -3006 4053
1573 4053 5699 -2333 -6412 748 7324 2419 -6589 -4218 6554 6372 -4320 -6529 2543 8598 409
1588 409 -7474 -2161 6632 5523 -3859 -7329 1898 8800 1592 -8529 -4943 8332 7771 -6879 -9319
1603 -9319 4225 10476 -1002 -11082 -1863 9593 4341 -6970 -7366 3389 9380 -121 -10258
1616 -10258 -4358 8811 8177 -8006 -12139 5844 13125 -3247 -14600 -1400 13699 4111 -11994
1629 -11994 -7385 7687 8963 -3567 -11233 -1814 10199 6346 -8995 -11878 5773 15450 -3415
1642 -3415 -17638 -1002 17474 5018 -16654 -8710 13229 10685 -8678 -12015 2600 12398 3186
1655 3186 -10332 -8186 6925 14300 -2553 -17872 -1422 19522 6810 -19092 -10903 17693 14780
1668 14780 -13601 -15154 8472 15824 -1443 -13612 -3912 10624 9719 -4560 -14259 -675 18496
1681 18496 7078 -18671 -12510 18148 17568 -15447 -20191 11677 21030 -5807 -19128 -80 16326
1694 16326 5496 -10664 -10365 3261 14223 3938 -16551 -11440 16089 17809 -14537 -23360 10888
1707 10888 25634 -7039 -25786 1503 23202 3545 -19364 -8141 11955 10988 -3713 -13301
1719 -13301 -5585 12874 13020 -11298 -20793 7738 25862 -3934 -28769 -729 27828 5701 -24953
1732 -24953 -10152 19566 12539 -12295 -13473 3346 13008 5326 -10628 -13678 6103 20493 -1048
1745 -1048 -25688 -3712 28054 9347 -27277 -13286 23931 16891 -18761 -17329 11563 17040 -2693
1758 -2693 -13854 -5017 9703 12688 -3159 -18213 -3383 23146 10019 -24174 -15197 23160 20654
1771 20654 -19432 -22649 14879 22808 -8101 -19924 1017 15800 5845 -9559 -10937 1740 15460
1784 15460 6225 -17614 -13290 17255 19359 -15376 -24407 11658 26170 -7634 -25530 1993 21639
1797 21639 3320 -16772 -7921 9374 10438 -1232 -12470 -7156 12727 14364 -11530 -20506 7730
1810 7730 24289 -4261 -26499 -131 24609 4078 -21870 -8675 16511 10698 -9533 -11977
1822 -11977 1518 11379 6478 -10017 -13028 6641 18089 -2461 -22156 -2308 23473 6565
1834 6565 -21677 -10110 18450 12846 -13673 -13711 8033 13415 -685 -10803 -5957 8356 11097
1847 11097 -3089 -14694 -1122 17669 6694 -17420 -10175 16381 13706 -12450 -15215 9065
1859 9065 15599 -3997 -13371 -998 10896 6253 -6319 -9398 1699 11438 3478 -12857 -8245
1872 -8245 12497 11350 -10208 -14113 7236 15577 -4053 -14868 317 12688 3245 -9833 -6871
1885 -6871 5682 8559 -1145 -9584 -3724 8992 7467 -8370 -11127 5644 12557 -2948 -13657
1898 -13657 -562 12724 2733 -11169 -5872 7654 7272 -4691 -8094 567 7295 3087 -7076
1911 -7076 -6706 5225 8599 -2601 -10300 -474 10508 2702 -9733 -4360 7620 6308 -5244 -7243
1925 -7243 2867 6972 219 -6162 -3176 4979 5740 -2974 -6212 987 7566 1988 -7310 -3236 6703
1940 6703 5170 -4345 -5754 3135 6689 -719 -5741 -877 5021 3158 -3588 -4320 2061 4929 191
1955 191 -4819 -1911 4707 3601 -3866 -4136 2600 5099 -649 -5224 -291 4595 1589 -3492 -3156 2455
1971 2455 3461 -1300 -3685 -466 3340 1785 -3426 -2859 2377 3046 -1349 -3563 -261 3177 770
1986 770 -3408 -1998 2376 2242 -1807 -2813 383 2507 250 -2383 -1463 1891 1694 -1476 -2180 343
2002 343 2017 206 -2541 -814 1598 1622 -1225 -2012 842 2040 -104 -1648 -672 1705 1480 -1363
2018 -1363 -1159 1297 1858 13 -1426 -434 1631 700 -824 -875 649 1865 -24 -1207 -106 1514
2034 1514 1026 -870 -986 1286 1491 -96 -891 -120 1231 762 -946 -614 849 879 -26 -1056 271
2051 271 964 329 -790 -1025 756 1053 -869 -1246 -1 904 439 -1139 -946 872 735 -437 -1600
2068 -1600 -214 1104 111 -1298 -982 188 1078 -515 -1395 -75 1063 291 -1001 -1093 606 1262 -694
2085 -694 -1649 -369 1317 381 -1450 -946 1024 1261 -509 -1595 25 1973 522 -1434 -959 1150
2101 1150 1627 -647 -2026 428 1672 607 -1520 -1645 1555 2017 -921 -1853 501 2500 558 -2263
2117 -2263 -1129 1868 1957 -609 -2205 409 3100 779 -2393 -1474 2152 2887 -1298 -2947 761 3329
2133 3329 349 -2889 -1635 2922 2236 -1609 -2708 503 3539 705 -3289 -1839 2827 3022 -2047
2148 -2047 -4099 1060 3894 -345 -4545 -1419 3568 2306 -3233 -3394 1254 3307 61 -4163 -1897
2163 -1897 3444 2875 -3022 -4629 1601 5139 -402 -5658 -1128 4882 2454 -4437 -4044 2899 4127
2178 4127 -1198 -4908 -1024 4324 2976 -3505 -4435 1736 6022 -403 -6912 -1267 6836 2720 -5847
2193 -5847 -4302 4787 5411 -2923 -5770 650 5513 1868 -4436 -3650 3109 5694 -1037 -6698 -1296
2208 -1296 7769 3725 -6856 -5012 6267 7000 -4060 -7234 2442 7332 508 -5760 -2685 4678
2222 4678 4909 -2101 -5902 -659 7070 3962 -7092 -5827 6564 8079 -4699 -9077 2872 9549
2236 9549 -1226 -8469 -1576 6878 3818 -4678 -5541 1290 6273 1970 -6612 -5291 5873 7477 -4910
2251 -4910 -10088 2494 11478 -1044 -11453 -1649 9569 3271 -7883 -5286 4367 5884 -1243 -6417
2265 -6417 -3082 5500 6159 -4548 -9193 2321 10929 155 -12105 -2600 11775 4540 -9941 -6100
2279 -6100 7850 7473 -4576 -6861 795 6330 3350 -4498 -6484 2266 9282 420 -10703 -3330
2293 -3330 11724 5913 -10907 -7731 9185 9159 -6765 -9174 3739 8688 -207 -6353 -3325 4422
2307 4422 6333 -747 -8420 -2229 9420 5924 -9675 -8398 9028 10356 -7083 -11532 4556 11167
2321 11167 -1858 -10013 -1169 7413 4005 -3967 -5978 285 6758 3432 -7169 -7395 6530 10308
2335 10308 -5753 -12171 3018 12812 -1342 -12549 -1097 10418 3330 -7340 -4932 3909 5762
2348 5762 -417 -6019 -3986 4931 7681 -4193 -10576 1981 11681 -205 -12404 -2258 11527
2361 11527 3875 -9934 -5417 6786 6256 -3658 -6436 338 5638 3727 -3871 -6665 1933 8878
2375 8878 383 -10478 -2964 10973 5203 -9747 -6545 8496 7304 -5605 -7692 2884 7209
2388 7209 636 -5075 -3743 2967 6076 -261 -7105 -2273 8240 4938 -7958 -7022 7242 8393
2402 8393 -5457 -8668 3199 8822 -738 -7295 -1311 5255 3592 -2529 -5041 -305 5985 2635
2416 2635 -6097 -5533 5287 7692 -4483 -8569 2354 8852 -781 -8697 -1284 7129 2519 -4947
2430 -4947 -3960 2354 4646 25 -4825 -2753 3824 5047 -3414 -6770 2059 7497 -429 -7817 -1712
2445 -1712 7092 2656 -6019 -3869 3663 4518 -1753 -4546 -565 3911 2515 -2920 -4537 1815 5712
2460 5712 -322 -5948 -1040 5850 2863 -5395 -3730 4226 4082 -2680 -4403 826 4339 1001 -3343
2475 -3343 -2331 2139 4026 -726 -4350 -393 4715 1790 -4087 -3462 3862 4245 -2475 -4483 1321
2490 1321 4646 272 -3693 -970 2964 2557 -1454 -3135 534 3488 528 -3093 -1903 2802 3085
2505 3085 -2133 -3878 1233 3535 -189 -3620 -1095 3129 1728 -2394 -2147 1028 2778 -30 -2835
2520 -2835 -1168 2342 1783 -1780 -2628 912 2991 -629 -2733 -789 2345 1586 -2366 -1965 1436 1910
2536 1910 -470 -2311 -224 1724 699 -1747 -1768 1105 1913 -541 -2405 -122 2113 786 -1592 -1307
2552 -1307 1531 1486 -1061 -1503 109 1827 394 -1526 -885 1386 951 -552 -1774 405 1952 447
2568 447 -1248 -575 1385 1187 -870 -1290 684 1521 296 -1515 -352 1600 911 -665 -1041 684 1540
2585 1540 -60 -1038 56 1135 693 -733 -1055 517 1258 -3 -985 -131 1063 542 -663 -1005 435
2602 435 966 -172 -1298 -80 979 147 -640 -702 263 944 -216 -977 -301 800 407 -793 -1031 527
2620 527 813 -175 -1085 -278 1254 -60 -803 -514 383 503 -204 -1084 -112 792 25 -711 -579 577 723
2639 723 -347 -825 51 1025 348 -1061 -563 704 888 -374 -1144 134 1228 425 -711 -798 632 976
2657 976 -455 -1211 314 1156 677 -828 -557 898 982 -354 -618 83 1387 498 -1231 -458 779 1161
2675 1161 -273 -1430 147 1468 469 -1175 -803 1081 1189 -882 -1275 145 1597 154 -1423 -1158
2691 -1158 1264 1237 -971 -1615 100 1778 203 -1995 -867 1399 1122 -1200 -1929 761 1829 -290
2707 -290 -1891 -1116 1361 1591 -1027 -2006 -143 2266 458 -2816 -1112 2210 1518 -1608 -1982 980
2723 980 2149 -404 -2240 -562 1819 1647 -1379 -2115 531 2516 530 -2598 -1027 2554 2066 -2142
2739 -2142 -2335 1614 2932 -441 -2865 68 2625 1003 -1619 -1864 1164 2622 354 -2850 -1199
2754 -1199 2874 2258 -2795 -2710 2296 3427 -892 -3868 224 3760 664 -2888 -1749 2109 2423 -653
2770 -653 -2888 -621 2921 1750 -2559 -3498 2349 3992 -1471 -4545 33 4450 659 -4413 -1635
2785 -1635 3172 2387 -1878 -3001 399 3008 835 -2978 -3102 2413 3778 -1454 -5262 274 5245
2800 5245 866 -5708 -2098 4676 2747 -3310 -3347 1931 3357 -196 -3546 -1578 2542 3301 -1533 -4579
2816 -4579 297 5443 1189 -5561 -2316 5184 3547 -4622 -4040 3228 4604 -1463 -4086 -238 3576
2831 3576 2183 -2098 -3209 737 4861 1007 -5017 -2642 5269 3994 -4712 -5055 3740 5523 -2312
2846 -2312 -5433 901 5000 668 -3642 -2011 1967 3306 46 -4430 -1827 4568 3818 -4222 -5289
2861 -5289 3537 6414 -2369 -6621 909 6382 270 -5747 -1501 4204 2480 -2058 -3619 -174 3734
2876 3734 2127 -3786 -4305 2542 5970 -1951 -7270 479 7182 915 -6967 -2314 5964 2624 -4288
2891 -4288 -3483 2102 3625 265 -3371 -2403 2436 4217 -1398 -6217 106 6648 1084 -6709 -2639
2906 -2639 6601 3792 -5616 -4214 3897 4253 -1544 -4031 -502 3369 2455 -1822 -3892 472 5588
2921 5588 1302 -5798 -2615 5700 4245 -5185 -4944 4404 5471 -2809 -4894 1063 4732 620 -3074
2936 -3074 -2035 1762 3767 351 -4373 -1897 5047 3670 -4546 -5282 3647 6070 -2469 -6171 1068
2951 1068 5713 482 -4500 -1391 3336 2593 -1519 -3298 -402 3555 2283 -3417 -4099 2624 5627
2966 5627 -1829 -6203 686 6159 534 -5404 -1573 4388 2320 -3417 -2921 1048 3211 836 -3288
2981 -3288 -2723 2384 3798 -1714 -4836 246 5221 477 -5349 -1693 4917 2992 -4009 -3522 2589
2996 2589 3351 -979 -3161 -738 2814 2116 -1707 -3182 556 4203 893 -4188 -1448 4122 2647
3011 2647 -3451 -3043 2910 4000 -1742 -3386 458 3188 875 -2509 -1822 1434 2724 -270 -3079
3026 -3079 -1019 3447 2048 -2696 -2818 2400 3354 -1606 -3731 795 3737 226 -2683 -1195 2268
3041 2268 1734 -1086 -2359 152 2314 1097 -2463 -1916 1798 2700 -1506 -3311 458 3100 90 -3219
3057 -3219 -679 2423 1603 -1827 -2049 764 1975 238 -2311 -1206 1790 1712 -1508 -2111 398 2648
3073 2648 75 -2594 -755 1893 1227 -1877 -1898 1139 1881 -439 -1812 -460 1771 1157 -1451 -1637
3089 -1637 899 1904 -216 -1950 -409 1915 897 -1563 -1450 1257 1752 -655 -1675 -158 1820
3104 1820 503 -1094 -963 945 1505 -340 -1319 -46 1628 486 -1429 -810 1152 1265 -676 -1261
3120 -1261 377 1444 176 -1311 -790 1006 1058 -501 -1306 390 1441 95 -1626 -390 1024 1074
3136 1074 -929 -1139 316 1285 -333 -1185 -405 1090 971 -812 -1344 390 1053 -69 -1236 -545 914
3153 914 705 -896 -983 388 657 -28 -1235 -201 650 594 -816 -1010 460 865 -359 -1018 34 734
3171 734 362 -1065 -677 646 786 -201 -796 -28 974 365 -447 -467 556 709 28 -744 -45 741 449
3190 449 -769 -478 799 784 -120 -466 181 826 683 -375 -327 561 980 -459 -764 117 1164 341 -935
3209 -935 -316 755 937 -208 -831 143 808 109 -796 -710 733 615 -422 -985 49 1029 144 -929
3227 -929 -398 570 687 -371 -849 350 1090 93 -809 -701 565 567 -712 -981 26 858 238 -1279 -637
3246 -637 869 899 -732 -1266 381 1203 -320 -1158 -544 520 1057 -628 -1273 106 1409 259 -1118
3263 -1118 -885 1318 1085 -1064 -1067 348 1645 -205 -1292 -256 967 908 -504 -1305 180 1444 221
3280 221 -1450 -667 1462 1291 -1143 -1464 1037 1793 9 -1476 -34 1581 561 -1221 -1027 594
3296 594 1672 92 -1647 -566 1688 1125 -1350 -1766 861 2208 -605 -1926 30 2210 838 -2096
3312 -2096 -1119 1170 1578 -395 -1953 -148 1392 928 -1680 -2013 1032 2421 -421 -2511 -125 2621
3328 2621 714 -2700 -1375 1999 1387 -1263 -2199 237 1670 523 -1812 -1656 1221 2161 -564 -2804
3344 -2804 -319 2883 656 -3193 -1391 2753 1944 -2101 -2256 1152 2013 203 -2136 -877 1437 1639
3360 1639 -579 -2347 -104 2977 1046 -2778 -1569 2785 2828 -2284 -2902 1783 2986 -609 -2482 -376
3376 -376 2529 1292 -1397 -1765 309 2647 915 -2791 -1810 2855 2604 -2576 -3214 1841 3813 -1105
3392 -1105 -3346 55 2748 703 -2357 -1415 1490 2215 -77 -2389 -1258 2403 2195 -2026 -3361 1600
3408 1600 3957 -868 -4601 266 4130 615 -3460 -1719 2335 1841 -1490 -2450 -307 2019 1591 -2467
3424 -2467 -3059 1071 3617 -620 -4376 -388 4490 1221 -4220 -1892 3312 2381 -2781 -2614 1187 2269
3440 2269 175 -2293 -1837 1575 2794 -910 -3480 -417 4110 1335 -4341 -2030 3991 2892 -2938
3455 -2938 -3284 2191 3338 -1065 -2554 -100 1969 1839 -1246 -2217 280 3113 1370 -3603 -2192 3687
3471 3687 3372 -2751 -3768 1996 4177 -1139 -3683 521 3067 612 -2213 -1696 1199 2320 526
3486 526 -2763 -1582 3069 3077 -2488 -3812 1874 4190 -1469 -4517 220 4008 632 -3570 -1443 2205
3502 2205 1978 -1143 -2422 -613 2073 1803 -2369 -3032 1494 3542 -904 -4278 -151 4289 667 -3946
3518 -3946 -1432 3074 1789 -2408 -2289 886 2236 520 -2016 -1780 1375 2539 -556 -3666 127
3533 127 3931 1050 -3966 -1910 3681 2143 -2641 -2740 1993 2637 -884 -2645 -703 1974 1618 -1230
3549 -1230 -2111 351 2878 1150 -2961 -1659 3376 2590 -2326 -2661 1960 3206 -939 -3000 177 2546
3565 2546 977 -1433 -1695 896 2501 -57 -2224 -1109 2436 2319 -2001 -2442 1657 2957 -847 -2836
3581 -2836 189 3035 247 -2184 -826 1444 1770 -850 -2050 -157 1672 1207 -1705 -1975 1410 2498
3597 2498 -1081 -3009 298 2772 265 -2901 -865 1857 1239 -1481 -1899 290 1732 52 -1844
3612 -1844 -1109 1533 1792 -898 -2088 120 1945 369 -2467 -1031 1894 1040 -1587 -1653 1093 2011
3628 2011 -302 -1628 -246 1437 830 -864 -1436 529 1929 98 -1718 -416 2124 1181 -1439 -1362
3644 -1362 1154 1596 -375 -1719 124 1535 730 -1085 -760 757 1282 -199 -1744 -222 1479 851
3660 851 -1300 -915 1100 1308 -461 -1454 275 1601 219 -1350 -630 753 1120 -471 -1426 206 1256
3677 1256 90 -1123 -815 1203 1166 -1100 -977 144 1343 154 -1375 -519 1063 696 -935 -1070 19
3694 19 1057 -296 -1114 -224 896 786 -857 -928 432 656 -72 -1100 -307 1049 299 -778 -853 443
3712 443 790 -489 -1332 201 1164 145 -623 -518 529 784 -191 -884 74 787 474 -1275 -480 557
3730 557 869 -337 -906 58 1218 174 -789 -620 486 862 -408 -1137 -36 844 427 -867 -364 609
3748 609 762 -171 -827 63 857 289 -841 -506 409 592 -662 -677 261 825 101 -596 -421 543 474 -427
3768 -427 -752 408 840 174 -648 -369 869 578 -573 -897 -196 422 167 -979 -389 541 366 -539 -902
3787 -902 290 825 -334 -907 -371 794 604 -965 -872 212 869 74 -1075 -121 1246 301 -749 -723
3805 -723 279 979 -75 -845 -223 874 598 -738 -784 345 1029 -48 -1029 -110 986 640 -888 -472
3823 -472 710 975 -153 -1239 31 1163 732 -708 -913 923 1373 -468 -884 238 1342 541 -893
3840 -893 -668 454 664 -244 -1298 -377 1012 364 -699 -1273 661 1417 -560 -1557 321 1463 294
3857 294 -1218 -751 1117 672 -446 -1089 1 904 188 -1102 -905 545 1454 -321 -1782 -15 1608
3874 1608 251 -1534 -723 1258 1021 -1158 -1482 556 1229 179 -1157 -545 757 1279 -478 -1436 22
3891 22 1846 667 -2201 -815 1532 1434 -1396 -1515 792 1430 -406 -1344 -340 1285 893 -601 -1406
3908 -1406 203 1905 539 -1998 -868 1950 1178 -1715 -1889 1411 2160 -711 -1771 226 1648 643
3924 643 -1044 -1186 780 1715 394 -1630 -1067 1947 1315 -1626 -2158 1195 2460 -754 -2487 458
3940 458 2230 199 -1630 -1075 1233 1471 -159 -1472 -712 1533 1008 -1714 -1973 1051 2528 -694
3956 -694 -2808 326 2707 100 -2523 -827 2107 1126 -1494 -1401 472 1251 523 -1196 -1815 1171 2189
3973 2189 -897 -2667 137 3012 642 -3000 -1199 2323 1666 -1795 -1632 863 1560 -45 -1610 -857
3989 -857 1149 1679 -500 -2030 144 2924 814 -2822 -1554 2881 2149 -2264 -2078 1531 2329 -910
4005 -910 -2130 -75 1757 973 -1007 -1528 552 2144 633 -2369 -1577 2593 1777 -2243 -2328 1706 2838
4022 2838 -1236 -3052 566 2315 98 -1834 -1064 1078 1393 -109 -1821 -684 2300 1982 -2041 -2471
4038 -2471 1815 2799 -1001 -3092 276 3222 147 -2721 -729 1810 1140 -770 -1661 -59 1798 1188
4054 1188 -1520 -2055 1270 2590 -820 -3118 -5 3089 452 -3309 -1196 2955 1362 -1938 -1657
4069 -1657 910 1736 -57 -1497 -709 1190 1868 -551 -2308 270 2876 566 -2813 -1260 2695 1625
4085 1625 -2121 -1561 1522 2072 -639 -1956 108 1562 927 -875 -1873 455 2266 337 -2193 -1023
4101 -1023 2284 1982 -2337 -2024 1802 2196 -1093 -2318 326 2092 363 -1098 -1091 638 1487 -305 -1874
4118 -1874 -579 1983 1440 -1725 -1912 1678 2518 -1074 -2466 341 2315 115 -2092 -549 1576 922
4134 922 -690 -1845 283 1449 784 -1226 -1727 1103 2039 -1197 -2315 632 2134 -78 -2556 -594
4150 -594 2114 698 -1301 -1003 674 1383 142 -1373 -673 1217 1328 -797 -1800 585 1900 -141
4166 -141 -2058 -533 1682 921 -1656 -1166 1033 1628 -452 -1449 -210 1301 601 -874 -1283 869 1621
4183 1621 -96 -1725 -519 1733 989 -1581 -1137 1309 1305 -651 -1253 168 1137 355 -1223 -682 662
4200 662 1381 -170 -1224 116 1456 467 -1284 -1088 1258 1271 -1050 -1354 307 1423 360 -1571 -681
4217 -681 896 620 -422 -1140 120 1258 32 -1382 -566 793 913 -632 -1452 339 1314 -114 -1186
4234 -1186 -535 1128 621 -854 -716 485 944 -47 -1142 -182 934 509 -460 -1091 626 1022 -290
4251 -290 -1218 -155 1094 622 -628 -723 708 786 -139 -853 6 1358 258 -946 -660 496 767 -161
4269 -161 -1005 138 939 215 -834 -292 732 732 -367 -777 -4 1113 487 -1175 -467 688 560 -331
4287 -331 -1026 498 1022 144 -642 -411 550 670 -437 -819 82 477 -7 -850 -623 491 476 -610 -736
4306 -736 415 722 -68 -804 -340 768 -37 -443 -809 254 561 -361 -571 -240 627 137 -645 -738 273
4325 273 869 -13 -735 -59 987 542 -603 -533 313 779 -207 -907 -187 708 509 -650 -579 637 735 124
4345 124 -719 -58 766 391 -602 -205 605 616 -98 -452 107 820 348 -661 -359 394 820 -439 -583 77
4365 77 1086 201 -683 -235 570 859 -201 -705 -250 702 17 -1005 -434 471 552 -610 -655 329 637 1
4385 1 -886 -619 1174 687 -192 -729 -42 777 274 -624 -401 608 633 -536 -869 124 695 38 -680 -566
4405 -566 538 589 -564 -783 432 682 355 -939 -614 450 367 -275 -910 115 1091 -148 -1236 -143
4423 -143 1117 452 -679 -878 315 682 -234 -656 -203 730 780 -312 -594 464 1133 101 -1247 -229
4441 -229 1079 698 -836 -764 712 834 -299 -766 26 780 444 -454 -804 416 783 -97 -1312 -605
4459 -605 1176 797 -1053 -866 601 1093 -469 -1082 172 1044 268 -765 -757 555 883 37 -1185 -383
4477 -383 1035 1059 -1262 -1266 954 1410 -529 -1448 303 1307 132 -1285 -516 890 716 -505 -987 -158
4495 -158 739 394 -724 -1372 727 1468 -967 -1622 191 1537 -69 -1830 -244 1778 629 -676
4511 -676 -1035 482 873 184 -686 -741 842 1348 -523 -1648 346 1777 184 -1923 -740 1745 695
4528 695 -1268 -1150 893 1188 -244 -986 -94 866 743 -273 -1275 315 1634 118 -1900 -589 1697
4545 1697 943 -1625 -1239 1380 1588 -725 -1387 299 1137 335 -537 -1034 416 1123 134 -1277 -715 1673
4563 1673 1075 -1216 -1382 1269 1505 -965 -1806 421 1741 -156 -1403 -364 847 924 -390 -1433
4579 -1433 -504 1255 839 -1299 -1277 855 1774 -933 -2089 668 1905 168 -1920 -618 1236 436
4595 436 -712 -827 189 1098 244 -1305 -876 857 1741 -377 -1887 289 2018 -45 -1800 -254
4611 -254 1893 508 -1411 -526 878 1177 -43 -973 -318 990 1038 -334 -1272 411 1824 303 -1744
4628 -1744 -355 2014 990 -1696 -1085 1354 1347 -627 -1164 253 1240 287 -820 -824 726 1159 146 -1418
4646 -1418 -387 1799 920 -1509 -1229 1445 1449 -1295 -1515 569 1589 158 -1440 -526 550 590 -215
4663 -215 -1367 -422 1504 335 -1355 -1244 1073 1311 -1127 -1741 582 1500 -13 -1591 -464 1213
4679 1213 497 -804 -819 -115 1114 95 -946 -790 763 1246 -560 -1731 653 1791 -117 -1695
4695 -1695 -176 1614 322 -1282 -600 408 1058 -268 -985 -97 806 825 -674 -907 418 1412 -348
4712 -348 -1564 46 1540 325 -1185 -778 1152 769 -546 -907 128 928 332 -844 -665 599 1215
4729 1215 -174 -1211 -137 1216 325 -1256 -815 1212 1086 -728 -822 504 982 106 -890 -173 469
4746 469 395 -493 -621 -377 839 111 -1013 -656 1010 858 -993 -1150 463 891 -263 -907 -157 653
4764 653 378 -621 -424 183 611 210 -939 -321 708 729 -873 -789 437 997 -481 -1080 52 741 481
4783 481 -660 -663 606 814 -187 -627 -315 845 461 -516 -671 435 810 -131 -1019 77 656 171 -552
4802 -552 -397 566 562 -77 -440 116 746 498 -614 -365 538 653 -380 -942 319 988 42 -816 -388 606
4822 606 547 -415 -915 152 498 -143 -558 -405 677 490 -814 -617 346 682 -341 -700 -40 520 455
4841 455 -489 -538 422 603 30 -477 -365 444 625 -689 -447 114 511 -202 -607 -102 647 161 -746 -338
4861 -338 205 865 -85 -456 -230 727 369 -470 -436 426 539 -164 -407 107 537 96 -607 -280 383 478 -365
4882 -365 -563 217 727 78 -472 -413 405 655 -552 -344 136 454 241 -681 -4 524 448 -282 -459 30
4902 30 573 91 -588 -147 604 421 -272 -421 187 391 149 -557 -386 632 312 -276 -465 149 575 78
4922 78 -647 152 340 137 -90 -450 78 610 -179 -505 -42 325 271 -599 -410 113 523 -91 -350 -53 714
4943 714 -35 -427 -403 133 369 -80 -607 10 636 185 -387 -758 343 418 -88 -563 -28 489 371 -400
4963 -400 -385 373 548 -269 -784 216 642 194 -173 -386 225 523 -206 -366 -49 521 300 -384 -449 672
4983 672 353 -191 -649 -98 639 289 -451 -187 576 558 -448 -696 245 692 12 -548 -352 300 367 -217
5003 -217 -604 44 369 409 -521 -593 628 416 -533 -578 321 707 -341 -568 -313 342 452 -385 -485 135
5023 135 596 178 -496 -213 816 683 -533 -727 531 627 -24 -632 23 646 333 -425 -483 345 618 -4
5043 -4 -789 -427 554 677 -612 -744 622 959 -421 -986 71 853 -222 -397 -110 623 329 -381 -697
5062 -697 -351 550 782 -164 -950 483 1049 -300 -1105 -194 1118 75 -1079 -273 960 531 -351 -803
5080 -803 219 453 156 -354 -457 636 767 3 -996 107 837 455 -630 -610 943 457 -640 -632 406
5099 406 512 -134 -538 -324 17 424 -111 -1138 159 924 384 -882 -570 941 776 -744 -673 666
5117 666 429 -227 -824 68 800 291 -520 -575 101 741 148 -632 -292 643 706 -668 -947 509 743 -176
5137 -176 -1326 -71 938 -75 -721 -435 465 638 311 -746 -167 488 766 -379 -1071 448 1327 21
5155 21 -1299 39 1325 396 -910 -145 787 488 -447 -496 263 743 289 -441 -725 458 925 -48 -1077
5174 -1077 -76 968 224 -864 -465 1082 909 -697 -741 224 749 -31 -516 -154 373 735 -218 -1072
5192 -1072 -194 1215 406 -856 -433 935 662 -693 -717 326 896 -218 -553 -202 587 185 -300 -836
5210 -836 -123 770 268 -971 -724 814 629 -852 -777 664 784 -504 -1095 31 694 -18 -426 -577
5228 -577 151 588 -66 -842 -430 798 564 -600 -751 273 897 -274 -940 255 906 -95 -666 -368
5246 -368 931 254 -277 -616 -215 562 354 -582 -586 447 835 -559 -866 154 1149 184 -864 -290 768
5265 768 382 -454 -548 219 440 -6 -473 -301 515 503 -277 -1120 423 863 -3 -756 -88 716 551 -624
5285 -624 -824 595 523 -321 -477 -245 215 424 -352 -580 -124 631 94 -710 -23 859 294 -491 -431 535
5305 535 793 -633 -491 189 507 203 -538 -230 337 320 -484 -823 -155 540 276 -658 -505 416 649 -535
5325 -535 -576 238 626 -59 -432 -37 111 442 -392 -564 56 959 149 -386 -336 512 343 -449 -652 362
5345 362 556 28 -447 -49 934 123 -121 -184 111 615 -79 -562 -241 619 177 -435 -592 379 802 -172
5365 -172 -773 10 512 70 -380 -598 437 235 -171 -509 -209 338 191 -410 -295 234 557 64 -539 75
5385 75 400 119 -605 -358 160 350 -228 -467 272 156 105 -287 -285 384 507 -347 -387 162 505 211 -380 57
5407 57 298 237 -63 -354 182 346 176 -319 -341 348 179 -76 -403 319 500 136 -348 -21 568 375 -296
5428 -296 66 486 490 -26 -349 287 371 342 -352 -403 101 648 -66 -535 -33 581 36 -168 -114 401 455 -31
5450 -31 -414 58 164 241 -319 -149 169 515 -11 -458 -96 328 -85 -201 -209 83 247 31 -414 -213 251
5471 251 81 -155 -190 -157 111 -262 -232 393 493 -169 -663 -174 71 122 -322 -275 198 310 258 -344 -340 476 122
5494 122 -388 -275 73 174 140 -315 -183 186 318 -186 -344 127 111 -156 -320 62 295 174 -394 -195 130
5515 130 549 -97 -293 -107 268 453 -91 -104 160 402 -179 -116 -101 362 156 -292 -329 156 367 -242 -342
5536 -342 -271 515 17 -353 -322 269 466 -260 -408 -150 430 266 -174 -260 316 314 -361 -465 19 465 341 -567
5558 -567 -210 197 105 -296 -344 -141 0 -56 -298 -371 140 568 -232 -475 -29 792 0 -358 -456 386 243 -251
5580 -251 -325 286 259 89 -248 29 519 320 -53 -436 -75 376 122 -623 -394 196 450 -66 -671 195 238
5601 238 63 -384 -21 331 242 -166 -222 77 443 82 -294 -375 206 360 -365 -531 231 652 23 -468 183
5622 183 542 -54 -376 -190 -37 113 35 -112 11 357 455 -399 -678 219 691 -38 -772 -111 426 62 -719
5643 -719 -339 405 270 -74 -261 -94 -18 447 -30 -382 34 347 -121 -675 -299 630 113 -520 -220 487
5663 487 136 -307 -155 146 340 116 -238 -288 299 59 -119 -597 -241 627 357 -671 -487 638 571 -319
5683 -319 -583 212 507 109 -354 -78 636 129 -126 -601 175 351 62 -508 -620 493 475 -324 -526 318
5703 318 645 0 -525 145 445 162 -278 -80 148 83 4 -378 -182 235 316 -242 -471 109 720 -161 -705
5724 -705 -1 858 137 -700 -374 416 383 -85 -558 -213 256 86 -326 -231 -3 506 -390 -883 169 607
5744 607 86 -435 -269 610 454 -508 -404 305 383 104 -523 -204 333 389 -90 -581 -67 776 296 -446 -593
5765 -593 309 324 -503 -214 294 532 -355 -361 -57 371 385 -23 -213 53 570 293 -367 -173 752 585 -348
5786 -348 -651 322 539 -176 -483 91 233 72 -253 -243 267 259 138 -465 -153 410 113 -88 -426 124 709
5807 709 -258 -490 186 427 -106 -360 -479 208 501 -148 -381 -87 292 241 -445 -616 165 623 -298 -821
5827 -821 181 666 133 -576 -73 686 360 -295 -296 80 400 102 -310 -174 416 437 -155 -599 305 595 180
5848 180 -310 -175 550 483 -383 -414 443 157 89 -577 31 514 389 -41 -453 98 465 -64 -455 -236 390
5869 390 164 -394 -303 350 452 -452 -361 -9 417 233 -259 -309 205 216 269 -454 -274 517 252 -512 -310 313
5891 313 319 -269 -218 -56 500 19 -464 -70 224 307 -253 -247 -169 426 167 -393 -27 519 407 -371 -313 -58 430
5914 430 -281 -713 -493 307 64 -332 -274 47 654 176 -380 -96 117 76 -515 -525 195 238 -149 -688 -213
5935 -213 281 283 -85 -316 328 248 -213 -502 -280 491 -34 -443 -305 195 91 -28 -210 -2 328 -14 70
5956 70 -38 271 255 -102 -230 -129 412 155 -156 -255 379 10 -219 -283 159 334 24 -244 172 321 422
5977 422 -43 -444 299 295 267 -36 -432 46 161 -212 -73 285 214 -74 -245 -91 279 46 -203 -3 128
5998 128 456 223 -240 -249 276 105 -356 -498 210 264 -89 -343 -2 162 21 -241 -224 160 200 -79 -433 12
6020 12 471 81 -339 -408 64 476 -24 -185 -43 114 116 -138 -156 391 39 146 -407 146 320 -189 -137 -429
6042 -429 450 237 -258 -371 -296 356 147 -32 -92 201 268 -95 -208 14 470 93 -251 -199 72 504 -129
6063 -129 -338 50 237 3 -193 38 84 537 -43 -213 79 576 -21 -160 20 212 153 -69 -374 182 85
6084 85 12 -297 -148 402 288 -241 -37 -28 228 -56 -258 21 198 251 -175 -388 87 552 -109 -182 -283 349
6106 349 124 -265 -288 103 259 -22 -345 -128 250 345 -388 -213 209 34 -40 -67 58 206 191 -146 -80 203
6128 203 308 62 -75 -38 348 293 11 -53 147 25 -102 -141 118 224 -126 -513 -7 -13 -20 -32 5 80 192 -25
6152 -25 -98 -155 226 323 304 -538 129 164 56 -159 23 97 157 -271 -201 -113 474 90 -187 195 141 325 -96 -64
6176 -64 12 235 118 -437 -37 -4 100 51 -317 241 147 16 -410 -144 328 116 -141 -91 169 204 45 -365
6198 -365 -61 133 210 -33 -433 -111 275 97 -228 210 320 237 -394 -149 207 172 0 81 -140 290 86
6219 86 40 -67 147 222 -20 -89 34 463 136 -259 -392 346 131 43 -205 7 609 67 -262 -437 12 -51
6241 -51 -75 -387 -385 209 -32 -261 -206 269 774 -59 -351 277 17 -116 -364 17 111 162 -223 -468 -236 146
6263 146 -136 -511 -350 252 270 -77 -261 -187 311 -18 -354 58 502 214 -253 0 68 48 311 -42 -192
6284 -192 225 278 -231 -383 -233 439 175 -558 -180 276 -1 -159 -83 140 171 -113 -210 -189 -10 -17 -218 -505
6306 -505 8 344 -101 -303 -139 137 392 -220 -69 422 -168 -193 -382 -43 95 96 51 28 141 367 70 -431
6328 -431 66 393 478 -359 -226 339 266 -158 -330 -2 70 -21 -129 -112 21 309 70 -146 0 332 301 -300
6350 -300 81 182 360 -253 -218 113 353 -99 -174 169 147 104 -326 -158 71 -43 161 1 -182 6 427
6371 427 -289 -305 64 320 -45 -413 332 312 123 -265 -345 166 268 -78 -329 -257 204 352 64 -30 70 315
6393 315 -39 -514 -36 419 -92 -247 -58 288 186 -186 -138 -20 331 234 -245 -121 279 205 -133 -444 -72
6414 -72 271 279 -363 -75 315 352 -145 -364 255 184 2 -134 -164 97 101 -159 -238 -5 356 -9 -240 -133 241
6437 241 162 -89 -308 227 275 -163 -221 -162 230 111 -372 -352 196 113 -3 -193 -159 157 387 -259 -210 278 386
6460 386 13 -140 -172 10 -112 -176 -140 114 229 -206 -366 -123 -6 108 -117 -9 159 243 31 -262 71
6481 71 319 146 -40 -5 239 45 11 -40 -34 518 105 -26 -159 263 177 -4 -59 127 371 173 -34 -45 56
6504 56 164 -58 -133 81 264 85 -109 -25 3 65 -69 -197 187 330 -33 -398 -112 -40 320 -29 -155 -49
6526 -49 -23 133 -40 15 60 134 -204 -231 119 317 66 -283 -170 83 90 -203 -177 6 -128 -230 -56 -148 290
6549 290 115 -438 -63 343 30 82 -155 -175 127 -19 -63 -50 156 44 40 -220 104 293 283 -152 -77 -39 115
6572 115 -76 -265 -156 227 -80 -183 4 146 66 -172 86 -42 259 144 -94 -93 -158 145 -28 -155 332
6593 332 358 138 -137 3 253 24 -73 9 15 81 -187 -14 132 399 301 -63 -198 236 489 -183 -458 -58
6615 -58 85 84 -84 -253 35 304 -86 -146 -142 61 -64 0 116 -88 70 35 -257 -164 22 -96 -9 -391 183
6638 183 184 -120 -189 -130 108 -5 -256 12 225 316 -232 -138 155 170 0 -200 -101 222 270 -80 -320 217 -132
6661 -132 -48 -313 -117 163 14 100 -149 236 78 113 -278 -164 129 113 -9 -245 121 370 19 -222 122
6682 122 208 259 -72 -328 -74 276 48 -509 192 172 106 164 -325 58 348 -231 -231 62 57 101 -161 -171 88 117
6706 117 151 -283 -226 73 289 -132 -196 83 -90 68 -112 33 17 -30 -363 -359 34 -60 -57 -207 -204 -69 12 -99
6730 -99 42 128 58 -115 -230 -133 267 266 -356 23 67 51 -90 -288 72 81 28 -215 -113 374 93 -74 -103 -103 144
6755 144 76 59 113 355 133 65 -112 -43 172 337 63 253 25 -71 128 -25 -126 83 96 -48 -119 424 306
6778 306 141 -158 224 432 -157 -334 91 281 240 11 -280 -1 383 -158 -420 -477 237 137 -302 -162 -168
6799 -168 218 -92 -347 -161 -37 -96 -51 9 283 -92 4 -194 -227 381 -106 -107 -7 -3 258 25 -83 2 334
6822 334 -150 -293 -19 -197 21 -139 -344 -94 416 -66 -217 -7 -179 -155 78 -211 72 225 52 -167
6842 -167 -71 221 350 13 41 16 184 21 -207 -27 -74 305 -79 -377 -279 153 109 -122 -224 177 55 -173
6864 -173 -104 173 223 -64 -9 -277 -199 143 -373 -86 -108 289 222 -226 145 184 -68 -84 -201 50 56 -213 -53
6887 -53 311 -42 -97 -206 -12 -487 124 -128 -151 -142 33 67 22 -328 102 178 -457 -106 -213 32 -56 -264 77
6910 77 22 313 80 -72 51 0 -103 3 -30 81 221 -96 -144 255 398 103 -152 -370 92 15 -8 -244
6932 -244 -57 139 34 -63 -148 152 -22 6 -290 -4 489 -74 -209 173 -109 170 161 -6 204 48 26 -237
6954 -237 -145 54 205 40 -144 190 120 170 -147 -37 110 75 -155 -129 -28 92 -13 -131 -505 -40 379 -57
6976 -57 -31 133 254 -183 -256 34 -27 206 -122 -171 348 27 -16 -334 323 111 126 -146 -219 139 323 6 -137
6999 -137 -228 77 238 -273 -189 265 191 -272 -201 158 281 -82 -143 -49 -165 505 90 -209 -48 26 45 -263 -153
7022 -153 103 -96 58 -176 55 370 205 -48 59 0 109 -94 -201 -11 15 192 -58 149 128 33 -85
7043 -85 -259 233 221 -160 -358 -68 263 90 -310 -28 43 -224 -133 -252 262 135 99 -326 -261 -9 162 101
7065 101 -281 -12 136 139 -82 -189 296 -49 -69 -282 -293 308 -120 3 -187 216 139 -37 -372 -13 -198 84
7087 84 -189 -49 14 45 -130 -332 47 187 92 -219 -338 111 144 -22 -188 59 186 -18 -245 -236 314 143
7109 143 230 -105 78 196 44 -14 -23 -29 113 -123 -189 181 72 -83 11 158 -10 15 154 200 245 346 12 -145
7133 -145 42 106 359 31 -104 111 105 237 -191 158 75 55 -222 -163 -76 298 176 -127 -107 28 79 -185 -171
7156 -171 38 239 -219 -286 -152 186 33 66 -338 208 193 -17 -244 -56 315 122 -163 -163 -67 132 -272 -227
7178 -227 119 93 134 27 60 23 225 -125 75 7 182 12 -287 -104 116 117 203 103 -184 15 74 -341 -155
7201 -155 18 93 -105 50 -86 156 -248 -163 174 177 301 -117 -270 -55 273 106 89 -144 -7 242 -63 229
7223 229 -228 146 34 -54 -27 133 43 39 145 -248 258 -201 -107 -226 178 62 -49 -91 149 156 89 -152 -182 -61
7247 -61 16 179 -497 306 131 -87 -119 107 41 94 -81 -69 79 157 -91 -39 177 163 102 -46 -207 -78 9 22
7271 22 -167 13 172 -239 0 -248 -10 -86 189 -10 88 207 312 -17 77 145 -2 63 -60 175 -5 139
7293 139 136 320 -103 115 -64 -72 -70 464 -88 -273 -130 215 154 28 -90 -205 -26 -3 -70 -8 289 184 -114
7316 -114 -161 5 77 330 -194 -97 157 36 -198 -53 -299 79 -115 59 -121 -23 -25 0 -194 -10 257 73
7338 73 -140 -32 84 218 11 197 45 76 -199 -42 103 -80 102 25 -133 121 242 78 -215 -304 134
7359 134 -129 -11 -35 180 6 -7 -402 68 207 49 -247 -302 379 -114 -312 103 -183 89 -42 -350 -205
7380 -205 155 -82 104 129 -78 71 106 -252 -48 211 140 -288 -97 144 4 -149 -347 26 256 112 -447
7401 -447 -191 18 171 -20 -387 136 327 13 -113 -167 208 190 223 50 30 214 47 123 -240 -210 114 209
7423 209 23 -77 -51 -1 -93 -77 66 244 -185 -106 -29 337 24 -150 -40 -10 86 -93 -108 -164 59 38 -237 64
7447 64 251 144 141 41 38 185 53 -123 239 182 -81 201 -97 -86 -54 67 -192 -50 286 489 97 -203 -18
7470 -18 229 -213 -40 173 54 282 -71 -252 14 113 31 204 -101 50 46 47 -101 -2 236 36 -34 -176 126
7493 126 355 -192 122 -58 316 205 -286 -200 -35 126 -48 13 24 196 -40 -118 -267 -138 23 -117 -138 123
7515 123 0 111 -178 -277 -26 -76 25 -326 -74 140 20 -82 65 -54 159 -15 -298 124 210 159 -98
7536 -98 -194 308 171 97 -11 221 300 24 45 -89 194 212 193 -95 75 51 -77 -156 1 -128 -83 110 -80
7559 -80 57 59 -304 -165 13 -105 37 137 -36 93 84 -137 -245 38 143 107 -197 -202 345 271 -84 -67 230
7582 230 150 -57 -333 -86 2 110 151 -33 234 127 143 152 -87 157 -1 -86 -47 29 -75 -19 -102 -233 -122 171
7606 171 -44 -38 86 -35 -87 -295 -180 -41 -61 163 -428 196 287 82 -198 -95 40 51 -212 -31 -81 143
7628 143 2 -103 -55 101 -120 -55 -106 61 181 40 -131 146 -6 129 -182 -107 25 -233 80 -178 -65
7649 -65 63 413 61 -134 67 41 -165 -282 -90 203 26 -154 -44 51 -15 -155 -50 -89 175 3 -231 7
7671 7 86 115 -128 -165 8 184 10 -361 -181 72 -18 -58 -241 159 122 -12 -92 26 123 148 -245 -299 -110 219
7695 219 83 -298 -179 344 -136 -236 -5 -97 -11 30 -66 133 -84 75 8 -302 38 -29 -382 -350 -39 272
7717 272 62 -96 -22 -52 -103 109 -119 -203 373 349 -123 -99 5 -14 43 -20 119 173 201 -185 -27 234 -38 -157
7741 -157 83 61 166 4 43 -183 153 235 -47 -44 155 -74 83 -304 -439 162 114 20 110 289 74 236 43
7764 43 -74 -6 67 13 43 62 286 216 -68 -570 313 90 3 -177 56 243 -90 -320 -75 245 -34 71 -266
7787 -266 -110 72 -75 -295 -123 226 111 -32 -17 -107 -242 -66 -144 37 221 59 -433 -230 -87 246 54
7808 54 -209 -173 -89 335 -122 -331 208 -132 -107 -115 199 -179 -111 -208 -59 369 64 -132 253 90 -1 92 13 -124
7832 -124 147 83 53 -135 -145 110 133 -224 45 377 81 41 -128 -178 112 -161 -199 9 90 94 60 -198 97 152
7856 152 74 -131 -54 144 197 -353 87 233 118 239 -77 -116 -52 264 -41 -104 -144 155 75 -162 -321 -124 73
7879 73 -239 -491 11 129 111 -89 -30 266 99 -177 10 64 19 214 -220 -87 88 -87 37 -117 176 162
7901 162 167 -143 144 -69 -39 -73 -82 -64 169 -81 -87 -129 -14 200 -336 -217 187 143 -138 226 270 71 157 146 -19
7926 -19 -91 -60 -53 -124 -111 98 76 27 -67 146 -84 12 -60 -113 96 176 -4 -190 90 108 -136 -262 -170 49 -24 -163
7952 -163 -478 -190 151 -454 -223 71 -14 73 -207 -157 164 240 228 -56 -223 254 201 -219 122 422 238 9
7974 9 -183 340 -9 -70 -172 -317 342 -28 79 99 -43 99 336 20 -115 105 -10 73 -523 -60 90 31
7996 31 -128 -91 303 29 53 -233 59 153 -45 90 -2 139 52 -17 -277 -52 64 -99 -125 -61 11 -37 -165 -171
8020 -171 32 -216 51 99 -47 194 -36 4 -112 -121 156 -45 140 111 -36 62 -401 13 184 167 58 46 2
8043 2 223 -123 -186 -255 -27 184 48 -430 -83 5 230 2 29 -27 64 183 -122 -35 286 116 -334 -137 154
8066 154 124 -259 -48 27 -225 9 42 -131 246 -26 -145 -230 -73 272 136 -8 28 166 150 -186 -6 -4 -77
8089 -77 140 -415 -142 38 97 -247 -227 -55 67 -148 -227 -28 437 131 -36 60 235 228 -54 -150 9 233 82
8112 82 -188 39 591 212 39 -127 -136 31 97 -21 152 104 267 13 -241 93 505 83 -30 206 -25 24
8134 24 158 -142 -250 -67 44 135 -69 -133 190 -184 2 -106 -9 -111 -67 -143 -111 77 -133 -256 -140 133
8156 133 134 -208 175 -4 -66 -68 -73 -10 250 3 -130 85 74 187 -242 -119 -38 -86 19 -222 -182 406 268 -208
8180 -208 -304 222 293 254 -156 -50 -38 -55 -92 -219 150
8191A50
$$ Imaginary data points
##PAGE= N=2
##DATA TABLE= (X++(I..I)), XYDATA
0 0 0 0 0 0 0 0 0 0 0 0 8 -8 8 -8 16 -16 19 -24 32 -32 43 -50 56 -72 83 -96 109 -128 147 -165 189 -219 247
33 247 -278 312 -352 394 -442 492 -548 609 -677 751 -828 915 -1012 1117 -1228 1353 -1492
50 -1492 1644 -1809 1997 -2206 2440 -2704 3010 -3362 3774 -4266 4866 -5610 6566 -7844 9641
65 9641 -12349 16886 -25853 50127 -250058 -653610 244549 582510 -112767 -520445 4169
76 4169 370042 101819 -213574 -183741 8388 242377 164052 -263738 -340768 238645 468473
87 468473 -191708 -571464 121551 592359 -45254 -569672 -45257 484090 114751 -370464
97 -370464 -166822 208798 190058 -38750 -195477 -130181 165119 274286 -104310 -396156
107 -396156 28031 478476 51785 -506187 -126493 487464 196579 -424352 -233224 331220
117 331220 244792 -196166 -220161 52681 183099 93925 -110309 -211383 27560 317363
127 317363 70760 -375864 -148258 399475 225518 -368580 -274830 318942 304088 -232595
137 -232595 -286230 133079 249877 -15188 -183498 -82832 103657 168771 -1708 -228862
147 -228862 -92630 264191 175133 -260886 -240361 227506 287209 -177281 -305428 111488
157 111488 286843 -37823 -246857 -39091 181779 93477 -104682 -136880 6281 156340
167 156340 80721 -165782 -161270 141729 216994 -109227 -263254 59848 271081 -17355 -257101
178 -257101 -37811 210443 77575 -158132 -108950 81571 114947 -3458 -117174 -76416
188 -76416 100334 135783 -72540 -183693 31469 211382 6251 -215904 -42247 193571
198 193571 76593 -153631 -102024 107020 114816 -48689 -108148 -9259 98476 65746 -73677
209 -73677 -101032 43622 131069 -265 -141565 -30679 143490 64359 -118201 -85317 92470
220 92470 107129 -54867 -105332 21601 98925 21556 -78504 -49911 58828 73239 -23189
231 -23189 -82157 -10333 90460 42883 -83495 -64016 67756 83620 -45397 -92890 24255
242 24255 88996 -1680 -75113 -24771 55701 42774 -35991 -54300 6645 55784 17890 -59123
254 -59123 -40850 48791 49975 -36954 -63165 15980 62761 -5386 -59422 -13100 41496 25100
266 25100 -30954 -39734 13497 38321 -149 -40670 -18710 34510 25045 -30050 -31463 14220 32345
279 32345 -2511 -35375 -7642 29255 15291 -21266 -24485 14227 28810 -8219 -25515 602
291 602 22083 9898 -17536 -12072 14099 15120 -2379 -14075 -2545 19568 8988 -14047 -7783
304 -7783 12446 15092 -6177 -12449 8264 12047 71 -4514 -2457 7131 8556 -2314 -5221 1232
318 1232 9518 3304 -9138 40 9458 768 -3124 -1409 2945 3642 -2234 -986 -316 221 3884 -2640
334 -2640 -4670 3038 1748 -2597 -3128 -208 2758 -3777 -3266 2010 -2971 -2134 217 -2831 -2056 -1645
350 -1645 -603 -1731 -4154 849 -778 -5061 964 -675 -4543 -657 -105 -1676 -3374 -1640 2900
365 2900 -2913 -4027 1932 -660 -1368 -693 -2198 1249 943 -597 -1432 -1726 4756 2446 -6206 278
381 278 5766 2177 -2832 -3216 5458 5299 -2306 -1774 601 5246 6113 -4956 -4607 7542 8791 -1955
397 -1955 -9024 3512 13870 318 -8781 -1090 8913 9697 -5703 -10624 5809 13890 2292 -13432
411 -13432 -5909 17034 10499 -12728 -12319 7264 18106 -1284 -20621 -4155 18456 11812 -15324
424 -15324 -21442 11715 25432 -8003 -28003 -2632 26313 9725 -26345 -17750 16342 20941 -6772
437 -6772 -29862 -7104 30018 14416 -29230 -28551 20144 35762 -16178 -43439 4083 39767 6501
450 6501 -38698 -21740 29881 27896 -19664 -35598 1333 38377 12998 -38816 -27963 29813
462 29813 40842 -18905 -52768 6869 57104 7092 -54312 -23052 48775 37916 -37429 -44523
474 -44523 22493 48742 604 -46159 -18716 41380 38748 -24084 -53234 8065 68891 12426
486 12426 -71361 -27548 69906 48520 -57948 -58943 45956 66019 -21922 -61267 -1768 55894
498 55894 28215 -38913 -46362 17936 65485 9392 -76177 -32155 79672 55688 -71972 -74726
510 -74726 58912 87188 -40671 -88599 15837 79720 10514 -66331 -35423 41811 51916
521 51916 -12600 -66985 -22617 72208 51093 -71159 -80930 56124 100995 -41937 -116346 19286
533 19286 112614 1596 -101735 -28125 77819 44254 -49047 -57894 7645 61267 31432 -62133
545 -62133 -70804 49367 100904 -31622 -126508 8889 137809 12672 -134361 -34956 117740
556 117740 54118 -89964 -64109 53877 66383 -8416 -59574 -36037 48272 77126 -25012
567 -25012 -107302 -293 132070 29878 -139232 -51893 135285 75396 -113767 -87522 88325
578 88325 92560 -49950 -81621 10095 66164 33939 -38874 -67538 8054 97369 30487 -114838
590 -114838 -63400 122838 92644 -114328 -112805 96114 125646 -70065 -122578 38562 105902
601 105902 -2785 -78528 -31743 41895 58291 838 -78682 -48250 89605 87928 -92333
612 -92333 -121578 79738 142157 -62325 -153409 36879 144432 -12499 -122891 -17322 86432
623 86432 38584 -46542 -55557 -3957 60323 51699 -61838 -96839 51398 127918 -35450 -150944
635 -150944 12533 157053 7956 -149205 -29187 123975 46916 -89658 -58633 48031
645 48031 60295 -1443 -53207 -44871 40949 85931 -20968 -115264 -2908 136269 30058
656 30058 -142091 -50099 135759 68111 -112208 -76902 83171 80618 -44732 -69449 5871
667 5871 53745 36931 -29008 -69379 3083 95954 30049 -108837 -57355 114789 81181 -104797
679 -104797 -93921 86154 101318 -59076 -95902 30574 80319 2082 -55152 -32355 26523
690 26523 56176 5672 -71013 -39929 77532 69291 -76565 -91055 64993 102466 -47526
701 -47526 -107807 24917 99603 -5132 -83193 -18335 55423 35451 -26924 -49676 -6962 51859
713 51859 37996 -52012 -67733 43295 86276 -31555 -99006 12164 100561 4022 -94851
724 -94851 -21256 76524 33849 -53150 -44727 25078 47161 3461 -43326 -32749 34744 57640
736 57640 -23023 -73554 7494 82382 10645 -82768 -24862 76888 37283 -59585 -43836 39732
748 39732 48671 -16269 -44081 -4531 35749 27861 -22220 -43511 10240 55620 7466 -57275
760 -57275 -21853 57917 36174 -49034 -42030 37445 47795 -19939 -46484 5503 41644 10297
772 10297 -29672 -23944 17206 34854 -2862 -39244 -11391 39678 25267 -36662 -36105 29296 41067
785 41067 -19361 -43719 5937 41337 3720 -35864 -14611 23968 21788 -13437 -28653 156
797 156 28014 10517 -27085 -23490 21110 29874 -16416 -34028 5768 32910 2040 -31968 -10463
810 -10463 24395 14675 -16606 -20511 6493 21936 1000 -20602 -9949 16034 16763 -12120 -21474
823 -21474 6666 22138 501 -20898 -6833 19461 11259 -14224 -13146 8604 16189 -1267 -15485
836 -15485 -2314 13643 8036 -8444 -11413 6378 14217 -1030 -12160 -2299 12386 8319 -9617
849 -9617 -8658 8318 10649 -2358 -10062 -87 10889 3248 -7502 -4502 5322 7869 -1995 -7694
863 -7694 589 7271 2805 -5818 -4769 5434 5472 -4053 -5289 533 5077 877 -5790 -2057 3416
878 3416 2151 -2130 -4838 327 4033 -1612 -3970 -1650 1895 1748 -3402 -3171 771 1115 -806 -3324
894 -3324 -1827 2001 225 -2676 -1686 -5 1701 -1304 -2914 504 877 -235 -1064 -1655 1072 831
910 831 -871 -441 -655 1037 980 -1361 -79 1032 538 673 -746 348 1514 380 596 -89 250 2350
928 2350 160 -743 665 898 1695 295 -791 1437 1443 856 237 -902 2104 2027 -688 -521 452 2630
946 2630 1179 -2139 -243 2182 1436 -530 -2483 684 3344 -77 -2786 -1281 2480 3253 -3046 -3603
962 -3603 1980 3080 -316 -4713 -2266 4532 2211 -4178 -4612 1253 5403 -1454 -7620 -1319 5433
977 5433 2144 -5725 -6272 3551 5975 -2899 -7568 -1656 7149 3770 -8302 -7073 5275 8233 -2969
992 -2969 -11526 -511 11160 2172 -10127 -6797 7374 9434 -5160 -11140 1155 11130 3911 -10506
1006 -10506 -8513 9495 11969 -5167 -14183 1275 16642 3822 -15646 -6953 13549 12151 -8516
1019 -8516 -14677 5814 16378 1393 -13918 -6747 13191 13945 -8336 -16291 3432 20553 4420
1032 4420 -20981 -9161 21009 15044 -15726 -18681 10732 22339 -4270 -20930 -2437 18085
1044 18085 10913 -13174 -17508 6952 21403 1651 -24126 -11060 24347 18139 -22839 -24127 15986
1057 15986 27553 -9558 -30579 1658 26701 5740 -21864 -15062 12914 20326 -4841 -24343
1069 -24343 -7895 24000 17993 -24216 -28244 18639 33815 -12189 -39040 2996 38704 4021
1081 4021 -34430 -12802 25422 19499 -15532 -24663 2380 24938 11313 -23583 -25452 19157 36275
1094 36275 -12257 -43652 2648 47836 7273 -46634 -14877 40976 22341 -29497 -26730 17254
1106 17254 28923 -1202 -24838 -13645 19700 29584 -10956 -39599 1541 47074 11636 -49339
1118 -49339 -21420 48699 30194 -39861 -34065 29369 37224 -15057 -33238 1046 26347 15059
1130 15059 -15215 -28565 3443 38569 10738 -43444 -24799 45237 36579 -42816 -44781 34567
1142 34567 48245 -23634 -48342 10704 41724 1673 -30658 -15655 14980 26134 528 -34148
1154 -34148 -18702 35769 34756 -36432 -49511 31057 56530 -23704 -60840 11603 57867 -1417
1166 -1417 -50658 -9888 35257 18841 -18565 -25932 -1461 27570 20384 -26551 -39575 22238
1178 22238 53719 -15461 -61847 5721 65021 4893 -61790 -13419 52728 20679 -36956 -24944
1190 -24944 19379 27073 -13 -23128 -18661 16805 37418 -7631 -50217 -1222 58947 13142
1202 13142 -60507 -22682 58267 30847 -48216 -33643 35030 34927 -17145 -31097 870 23717
1214 23717 17054 -11769 -31888 -59 43642 13795 -49157 -26560 50479 37760 -46773 -44313
1226 -44313 38445 45847 -25946 -43535 11472 37145 1607 -25717 -15305 10499 26137 4111
1238 4111 -34286 -19655 35436 32900 -34899 -44621 29714 49686 -22907 -51177 11383 46896
1250 46896 -1883 -39702 -8126 26373 15518 -11664 -22443 -5102 24471 19257 -24094 -33607
1262 -33607 19937 43736 -14552 -49344 6848 49574 1831 -45664 -9759 38133 15448 -25749
1274 -25749 -19101 11568 21490 3402 -19879 -16534 15685 29361 -8854 -37778 2430 42629
1286 42629 5921 -41551 -13250 38873 20019 -30789 -22132 20760 23854 -7665 -21426 -3687
1298 -3687 18038 14417 -10307 -23173 2398 30422 6115 -31941 -12986 31370 20687 -27344
1310 -27344 -24645 21475 26063 -12800 -24761 3082 21774 5272 -15931 -12379 7862 17960
1322 17960 170 -22487 -8366 22465 14426 -20672 -21501 16242 24324 -12355 -25224 4724 22677
1335 22677 1881 -20032 -8016 13566 11038 -6879 -15346 -1736 15777 7532 -15461 -13805 11829
1348 11829 18381 -8677 -21467 3967 20465 1063 -18500 -6236 15160 9283 -10254 -11346
1360 -11346 3934 12548 2079 -12399 -6719 9774 11206 -6002 -14233 2995 16012 633 -14265
1373 -14265 -4030 13258 8437 -9868 -9578 6820 10948 -1003 -9891 -2225 9594 6012 -6496
1386 -6496 -8184 3528 10649 40 -10865 -1905 10057 5322 -7781 -7192 6339 8667 -3281
1399 -3281 -8261 219 7456 2804 -6404 -4719 4378 5574 -1701 -7251 -560 6843 2034 -5702 -4273
1414 -4273 3783 5376 -3176 -6156 817 4988 936 -5398 -2796 3861 2988 -2633 -4246 -4 4064
1429 4064 434 -4557 -1949 2594 2388 -2224 -4382 898 3251 -508 -3337 -1548 2607 2066 -2626
1444 -2626 -2430 1488 2302 20 -2926 -704 2755 955 -1743 -1593 894 2463 -414 -2061 567 1811
1460 1811 927 -1234 -1595 1766 1814 -395 -780 123 2298 1232 -1217 -328 1327 1357 275 -1227 512
1477 512 1829 639 -567 -803 1054 1558 -708 -578 185 987 856 -1241 -827 1171 711 -159 -1017 -118
1495 -118 1589 504 -1101 -965 217 975 -251 -1973 190 968 -7 -1229 -1479 554 1249 -861 -1460
1512 -1460 -190 1069 733 -1854 -1435 762 996 -710 -2235 -714 1982 152 -2072 -1584 903 2143
1528 2143 -1062 -2519 318 2131 803 -2264 -2402 2095 2388 -1301 -2746 -295 3644 1039 -3365
1543 -3365 -1440 2509 2910 -1141 -3835 689 3942 597 -3410 -2154 3285 4080 -1982 -4479 951
1558 951 5355 1602 -4717 -2489 5038 4132 -2921 -4647 1891 6180 508 -5309 -1904 4483 4365 -3032
1574 -3032 -6003 1910 6823 656 -6832 -3020 6940 5476 -5845 -6577 3490 7493 -852 -8401 -1536
1589 -1536 7124 3519 -5519 -6294 2464 7988 -639 -9044 -3419 8164 6070 -8101 -9062 5557 9769
1604 9769 -3146 -10989 -984 10268 2860 -8796 -6170 5000 8206 -1898 -10181 -2256 9259
1617 9259 6005 -8721 -10567 6877 12474 -4803 -14286 626 14258 2529 -13065 -5890 10112
1630 10112 8098 -5355 -10128 920 11010 4408 -9534 -8988 7516 14298 -4596 -16491 1589
1643 1589 18166 3542 -17185 -6496 15740 9797 -10832 -11171 5863 12639 426 -11419 -5497
1656 -5497 8970 11829 -4855 -16136 933 19364 4096 -19489 -8539 18750 13076 -15436
1668 -15436 -14935 11164 15833 -5190 -14861 -1285 12137 7053 -7532 -12689 2028 16458 3574
1681 3574 -19110 -10025 18166 15176 -17076 -19797 13395 20666 -8830 -20810 2596 17539 2324
1694 2324 -13735 -8375 6920 12282 39 -16321 -8125 16087 14274 -15543 -20754 12587 24630
1707 24630 -9484 -26291 4036 24764 1173 -21742 -6473 15735 9745 -7923 -12418 -839
1719 -839 13459 9690 -12168 -17091 9650 23576 -5652 -27671 1945 28586 3585 -26421 -7875
1732 -7875 23092 11580 -16212 -12962 7828 13679 1710 -11588 -9435 8714 17473 -3317 -23339
1745 -23339 -929 27583 6697 -27891 -11149 26195 15476 -21557 -17123 15516 17431 -7142
1757 -7142 -15302 -1338 12074 9118 -6722 -15564 -209 20964 6435 -23839 -12864 23704 17989
1770 17989 -21504 -21929 17385 23052 -11767 -21850 3979 17868 2500 -12983 -8642 5167 12757
1783 12757 1894 -17155 -10166 17624 16442 -16677 -22433 13327 25461 -9787 -25979 4591
1795 4591 23688 651 -19450 -5959 13345 9416 -5767 -11692 -3013 12697 10852 -12128 -17520
1808 -17520 9901 22702 -5931 -25743 2176 26448 2252 -23861 -6252 19021 9953 -13092
1820 -13092 -11153 6078 12023 2504 -10388 -9847 8749 16243 -4371 -20093 54 23374 4509
1833 4509 -22651 -7857 20545 11851 -16044 -13554 11131 13894 -3986 -12180 -2429 9649 8542
1846 8542 -5623 -12913 796 16475 4230 -17807 -8389 17109 12223 -14331 -14631 10772 15445
1859 15445 -6656 -14635 1101 12051 3733 -9083 -7839 4354 10406 852 -12375 -6102 12691
1872 12691 9879 -12006 -13493 8536 15068 -5768 -15964 1819 13931 1318 -11645 -5573 7812
1885 7812 7531 -3846 -9294 -1128 9475 5745 -8936 -9548 7102 12006 -4312 -13434 1148 13830
1899 13830 1359 -11771 -4171 9452 6802 -6302 -7531 2413 7964 1685 -6997 -4752 6388
1912 6388 7705 -3532 -9355 1367 10686 1825 -9992 -3578 9289 5836 -6126 -6713 4266 7613
1926 7613 -984 -6374 -1788 5803 4703 -3894 -6069 2302 7062 356 -7406 -2665 7032 4121 -5824
1941 -5824 -5621 3850 6464 -2014 -6509 163 5291 2393 -4238 -4007 2545 4624 -1054 -5334 -1363
1956 -1363 5052 2678 -4821 -4070 2914 4563 -1835 -5749 -90 4643 899 -4301 -2554 2643 3311
1971 3311 -2103 -3845 102 3210 1026 -3537 -2327 2752 3023 -1985 -3437 448 3594 189 -3475
1986 -3475 -1423 2513 2196 -1719 -2857 1191 2812 -80 -2275 -998 2349 2026 -1640 -1909 1115 2374
2002 2374 265 -2313 -390 2612 1102 -1698 -1524 1183 2418 -278 -1727 9 1766 1073 -1253
2017 -1253 -1465 1439 1726 -189 -1565 -177 2019 659 -1509 -619 958 1546 -392 -1510 293 1458
2033 1458 402 -938 -973 786 1292 -599 -1310 -285 1153 557 -1217 -1137 956 836 -450 -1384 -200
2050 -200 1263 209 -1453 -756 495 857 -741 -1261 210 645 6 -1041 -976 874 866 -940 -881 -110
2068 -110 1153 206 -1548 -541 937 1091 -527 -1480 413 1347 100 -1049 -778 704 1152 -691 -1182
2085 -1182 377 1482 800 -1452 -745 1761 1162 -696 -1468 154 1897 296 -1532 -596 1608 1416
2101 1416 -698 -1737 612 2307 275 -1763 -943 1633 1849 -1424 -1797 694 2401 297 -2307 -965
2117 -965 2135 1338 -1279 -2307 355 2829 359 -2515 -1378 2239 1851 -2031 -2868 1384 2783 -423
2133 -423 -3137 -1074 2835 1652 -2558 -2417 1104 2834 280 -3641 -1275 2966 1886 -2400 -3547
2148 -3547 1496 4049 -613 -4308 -832 3727 1866 -3519 -3051 2235 3287 -653 -4113 -1328 3855
2163 3855 2101 -3396 -3855 2249 5081 -850 -5564 -93 5504 1913 -4506 -2977 3963 4195 -1964
2178 -1964 -4226 216 4545 1985 -3595 -3707 3016 5355 -935 -6102 -65 7070 1878 -6382 -3448
2193 -3448 5592 5052 -3828 -5538 1956 5520 827 -5173 -2804 3816 5190 -1732 -6255 -59 7542
2208 7542 2722 -7379 -4150 6402 6151 -4901 -7182 3283 7234 -1059 -6568 -1898 5507 3759
2222 3759 -3623 -5457 514 6378 2187 -7370 -4942 6711 6596 -5858 -8985 3817 9347 -1843
2236 -1843 -9026 -706 7649 2268 -5883 -4874 2612 5805 -50 -6516 -4016 6449 6574 -5607 -9067
2251 -9067 3833 10869 -1854 -11270 -315 10689 2359 -8860 -4355 6327 5641 -3175 -5915 -539
2265 -539 6189 4932 -5058 -7719 3489 10162 -683 -11630 -1154 12284 3323 -10854 -5237 9185
2279 9185 6829 -6018 -7232 2960 6867 1270 -5208 -4985 3586 8253 -759 -9986 -1914 11299
2293 11299 4841 -11411 -6527 10224 8579 -8096 -9422 5061 9246 -1872 -7850 -1518 5274
2306 5274 4872 -2772 -7521 -643 8899 4247 -9806 -7580 9459 9413 -8077 -11078 5573 11328 -3185
2321 -3185 -10755 375 8392 2422 -6082 -5188 2009 6265 1375 -7093 -5806 7035 8912 -6504
2335 -6504 -11253 4586 12333 -2277 -13107 -203 11423 2054 -8858 -4249 5683 5515 -1938 -5910
2349 -5910 -2112 5557 6110 -4617 -8990 3159 11460 -884 -12138 -1120 12403 3216 -10811
2362 -10811 -4733 8710 6049 -5102 -6213 1731 5997 1910 -4368 -5162 2814 8332 -643 -9815
2376 -9815 -1665 10614 4053 -10366 -6015 9340 7172 -6848 -7948 3906 7439 -1211 -6264 -1927
2390 -1927 3994 4758 -1636 -6798 -766 7783 3497 -8024 -6206 7812 7784 -6563 -8971 4045 8657
2405 8657 -2136 -8038 -523 5927 2279 -3932 -4595 1239 5344 1328 -6072 -4550 5765 6450 -5132
2420 -5132 -8239 3437 8820 -1530 -8766 -197 7915 1911 -6156 -3188 3228 4433 -1145 -4760
2434 -4760 -1407 4387 3767 -3663 -6195 2627 7245 -1096 -7788 -575 7713 2466 -6619 -3062 4909
2449 4909 4037 -2554 -4355 600 4357 1685 -3294 -3635 2229 5457 -810 -5730 -572 6103 2467
2464 2467 -5676 -3404 5064 4081 -3037 -4084 1411 4831 184 -4102 -1658 2657 3153 -1539 -4162
2479 -4162 255 4380 1272 -4549 -2803 4032 3711 -3148 -4296 1753 4154 -457 -4383 -828 3185
2494 3185 1642 -2718 -3133 567 2984 146 -3693 -1523 2742 2332 -2734 -3457 1776 3493 -1012 -3865
2510 -3865 -461 3096 1167 -2775 -1990 1510 2296 -491 -2821 -389 2605 1181 -2070 -2210 1130 2667
2526 2667 -914 -3044 -17 2480 1078 -2165 -1303 2009 2174 -576 -1997 94 2591 1014 -1734
2541 -1734 -1264 1425 2003 -681 -1783 554 2184 741 -1387 -929 1682 1521 -1093 -1446 471 1915
2557 1915 430 -1868 -486 1698 1049 -745 -1616 583 1916 21 -1578 -352 1408 846 -963 -1058
2573 -1058 924 1137 -7 -1301 -300 1360 635 -1049 -764 601 1316 -454 -1814 -124 1320 220
2589 220 -1034 -1090 503 881 -369 -1272 -365 1171 425 -1011 -913 536 751 -268 -1293 -71 948
2606 948 4 -1057 -795 506 652 -319 -1121 12 817 277 -796 -554 790 897 -239 -783 -24 1153
2624 1153 429 -827 -554 617 936 -356 -784 312 733 203 -713 -389 803 699 -433 -890 218
2641 218 966 686 -855 -334 685 849 -259 -790 10 1285 -9 -901 -417 786 952 -511 -1282 279
2659 279 1024 -144 -1018 -678 880 1084 -1084 -1021 421 873 256 -1377 -484 1149 600 -745 -1297 268
2677 268 1940 -308 -1516 -429 1312 1188 -1033 -1460 685 1390 134 -1684 -829 1377 1120 -1107
2693 -1107 -1773 460 1548 130 -2018 -402 1709 988 -1404 -1781 796 1770 -391 -1431 -439 1329
2709 1329 1245 -1135 -1888 724 2172 367 -2228 -772 2621 1634 -1496 -1814 1276 2379 -307 -2135
2725 -2135 -126 1932 1158 -1656 -1814 929 2261 -54 -2121 -797 2674 1565 -2779 -2061 2032 2752
2741 2752 -1051 -3164 464 2830 634 -1906 -1385 1310 2340 -661 -2654 -470 3096 1619 -2958
2756 -2958 -2507 2360 3248 -2013 -3893 213 3724 180 -3344 -1294 2420 2092 -1365 -2858 50 2967
2772 2967 1199 -3058 -2912 2515 3690 -2030 -4470 763 4692 145 -4511 -1202 3737 1820 -2701
2787 -2701 -3050 1133 2824 236 -3170 -1713 2499 3531 -1882 -4628 1114 5079 191 -5541 -1439
2802 -1439 5332 2487 -4387 -2879 2598 3702 -675 -3294 -388 2712 2601 -1806 -3897 1175 5151
2817 5151 451 -5308 -1834 5778 3267 -5011 -3654 4048 4235 -2216 -4100 932 3840 844 -2438
2832 -2438 -2617 1427 4345 89 -4871 -1933 5391 3428 -5094 -4785 4191 5477 -3193 -5647 1716
2847 1716 5177 -110 -4515 -1522 2842 2574 -866 -3994 -881 4294 2683 -4520 -4621 3475 5875
2862 5875 -3277 -6908 1778 6654 -330 -6281 -1027 4878 1952 -3278 -3223 831 3662 1450 -3827
2877 -3827 -3581 3213 5592 -2648 -6821 1192 7259 182 -7385 -1388 6395 2608 -5157 -2943 3078
2892 3078 3912 -443 -3635 -1732 2910 3661 -1902 -5056 613 6521 457 -6664 -1787 6669 3317
2907 3317 -5961 -4022 4575 4264 -2628 -3954 821 3972 1409 -2529 -3418 1235 4739 238 -5704
2922 -5704 -1753 6070 3626 -5502 -4685 4910 5412 -3591 -5540 1759 4940 31 -4142 -1426 2308
2937 2308 2872 -886 -4106 -1193 4413 3007 -4747 -4738 3746 5715 -3302 -6296 1762 5839 -467 -5209
2953 -5209 -982 4145 2247 -2454 -3075 382 3410 1589 -3783 -3301 3101 4615 -1983 -5858 1482
2968 1482 6293 31 -5964 -780 5243 2223 -3837 -2832 2400 2915 -218 -3060 -1346 2815 2846 -1780
2984 -1780 -4456 1112 5406 468 -5572 -898 4991 2365 -4397 -3036 3347 3818 -1680 -3248 225
2999 225 3176 1581 -2288 -2640 1166 3769 155 -4204 -1004 4546 2243 -4069 -3040 3345 3873 -2102
3015 -2102 -3743 1003 3434 269 -2702 -1491 1818 2141 -872 -2861 -828 3214 1541 -3244 -2432
3030 -2432 2687 3318 -2163 -3741 1185 3189 -460 -3333 -967 2721 1778 -1892 -1956 567 2393 452
3046 452 -2515 -1614 2246 2154 -1524 -3168 1104 3024 -291 -3221 -382 2545 1326 -2056 -1630 1396
3062 1396 2071 -275 -2085 -799 1957 1584 -1719 -2026 782 2726 -34 -2760 -382 2519 1346 -2121
3078 -2121 -1746 1718 2058 -852 -1744 -85 2042 794 -1564 -1314 1160 1720 -79 -1976 -208 2158
3094 2158 561 -1647 -950 1449 1619 -1102 -1463 518 1492 228 -1316 -1175 1249 1356 -894 -1260 -86
3111 -86 1530 282 -1689 -801 1245 1177 -916 -1621 468 1586 -156 -1410 -611 1002 726 -908 -1203
3128 -1203 521 1148 85 -1353 -402 1236 616 -832 -1131 627 1041 -566 -1349 -132 898 424 -753
3145 -753 -958 467 809 -233 -1128 -37 1078 768 -903 -621 837 631 15 -1085 118 1102 309
3162 309 -1084 -550 751 1296 -101 -872 116 1028 500 -782 -382 850 945 -400 -802 -31 1023 443
3180 443 -745 -202 588 822 179 -934 180 960 382 -623 -446 578 846 -300 -634 89 809 46
3198 46 -768 -599 630 619 -372 -801 87 941 -125 -911 -598 721 630 -605 -882 242 581 -230 -747
3217 -747 -407 823 472 -546 -812 92 787 16 -1246 -223 952 462 -677 -843 174 726 -240 -1001
3235 -1001 -380 948 799 -731 -832 422 995 -4 -1059 -551 1036 1018 -883 -722 340 1016 137 -1036
3253 -1036 5 1148 796 -725 -979 506 1270 116 -1125 -342 1446 1095 -1256 -878 1002 1271 -324
3270 -324 -1736 -359 1422 486 -986 -945 853 1526 28 -1309 -333 1263 994 -1267 -1603 928 1468
3287 1468 -486 -1740 25 1646 400 -1641 -962 616 1284 -298 -1303 -401 1722 945 -1401 -1580
3303 -1580 986 2029 -844 -2183 264 2085 466 -1665 -1223 1440 1220 -765 -1660 -98 1618 559
3319 559 -1583 -1252 1243 2287 -904 -2655 352 2573 400 -2225 -826 2159 1465 -1530 -1463 757
3335 757 1632 327 -1642 -1084 1385 2036 -669 -2325 420 3244 580 -2648 -1125 2792 1996 -2290
3351 -2290 -2216 1337 2413 -506 -2064 -653 1948 1250 -1096 -2069 70 2980 659 -2859 -1215 3126
3367 3126 2402 -2366 -2892 1958 2923 -1288 -2888 230 2324 1051 -1943 -1443 854 2231 81 -2680
3383 -2680 -1220 2948 2090 -2623 -3069 2011 3627 -1577 -3750 664 3341 331 -2848 -1410 1696
3398 1696 1424 -851 -2216 -606 2574 1877 -2599 -2876 1863 3444 -1328 -4571 797 3925 2 -3753
3414 -3753 -1337 3000 1652 -2260 -2322 650 2298 1080 -2224 -1899 1748 3181 -1221 -3908 226 4479
3430 4479 687 -4548 -1233 4017 2172 -2809 -2379 1877 2693 -507 -2262 -890 1927 2449 -1133 -3001
3446 -3001 73 3971 363 -4444 -1559 4351 2635 -3296 -3177 2506 3507 -1608 -3122 271 2702
3461 2702 976 -1743 -1926 447 2474 479 -3374 -1769 3784 2834 -3543 -3637 2906 3828 -1884 -4263
3477 -4263 789 3715 176 -2715 -1408 1865 1960 -637 -2777 -1213 2915 2461 -2863 -3356 2021 3944
3493 3944 -1682 -4458 798 4257 137 -3878 -1055 2649 1614 -1489 -2400 395 2208 1365 -2203
3508 -2203 -2263 1856 3271 -1293 -4175 298 4405 242 -4389 -832 3396 1758 -2568 -2408 1697 2583
3524 2583 -171 -2023 -891 1718 2331 -1040 -2938 623 3804 574 -3765 -1448 3836 2054 -3017
3539 -3017 -2534 2329 2577 -959 -2566 502 2299 1196 -1436 -1904 800 2675 433 -2997 -1497 3170
3555 3170 2091 -2730 -2504 2176 2807 -1449 -2954 565 2465 380 -2147 -1162 1426 1940 -496 -2303
3571 -2303 -584 2265 1573 -2333 -2271 2326 2700 -1445 -3181 583 3048 -42 -2618 -874 1735 1309
3587 1309 -1491 -2011 222 1864 629 -1980 -1648 1663 2327 -967 -2880 430 3016 230 -2840 -667
3603 -667 2472 1152 -1870 -1411 925 1668 -169 -1611 -669 1380 1355 -1260 -1424 686 2241 60 -2293
3620 -2293 -520 2199 1118 -1849 -1513 1512 1702 -303 -1744 277 1665 912 -880 -1408 999 1745
3636 1745 -254 -1899 -308 1968 989 -1738 -1535 1272 1648 -983 -1422 158 1739 157 -1248 -804
3652 -804 1019 919 -597 -1390 184 1329 553 -1244 -1218 1263 1041 -1037 -1410 269 1261 -117 -1389
3669 -1389 -638 1344 550 -646 -1264 315 1265 95 -1609 -595 819 783 -1109 -1123 646 1070 -147
3686 -147 -1292 -190 871 393 -1088 -885 593 1113 -202 -1301 -167 1048 630 -750 -680 834 1003
3703 1003 -265 -1105 -46 1182 361 -641 -638 597 861 -222 -1148 94 1094 429 -770 -506 757
3720 757 942 -510 -895 376 1048 443 -776 -402 705 705 -433 -644 157 992 98 -1002 -450 691
3738 691 584 -363 -779 285 627 -28 -775 -551 838 448 -403 -595 47 616 147 -973 -495 510 511
3757 511 -585 -594 275 887 -38 -849 -371 641 104 -689 -799 210 610 -165 -836 -512 759 504 -535
3776 -535 -788 664 831 -92 -758 186 706 385 -438 -547 14 801 -293 -884 -139 746 680 -537 -649
3795 -649 425 900 35 -871 -352 1080 169 -862 -376 483 959 -212 -536 141 1109 556 -1019 -793
3813 -793 774 958 -181 -856 -181 913 384 -720 -617 752 594 -236 -1055 -91 924 72 -938 -748
3831 -748 535 981 -648 -1019 111 1106 -16 -1144 -617 791 974 -511 -746 11 1060 292 -1193
3848 -1193 -970 661 980 -457 -1363 225 1117 3 -1139 -382 969 373 -599 -1057 -115 1200 185
3865 185 -1017 -604 804 1030 -651 -1596 127 1835 -53 -1451 -529 1390 912 -1029 -1122 712 1162
3882 1162 169 -1051 -488 1050 1159 -469 -1548 329 1755 207 -2154 -595 1693 1063 -1429 -1121
3898 -1121 1098 1756 -558 -1323 -4 1274 1129 -939 -1094 559 1604 220 -2168 -621 1970 926
3914 926 -1678 -1614 1444 1829 -1050 -1875 514 1706 359 -1519 -999 710 1196 -24 -1490 -855 1833
3931 1833 1225 -2303 -1943 1467 2253 -878 -2578 242 2417 54 -1988 -642 1608 1175 -780 -1309
3947 -1309 89 1528 832 -1548 -1624 1160 2115 -1082 -2710 185 2926 364 -2618 -601 2226 1059
3963 1059 -1416 -1393 927 1688 531 -1160 -1242 1278 2368 -631 -2616 293 3362 322 -2768 -609
3979 -609 2733 1132 -2077 -1535 1761 1938 -513 -1767 -77 1276 1238 -1166 -2087 439 2497 370
3995 370 -2773 -1020 2718 1823 -2596 -2136 1989 2477 -1157 -2358 358 2023 372 -1561 -1518 677
4011 677 1839 82 -2336 -1020 2293 1913 -2570 -2384 2189 2541 -1628 -2778 903 2584 -258 -2412
4027 -2412 -368 1549 1145 -627 -1974 -462 2007 1192 -1953 -2175 2147 2625 -1543 -3201 486 3001
4043 3001 147 -2973 -454 2440 831 -1273 -1287 616 1660 486 -1576 -1342 1257 2410 -1160 -2768
4059 -2768 682 3241 -138 -3129 -598 2974 1190 -2249 -1312 1250 1757 -419 -1631 -302 1397
4074 1397 1319 -983 -2239 570 2845 88 -2982 -713 2985 1315 -2572 -1836 1795 1905 -1035 -2214
4090 -2214 436 1890 506 -1246 -1239 436 1914 -207 -2495 -724 2353 1476 -2373 -2009 1811 1954
4106 1954 -1385 -2202 818 2120 -184 -1839 -558 1103 1214 -564 -1809 -215 1753 810 -1846 -1890
4122 -1890 1924 1792 -1652 -2347 987 2571 -315 -2422 -247 1599 809 -1211 -1471 507 1539 354
4138 354 -1327 -965 1396 1683 -1038 -2204 602 2251 12 -2283 -384 2249 662 -1534 -954 844
4154 844 1456 -260 -1070 -200 1214 1208 -929 -1373 676 1993 -230 -1980 -233 1864 808 -1575 -1137
4171 -1137 1196 1552 -807 -1577 349 1508 558 -855 -971 375 1329 -426 -1635 -274 1823 603
4187 603 -1711 -1180 1552 1116 -937 -1190 477 1327 -26 -998 -437 993 843 -423 -1484 159 1027
4204 1027 416 -1203 -881 1435 1041 -1248 -1385 978 1334 -68 -1136 -426 1001 742 -651 -902 405
4221 405 1098 -254 -1201 -440 1050 858 -773 -1153 413 1234 -214 -1287 -2 1244 335 -755 -540
4238 -540 698 1080 -197 -1180 44 1194 563 -779 -576 494 1106 -435 -1021 96 919 481 -840
4255 -840 -352 922 891 -446 -807 124 997 146 -1124 -301 700 597 -475 -1038 405 1140 295 -670
4273 -670 -257 661 511 -594 -613 322 943 93 -832 -473 797 300 -629 -738 268 790 -271 -969 -239
4292 -239 784 335 -379 -565 233 721 -115 -625 -149 716 415 -789 -684 78 704 -185 -833 -10 598
4311 598 295 -474 -608 529 504 -262 -596 -26 834 306 -826 -525 798 586 -22 -589 28 1000 227
4330 227 -565 -74 449 552 -465 -392 19 580 558 -422 -564 631 708 -126 -746 20 719 222 -682 -187
4350 -187 550 466 -135 -736 324 766 315 -606 -621 410 791 -285 -547 209 1007 152 -748 -331 630 417
4370 417 -454 -772 -184 589 -108 -777 -732 511 226 -564 -740 556 642 8 -811 -221 546 384 -473 -515
4390 -515 161 708 33 -920 -334 509 485 -663 -882 219 856 -63 -646 -297 704 541 -734 -661 246
4409 246 457 -47 -737 -316 1008 602 -329 -805 282 1046 17 -1075 -114 980 696 -795 -681 721
4427 721 816 -345 -425 158 904 688 -709 -796 285 1055 -209 -1225 -241 1392 691 -949 -426 975
4445 975 970 -692 -1073 206 1038 400 -803 -358 374 950 -89 -991 -220 1315 493 -1156 -528 1102
4463 1102 803 -641 -1081 351 1173 192 -619 -645 465 627 -316 -1233 -155 1175 405 -1070 -1251 911
4481 911 1462 -777 -1380 243 1469 -272 -1113 -327 901 248 -571 -610 225 1004 286 -719 -781 944
4499 944 1514 -616 -1409 556 1736 -46 -1503 71 1511 443 -927 -759 800 1051 -269 -908
4515 -908 -342 872 1079 -745 -1189 400 1779 11 -1708 -369 1621 827 -1568 -1092 1118 1140 -564
4532 -564 -973 236 753 444 -696 -772 339 1566 28 -1502 -748 1909 1047 -1646 -1335 1649 1186
4549 1186 -953 -1469 450 998 -150 -845 -566 384 905 -88 -1430 -534 1218 816 -1651 -1248 1470
4566 1470 1417 -1290 -1737 626 1706 -197 -1732 -317 993 511 -542 -1196 17 1256 302 -1191
4582 -1191 -925 1224 1575 -662 -2107 661 2196 -410 -1808 -252 1542 453 -1268 -871 602 831
4598 831 258 -1093 -369 782 1540 -656 -1705 597 1978 -216 -1897 -405 2021 505 -1606 -832
4614 -832 980 1165 -426 -835 -197 827 1042 -555 -945 485 1580 132 -1898 -281 1981 476
4630 476 -1971 -743 1437 1179 -1194 -1298 333 1127 54 -1059 -773 323 1268 -20 -1632 -51
4646 -51 1611 678 -1409 -1429 1415 1087 -1313 -1535 642 1493 -348 -1300 -438 1074 275 -385 -881 -384
4664 -384 1264 244 -1028 -1088 1457 1503 -1192 -1846 750 1593 -180 -1404 -33 1272 377 -894 -679
4681 -679 291 816 354 -973 -269 988 982 -882 -1282 659 1654 -142 -1768 73 1553 318 -1226
4698 -1226 -582 886 873 -425 -666 -122 1183 640 -732 -1021 380 1569 -569 -1600 266 1394 693
4715 693 -1326 -581 1147 753 -854 -904 50 1059 -67 -887 -379 474 872 -356 -1337 144 1381 153
4733 153 -1439 -523 963 658 -1015 -1029 483 684 -13 -538 -472 850 512 -529 -932 314 873 242
4751 242 -1078 -410 1112 981 -947 -1209 781 845 -226 -1078 -91 945 450 -618 -594 216 558 11
4769 11 -770 -73 805 369 -729 -836 481 1000 -258 -1069 -33 992 252 -771 -386 952 647 -52
4787 -52 -904 -153 1234 223 -823 -332 501 954 -510 -837 304 969 80 -657 -275 745 534 -253
4805 -253 -673 225 562 164 -677 -388 756 432 -549 -842 230 750 -65 -531 -346 962 435 -833 -577
4824 -577 288 632 26 -849 -118 728 121 -774 -590 458 434 -218 -731 131 673 27 -406 -848 621 580
4844 580 -423 -617 -65 860 522 -536 -623 379 596 -303 -850 121 704 190 -248 -413 327 364 -346 -509
4864 -509 127 484 51 -506 -226 277 601 -430 -678 65 479 161 -645 -68 637 241 -28 -561 -37 806
4884 806 -56 -617 -355 457 489 -375 -390 194 430 19 -581 -231 309 181 -396 -518 142 563 -183 -685 -60
4905 -60 357 396 -474 -679 479 462 -183 -763 -160 461 -45 -548 -598 297 395 -135 -554 -105 399 286 -397
4926 -397 -438 285 601 -121 -637 59 386 -86 -518 -325 403 440 -296 -455 61 582 287 -513 -507 238 612
4947 612 -236 -716 -32 561 409 -554 -417 571 525 -319 -391 181 378 298 -243 -280 640 577 -212 -579 22 506
4969 506 260 -603 -268 362 462 -558 -518 99 419 -3 -309 -211 484 205 -320 -455 119 753 65 -843
4989 -843 -57 413 145 -442 -593 45 591 27 -542 -204 463 651 -394 -398 226 290 306 -632 -337 742 214
5010 214 -546 -424 338 469 -168 -669 11 199 153 -624 -454 303 475 159 -527 -241 774 460 -581 -491
5030 -491 590 698 -81 -958 110 770 217 -462 -479 280 267 297 -468 26 576 283 -569 -510 384 931 -304
5051 -304 -874 140 988 55 -575 -67 783 427 -175 -485 57 695 194 -268 -614 486 922 -262 -755
5070 -755 37 1163 167 -1056 -612 751 617 -606 -322 159 215 -54 -329 -198 595 499 -319 -828 -225
5089 -225 984 476 -1026 -534 941 696 -802 -553 450 443 -180 -385 -16 496 553 -304 -656 -41 855
5108 855 304 -961 -835 1036 1011 -692 -847 657 1074 -388 -581 109 577 -22 -446 -451 140 617 171
5127 171 -903 -488 810 568 -608 -874 390 1255 -293 -1025 71 1141 97 -864 -42 446 513 -152
5145 -152 -575 124 795 609 -633 -764 799 975 -287 -1309 141 1112 82 -1208 -226 917 613
5162 613 -467 -403 117 570 223 -556 -494 199 972 -359 -1017 42 1201 -188 -1398 -581 1159 610
5180 610 -874 -786 378 509 -167 -356 -358 325 398 -173 -879 -4 870 -111 -1040 -380 1012 679 -1046 -832
5200 -832 886 755 -572 -603 -41 649 472 -637 -683 -149 757 304 -960 -145 910 620 -1043 -1016 889
5219 889 813 -761 -870 548 902 200 -723 -321 300 382 -277 -586 -17 913 646 -796 -836 503 857 -557
5239 -557 -1362 467 1132 -250 -634 -19 781 324 -494 -618 43 537 272 -640 -457 390 533 -248 -852
5258 -852 143 633 -189 -1260 -446 788 204 -976 -613 377 324 -62 -389 -250 807 567 -438 -1001 267
5277 267 844 2 -893 -170 778 344 -894 -319 362 565 -372 -682 187 564 61 -703 -342 392 680 -134
5297 -134 -472 -284 802 261 -806 -391 575 522 -525 -789 214 738 -22 -448 13 373 336 -214 -538
5316 -538 -198 806 347 -655 -330 300 701 -314 -571 345 796 -108 -377 -88 404 450 -294 -251 385 466
5336 466 178 -421 -192 451 514 -278 -474 394 728 -257 -863 28 506 326 -677 -435 21 417 -194 -562
5356 -562 99 506 221 -513 -216 430 811 -312 -538 162 438 102 -296 -76 236 407 -126 -536 -63 354
5376 354 -105 -545 -144 454 374 -194 -595 194 668 7 -325 -141 217 424 -218 -268 238 650 71 -464 -344
5397 -344 356 121 -500 -379 327 496 158 -461 -71 732 411 -299 -222 272 452 -7 -373 50 501 152
5417 152 -553 103 356 549 -176 -692 59 464 192 -143 -431 233 356 -112 -578 94 152 315 -171 -390
5437 -390 363 571 -22 -156 -62 504 151 -96 -90 155 69 -184 -66 -166 237 -202 -177 -63 230 95 -311 -360
5459 -360 289 479 83 -474 -332 258 302 -29 -99 99 391 -20 -308 -11 342 249 -199 -489 -11 493 96
5480 96 -362 -328 369 367 -376 -351 250 309 105 -143 -50 307 141 -147 -191 121 661 -217 -96 118 259 364 -265
5503 -265 -420 330 228 -148 -165 -18 473 207 -305 -666 165 618 91 -376 -29 217 24 -296 -575 398
5523 398 266 125 -223 -34 386 -21 -251 -245 105 -12 -221 -395 -161 456 -38 -234 -401 106 470 -200 39
5544 39 -114 656 -19 -234 -220 486 360 -359 -302 -84 418 -14 -702 -136 561 114 -440 -479 -93 187 36
5565 36 -283 -325 174 76 -114 -598 109 644 217 -464 -105 624 245 -248 -289 376 326 -234 -276 -102 438 222
5587 222 -180 -432 -90 549 28 -255 -241 489 340 -447 -433 154 478 16 -427 150 286 67 -542 -393 -155
5608 -155 390 -10 -648 180 316 108 -234 -549 161 374 -24 -563 69 469 188 -455 -120 491 292 79
5628 79 -253 -166 36 143 -404 -552 248 324 -437 -674 -135 665 47 -603 -272 169 123 -206 -457 53 276
5649 276 170 -270 -210 -60 403 252 -536 -37 652 67 -543 -457 470 231 -378 -224 43 519 22 -411 70
5670 70 349 338 36 -464 59 531 189 -686 -307 479 392 -381 -470 504 747 0 -506 167 307 -13 71 -205
5692 -205 92 446 217 -447 -376 352 544 -509 -705 345 500 -395 -778 176 539 -241 -394 -252 323 177
5712 177 96 -187 -226 141 364 -421 -487 91 545 -22 -560 120 451 124 -560 -195 653 273 -441 -559 143
5733 143 334 183 -421 -477 164 441 -126 -584 26 751 48 -678 238 838 341 -282 -374 224 412 -26 -548
5754 -548 -94 233 -73 -57 -265 -68 568 -112 -507 -115 647 429 -464 -625 479 387 -228 -552 47 398
5774 398 454 -438 -40 126 274 191 -503 -407 602 181 -374 -329 385 480 -376 -468 -57 276 213 -424 -276 112
5796 112 -62 -6 -300 -186 382 302 -510 -263 130 460 -102 -730 242 497 13 -607 -262 441 229 -276 -577
5817 -577 -206 99 414 -554 -446 302 281 -166 -286 114 873 127 -371 -166 511 199 -378 -490 141 363
5837 363 -311 -236 -44 252 282 -494 -395 119 525 151 -460 102 349 345 -398 -421 566 385 116 -428 -298 487
5859 487 244 -499 -329 40 282 179 -455 -217 664 257 -583 -359 208 659 -47 -243 175 277 77 -241
5879 -241 -30 310 272 -121 -622 44 706 12 -507 -235 689 488 -352 -613 200 326 -139 -476 -298 153
5899 153 124 -341 -187 103 37 131 -301 -212 338 2 -91 -120 202 440 -150 -673 85 296 158 -305 -252 319
5921 319 312 -358 -337 -38 437 353 -146 -84 247 227 -116 -358 -82 544 -100 -99 -99 155 241 -143 -192 33 246 101
5945 101 -464 -198 63 231 229 -336 13 253 283 -191 -336 329 242 -213 -415 55 214 113 18 -414 289 328
5967 328 -227 -480 213 243 45 -211 32 241 140 -215 -389 193 402 -163 -130 -58 343 63 -263 -607 104
5988 104 332 4 -138 -52 472 269 42 -228 -360 210 149 -132 -237 86 123 -308 -265 303 333 -233 -414 -81
6010 -81 464 25 -424 -52 149 98 -12 -661 89 336 67 -212 -39 260 270 57 -118 136 223 213 -217 -117
6032 -117 258 320 -43 -350 65 61 -53 35 32 115 405 -3 -157 89 415 64 -207 -301 264 135 -419 -275 202
6055 202 195 39 -70 -81 82 339 -188 -431 15 28 -69 -119 126 221 -111 -506 -75 114 73 66 -179 -40 313
6078 313 3 -221 -373 118 29 107 -345 -45 266 91 -80 -78 521 103 -81 -196 -123 29 193 -456 -239 32
6100 32 207 22 -412 50 368 252 -352 -176 261 282 -244 -270 86 189 127 -306 -228 269 164 -15 -110 -49
6122 -49 351 -168 -214 -219 15 183 49 -293 228 302 -49 -86 -223 470 41 -203 -359 42 156 144 -138 -127 289
6145 289 262 -349 -22 160 148 40 -217 -181 -26 132 -158 -25 -63 274 -182 -346 -187 27 73 -42 -279 -30
6167 -30 323 -124 -353 -92 304 -205 -281 -188 156 -18 146 -241 -227 256 254 -310 -385 -191 97 -109 -297 114
6189 114 311 187 -325 -112 95 302 176 -256 39 35 2 -12 -113 237 296 -119 -241 142 161 -179 -130 -26
6211 -26 310 154 -207 -107 256 75 60 -8 -15 251 142 66 -130 -57 556 247 -611 -517 214 620 -195 -148 180
6234 180 247 -290 -167 62 49 -44 135 -54 145 155 33 -39 -166 325 126 -276 -334 125 467 -161 -257 -94
6256 -94 421 55 -415 -135 172 -17 -166 -319 -135 14 277 -3 -388 123 292 275 -514 103 440 -44 -372
6277 -372 3 210 75 -105 -523 -193 208 485 -137 -395 73 206 163 -302 -198 486 -96 -419 -30 258
6297 258 298 -79 -93 199 122 130 127 -9 -34 225 96 -549 194 315 84 -316 -259 217 94 -286 -149 122 82
6320 82 189 6 -253 152 484 -163 -224 195 289 -57 -268 -72 81 220 -184 -473 112 94 -89 -13 -216 150
6342 150 109 -156 14 -32 492 37 -496 -5 335 425 -446 -423 154 52 80 -154 90 -84 -38 -185 -119 84
6364 84 -135 106 -21 -7 186 334 -269 -308 213 167 27 -162 12 469 287 -83 -136 425 400 -4 -93 44
6386 44 -71 -14 -151 -502 170 231 -184 -417 115 357 19 -225 48 210 289 -272 -88 221 178 -156 15 12
6408 12 166 151 -98 -256 225 145 15 -77 -36 309 227 -265 -147 78 290 -118 -391 -314 287 -8 -59 -493 243
6431 243 86 38 -202 -64 365 -161 -40 -497 294 479 -125 -263 -383 -5 208 -101 100 130 74 170 -340
6452 -340 -152 544 236 -304 -70 236 351 -119 -80 120 317 -113 -110 -73 166 132 -58 -242 164 312 -233 25
6474 25 -206 133 240 -101 -259 -38 554 70 -200 -56 -165 252 -270 -247 71 140 553 -106 -156 349 69
6495 69 -185 -83 133 353 168 -324 276 210 -5 -127 19 -12 174 -123 -93 16 126 166 -305 15 3 144
6517 144 -163 -276 -115 222 48 -386 -61 0 -57 -103 -67 189 22 -135 24 -42 225 273 -118 -296 21 93
6539 93 -17 -386 -245 187 94 31 -251 4 507 -239 -327 -264 207 41 -281 -261 -57 185 285 -142 -238 149
6561 149 -44 171 -388 -216 122 48 -155 -213 435 174 -167 262 -51 248 -55 -261 152 101 -150 -140 -9
6582 -9 209 147 -178 -104 3 248 40 42 -193 58 194 -168 -177 -61 63 302 -281 -156 -46 158 -150 -51 -33
6605 -33 312 -49 -202 0 51 4 -86 -283 -268 399 110 -175 -31 383 282 103 -177 133 351 -24 -85 -127
6627 -127 257 372 101 -162 108 128 -216 -229 -25 77 57 217 -78 -10 125 -85 11 148 27 338 -51 -36
6649 -36 163 74 -18 135 -263 73 258 13 19 285 193 -46 -182 -184 -87 -116 20 -320 63 164 -128 -87 -3 347
6673 347 49 -219 3 -348 93 77 -200 350 151 -173 -27 -20 248 192 -28 -309 -30 -45 3 -294 8 -42
6695 -42 327 103 -246 -271 209 -131 -79 -266 -25 115 -117 -313 -78 211 98 -254 -93 172 213 31 -39 260
6717 260 295 13 -316 -115 -36 161 -245 100 -259 204 51 -166 -73 169 290 -235 -138 181 131 -57 -74 -40
6739 -40 -55 237 -117 -142 127 188 -28 -144 -28 77 408 6 -273 53 364 120 -248 85 160 -49 -288 -117
6761 -117 110 280 -9 -327 -223 39 -193 -230 -142 20 0 -46 -86 -270 50 297 125 -275 -58 266 113 -209
6783 -209 -39 135 -21 -115 313 35 48 -124 -429 7 391 -24 -242 161 308 38 98 -90 41 283 80
6804 80 -197 201 154 149 -34 -178 95 121 102 -113 -103 103 150 211 -429 -302 341 222 -1 277 258 159 37 -133
6828 -133 -64 169 23 -548 262 121 195 -312 -122 147 128 -62 -95 184 283 132 -272 -212 24 184 -37 -20
6850 -20 -55 109 -57 -187 -309 -128 152 88 -241 -10 160 -129 -219 76 273 74 -159 -125 -224 35 47 -377
6872 -377 -106 0 501 125 -345 -189 637 174 -469 -130 75 156 -157 -85 45 260 -174 -261 -16 44 -109
6893 -109 -61 -7 -39 318 57 1 -323 242 194 -136 -61 -23 186 173 -164 -11 262 152 108 -456 29 92 332
6916 332 -158 192 138 65 -12 -175 134 196 -258 -300 -27 84 111 -114 -185 163 -98 -175 -26 -223 152 64 -51
6939 -51 -199 -175 251 76 -319 301 -120 228 -54 -276 45 -88 -31 -228 -141 56 -119 42 -26 10 -77 -231
6961 -231 -147 -16 33 94 -102 -54 127 82 -50 -120 -173 -92 -15 -101 158 294 178 -289 -377 -202 -18 16 -44 -305
6985 -305 -45 240 -266 -174 186 345 -79 -122 -41 181 187 -61 -269 290 116 -24 -103 -104 275 286 -3 -186 15
7008 15 140 10 -139 -36 -86 149 148 -41 -48 -104 56 -55 -259 106 325 -157 -135 155 26 191 -113 -262 230
7031 230 110 -284 -246 177 58 -27 -178 -292 56 81 -235 -92 44 247 47 -228 110 279 -136 -123 -315
7052 -315 55 158 173 97 79 359 -91 -45 -107 101 231 -58 22 86 202 46 -182 -216 318 -83 5 -285 -6
7075 -6 68 -7 -214 -201 225 0 -203 -53 -92 203 148 -138 -369 144 90 -166 -62 -51 284 -138 -72 -192 209
7098 209 -70 -62 -140 311 58 110 90 -240 250 118 116 -327 -23 -55 -9 -376 -169 51 273 158 69 -135 7
7121 7 81 -319 -154 180 37 -214 -154 -10 20 56 -99 -86 246 -215 -185 -197 349 -47 -90 -157 -77 293 -103 -194
7145 -194 -73 38 40 -179 -187 61 -26 107 -87 -141 298 348 141 74 257 125 181 -90 -113 70 104 -105 188 27
7169 27 119 -205 61 -140 121 74 -297 -54 -199 139 297 -205 -239 177 252 -174 -306 46 22 -232 -46 42
7191 42 -189 175 60 -50 -114 6 -52 60 244 289 -91 85 24 9 40 38 194 -116 125 42 -198 -89 45
7214 45 319 182 -225 -80 -72 251 -189 -36 -115 186 -192 -133 -221 135 96 -135 -178 16 82 44 -210 -256 194 37
7238 37 148 -169 -167 -36 -219 -79 16 322 152 -22 -9 83 262 54 -256 -51 176 249 -91 -339 20 -49 -77
7261 -77 -230 25 323 -42 -274 -308 165 7 34 -52 -170 252 201 -361 -228 -295 204 -165 -360 410 220 -170
7283 -170 -403 188 -139 45 -69 -118 77 110 -217 31 2 132 159 -151 -387 24 258 110 -170 -16 260
7304 260 -218 69 -97 49 238 -182 46 -188 334 -80 -147 -194 213 266 206 -229 -123 -26 -260 3 -105 140
7326 140 -159 -35 -22 0 2 241 21 -54 -182 85 35 -246 -21 68 152 -283 -23 -92 263 261 48 115 321 -69
7350 -69 122 -110 -91 45 -133 -57 179 -46 261 -393 -211 -83 289 -116 -169 164 158 -100 -146 -252 113 237
7372 237 63 102 184 65 194 -216 -64 -9 330 298 -186 142 244 105 -169 -62 55 17 -64 -211 -9 335
7394 335 -160 -113 33 20 376 -78 -275 -167 -195 -209 -167 158 75 -6 -186 37 256 183 68 -194 41 122 133
7417 133 -255 18 157 148 139 -41 -406 9 -123 101 -89 62 137 -246 -291 278 -1 6 -8 -97 -179 1 66 35
7441 35 -9 56 168 -207 -226 5 90 -71 -179 204 259 80 -22 -295 34 272 -197 -117 -82 108 9 -70 -339
7464 -339 13 151 -337 81 69 216 -144 -225 -224 125 42 -11 -193 105 54 -115 -351 -181 81 321 -173 -125 107
7487 107 -76 120 -127 -98 300 -67 75 -53 64 233 -115 -294 31 24 -63 -262 -214 -291 -24 -138 19 -265
7509 -265 292 200 -127 -233 14 164 -119 -282 -119 167 88 -227 -253 237 77 34 -122 -52 336 5 -60 -39
7531 -39 131 226 -135 319 -54 49 94 -184 -120 -100 117 -95 -247 -50 278 41 -207 -13 62 391 -67 -158
7553 -158 224 355 -243 -438 80 77 18 -88 11 77 313 -9 -36 61 119 60 26 -51 147 181 73 -182 -199 150
7577 150 2 -178 -117 -384 126 2 -268 -156 156 309 150 -64 46 65 20 -331 -138 86 43 -25 -166 -36
7599 -36 116 114 -78 237 173 -149 -155 123 161 178 -169 -243 -26 16 -61 125 -429 -264 133 104 -162 -294 188 -256
7623 -256 -87 9 107 90 176 -262 50 176 87 -119 -28 -148 53 -9 -237 38 291 260 -4 -122 2 394 -33
7646 -33 150 -118 201 22 -199 -50 -97 -28 -209 -286 -189 197 4 -26 102 125 272 20 -343 -87 223 -56
7668 -56 -219 -359 -152 8 -83 -14 -14 137 55 -206 -180 -174 8 -143 -161 -125 33 -87 -219 -96 16 16 -158 -462
7692 -462 -148 -60 -301 -51 -164 -1 157 -124 -14 -119 112 14 -116 -88 112 130 -153 -112 139 198 19 -112
7714 -112 -226 152 86 56 -80 198 163 -54 -117 -41 139 -7 -179 -221 11 -6 -25 55 -6 88 189 -87 -96 86
7738 86 231 208 120 21 -6 158 -6 -8 109 212 37 -224 -39 214 219 -127 -222 -77 349 -136 86 -44 310
7761 310 293 -192 -244 -5 -118 -204 -145 -212 287 -25 53 -63 61 8 -151 12 -86 -120 172 -189 -150 4 184
7784 184 17 -109 59 14 67 -287 -33 284 26 -81 -131 73 -100 -92 -29 21 65 -20 -90 -3 111 43 -259 -88
7808 -88 -62 -195 75 -104 -99 -39 259 221 -170 183 268 288 -69 -157 175 5 -197 -187 41 315 22 -58 42 157
7832 157 106 81 -408 -108 394 -125 -217 -156 162 237 175 -58 80 5 81 -194 11 103 -185 -435 51 -105 128
7855 128 -141 6 -77 -304 -60 -143 8 -66 217 -224 -256 90 148 -3 -185 30 50 -245 275 271 -98 18 158
7878 158 -5 -147 25 297 -83 -13 127 246 176 47 -106 253 182 100 -250 -68 178 90 94 -183 60 27 -113
7901 -113 114 2 230 66 -8 -201 -21 294 39 -18 146 471 -88 -27 -2 153 -172 -150 58 -100 270 -8
7923 -8 36 -71 -6 177 -121 -191 -117 81 -72 -6 -111 -49 283 -87 -108 -199 66 -41 -334 -166 153 224 91 -167
7947 -167 104 57 26 -91 -118 341 57 168 -34 33 86 -9 -78 -197 347 99 -38 -286 -48 5 -39 -319 -47
7970 -47 130 -261 -302 -255 -64 108 -4 -168 -471 240 72 24 120 81 127 42 -274 -132 141 -1 -84 90 158
7993 158 317 16 59 92 29 142 -188 -117 -71 -35 -37 -138 -66 65 41 -251 -192 199 67 -147 -256 157 -67 -74
8017 -74 -453 -6 -7 116 116 -217 -5 -2 -35 99 -148 324 58 265 -125 116 427 201 -211 -207 393 248 -333
8040 -333 -106 -101 160 -37 -204 -30 -96 263 -238 -20 -355 17 4 -107 -272 -12 -27 -157 -308 -117 162 362
8062 362 -76 -3 343 -56 187 46 -65 120 2 -106 -126 213 433 213 -4 -119 329 62 -92 120 221
8083 221 27 -163 -47 133 -80 -278 -219 -128 -138 177 -278 -152 173 196 10 89 -115 294 -260 -7 -95 108
8105 108 154 -194 -295 177 345 170 -151 -156 206 147 -156 -105 -216 98 68 -47 21 -44 180 -28 -122 -235 114
8128 114 -33 -10 -253 -124 117 -17 -224 37 201 2 -6 9 134 75 -203 -342 -109 8 -30 -46 -80 16 -16
8151 -16 -86 -229 -224 238 416 -248 -7 6 41 -265 -61 112 168 117 -88 36 -3 30 -9 73 -204 120 -133 -114
8175 -114 -78 270 273 32 -191 210 368 191 43 36 216 -100 -446 -323 -11 247
8191B47
##END NTUPLES=NMR FID
##END=
