##TITLE=1H_Gl u Cl2
 CCl4, 8 sc, 
 22.9.2020
##JCAMPDX= 6.0         $$ Bruker NMR JCAMP-DX V2.0
##DATA TYPE= NMR FID
##DATA CLASS= NTUPLES
##ORIGIN= UXNMR, Bruker Analytische Messtechnik GmbH
##OWNER= root
$$ XWIN-NMR		Version 3.5
$$ Tue Sep 22 13:02:59 2020 Russian Standard Time (UT+4h)  she@DPX200
##.OBSERVE FREQUENCY= 200.1315066352
##.OBSERVE NUCLEUS= ^1H
##.DELAY= (6, 6)
##.ACQUISITION MODE= SIMULTANEOUS
##.ACQUISITION SCHEME= undefined
##.AVERAGES= 8
##.DIGITISER RES= 18
##SPECTROMETER/DATA SYSTEM= spect
##.PULSE SEQUENCE= zg30
##.SOLVENT NAME= CDCl3
##.SHIFT REFERENCE= (INTERNAL, CDCl3, 0, 15.7039)
##AUDIT TRAIL= $$ (NUMBER, WHEN, WHO, WHERE, WHAT)
$$ ##TITLE= Audit trail, XWIN-NMR		Version 3.5
$$ ##JCAMPDX= 5.01
$$ ##ORIGIN= Bruker BioSpin GmbH
$$ ##OWNER= she
$$ F:/spectra/data/she/nmr/H-F/1/audita.txt
$$ ##AUDIT TRAIL=  $$ (NUMBER, WHEN, WHO, WHERE, WHAT)
(   1,<2020-09-22 13:02:01.67 +0400>,<she>,<DPX200>,
      <created by zg, POWCHK disabled, PULCHK disabled
       configuration hash MD5:
       00 E9 B6 7A A2 85 ED C7 34 08 36 98 17 FE 4E 26
       data hash MD5: 16K
       68 D3 8D A1 10 84 CF E2 7F E3 53 4A A9 B6 F2 83>)
$$ ##END=
$$ 
$$ hash MD5
$$ 6E F9 97 09 11 3E 43 39 38 D2 07 93 38 4E FC 5C
##$RELAX= 
##$RELAX= 
##$RELAX= 
##$RELAX= 
##$RELAX= 
##$RELAX= 
$$ Bruker specific parameters
$$ --------------------------
##$DU= <F:/spectra>
##$EXPNO= 1
##$NAME= <H-F>
##$PROCNO= 1
##$TYPE= <nmr>
##$USER= <she>
##$AMP= (0..31)
100 100 100 100 100 100 100 100 100 100 100 100 100 100 100 100 100 100 
100 100 100 100 100 100 100 100 100 100 100 100 100 100 
##$AQSEQ= 0
##$AQ_mod= 1
##$AUNM= <au_zg>
##$AUTOPOS= <>
##$BF1= 200.13
##$BF2= 200.13
##$BF3= 200.13
##$BF4= 200.13
##$BF5= 200.13
##$BF6= 200.13
##$BF7= 200.13
##$BF8= 200.13
##$BYTORDA= 1
##$CFDGTYP= 0
##$CFRGTYP= 5
##$CHEMSTR= <none>
##$CNST= (0..31)
1 1 145 1 1 1 1 1 1 1 1 1 1 1 1 1 1 1 1 1 1 1 1 1 1 1 1 1 1 1 1 1 
##$CPDPRG= <>
##$CPDPRG1= <>
##$CPDPRG2= <>
##$CPDPRG3= <>
##$CPDPRG4= <mlev>
##$CPDPRG5= <mlev>
##$CPDPRG6= <mlev>
##$CPDPRG7= <mlev>
##$CPDPRG8= <mlev>
##$CPDPRGB= <>
##$CPDPRGT= <>
##$D= (0..31)
0 1.2 0 0 0 0 0 0 0 0.06 0 0.03 0 0 0 0 0.0002 0 0 0 0 0 0 0 0 0 0 0 0 
0 0 0 
##$DATE= 1600765321
##$DBL= (0..7)
120 120 120 120 120 120 120 120 
##$DBP= (0..7)
150 150 150 150 150 150 150 150 
##$DBP07= 0
##$DBPNAM0= <>
##$DBPNAM1= <>
##$DBPNAM2= <>
##$DBPNAM3= <>
##$DBPNAM4= <>
##$DBPNAM5= <>
##$DBPNAM6= <>
##$DBPNAM7= <>
##$DBPOAL= (0..7)
0.5 0.5 0.5 0.5 0.5 0.5 0.5 0.5 
##$DBPOFFS= (0..7)
0 0 0 0 0 0 0 0 
##$DE= 6
##$DECBNUC= <off>
##$DECIM= 32
##$DECNUC= <off>
##$DECSTAT= 4
##$DIGMOD= 1
##$DIGTYP= 9
##$DL= (0..7)
0 120 120 120 120 120 120 120 
##$DP= (0..7)
150 150 150 150 150 150 150 150 
##$DP07= 0
##$DPNAME0= <>
##$DPNAME1= <>
##$DPNAME2= <>
##$DPNAME3= <>
##$DPNAME4= <>
##$DPNAME5= <>
##$DPNAME6= <>
##$DPNAME7= <>
##$DPOAL= (0..7)
0.5 0.5 0.5 0.5 0.5 0.5 0.5 0.5 
##$DPOFFS= (0..7)
0 0 0 0 0 0 0 0 
##$DQDMODE= 0
##$DR= 18
##$DS= 0
##$DSLIST= <SSSSSSSSSSSSSSS>
$$ [...]
##$SUBNAM2= <"">
##$SUBNAM3= <"">
##$SUBNAM4= <"">
##$SUBNAM5= <"">
##$SUBNAM6= <"">
##$SUBNAM7= <"">
##$SUBNAM8= <"">
##$SUBNAM9= <"">
##$SW= 16.880792210976
##$SWIBOX= (0..15)
0 0 2 0 0 0 0 0 0 0 0 0 0 0 0 0 
##$SW_h= 3378.37837837838
##$TD= 16384
##$TD0= 1
##$TE= 0
##$TE2= 300
##$TE3= 300
##$TEG= 300
##$TL= (0..7)
0 120 120 120 120 120 120 120 
##$TP= (0..7)
150 150 150 150 150 150 150 150 
##$TP07= 0
##$TPNAME0= <>
##$TPNAME1= <>
##$TPNAME2= <>
##$TPNAME3= <>
##$TPNAME4= <>
##$TPNAME5= <>
##$TPNAME6= <>
##$TPNAME7= <>
##$TPOAL= (0..7)
0.5 0.5 0.5 0.5 0.5 0.5 0.5 0.5 
##$TPOFFS= (0..7)
0 0 0 0 0 0 0 0 
##$TUNHIN= 0
##$TUNHOUT= 0
##$TUNXOUT= 0
##$USERA1= <user>
##$USERA2= <user>
##$USERA3= <user>
##$USERA4= <user>
##$USERA5= <user>
##$V9= 5
##$VALIST= <valist>
##$VCLIST= <CCCCCCCCCCCCCCC>
##$VD= 0
##$VDLIST= <DDDDDDDDDDDDDDD>
##$VPLIST= <PPPPPPPPPPPPPPP>
##$VTLIST= <TTTTTTTTTTTTTTT>
##$WBST= 1024
##$WBSW= 4
##$XGAIN= (0..3)
0 0 0 0 
##$XL= 0
##$YL= 0
##$YMAX_a= 400931
##$YMIN_a= -313353
##$ZGOPTNS= <>
##$ZL1= 120
##$ZL2= 120
##$ZL3= 120
##$ZL4= 120
##$ABSF1= 10
##$ABSF2= 0
##$ABSG= 5
##$ABSL= 3
##$ALPHA= 0
##$AQORDER= 0
##$ASSFAC= 0
##$ASSFACI= 0
##$ASSFACX= 0
##$ASSWID= 0
##$AUNMP= <proc_1d>
##$AZFE= 0.1
##$AZFW= 0.1
##$BCFW= 1
##$BC_mod= 2
##$BYTORDP= 1
##$COROFFS= 0
##$CY= 11.3945322036743
##$DATMOD= 1
##$DC= 2
##$DFILT= <>
##$DTYPP= 0
##$F1P= 16.9975609425685
##$F2P= -3.02152046262296
##$FCOR= 0.5
##$FTSIZE= 0
##$FT_mod= 4
##$GAMMA= 1
##$GB= 0.15
##$INTBC= 1
##$INTSCL= 1
##$ISEN= 128
##$LB= 0.24
##$LEV0= 0
##$LPBIN= 0
##$MAXI= 10000
##$MC2= 0
##$MEAN= 0
##$ME_mod= 0
##$MI= 1.114404
##$NCOEF= 0
##$NC_proc= 0
##$NLEV= 6
##$NOISF1= 3.799351
##$NOISF2= 2.8
##$NSP= 1
##$NTH_PI= 0
##$NZP= 0
##$OFFSET= 15.70392
##$PC= 1
##$PHC0= -9967.896
##$PHC1= 10.6009
##$PH_mod= 1
##$PKNL= yes
##$PPARMOD= 0
##$PSCAL= 0
##$PSIGN= 0
##$REVERSE= no
##$SF= 200.130013532006
##$SI= 16384
##$SIGF1= 3
##$SIGF2= 2
##$SINO= 400
##$SIOLD= 16384
##$SREGLST= <1H.CDCl3>
##$SSB= 0
##$STSI= 0
##$STSR= 0
##$SW_p= 3612.71676300578
##$SYMM= 0
##$S_DEV= 0
##$TDeff= 0
##$TDoff= 0
##$TI= <>
##$TILT= no
##$TM1= 0
##$TM2= 0
##$TOPLEV= 0
##$USERP1= <user>
##$USERP2= <user>
##$USERP3= <user>
##$USERP4= <user>
##$USERP5= <user>
##$WDW= 1
##$XDIM= 8192
##$YMAX_p= 0
##$YMIN_p= 0
$$ End of Bruker specific parameters
$$ ---------------------------------
##NTUPLES= NMR FID
##VAR_NAME=  TIME,          FID/REAL,        FID/IMAG
##SYMBOL=    X,             R,               I
##VAR_TYPE=  INDEPENDENT,   DEPENDENT,       DEPENDENT
##VAR_FORM=  AFFN,          ASDF,            ASDF
##VAR_DIM=   8192,          8192,            8192
##UNITS=     SECONDS,       ARBITRARY UNITS, ARBITRARY UNITS
##FACTOR=    0.000296,      1,               1
##FIRST=     0,             0,               0
##LAST=      2.424536,      0,               0
##MIN=       0,             -313353,         0
##MAX=       2.424536,      400931,          0
$$ Real data points
##PAGE= N=1
##DATA TABLE= (X++(R..R)), XYDATA
$$ [...]
1745E4J0J0J1M1l32L31j64j83M79n58L02L24m41P5K71k58J2J68k17J8j00M1K17
$$ 54 64 74 85 126 -206 125 -39 -222 257 -301 1 325 -116 -41 230 -28 -16 152 -65 -47 -147 -106 111
1768A11j92K12K93k14k71q7K92k5J98m13J59j62o5L75k29K43l54Nq7K36k49J58
$$ 111 -81 131 424 210 -61 -148 144 119 317 -96 63 -99 -164 211 -18 225 -129 -124 -211 25 -224 -66
1790f6%R3j67K09k52J70p0o6J69j27j51M85k81m6L14k69l95P47l52k54L99j73
$$ -66 -66 27 -140 69 -183 -13 -83 -149 20 -107 -258 227 -54 -100 214 -55 -450 297 -55 -309 90 -83
1812h3J84N5j26r6K06p4Q8j39j50M8J80k8M01l73j04K42m83P8L69l40M8K96o32
$$ -83 101 156 30 -66 140 66 154 15 -135 -87 93 65 466 93 -11 231 -252 -174 195 -145 -97 199 -433
1835d33O38j75m01M74j59j31L93k13J55k1n25N87J46o01L92J2l29L55q3l00O23
$$ -433 205 30 -371 103 -56 -187 206 -7 148 127 -398 189 335 -266 126 138 -191 164 81 -219 404
1856D04n13N5K62o23L32L43m10M1L66p94Q89k93m27M92j55j39J90j30pN95p88
$$ 404 -109 -54 208 -415 -83 260 -150 -109 257 -537 352 59 -368 124 -31 -170 20 -110 -117 478 -310
1877c10R3M35o74P55P9o98O53l77k17N82m44l7M24j40l36P30o44J96N49o95J92
$$ -310 -217 218 -456 299 378 -320 333 -44 -261 321 -123 -160 264 124 -212 518 -126 70 619 -76 116
1898A16K99q74Q46j93n81O32k96m52R81n52o4N11q64M35O97j025N08L29j090P94
$$ 116 415 -459 387 194 -387 245 -51 -503 478 -74 -138 373 -491 -56 641 -384 124 453 -637 157
1918A57R2n54Q02n19k24P88o43r8N81p13L33M55q41N51L40r11O90k8n71Q37m75
$$ 157 249 -305 497 -22 -246 542 -101 -199 382 -331 2 457 -384 167 507 -404 286 258 -313 524 49
1939D9k71P52p40k05P99p14J90O05q77O86J93r85R02l21q44J356p95J00M82q82
$$ 49 -222 530 -210 -415 384 -330 -140 465 -412 274 467 -518 384 63 -781 575 -220 -120 362 -520
1959e20J42Q80q65J31Q37r70N24n1o93R66j92m65Q15o48m54R71p86M18O11j099
$$ -520 -378 502 -363 -232 605 -365 159 108 -585 381 189 -276 539 -109 -563 408 -378 40 651 -448
1979d48K58N22q95Q87P1r57R76l79n58J083p16L4P10q73J75M94o58L03M33q06
$$ -448 -190 332 -563 324 395 -562 414 35 -523 560 -156 -122 588 -285 -110 384 -274 29 462 -344
1999c44N92R3p87P39k56n39Q95m18j48P61q08M04L35o95J13R4o29O77K38q35Q24
$$ -344 248 341 -446 293 37 -502 393 -25 -173 588 -220 184 519 -176 -63 31 -598 79 317 -518 306
2020C06j88q05J175q77L10N82p62K78K74p67N71K00r12Q00M1n72N68j75k54P51
$$ 306 118 -687 488 -389 -79 503 -259 19 293 -474 97 297 -615 185 226 -346 222 47 -207 544
2040E44p60J94O02o06K29O0q98N59M11n88L74Q5n46P58l82j92O18o96J73O30r06
$$ 544 -216 -22 580 -26 203 263 -635 -76 335 -253 121 206 -340 418 36 -156 462 -234 -61 569 -337
2061c37L48K82n46L39J64o95P94j74m11L97k87j21O58l42j74M82o37K42K81o34
$$ -337 11 293 -253 86 250 -445 349 175 -236 161 -126 -247 411 69 -105 377 -260 -18 263 -371
2081c71L42M66m30J23k0p4K6m42J87N16m58k2L47o90N57K66o42P27l59l68N41
$$ -371 -29 437 7 130 110 36 62 -380 -193 323 -135 -157 190 -500 57 323 -319 408 49 -319 222
2102B22j26l88J50L60m73P18q33K36L88n23K30O3l72M03n8k79L25J43l87N06m59
$$ 222 96 -292 -142 218 -255 463 -370 -134 254 -269 -39 24 -348 55 -3 -282 43 186 -201 305 -154
2123a54o5L77j93J3K98o08K02L94m83L17O2k67M19l49j34M36l65Q1Q3K7k47J10
$$ -154 -219 158 -35 -22 276 -332 -130 264 -219 98 160 -107 312 -37 -171 265 -100 -19 64 91 -156 -46
2145d6j96M98L2m06J7L81l94K96l04r1K38n2L0J18k27j03L87l29M51l34j49K07
$$ -46 -242 256 288 -118 -101 280 -114 182 -122 -213 25 -27 3 121 -106 -209 178 -151 300 -34 -183 24
2167B4lq4j54J25j05J90j28J51J73q2j77J78k22K51n4j37K89k56j57K47j60k01
$$ 24 21 -63 -217 -92 -197 -7 -135 16 189 107 -70 108 -114 137 83 -54 235 -21 -178 69 -91 -292
2189b92L78N9j91j17l9K54J93m12R8oj49J91J47k6L96n14k14J6J48n2J34j15L12
$$ -292 86 145 -46 -163 -202 52 245 -167 -69 -75 -224 -33 114 88 484 -30 -244 -228 -80 -132 2 -113 199
2212A99j52l19L23K9l51j9O59m74p0J44R2N7k35K09K05l12R7O5j27m9j58J91J27
$$ 199 47 -272 51 80 -271 -290 369 -105 -175 -31 61 118 -117 92 297 -15 82 147 20 -29 -187 4 131
2235A31k13J63J75k76m1K05m29L26K52l28J49j86pj14J79j25K25n4O7j40j15j1
$$ 131 -82 81 256 -20 -61 144 -285 41 293 -35 114 -72 -79 -193 -14 -139 86 32 99 -41 -156 -167
2257a67K13k15l0K59j14k5N3J37j10j51R2J91k56p7L44n4k31J11j32J56j52M2
$$ -167 46 -169 -199 60 -54 -79 -26 111 1 -150 -58 133 -123 -200 144 90 -141 -30 -162 -6 -158 -116
2279a16K0K22j42K96l73R8N1j17J04J58k35q9J92j06K17L4k13J25j79j56J90J12
$$ -116 -96 126 -16 280 -93 5 56 -61 43 201 -34 -123 69 -37 180 214 1 126 -53 -209 -19 93
2301I3j7J21j68m9R8q0p4L89l39o9Q9LJ09j63j13j5R6j02N0k4j2K04J12r1M6j07
$$ 93 76 197 29 -20 78 -2 -76 313 -26 -95 -6 -3 106 -57 -170 -185 -89 -191 -141 -165 -177 27 139 48 94 -13
2327a3mO5N0j23M8l18L42J54m44K83P6l2L0j80l4N35n46m9J74j55J83p8o3J11
$$ -13 -17 48 98 -25 23 -295 47 201 -243 40 116 84 114 -66 -100 435 -111 -160 14 -141 42 -36 -99 12
2351A2j66j43N28j89k11K49j77j24M66l27K59N9l65n6K65l66L70k00l9K56j32
$$ 12 -154 -297 231 42 -169 80 -97 -221 245 -82 177 236 -129 -185 80 -286 84 -116 -155 101 -31
2372c1q5J64j53ln0q5L02N9l65L02j32j51L36O2k08L29j92k73L91l10O7M02o51
$$ -31 -116 48 -105 -108 -158 -243 59 118 -247 55 -77 -228 108 170 -38 291 99 -174 217 -93 -26 376 -275
2395b75J59M22m05L61m33J60J41k07l45P09k44k96M42k77JL61n24q0M89j47J9
$$ -275 -116 306 -99 262 -171 -11 130 -77 -422 287 43 -253 189 -88 -87 274 -250 -330 159 12 31
2416C1J63m37L00M4k69M25j43k23M50n41j7L87l26J44K30l92K91J8k76N94p21
$$ 31 194 -243 57 101 -168 257 114 -109 341 -200 -217 170 -156 -12 218 -174 117 135 -141 453 -268
2437b68J43L26j75m8J06k81N6N22o76K96J23m90L19J52l00N04k04k89L93m64J73
$$ -268 -125 201 26 -22 84 -197 -141 381 -295 1 124 -366 -47 105 -195 309 105 -184 209 -255 -82
2458h2M01k80j8J58o28J99L47m49N18j86j47M78l34k2J39k2n2K73l80J82J50n59
$$ -82 319 39 21 179 -449 -250 97 -352 166 -20 -167 311 -23 -45 94 72 20 293 -87 95 245 -314
2480c14J40L98m01J87J90p66P21j73k77O47m69J4N08n54K20J56k56l1K02m31K64
$$ -314 -174 224 -177 10 200 -566 155 -18 -295 352 -117 -103 405 -149 71 227 -29 -60 142 -289 -25
2501b5Ql60P36n17j27M86j06k61L16j57K55P0n07L32N2j99L01m25Q6K25k31N3
$$ -25 -17 -377 359 -158 -285 201 95 -166 150 -7 248 318 -189 143 195 -4 297 -128 -42 183 -48 5
2523EJ74l35r4M33k78K31K8m22L63J16l65K96j31m04N95j84l3L93l39M1M5l83
$$ 5 179 -156 -250 183 -95 136 164 -258 105 221 -144 152 21 -383 212 28 -5 388 49 90 135 -248
2545b48J90K73m07K36o4l44N65j17k75J35K18j93L34m45m8L05k89K08L36m17m9
$$ -248 -58 215 -192 44 -20 -364 201 84 -191 -56 162 -31 303 -142 -190 115 -174 34 370 -47 -96
2566i6M2O1J55k61K50l0Q1j89K01k69J79J38n08K58O6j78N06l82M5J15k00L8j4
$$ -96 -54 7 162 -99 151 121 202 13 214 -55 124 262 -246 12 78 -100 406 24 69 184 -16 22 8
2589Hj16j11L14k69K36P7l90M69j25j68K39K1j41j5j8j58N6r5M6LJ21J51k7k51
$$ 8 -108 -219 95 -174 62 139 -251 218 93 -75 164 185 44 29 11 -147 -91 -186 -140 -137 -16 135 108 -143
2613a43J21R2j73N3q9K07j66L57l14m3K25l48J16j07J55m0J44J36k84q2L70j33
$$ -143 -22 70 -103 -50 -139 68 -98 259 -55 -98 127 -221 -105 -212 -57 -97 47 183 -101 -183 187 54
2635E4j46J47r7J6J70j54K10k23J52J14Lk65O3l1n7K81l68K39p3j05J46n6kP2
$$ 54 -92 55 -42 -26 144 -10 200 -23 129 243 246 -19 44 13 -44 237 -131 108 35 -70 76 20 18 90
2659I0j46K1K52J8l04J44k01j7J20k17J16J79K5k23K72l40N44k98k8k04K03k33
$$ 90 -56 -35 217 235 -69 75 -126 -143 -23 -240 -124 55 80 -143 129 -211 333 35 7 -197 6 -227
2681b27J80j00J33J98j90L2J22k7j94M2N8M6l11O3J29J93p4J4K86m57J34r2q2
$$ -227 -47 -147 -14 184 -6 26 148 121 -73 -31 27 73 -238 -175 -46 147 73 87 373 -84 50 -42 -124
2704a24j03L19j37k23K23J43j14j8o4p5J48n5Q4P0j01L2P6Nk12K48j47j26j1J42
$$ -124 -227 92 -45 -268 -45 98 -16 -34 -98 -173 -25 -80 4 74 -27 5 81 86 -126 122 -25 -151 -162 -20
2728b0K76l02j74K05K9m3Q8r0L6j64K65j94J27j10k0j08N3L02Ql84K50k06K57
$$ -20 256 -46 -220 -15 14 -29 59 -31 5 -159 106 -88 39 -71 -91 -199 -146 156 164 -220 30 -176 81
2751H1K8O3n43K94J39o6J01J09k44j20L33j12j74lJ05M9p1L4K0k13J10O8r5N05
$$ 81 109 172 -371 -77 62 -4 97 206 -38 -158 175 63 -111 -114 -9 40 -31 3 23 -190 -80 -12 -107 398
2775C98l15j55K06l52J7O7r2J05K5J0L13k18l6m2Q0L9j45j81M33k19Q4m4ro6j54
$$ 398 83 -72 134 -218 -201 -134 -226 -121 -96 -86 227 9 -27 -69 11 50 -95 -276 157 -62 22 -22 -31 -97 -251
2800b51M98j50n6j03k17N15k06P8j13rp1J57J5k14K9L23k53J50j37k0J61J2k11
$$ -251 247 97 41 -62 -279 236 30 108 -5 -14 -85 72 87 -127 -98 225 -28 122 -15 -35 126 138 -73
2823g3P3Nj2P6K22k54R6l74J48K83n67J96K60j25K2l1o6K62j21QK45l25J30q4
$$ -73 0 5 -7 69 291 37 133 -241 -93 190 -377 -181 79 -46 -24 -55 -121 141 20 28 273 -52 78 -6
2847fk16L34o5l65K19J12p9L6j35K29j15J73m9K3j34M8q3J17k30J10m2Q1q9J58
$$ -6 -222 112 47 -318 -99 13 -66 -30 -165 64 -51 122 73 96 -38 10 -73 44 -186 -76 -118 -37 -126 32
2871C2p4R4j7J69l58K19p6L7M7l7o2Q0j64k5M34k68k23L20l11K14J6j93J04J89
$$ 32 -42 52 35 204 -154 65 -11 26 73 36 -26 54 -110 -135 299 31 -192 128 -183 31 47 -146 -42 147
2895A47k21K13j64o3J91j01Q8k60R2L7N4j44R5R0J27k42O3k53K64Q4k48P5K13
$$ 147 -74 139 -25 -88 103 2 90 -170 -78 -41 13 -131 -36 54 181 -61 2 -251 13 97 -151 -76 137
2918A37k15K71k50j03K37k33K83J14m03P3L7kM62n04O0J80K2k44K18m73L87j19
$$ 137 -78 193 -57 -160 77 -156 127 241 -162 -89 -52 -54 408 -96 -36 144 166 -78 140 -333 54 -65
2940f5j0q1J38o0m8J86K7j4k50N8m0K73L7j87j44O4M02p1k18K9j50J63j31Q9j68
$$ -65 -75 -156 -18 -78 -126 60 87 73 -177 -119 -159 114 151 -36 -180 -116 286 215 -3 26 -124 39 -92 -3 -171
2965a71L28k16J37o6j05L07k72o2J68N0k97L04j00J8N8j33L73m69R9K11j73j68
$$ -171 157 -59 78 12 -93 214 -58 -120 48 98 -199 105 5 23 81 -52 321 -148 -49 162 -11 -179
2987a79K42J42j38j16n8Q4N4p3K15K7k25J26k07j01J87mj27j0J20J36j92JO1n3
$$ -179 63 205 67 -49 -107 -23 31 -42 173 200 -25 101 -106 -207 -20 -24 -151 -161 -41 95 -97 -96 -35 -88
3011h8j25L98j48k19j7K41p8K02j73J58J38o93N46j96j24R2jO7J23r3j63J32J7
$$ -88 -213 185 37 -182 -199 42 -36 166 -7 151 289 -404 142 -54 -178 -86 -87 -20 103 10 -153 -21 -4
3034dM9J0l9m57M31j99L46N5j38k03n1K80l37J68J86J60q0r2K2m8q2j16K19j81
$$ -4 45 55 16 -441 -10 -209 137 192 54 -149 -200 80 -257 -89 97 257 177 85 107 59 -23 -139 80 -101
3058a01J78k33J36J21k8j54p8K60q7j64K84n5q4N8j58j55K91l1r3j09N12l03j18
$$ -101 77 -156 -20 101 73 -81 -159 101 14 -150 134 79 -5 53 -105 -260 31 0 -93 -202 310 7 -111
3081a11N0O2K45j98j21K10j69P6K15l22L33j77r4o8J40m22L00P7R1k60J60J72
$$ -111 -61 1 246 48 -73 137 -32 44 259 -63 270 93 -1 -69 71 -351 -51 26 117 -143 17 189
3103A89k60N2n6n8L25j51J8o6p7J68j42K78k06p4Q7q9J7J50j4k55K31l43J13L34
$$ 189 -71 -19 -75 -133 192 41 59 -7 -84 84 -58 220 14 -60 27 -62 -45 105 91 -164 67 -276 -163 171
3127A71m44M10j29r5J38q2k68J14K66j99K53o5m0j37J13Ko0J2p6j2L49J5k10k2
$$ 171 -273 137 8 -87 51 -31 -299 -185 81 -118 135 70 30 -107 6 8 -52 -40 -116 -128 221 236 26 4
3151Dj30lN8K85j61K1J47l64R5K6j00J90J79k69J16r1n8K29q9k67M28j32j06K86
$$ 4 -126 -129 -71 214 53 74 221 -143 -48 -22 -122 68 247 -22 94 3 -55 174 85 -182 246 114 8 294
3175B94k58m8N6j75J34p3N0L12l00J4l9J41q8P7j48K23p7n0n0L04k95j41O2J36
$$ 294 36 -12 44 -131 3 -70 -20 292 -8 6 -33 108 20 97 -51 172 95 45 -5 299 4 -137 -75 61
3199F1lk52L03j32Km5J15k03P3Q9n2K7o2k02K29k02L46k30PL08l05O7J13k13P6
$$ 61 58 -194 109 -23 -21 -66 49 -154 -81 8 -44 -17 -79 -281 -52 -254 92 -138 -131 177 -128 -61 52 -161 -85
3224h5NM1j13K29j3j83M23m98K16N2l12J83L92n31L42k27r0KJ14K17j76K09l99
$$ -85 -80 -39 -152 77 64 -119 304 -194 22 74 -238 -55 337 -194 148 -79 -169 -167 -53 164 -12 197 -202
3247b02l4oM27k69p6J04j48M3J46J83m59M23j74J89j68j9k7J29M1r2K09l99J20
$$ -202 -236 -242 185 -84 -160 -56 -204 -161 -15 168 -291 132 -42 147 -21 -40 -67 62 103 11 220 -179 -59
3270e9J39P5l51K89Q5j86k50J77O4Q2m51O43l50J01J92qr8j85N8j31K80k59k4
$$ -59 80 155 -196 93 178 -8 -258 -81 -17 65 -386 257 -93 8 200 192 94 -91 -33 -164 116 -143 -167
3293a67K13k01mJ21m58N05k93L43j56j05K96M7j46Q7j83J81q7R7k49K18n0M7j51
$$ -167 46 -155 -159 -38 -496 9 -284 59 -97 -202 94 141 -5 82 -101 80 -7 90 -159 59 9 56 -95
3316i5j1K6L64m75K39J24l41L11k04K64k42mL98l80j60J35ok28K36Q2q2lm1J11
$$ -95 -106 -80 284 -191 48 172 -169 142 -62 202 -40 -44 354 -26 -186 -51 -57 -285 -49 33 -49 -52 -93 18
3340A8J20m8n00L37J52m5M7j51P1r8K00k46j4K5J15K14j08L6l34n1K57J13l7j38
$$ 18 138 90 -410 -73 79 34 81 -70 1 -97 103 -143 -157 -132 -17 197 89 125 -209 -260 -3 110 73 -65
3364f5J24l11L22j11J48l1q5n6K54m80L16R6L4k92j54L84o3J7r4l0%P7j0j71L12
$$ -65 59 -252 70 -41 107 76 -9 -65 189 -291 25 121 155 -137 -291 93 30 47 -47 -77 -77 0 -10 -181 131
3389A31j18J71j53k75K36p9K10j85J1J19J01j89L0k19N10l16R5K06l03J00K0J00
$$ 131 13 184 31 -244 -8 -87 123 -62 -51 68 169 -20 10 -209 301 -15 80 286 -17 83 103 203
3411B03m1q5o9O9r5j28J95l2J01j98q9K41q3q0M22k63j79R3K15p6j52L3K03j08
$$ 203 162 77 8 77 -18 -146 49 17 118 -80 -169 72 -11 -91 331 68 -111 -18 197 121 -31 2 205 97
3435I7k47N1K09j83M1Q0k25K88k71M23j74p9n8K15k75k2J66j87K03l1j12R5K59
$$ 97 -150 -99 110 -73 -32 48 -177 111 -160 263 89 10 -48 167 -108 -130 36 -151 52 21 -91 4 263
3458B63l22p6J35j88Q6K60j13q0J59j16l34L99k84M35k54j03K85l68J54K5k2J53
$$ 263 -59 -135 0 -188 -102 158 45 -35 124 8 -326 73 -211 224 -30 -133 152 -216 -62 -37 -59 94
3480I4j80l1rl9K55l94M72l13J21j31J92L5k73L10j37J17j53p1J08p8p7J60R6
$$ 94 -86 -117 -126 -165 90 -304 168 -145 -24 -155 37 72 -201 109 -28 89 -64 -135 -27 -105 -182 -22 74
3503G4k57J75qn8lL05l25J11J13k11Q0R2j12j5L80l09P7J7k43l7p5K90j54K34
$$ 74 -183 -8 -16 -74 -77 228 -97 14 127 -84 -4 88 -24 -39 341 32 109 126 -117 -154 -229 61 -93 141
3527A41k7r1K28k25j45K70O7m43L3J92P7o7j14KJ21j22OJ42j38%L06M5j99k81
$$ 141 114 23 251 26 -119 151 218 -225 -192 0 77 10 -104 -102 19 -103 -97 45 -93 -93 213 258 59 -222
3551b22JL91k02J35k09K1J72Q2pj97L1n3Q5R8k24L27J35o09K50M9l4l0K37l16
$$ -222 -221 170 -32 103 -106 -85 87 169 162 -35 -4 -57 28 126 -98 229 364 -245 5 54 20 -10 227 -89
3575h9j44M41k22Q7P2j73K30j87l27L66k11J85O7l07k4K02K54k56K4O4KK22m12
$$ -89 -233 208 -14 73 145 -28 202 15 -312 54 -157 28 95 -212 -236 -34 220 -36 -12 52 54 276 -136
3598a36L27l62Q1K06K23l25n1K31j80K05k78J35L5k8ol93K11K8oJJ52j95J94k39
$$ -136 191 -171 -90 116 339 14 -37 194 14 219 -59 76 111 83 77 -316 -105 -77 -83 -82 70 -125 69 -170
3622a70M26r4k55J33K09k53k43L03k16K17j35j64J3K55o1J52L4n88N24j06m0J36
$$ -170 256 162 -93 40 249 -4 -247 56 -160 57 -78 -242 -229 26 -35 117 151 -437 87 -19 -59 77
3644G7J11n94L02K68k3k05Q4J07m1j0on6k3Q2k49K55P1o4j73q7L86p4r0m6K75
$$ 77 188 -406 -104 164 141 -64 20 127 86 76 70 14 -9 73 -176 79 150 86 -87 -174 212 138 48 2 277
3669B77l02R4K7j57Q2PK20jj20r0M1j75r5M15l22j92L76r2J9j20J06P5j20m2m3
$$ 277 -25 69 96 -61 21 28 248 247 127 37 78 -97 -192 223 -99 -291 85 -7 12 -108 -2 73 -47 -89 -132
3694a32K33k19J73p0p0K70j25j62j08J44m8Q7l8J22l65L09j11J30K57l11q7J79
$$ -132 101 -118 55 -15 -85 185 60 -102 -210 -66 -114 -27 -65 57 -308 1 -110 20 277 -34 -121 58
3716E8j49QJ34Q0J9N3p2r4Q0k29J64pM4j32p1J8K50l6k58Q3N1J49k65J53J5J16
$$ 58 -91 -83 51 131 150 203 131 37 117 -112 52 45 89 -43 -114 -96 154 118 -140 -57 -6 143 -122 31 46 162
3742A62j11p3kJ46j61p4Q7q5K06k17J14r6o5K98m3l08M12k22r5K91n3r8J01j34
$$ 162 51 -22 -24 122 -39 -113 -26 -111 95 -122 -8 -104 -169 129 86 -222 190 -32 -127 164 111 13 114 -20
3766b0m3lQ9J41j95J54p6o6J85L4k27RK74k44J07k51J0K60m3M6p0k84K75j75J48
$$ -20 -63 -66 23 164 -31 123 47 -19 166 200 -27 -18 256 12 119 -132 -122 138 95 141 71 -213 62 -113 35
3791C5o5j39K18r5p5K56l02K50o0R0j53J64M4J9m65L36j67J37J21k68o2L30r3
$$ 35 -30 -169 49 -46 -121 135 -167 83 23 113 -40 124 168 187 -278 58 -109 28 149 -119 -181 149 56
3814E6l5K7r2M2J15J11l52J61Nr5j59J08J29L01m39j17J24J02k83O17m48K73k48
$$ 56 21 48 -44 -2 113 224 -128 33 38 -57 -216 -108 21 322 -117 -234 -110 -8 -291 326 -122 151 -97
3837i7J63j2r8M4r4J07j23O6M8Q1p4j76P8o4M8K04q9o3j05L80l02JJ01k80K87
$$ -97 66 54 -44 0 -94 13 -110 -44 4 85 11 -165 -87 -151 -103 101 12 -51 -156 224 -78 -77 24 -256 31
3862C1r4j83L45j96J17P8k36N7L3j47K01p3r5K2M04j03K4nj43M7p2j62L78j95
$$ 31 -63 -246 99 -97 20 98 -138 -81 -48 -195 6 -67 -162 -140 264 161 185 180 37 84 12 -150 228 33
3886C3P7j6l4P4r6r3K5k83M38j18J17l01K61j9j96K03l0m4Qn3o5Q1j29k3K64J8
$$ 33 110 94 60 134 38 -55 -30 -313 125 7 124 -177 84 65 -131 72 42 -2 6 -47 -112 -31 -160 -183 81 99
3912I9l27J99j97L28o6o3J26j80j60K53J07m8j46K03j00k6k5J13l0m1j22r4J68
$$ 99 -228 -29 -226 102 36 -27 99 -81 -241 12 119 71 -75 128 28 2 -23 90 60 19 -103 -197 -29
3935b9Q3l50K94m7J16r6J19k3j15j02N26m06O5o4q6n8L37p7j63R2j04k55M33K37
$$ -29 54 -296 -2 -49 67 -29 90 67 -48 -150 376 -30 35 -29 -115 -173 164 87 -76 16 -88 -343 90 327
3959C27l10J1r4j0J04j30m9K63P4k94L8L16j89k1j7J51k53r2J98l0Q0k03L29j51
$$ 327 17 28 -66 -76 28 -102 -151 112 186 -108 -70 246 57 36 19 170 -83 -175 23 -7 73 -130 199 48
3983D8j8l57QK74J62l87M48j95o4O0J05j35R0J18mj69n6K67k43K8J08N9o0k41
$$ 48 30 -327 -319 -45 117 -270 178 -17 -81 -21 84 -51 39 157 153 -16 -72 195 -48 -20 88 147 87 -154
4007a54J10n1O1k3m8J26J31l40K04J26jK10j52J11l1l32K7O1K4l3J18r9Mq7o2
$$ -154 -44 -95 -34 -57 -105 21 152 -188 16 142 141 351 199 310 279 -53 -26 35 59 26 144 45 49 -38 -100
4032a00k1J46j52K52j54J1J48m8k69M53k95l08N13j00k54J54q7k73K81J55J76
$$ -100 -121 25 -127 125 -29 -18 130 82 -187 266 -29 -337 176 76 -178 -24 -111 -384 -103 52 228
4053B28r1j16M0O5j90K80j46l5Mqk16M05k63j28K91k41K19m1j68J00k0k33L32
$$ 228 137 21 61 126 -64 216 70 35 39 31 -185 220 -43 -171 120 -121 98 57 -111 -11 -31 -264 68
4076F8M0n3q9j08K37j4j87l7J76r9J09j29k6kJ00j28K96M9j77k10J86Q5j11J02
$$ 68 108 55 -34 -142 95 81 -106 -143 33 -66 43 -86 -112 -114 -14 -142 154 203 26 -184 2 87 -24 78
4100G8p7j30j41L76l1JJ19k32RJ97l16J19j46K54m4J3n2j13M32k41j53J11o5j46
$$ 78 1 -129 -270 106 75 76 195 -37 -28 169 -147 -28 -174 80 36 49 -3 -116 316 75 -78 33 -32 -178
4124a78M43k31j34q6J78k71L79L7m2k08R5o8P5J30j71j04L21k31K0L09k30j14
$$ -178 265 34 -100 -186 -8 -279 100 137 95 -113 -18 -86 -11 119 -52 -156 165 -66 -46 263 33 -81
4146h1J05j10L1J32j99P8J35q5J61p5m9l4j32k4K75j16J57l06K11J81k46O8P6
$$ -81 24 -86 -55 77 -122 -44 91 6 167 92 43 9 -123 -147 128 12 169 -137 74 255 9 77 153
4169A53J55L5j40l21l8K05l3p9L6q0J19mj31K06k98L0L29P2p0k50M30m24K42l01
$$ 153 308 343 203 -118 -156 49 16 -63 -27 -107 12 8 -123 83 -215 -185 144 216 146 -104 326 -98 144 -157
4193a57K01j10j09J07K10k59l3K97n3K96n20J43k36N91j57l00K47q9r7jj01J50
$$ -157 44 -66 -175 -68 142 -117 -150 147 94 390 -130 13 -223 368 211 -89 158 69 -28 -29 -130 20
4215B0J34o1k49K58j08m1M3Qj26K2J76j69K13k45MNJ25oL2p7J7lm5K27m5k18n2
$$ 20 154 93 -156 102 -6 -47 -4 4 -122 -100 76 -93 120 -125 -121 -116 9 3 35 -42 -25 -28 -73 154 109 -109 -161
4242a61K84K8lN2l29K07L2j69p0J35j03J94J18j03k11J85K9j75K43o9r2o6l9n8
$$ -161 123 151 148 200 -129 78 110 -59 -129 6 -97 97 215 112 -99 86 115 -60 183 114 22 -44 -83 -141
4266a41J85j87K38k02l4PK86l83M42k43m4L10k09k26K05J46n1j24qj3J17p0k3
$$ -141 44 -143 95 -107 -141 -134 152 -231 211 -32 -76 234 25 -201 4 150 99 -25 -33 -46 71 1 -22
4289b2Q4j31Q0k12J34l2K11j33j22K06r1K52k60K8M1l7J32J23j54n2l9l32O0L50
$$ -22 62 -69 11 -201 -67 -99 112 -21 -143 63 -28 224 -36 -8 33 -4 128 251 97 45 6 -326 -266 84
4313H4j12J7M8j63K4K61j13j65J43o4LJ76j44M1Qr5K66l18K67k98p5L49Q2j90
$$ 84 -28 -11 37 -126 -102 159 46 -119 24 -40 -37 139 -5 36 44 -51 215 -103 164 -134 -209 140 222 32
4337C2j00J55j50K02j12L3L4j09rP0jN4j16n7l8K06K0o2r9J17l7pj74j33J72l3
$$ 32 -68 87 -63 139 27 60 94 -15 -24 46 45 99 -17 -74 -112 94 114 52 -47 70 33 26 -148 -281 -109 -142
4363a42J16Q7q0k9n6Q8m5k4J9P3j52j0l0J07P7p3K01j19N7R5m48K15j84L9K00
$$ -142 -26 61 -19 -48 -104 -16 -61 -85 -66 7 -145 -155 -185 -78 -1 -74 127 8 65 160 -288 -73 -257 -218 -18
4388a8P6l30OK11O1j1j95J74J52k5L0j66K38k47J25K4mk12n4K62m7l36L13Pj8
$$ -18 58 -272 -266 -55 6 -5 -200 -26 126 101 131 -35 203 -44 81 105 101 -111 -165 97 50 -286 27 34 16
4413A6q0K07%j41r4k9J37m0K06k00j49R3P7J70j14j79J33K5p1k48K94m7L3l29
$$ 16 -64 143 143 2 -92 -121 16 -24 182 -18 -167 -74 3 173 59 -120 13 38 -33 -281 13 -34 -1 -330
4437c30N32k70R0o1Q9Ok35J39L5N1r4K32m4R2l00J39k29K55J8M1k87K44l15J12
$$ -330 202 -68 22 -39 50 56 -179 -40 -5 46 -48 184 140 232 -68 71 -158 97 115 156 -131 113 -202 -90
4461i0J36Q6j35J57L4l11O4J76k41J17J6j4j10k13O52k78k3N9p9m4P2O1J66k35
$$ -90 46 132 -3 154 188 -123 -59 117 -124 -7 9 -5 -115 -328 324 46 23 82 3 -41 31 92 258 23
4485B3j93J06p4J5J96oJ63k35j89M14k93K72k28J43k03K35k91J18j27L74j51j7
$$ 23 -170 -64 -138 -123 73 67 230 -5 -194 220 -73 199 -29 114 -89 146 -145 -27 -154 220 69 52
4507E2j7J31n4m16M39j75j73L06m8n3K19k99j77L77p7J52l49K78o8m5J32j4nk93
$$ 52 35 166 112 -304 135 -40 -213 93 45 -8 211 -88 -265 112 35 187 -162 116 48 3 135 121 116 -177
4531a77QK28l46J70J0L13j6k07p1j41K26J48k80K4J15Q4j30N6Q4k20K26Pk2q6
$$ -177 -169 59 -287 -117 -107 206 190 -17 -88 -229 -3 145 -135 -111 4 88 -42 14 98 -122 104 111 89 3
4555Cn5o2K14l30P4K22o7m4P2n13Q37l25n8K31k18J27J58l40R4J98q9k13j08K56
$$ 3 -52 -114 100 -230 -156 66 -1 -45 27 -486 351 26 -32 199 -19 108 266 -74 20 218 129 -84 -192 64
4579F4j16o0K01j28L66m56J54P3l40K12l5M2J47j91Q5P8l46L67k74J64j08K18
$$ 64 -52 -112 89 -39 327 -129 25 98 -242 -30 -65 -23 124 -67 18 96 -250 117 -157 7 -101 117
4601A17j49j98J73k7K8L7p0O6j4j50K06j06P7j17O9J52J7j99J2l5K63j47O2l44
$$ 117 -32 -230 -57 -84 -56 -19 -89 -23 -37 -187 19 -87 -10 -127 -58 94 111 -88 -76 -111 152 5 67 -277
4625b77K72o7M3k9J24m1j05m4O4J07o0J46k12j75M97l01L67j36m55J69r2J15n0
$$ -277 -5 -72 -29 -58 66 25 -80 -124 -60 47 -13 133 -79 -254 243 -58 309 173 -282 -113 -205 -90 -140
4648a40P9M6Pk75L62nO2j64P5k35J08J64j87q4K87j31J09J0j23J1j7L3j24J60
$$ -140 -61 -15 -8 -283 79 74 136 -28 47 -188 -80 84 -103 -187 100 -31 78 88 -35 -24 -41 -8 -132 28
4672B8j99J03R5j38K7K8o0J00Q1q6n8l8K01O8L2j65K72l73M8j57J08J82p8O2j95
$$ 28 -171 -68 27 -111 -84 -56 -116 -16 65 -21 -79 -117 84 152 184 19 291 -82 -34 -191 -83 99 21 83 -112
4697a12L74l34j69L27o4N9n3m19L65J38R2k30J09l5k52J24Oo1J7K24j01p6J8j88
$$ -112 262 -72 -241 86 22 81 28 -391 -26 112 204 -26 83 48 -204 -80 -74 -135 -118 106 5 -71 -53 -241
4721b41L12J12p4q7Q6l16M57j92q4Q8j96J56l2J3j07J79q1k57J67J75K6l37J53
$$ -241 71 183 109 22 108 -208 249 57 -27 61 -135 21 -11 2 -105 74 -7 -264 -97 78 104 -233 -80
4744h0Rj30J84k2K02P5l37K9J55q5J13n8K7j66J23Q6j48q6J27j20k6K32k53K77
$$ -80 -71 -201 -17 -39 163 238 -99 -70 85 0 113 55 82 -84 39 125 -23 -109 18 -102 -128 104 -149 128
4768A28j75R8p0N0n7k8J29j48K71k1k08P2n9O3k0J03m20K27j17J66n8K04l7k8
$$ 128 -47 51 -19 31 -26 -54 75 -73 198 177 -31 41 -18 45 25 128 -292 -65 -182 -16 -74 130 93 65
4792F5k6k39K60o2j4O3k91J66K27k62L41k24J36n8j36N0r7J78k68J74J08k95K27
$$ 65 39 -200 60 -2 -16 47 -244 -78 149 -113 228 4 140 82 -54 -4 -101 77 -191 -17 91 -204 23
4815B3J50j40k2P6j1K1k55K08l30J76l6J69l78L80p9Q8L7l37L36L8j34J23j35
$$ 23 173 33 11 87 76 97 -158 50 -280 -104 -140 29 -349 31 -48 40 77 -260 76 114 -20 103 -32
4838c2J53j50J25j21r6Q9m1J26J04k10O0L0R2l27L18p7K21k04k25K25K16m23J78
$$ -32 121 -29 96 -25 -121 -32 -73 53 157 -53 7 37 129 -198 120 43 264 60 -165 60 276 -147 31
4861C1n5j29J97OQ2n5J76l90J88j10J38J28j78j34J82k1R8j31L4j2o9j39K19j24
$$ 31 -24 -153 44 50 132 77 253 -137 51 -59 79 207 29 -105 77 56 154 23 57 45 -24 -163 56 -68
4885f8o0K34k30J70j6J4j84K8l9J55L5r0O9r5J27j0J45l61J23J17J9q0j89J73
$$ -68 -128 106 -124 46 30 44 -140 -112 -151 4 39 -51 18 -77 50 40 185 -176 -53 64 83 3 -186 -13
4909a3j58K70J1j9j26l6K77J39j74nj00j4r8R1k36J31K47j54j48J57j67K99n4
$$ -13 -171 99 110 91 -35 -71 206 345 171 166 66 52 -46 45 -191 -60 187 33 -115 42 -125 174 120
4932A20k43J87m7M2p0JR7R9k99PL3J56p0j75m9J94J11p1K32l80J1p6L26l2j0J2
$$ 120 -123 64 17 59 -11 -10 87 186 -113 -106 -73 83 13 -162 -211 -17 94 23 255 -125 -114 -190 136 104 94 106
4958A06L0k66R0J25P5m41K26P1P3k41Q8k2j48L77j29j02J14K21m00M00j29k10
$$ 106 136 -130 -40 85 160 -281 -55 16 89 -152 -64 -86 -234 143 14 -88 26 247 -153 247 118 -92
4980i2K40q9j12r5K81p1K06l48K09j57n1J34o2j63O0QJ45R9n3M1l0n0Q9q1r1J00
$$ -92 148 59 -53 -148 133 62 268 -80 129 -28 -79 55 -7 -170 -110 -102 43 142 89 130 100 50 139 58 -33 67
5006F7k40J57l26J76K45j77J83j34N6m7J11M2Or6j22J90j98Q4p6Q1j32J64O5p9
$$ 67 -173 -16 -342 -166 79 -98 85 -49 7 -40 71 113 119 23 -99 91 -107 -23 -99 -18 -150 14 79 0
5030@L98n12p9J37o3o0K27P5k13J86k0mr6l05j0L80j39r7K10j22j33N46m21J3
$$ 0 398 -114 -193 -56 -119 -179 48 123 -90 96 76 72 -24 -329 -339 41 -98 -195 15 -107 -240 306 -115 -102
5054a02m3K04J18l44J35J64k18L25k93J70j50J7N4P1k87K19o6J27k36K64j54j27
$$ -102 -145 59 177 -167 -32 132 -86 239 -54 116 -34 -17 37 108 -179 40 -26 101 -135 129 -25 -152
5076a52R3L61r1n6nMl11J55j21l00L46K24j47L9j49O9J5P6k1j28k5K48k76M20
$$ -152 -59 302 211 155 150 154 -157 -2 -123 -423 -77 147 0 39 -110 -41 -26 50 29 -99 -124 124 -152 268
5100B68l43J59q5K9j17o2J47J8j52j26J50J1J36J20j78k6Q9j02N6j04k08K66m9
$$ 268 -75 84 -1 28 -89 -151 -4 14 -138 -264 -114 -103 33 153 -25 -51 38 -64 -8 -112 -320 -54 -103
5123a03J8K41m7j67k1N8J1O0J59k57J10Mj22J41Oj19p8K83k68L09m07J65kj34
$$ -103 -85 156 109 -58 -79 -21 -10 50 209 -48 62 66 -56 85 91 -28 -106 177 -91 218 -189 -24 -26 -160
5147a60K3Q9j50K67J32k71J5m2l2K35k40N2m2J51j46R4j00l9K62p5k09J65j09
$$ -160 -137 -48 -198 69 201 -70 -55 -97 -129 106 -134 -82 -124 27 -119 -25 -125 -164 98 23 -186 -21 -130
5170a30j05L09j32J0k05J39J40r8K33j16N0k96K09j57L75k96J71k6K76l80j17
$$ -130 -235 74 -58 -48 -253 -114 26 -72 161 45 95 -201 8 -149 226 -70 101 75 351 -29 -146
5191a46R2J15J16k10n8l3J25M2N1l10J49j64K16R5k24K13R7k74L24j25j38J46
$$ -146 -54 61 177 -33 -91 -124 1 43 94 -216 -67 -231 -15 80 -144 69 166 -108 216 91 -47 99
5213I9r2L04j64p3J19j01l3J06j94K13m55J36J94J04j36J5j13l5K48l19J68j37
$$ 99 7 311 147 74 193 92 59 165 -29 184 -271 -135 59 163 27 42 -71 -106 142 -177 -9 -146
5235a46J83j50R7k6L03l41J46j48R8P3J6j95Q3k4J56j44k1O3Jj11R1J67k12J33
$$ -146 37 -113 -16 -42 261 -80 66 -82 16 89 105 -90 -7 -31 125 -19 -40 23 24 -87 4 171 -41 92
5259I2l2j89K36l26R4L60k43L80j86j91N7k11J27jJ79m62K96R4k13J50k84J37
$$ 92 60 -129 107 -219 -125 235 -8 372 186 -5 52 -159 -32 -33 146 -316 -20 74 -139 11 -273 -136
5281a36L23M2j15k72K21J1K5j53J03N8j31J72k98K09k72J66o1k4n4K08r4m0Q2
$$ -136 187 229 114 -158 63 74 99 -54 49 107 -24 148 -150 59 -213 -47 -108 -132 -186 22 -72 -112 -30
5304c0L1n5o1K07k90J88K03k64K9J84j35l94K87J26j04J48j59M0L8n4J07J69m0
$$ -30 1 -54 -115 92 -198 -10 193 -71 -42 142 7 -387 -100 26 -78 70 -89 -49 -11 -65 42 211 171
5327A71k13J11j47j02J01p7P1K86l11Q4K17l70J95p1N6R1J7m0j59J75r2J87j81
$$ 171 -42 69 -78 -180 -79 -156 -85 201 -110 -26 191 -179 16 -55 1 92 109 69 -90 85 -7 180 -1
5350aJ53l05K31J25k15P1j90L32j45j22J44k24p8J19J28j47O3L04j60k33K62j16
$$ -1 152 -153 78 203 -12 59 -131 201 56 -66 78 -146 -224 -105 23 -124 -61 243 83 -150 112 -4
5372dJ86o5r8m3J89j91j76K3K91j20j91M5P9K17O2l27J72q9J41k67kM16j84j32
$$ -4 182 117 19 -24 165 -26 -202 -179 112 -8 -199 -154 -75 142 204 -123 49 -40 101 -166 -168 248 64 -68
5396f8J84m01L10q7k3M3RjrJ05J80k01L52l27q7O1k5J41k8oj3l2n7O6j44P5K20
$$ -68 116 -285 25 -62 -85 -42 -33 -34 -43 62 242 41 393 66 -21 40 15 156 128 122 109 77 20 86 -58 17 237
5423B37k74J05k12K30r0J34j18j44L62l44K41P3n5j81j0K11p5j68O0R7kJp7l43
$$ 237 -37 68 -144 86 -4 130 12 -132 230 -114 127 200 145 -36 -46 165 90 -78 -18 79 77 78 1 -342
5447c42O71l40j9J5P9j56j19K03P4n9j71J61j97L87j25%j53J72j04J42q2j30L5
$$ -342 329 -11 -30 -15 64 -92 -211 -8 66 7 -164 -3 -200 187 62 62 -91 81 -23 119 37 -93 -58
5470e8J31o7J01j07K46k04r9RK74k48r7L28o7l44JJ18K99j91L0J59k20K9j76J92
$$ -58 73 6 107 0 246 42 -57 -48 226 -22 -119 209 142 -202 -201 -83 216 25 55 214 -6 23 -153 39
5494C9j72K59q5j12K5J59l5ok3j3K00o5Q4j50j55J00R8rk92K14j39nO7j51L37
$$ 39 -133 126 41 -71 -46 113 78 72 49 36 236 171 255 105 -50 50 148 139 -153 61 -78 -83 -16 -167 170
5519A70l11Q0kJ85n9Q6l4k43k8L92k40j15J35r3j9J7QJ94j32K01k60j64K13J52
$$ 170 -141 -61 -63 122 63 149 115 -128 -156 236 -4 -119 16 -77 -96 -79 -71 123 -9 192 -68 -232 -19 133
5543A33j08M3j44K07J72m68J74J6o4K8n8J09q8p8L4Q0L9J22j37j11L46l0J0j11
$$ 133 25 68 -76 131 303 -165 9 25 -39 -11 -69 40 -48 -126 -92 -12 27 149 12 -99 247 217 227 116
5567A16k38K02R4J9l20R5N9j31J17P2k13P4qJ04J05n6Kj1m7j66M9qQ7M3k95L12
$$ 116 -122 80 174 193 -127 -32 27 -104 13 85 -128 -54 -62 42 147 91 93 82 35 -131 -82 -90 -3 40 -255 57
5593E7Kj22l5L3QL9M9N1j30j05J60j58K29j41J64j41P4k27K25J55j97j17J71N5
$$ 57 59 -63 -98 -65 -57 -18 31 82 -48 -153 7 -151 78 -63 101 -40 34 -193 32 187 -10 -127 44 99
5617I9j07j44L02m15L0K40k32K06N0P2j30Q9k32J28J09J14l69l5O4J52o7j13J10
$$ 99 -8 -152 150 -265 -235 5 -227 -21 29 101 -29 60 -172 -44 65 179 -190 -225 -161 -9 -76 -189 -79
5640g9L48l30J34K5J21j28J17o4K8o0k01J40j89J00Q3J69q6j24N3r6J66m7no4
$$ -79 269 -61 73 98 219 91 208 144 172 112 -89 51 -138 -38 45 214 128 4 57 -39 127 80 75 11
5664A1q1J46j17q9K96mp7j8J22l05K73Oj41j09J72r4R3k35K51N1k06N6N9k98K61
$$ 11 -70 76 -41 -130 166 162 85 67 189 -116 157 163 22 -87 85 -9 84 -151 100 151 -55 1 60 -238 23
5689B3m5M7L35o65L1K37k1P0J98k75M3K19Q6k10J50k47j8L49j36O2k40J34k63
$$ 23 -22 25 360 -305 -274 -37 -58 12 210 -65 -22 197 283 73 223 -24 -42 307 171 233 -7 127 -136
5712a36M5J47R6o4j15L97j87j16j40K85k57P4J25j44N0j64L3O6k69M22k28K08
$$ -136 -91 56 152 88 -27 370 183 67 -73 212 -45 29 154 10 60 -104 -71 -5 -274 148 -80 128
5734A28l5l9j36m1J76r6P7l16K99J9J62l97L3K59l43J4J79J34j05K76j19j99l8
$$ 128 93 54 -82 -123 53 -43 34 -282 17 36 198 -199 -166 93 -250 -236 -57 77 -28 248 129 -70 -108
5757a08J3J1J38r1J81j67j74j28L85K19l23K7R3j93J54o7J50j5j32n9n0K10r7
$$ -108 -95 -84 54 -37 144 -23 -197 -325 60 279 -44 -17 76 -117 37 -30 120 105 -27 -86 -136 74 -23
5780b3j39N1j30J92N2K25l02K44l71J20K03k57J14j59j7J29K27j36j43Q1O8J07
$$ -23 -162 -111 -241 -49 3 228 -74 170 -201 -81 122 -135 -21 -180 -197 -68 159 23 -120 -39 29 136
5802A36l63L73%k15n7J12j99L37l2jj18J34j40J6RN3K13j11L50m93P7o6k3K16
$$ 136 -227 146 146 -69 -126 -14 -213 124 92 91 -27 107 -33 -17 -8 45 258 147 497 4 81 15 -8 208
5826B08l64M0K42J7k54K16j91K66l04Q2K16j73J4J86k15J37k67O0K01k60J91m9
$$ 208 -156 -116 126 143 -111 105 -86 180 -124 -42 174 1 15 201 -14 123 -144 -84 117 -143 48 -1
5848aj22L66j78k69J61M9N6L3l6p4J22k27L7j57K47l5k49K26J73q4l0M6J10k53
$$ -1 -123 243 65 -204 -43 6 62 95 59 -15 107 -120 -83 -240 7 -28 -277 -51 122 38 8 54 164 -89
5872h9K60j89k5NK65j83L0j45M61l68j69K39M7j13J07j25P4l8j87J67J52q6j10
$$ -89 171 -18 -43 -38 227 44 74 -71 390 22 -147 92 139 26 133 8 82 44 -143 24 176 90 -20
5895b0K13j76k4K4j71R0k16J72J44o5M2j36O5J6r9K95j15m0Q7k30J63j2J23j59
$$ -20 193 17 -7 17 -154 -64 -280 -108 36 -29 13 -123 -58 -42 -141 154 39 -1 86 -144 19 7 130 -29
5919b9K52r6o4k10K07l7K29k11N2k13M5L2J96Nj91k5L07k12p9m2l9M4N8N9m2R2
$$ -29 223 127 63 -147 60 23 252 41 93 -120 -75 -43 153 158 -33 -58 249 37 -42 -84 -123 -79 -21 38 -4 88
5945H8j6J61k38M4j28K56m8k23J46M7j37J84o5k3O3j51NM5j11j76K38J31k08K32
$$ 88 72 233 -5 39 -89 167 119 -104 42 89 -48 136 71 48 111 -40 -35 10 -101 -277 -39 92 -116 116
5969A16j7k42K86r0q1j5J39o6J20q0l10J80J81l95J93M2J49j03k8J2n2P6k2j28
$$ 116 99 -143 143 53 -28 -43 96 30 150 70 -240 -60 121 -274 -81 -39 110 7 -21 -9 -61 15 -7 -135
5993a35K08l24L39J57k70J31q0j79K88R6k09k6R7m17K94K76o7j57l8J3o8L5p3
$$ -135 73 -251 88 245 -25 106 26 -153 135 231 22 -4 93 -324 -30 246 179 22 -16 -3 -71 -36 -109
6016a09J28K87k95r6N3j50k9K99j24P7K85l0l85J49k23J67L02j22m34J51llL02
$$ -109 19 306 11 -85 -32 -182 -211 88 -36 41 326 296 -89 60 -163 4 306 184 -250 -99 -102 -105 197
6039A97k98J22j53J24l01M03RlK10k84p3m0J32J2lL6p9k07Q9O8J97j11Q5k1P5
$$ 197 -101 21 -132 -8 -309 94 103 100 310 26 -47 -87 45 57 54 90 11 -196 -107 -39 158 47 132 111 186
6064A86j47j06m7J63J68j35r5J42j03K24k30N2P4J9l02k13K25j21Q9K0kJ53N8
$$ 186 39 -67 -114 49 217 82 -13 129 26 250 20 72 146 165 -137 -350 -125 -246 -157 -137 -139 14 72
6087G2j91L41j44Qr7J66j48P1n4kqj48J52J54j97J11k63J14N6r1K22r7l4r8J55
$$ 72 -119 222 78 86 -11 155 7 78 24 22 14 -134 18 172 -25 86 -177 -63 -7 -98 124 27 -7 -105 50
6112E0ml0n4K59m05J75j21L15o0j27J27j12J22p5k26J47m9q4O9K68p1n1j53L8
$$ 50 46 16 -38 221 -184 -9 -130 185 125 -2 125 13 135 60 -166 -19 -68 -152 -83 185 114 63 -90 -52
6136e2J47j60j1j55L29k46L39k97O6k3J56j16M9q6K55k72J3j20M70k78j67Rp1
$$ -52 95 -65 -76 -231 98 -148 191 -106 -40 -63 93 -23 26 -60 195 -77 -64 -184 286 8 -159 -150 -221
6159b21L36R2k61L00q7j13j96J24J98j83j41O4L2r5O2j01J54J12k5j31j16J40
$$ -221 115 207 -54 246 159 46 -150 -26 172 -11 -152 -88 -56 -151 -89 -190 -36 76 51 -80 -196 -56
6181e6J0J65j92O7m1J43j26R6P3k0j58L1J44p6J22j40nj13J15j52p1J52q1J99
$$ -56 -46 119 -73 -6 -47 96 -30 66 139 119 -39 -8 136 60 182 42 37 -76 39 -113 -184 -32 -113 86
6205H6j11j2o9l1N3qJ94p0j25O1o6J16j4j66M8L52l19J11J43k84K58Rk25N0j23
$$ 86 -25 -37 -106 -137 -84 -92 102 32 -93 -32 -98 18 4 -162 -114 238 -81 30 173 -111 147 156 -69 -19 -142
6230a42J61n2j9J81j2N2l45J58oj4J95l14J46j65P4J84r6m0P1J1j69K03J71l60
$$ -142 19 -33 -52 129 117 169 -176 -18 -24 -38 157 -157 -11 -176 -102 82 -14 -54 17 28 -141 62 233 -127
6254a27J29J24j80j90J0K06l3K73j86n5q3J63QK04k45K22l45M21n37N47n08J59
$$ -127 2 126 -54 -244 -234 -28 -61 212 26 -29 -112 51 59 263 18 240 -105 316 -221 326 -182 -23
6276b3K64r4j83j0ml4J34l3M8p8q3K86k49l4J64k60L27k08J86j09j19l27L22K57
$$ -23 241 147 -36 -46 -50 -84 50 17 65 -13 -96 190 -59 -93 71 -189 138 -70 116 7 -112 -439 -117 140
6300A40k32J74J33m81L6L37J21o2j95j36Q1L4J58k91K4k7L59j96P7m4J7N5j21
$$ 140 -92 82 215 -266 -230 107 228 166 -29 -165 -84 -50 108 -183 -159 -186 173 -23 54 10 27 82 -39
6323c9L8J29j33M1j51K32p2k4p6j5o9N3N4k1%O3k16J67K9k52K50jPj20J56N8q6
$$ -39 -1 128 -5 36 -115 117 45 21 -55 -70 -139 -86 -32 -53 -53 10 -206 -39 -10 -262 -12 -13 -6 -126 30 88 2
6350Bj35jK29l90J45N9J81J34j36k18J36K2K03k8k46J29K8l65L19M4Pj79J97j40
$$ 2 -133 -134 95 -295 -150 -91 90 224 88 -130 6 28 231 203 -43 86 114 -251 68 112 119 -60 137 -3
6374cj87K20J62j87n3l3J46K8j37K43k75qK62k27K19n7k3Q2k75L05k60kR0O7J00
$$ -3 -190 30 192 5 -48 -81 65 93 -44 199 -76 -84 178 -49 170 113 90 172 -103 202 -58 -60 30 97 197
6399A97j60j16R3p5J08j04j80J98p0L52k60j22J86j16P3q0O6J20l9N7j28M7p8
$$ 197 37 -79 14 -61 47 -57 -237 -39 -109 243 -17 -139 47 -69 4 -76 -10 110 71 128 0 47 -31
6422c1J72j62j9RJ59l6J30m20K01j16Q2J13R0j01m8j64J62j57K49j10j00L11j01
$$ -31 141 -21 -40 -31 128 92 222 -198 3 -113 -31 82 172 71 23 -141 21 -136 113 3 -97 214 113
6445A13p0o6m5L9k22J56J03J26K5k03J1N9k15J27J71k05K73j20l38M72l9j64j48
$$ 113 43 -23 -68 -29 -251 -95 8 134 159 -44 -33 26 -189 -62 109 -96 177 57 -281 191 152 -12 -160
6468a60J19m0J15k31L54n5j33q8K02k06K17J29k47J11l6j37N5J11k9j22KR3j53
$$ -160 -41 -81 34 -197 157 102 -31 -119 83 -123 94 223 -24 87 51 -86 -31 80 51 -71 -69 24 -129
6491a29j10L13q5k1J65k96qJ08J40M3l17K70p0J29O7M4l19N8j1o3J24j14k0M7
$$ -129 -239 74 -11 -32 133 -163 -171 -63 77 120 -197 73 3 132 199 243 -76 -18 -29 -92 32 -82 -102 -55
6515e5Nm5r3J33k4q9K88j14k25K70j78Q3p1J57J4k26J87j0K0j90j20K53J22j15
$$ -55 -50 -95 -188 -55 -79 -168 120 6 -219 51 -127 -44 -115 42 56 -170 17 7 27 -163 -283 -30 92 -23
6539b3J70j86n8j69L14Jq0K08m1k14K0j30L33l20K93n6j47PM1k02Q8n8J99M5J71
$$ -23 147 -39 -97 -266 48 49 -31 177 136 -78 -58 -188 145 -175 118 62 -85 -78 -37 -239 -151 -209 -10 35 206
6564B06j99M5jk76Q8r0M97m57L19l64L37J3j06J77l35L20j17j15J00l8p2NM5l0
$$ 206 7 52 51 -225 -137 -227 270 -187 132 -232 105 118 12 189 -146 174 57 -58 42 4 -68 -63 -18 -48
6588d8J93J29k21p5J25Rj05j23R0K68M4l33k1j39K46o4R6k21J01j21J7K65k43
$$ -48 145 274 53 -22 103 112 7 -116 -26 242 286 -47 -68 -207 39 -25 71 -150 -49 -170 -153 112 -131
6611a31J64o2K9p2K69k71J41j13m6j91M3L56l7j79K32M0m6j41J4J01j33J62n4
$$ -131 33 -29 0 -72 197 -74 67 -46 -92 -283 -240 116 79 -100 132 172 126 -15 -1 100 -33 129 75
6634G5j84O8J75j19J7J55rj61j7K23k59k48K16K53L2m15J75N8NK39l31J05L1j3
$$ 75 -109 -41 134 15 32 187 178 17 0 223 -36 -284 -68 185 217 -198 -23 35 40 279 -52 53 84 71
6658G1J45j61K25l16k61M70j45J8j21L14k57NP8o2j58P2Q4j20K02l4n7K25j49
$$ 71 216 55 280 -36 -297 173 28 46 -75 239 -18 -13 65 3 -155 -83 1 -119 83 49 -8 217 68
6681F8J21m0k13M6l1P2p4J67k36R0Q1n2o4J2R0J51j74j21J01k39P0M9J22q1J19
$$ 68 189 149 -64 -18 -49 23 -51 116 -120 -30 51 -1 -65 -53 37 188 14 -107 -6 -245 -175 -126 -4 -85 34
6706C4J43j95p7K19N1q3j02O5j57r3J65J36o7JK16k8m92K08k57L95l38M4R4j21
$$ 34 177 -18 -95 124 175 92 -10 55 -102 -195 -30 106 39 40 256 228 -264 -56 -313 82 -256 -212 -118 -239
6730b39J98K5p9K10k29J38K0j52Q5r8J48J3l2J77k42K06j59K5Q4K9j48j24J89
$$ -239 -41 -16 -95 115 -114 24 44 -108 -23 -121 27 40 8 185 -57 149 -10 15 99 128 -20 -144 45
6753D5k03K40Q4j92J60k27J98K44n11J45k34M25j62k58J75Q8q0j1K81l32j4K5
$$ 45 -158 82 166 -26 134 -93 105 349 -162 -17 -251 174 12 -246 -71 17 -63 -74 207 -125 -139 -114
6775a14K68l9k49K40K1j57j1k0L05l64R7J81m5l65N38k41j87K09J31k54k54K58
$$ -114 154 115 -134 106 127 -30 -41 -61 244 -120 -23 158 113 -252 286 45 -142 67 198 -56 -310 -52
6797e2L7P1l70J49J42nP7Q7mk65L49k94J46J17l43O7K08k87L51m56J97J74L7J7
$$ -52 -15 56 -314 -165 -23 -28 49 136 132 -133 216 -78 68 185 -158 -91 117 -170 181 -275 -78 96 133 150
6821A50k77J23K81j54k6j24j60M67k74M4Q1j89M1p9P4k4j49J92J06j04j14K98
$$ 150 -127 -4 277 123 97 -27 -187 280 6 50 131 -58 -17 -96 -22 -46 -195 -3 103 -1 -115 183
6843A83j77n3J80j28j94K75k06k3N3J70J90j4j55j62L21j76j78J23R7k03Q1Q8
$$ 183 6 -47 133 5 -189 86 -120 -143 -90 80 270 256 101 -61 260 84 -94 29 126 -77 4 92
6865I2j90Q5j49R3j08L63l57K20j25p1J5K09Jj74L5q0J59K4J54k53l1P5L3q0J47
$$ 92 -98 -13 -162 -69 -177 186 -171 49 -76 -147 -132 77 78 -96 -61 -141 18 42 196 -57 -88 -13 20 -60 87
6890H7j34J43j63po6M7K68q6k01rK33m5j76QJ73k8M6j86K18P6R9l9j43Ln09M44
$$ 87 -47 96 -67 -74 -140 -93 175 89 -112 -121 112 67 -109 -101 72 44 90 -96 122 198 297 258 115 118 -391 53
6916E3o2P8j16L4j14J0J61J18j59o4j5K17n2j47J16j10r5l7K08P1m8l02K41J62
$$ 53 -9 69 -47 -13 -127 -117 44 162 3 -61 -76 141 89 -58 58 -52 -147 -184 24 95 47 -255 -14 148
6940A48k42O0j89N4J71p9L9l1J60q0j09R6j17K92k40j37L29L9j74pL0m5Q9q7L27
$$ 148 -94 -34 -223 -169 2 -77 -38 -69 91 11 -98 -2 -119 173 -67 -204 125 164 -10 -17 13 -32 57 -30 297
6965B97k92q1J55j44P3K39m29J76P8j66J61j16j83J29J15k88L17M1j49rj3N7K18
$$ 297 5 -76 79 -65 8 247 -182 -6 72 -94 67 -49 -232 -103 12 -276 41 82 -67 -76 -89 -32 186
6988A86l35K35k10J1RM01l09J64k44r3J86M6PR2m76K2K31J64j81M1K3L6N6j34
$$ 186 -149 86 -124 -113 -104 297 -12 152 -92 -185 1 47 54 146 -330 -308 -77 87 -94 -53 -30 6 62 -72
7012g2k8O4r3J03mr2O2j90K43J23j26j20K55j11J11k04NLL8K36j15m2l93M22k79
$$ -72 -100 -36 -129 -26 -30 -122 -60 -250 -7 116 -10 -130 125 14 125 -79 -74 -71 -33 203 88 46 -347 75 -204
7037b04P0M2j32Q5l6J60lJ23Q3j80p4j09J55j25K48j58oR9J11k10K62j19j43J06
$$ -204 -134 -92 -224 -139 -175 -15 -18 105 188 8 -66 -175 -20 -145 103 -55 -61 38 149 -61 201 82 -61 45
7061D5j32j90N64j99j29L14k26j8k00J9K66m6O8k28J71j32j73L14j11o2R1np7
$$ 45 -87 -277 287 88 -41 273 47 29 -171 -152 114 68 136 -92 79 -53 -226 88 -23 -85 6 1 -76
7084g6N7m2K33l53J31mj05J09L02k80j0l9n7K43P2j45j17j5Q6J1k9j98J95J44
$$ -76 -19 -61 172 -181 -50 -54 -159 -50 252 -28 -38 -77 -134 109 181 36 -81 -96 -10 1 -28 -226 -31 113
7108A13j7j3l05L65p8j3N9Nk26K48j19mq5j71M0J62J75N1k48mj07L47l63J28j36
$$ 113 96 83 -222 143 65 52 111 116 -110 138 19 15 -70 -241 -201 -39 136 187 -61 -65 -172 175 -188 -60 -196
7133a96K21k5m1J61j22j35M01m8k38J91m02J83M3oO9M3j83K79l71K39k0q3N8n7
$$ -196 25 0 -41 120 -2 -137 264 216 -22 169 -233 -50 -7 -13 56 99 -84 195 -176 63 43 -40 18 -39
7157c9J55j10l61M96j67M0l9j3K36k67J71j82K37k67j78L38k3k04R7P5k06J13
$$ -39 116 6 -355 141 -26 14 -25 -38 198 -69 102 -80 157 -110 -288 50 27 -177 -80 -5 -211 -98
7179i8j45J34RJ16k9J71q2J47r4K9k76k5P0K29k79K11J81j67j31k1J30p7K47l91
$$ -98 -243 -109 -100 16 -13 158 76 223 129 158 -118 -143 -73 156 -123 88 269 102 -29 -50 80 3 250 -141
7203a41k7K40j77K28k62J36j3P4q1j37K03N5j19O0K4J4N6r3k62K6J69J68k86K40
$$ -141 -168 72 -105 123 -139 -3 -16 58 -23 -160 43 98 -21 39 63 77 133 40 -222 -196 -27 141 -145 95
7227I5l9j35J05j16J90m6P6j53J10q4nK0J40r6m0p1j03M8M2j10K54J22k00L5J28
$$ 95 56 -79 26 -90 100 54 130 -23 87 3 -2 18 158 62 22 -49 -152 -104 -62 -172 82 204 4 39 167
7252A67j86J1o5r7J29j07J45J90j3j50JRn1k58N77j20k22N2j1r5K15j08M4K03
$$ 167 -19 -8 -73 -170 -41 -148 -3 187 174 24 25 34 -17 -275 302 182 -40 12 1 -94 121 13 57 260
7276B60j55j17q5J78j55j6J98k04J17n7O0ln07M08n4O0p2J28J68j45O2%j42J07
$$ 260 105 -12 -97 81 -74 -90 108 -96 21 -36 24 21 -486 -78 -132 -72 -144 -16 152 7 69 69 -73 34
7300C4K01j72k4o6M1k01J20K56l6j64J07J42k13j06R5M4j33J17M6k32K03K3m5
$$ 34 235 63 39 -27 14 -187 -67 189 153 -11 96 238 25 -81 14 58 -75 42 88 -144 59 82 37
7323C7J93l14J35L2j14K04m54J62L17j45k99J80J96k42l8L15o1j61l8J50l5nP0
$$ 37 230 -84 51 83 -31 173 -281 -119 198 53 -246 -66 130 -112 -150 165 104 -57 -95 55 20 15 85
7346H5j4o4j53K29j13j44M34j17j04N1J15j72L2j2o9J54l86L14j24K1j06O8Q8
$$ 85 71 7 -146 83 -30 -174 260 143 39 90 205 33 65 53 -16 138 -248 66 -58 -37 -143 -75 13
7369A3L1m3PL5o0Jj93L84j57l41L15K94l64n4L40j98J1j72J85J69k11K32l47p5
$$ 13 44 1 8 43 -17 -16 -209 175 18 -323 -8 286 -78 -132 208 10 21 -151 34 203 -8 224 -123 -198
7393a98K15l55M85j20j62N2k20L93J64p6p3k85K13J37j96q0O8K0L8K85l36m6o5
$$ -198 17 -338 147 27 -135 -83 -303 90 254 178 105 -180 33 170 -26 -106 -38 -18 20 305 -31 -77 -142
7416a42rK78l59L00J32l72K30k16J43PK03k74M0n5L52l24L4P3q1L7J4j52M0n6
$$ -142 -151 127 -232 68 200 -172 58 -158 -15 -8 195 -79 -39 -94 258 -66 -32 41 -40 -3 11 -141 -101 -157
7440a57Nj89L72k20o5K71k33j10L79k37J12R0R6O0m5j26o3J36r9J12P2l8j69j5
$$ -157 -152 -341 31 -189 -254 17 -216 -326 53 -184 -72 18 114 174 129 3 -60 76 -23 89 161 123 -46 -61
7464f1M8k2p8J32j60J6L73k00k55N30n23K63J16j76OK15k72j06qJ69q3K8K82k46
$$ -61 -13 -35 -113 19 -141 -125 248 48 -207 323 -200 63 179 3 9 224 -48 -154 -162 7 -76 -48 234 -12
7488a2jK8k2L5k91J75M7l0J60J17k49p6L1J37j10J28J19l91J72K20j14J0J24m12
$$ -12 -13 15 -7 28 -263 -88 -41 -71 89 206 -43 -119 -88 49 -61 67 186 -205 -33 187 73 83 207 -205
7512b05K78j26M5Q6j85J50j10J91N7k30o3J85K7j30K31j22k30J17j02K79k13n4
$$ -205 73 -53 -8 78 -107 43 -67 124 181 -49 -112 73 100 -30 201 79 -151 -34 -136 143 -70 -124
7534a24J45r0l3L21k10j18L05m67L16j36K94k26L64o36L97m4q1K41k95J02j88
$$ -124 21 -69 -102 219 9 -109 196 -271 45 -91 203 -23 341 -295 102 58 -23 218 -77 25 -163
7555a63K32j96K72j81K52O7l71PK67l29J40j0P9k98K23k6R7q0J50k8O7k30j1J79
$$ -163 69 -127 145 -36 216 283 -88 -81 186 -143 -3 -13 66 -232 -9 -35 62 -18 132 104 171 -59 -70 109
7579A09j22j56L27q9j02L4P4J81L3l22m6J26k02P8j24j42K47N0j36K99o3o4J3
$$ 109 -13 -169 158 69 -33 1 75 256 289 -33 -79 47 -155 -77 -201 -343 -96 -46 -182 117 54 -10 3
7602CJ19k35J10m5P1J31j28jk57K31P0k95j6L13o1P7J31j82l27K97OL8k4j4j27
$$ 3 122 -113 -3 -48 23 154 26 25 -232 -1 69 -226 -242 71 10 87 218 36 -291 6 12 50 26 12 -115
7627a15%Q0J34J23k12jM2o7J43j13k76o4M83j58k4J83k32K2J40j90K85j60n8j3
$$ -115 -115 -35 99 222 10 9 51 -16 127 14 -262 -326 157 -1 -25 158 -74 -52 88 -102 183 23 -35 -48
7651d8m3j28M41l61M00j13m8r8J9k1O5J8k33K62k02J24L79k85j16j53J86J62l70
$$ -48 -91 -219 222 -139 261 148 100 2 21 0 65 83 -150 112 -90 34 413 128 12 -141 45 207 -163
7674a63j07M07l68K57m1o3K83j52j14L1J03J21r8k19J58K25k48q5lP1J88k94K27
$$ -163 -270 137 -231 26 -15 -78 205 53 -61 -30 73 194 96 -123 35 260 12 -73 -76 -5 183 -111 116
7697A16j05m4K9P6p4J34m3k55K6J22J58k10J30l9P4k34p1K5j6j5K56j00K66l86
$$ 116 11 -33 -4 72 -2 132 89 -166 -140 -18 140 -70 60 21 95 -139 -210 -185 -201 -216 40 -60 206 -180
7721a80L2J48J28l6J45l71K54J84l17L01l52J43%k5K67m78J11j29L06j45M3r1
$$ -180 -148 0 128 92 237 -134 120 304 -13 288 -64 79 79 54 321 -157 -46 -175 131 -14 29 -62
7743f2J98k18oK70j34j51J1K08k21K43o2m1j24K74N0p4j04j26j06J77Q6KP0L7
$$ -62 136 -82 -88 182 48 -103 -92 116 -105 138 76 35 -89 185 235 161 57 -69 -175 2 88 90 160 197
7767A97k63J26j42j3N3J54l2j00k76K55J93l99M11l12N6J13Q9j6l0r8Q9J50j35
$$ 197 -66 60 -82 -95 -42 112 80 -20 -296 -41 152 -247 164 -148 -92 21 110 94 64 -34 55 205 70
7790G0qj17k3J10k63K87r7o9K75j40j28J10n4j70J99k4J13l02J19J53q4J94j67
$$ 70 62 -55 -78 32 -231 56 -41 -110 165 25 -103 7 -47 -217 -18 -42 71 -231 -112 41 -43 151 -16
7813a6K35m39L52q8J84l29J12P4L7Jk68K59J9l35M5K93l3j53M2Q0j1j57K89j83
$$ -16 219 -220 132 44 228 -101 11 85 122 123 -145 114 133 -202 -157 136 103 -50 -8 72 61 -96 193 10
7837A0K8j12l3J84n9k5m9J59k61K16K73j58j25o6j08J91p2m4J11q8K40r4k28K12
$$ 10 38 -74 -107 77 18 -7 -56 103 -158 58 331 173 48 -18 -126 65 -7 -51 60 -28 212 118 -110 102
7861A02j29K35k12K8L38k04J1j08k97J81K88k90K28j13l04K25O0J17k89L60j76
$$ 102 -27 208 -4 24 362 158 169 61 -236 -55 233 -57 171 58 -246 -21 39 156 -133 227 51
7882E1k21O6M5L27j72QL1j35j30N9K11j25k16K23J56k5N5m96K80K58k68N2m4K99
$$ 51 -170 -104 -59 268 96 104 135 0 -130 -71 140 15 -201 22 178 153 208 -288 -8 250 -18 34 -10 289
7906B89k44q6J86k74K48j79N9m9p5J46j4o9nj03Q4j33J43N6l2p5J63J49L8j91
$$ 289 45 -41 145 -129 119 -60 -1 -50 -125 21 7 -62 -67 -170 -86 -219 -76 -20 -52 -127 36 185 223 32
7930C2o3J2J3p0k2J62j16K0o7k8J48J17l79K32M0k52K15n1O3K69k86O2o1r3K03
$$ 32 -31 -19 -6 -76 -98 64 -52 -32 -99 -127 21 138 -241 -9 31 -221 -6 -57 6 275 -11 51 -10 -103 100
7955A00p8j00J28k70M55n54J63J05K99k94l5L8Q0P9O7K08o31M55j91j7K31m07
$$ 100 22 -78 50 -220 235 -319 -156 -51 248 -46 -81 -43 37 116 183 391 -240 215 24 7 238 -169
7977a69L04j85j8k46J75K24k66K82Q0k61R0j75J92k09J73J93l39J24J77K2j69
$$ -169 135 -50 -68 -314 -139 85 -181 101 181 -80 10 -165 27 -182 -9 184 -155 -31 146 168 -1
7998aJ08j78K9j15QK14K71l08j34K14r0j0Lk39K47p8K60Q1k89K2K9j07J72J77
$$ -1 107 -71 -42 -157 -149 65 336 28 -106 108 18 8 11 -228 19 -59 201 282 -7 15 44 -63 109 286
8022B86l05Q8k37L5N7j4J00K50m24L17m4l9j5q5J14j08J20j78K43j3k37r8K44
$$ 286 -19 69 -168 -133 -76 -90 10 260 -164 153 109 70 55 -30 84 -24 96 -82 161 148 -89 -187 57
8045E7J28n5j32K91l19M1p2R6M1j22m4P9n0K65K7k84K2j9L38Q3n30L92l0k68K
$$ 57 185 130 -2 289 -30 11 -61 35 76 -46 -90 -11 -61 204 231 -53 -31 -50 288 371 -159 233 203 -65 -63
8070f3O9p8Q0j95R1J02j83O4J54k1R8k44o9K74Oqj1j20O5L9j57L49j66l15M05
$$ -63 6 -72 8 -187 -96 6 -177 -113 41 20 118 -126 -195 79 85 77 66 -54 11 50 -107 242 76 -239 166
8095A66q3k29M55k87q8J59j70j08J45R2M0l26M05j09j73J81J4j63n5J58J49j10
$$ 166 83 -146 309 22 -66 93 -77 -185 -40 52 92 -234 171 62 -111 70 84 -79 -134 24 173 63
8117F3o8l9R8l6n0J02j41j08K08j25J69j02R0k49J48J44j41p1JL01j51j37o5m8
$$ 63 -5 -44 54 18 -32 70 -71 -179 29 -96 73 -29 61 -188 -40 104 -37 -108 -107 194 43 -94 -159 -207
8141b07K68o2M2M9J63j98j36P3J2j68K11n4lK44l26J73j26R3O1j89J27o0JK0K13
$$ -207 61 -1 41 90 253 55 -81 -8 4 -164 47 -7 -10 234 -92 81 -45 48 109 -80 47 -13 -12 8 221
8166B21p8r7ql0k69N41j9k82j2KP6m5P5J31j83J3j36%R4K40k16L2j8j83J2
$$ 221 143 46 38 8 -261 280 261 -21 -33 -31 45 0 75 206 23 36 -100 -100 -6 234 18 50 32 -151 -139
8191a39
$$ Imaginary data points
##PAGE= N=2
##DATA TABLE= (X++(I..I)), XYDATA
0@%%%%%%%%qJ6j6J6k4L6m4N6p2Q8j04J28j52J76k15K55k96L44l97M60n27O01o88
$$ 0 0 0 0 0 0 0 0 0 -8 8 -8 8 -16 20 -24 32 -40 48 -56 72 -80 96 -119 136 -160 184 -213 247 -280 321 -367
31c67P83q86J000j126J266j418J582j764J964k184K423k682K965l272L607l974
$$ -367 416 -470 530 -596 670 -748 834 -930 1034 -1150 1273 -1409 1556 -1716 1891 -2083
47b083M376m816N299n829O415p067P795q608R525j0573J1776j3174J4823j6803
$$ -2083 2293 -2523 2776 -3053 3362 -3705 4090 -4518 5007 -5566 6210 -6964 7859 -8944
61h944J9226k2262K6185l1452L8899n0228O9531j10329L22041k84027k44309O76600
$$ -8944 10282 -11980 14205 -17247 21652 -28576 40955 -69374 252667 -31360 -275669 400931
73D00931o81079L06475J43215l55603K36930M2740k06666J03878J73213l69298
$$ 400931 -280148 26327 169542 -186061 50869 93609 -113057 -9179 164034 -205264
83b05264K80196P3588m54673N84211l56201q2187M42305n04226K69759N8502k45914
$$ -205264 74932 148520 -306153 278058 -78143 -160330 281975 -222251 47508 106010 -139904
94a39904K02893l4892o8833J868J68840k61797J44988J43158m07894M43836j99029
$$ -139904 62989 28097 -40736 -38868 129972 -131825 13163 156321 -251573 192263 -6766
105f766j77755M39090m19263J54079J53974k90258J88892K7688j57240Q5127J20989
$$ -6766 -184521 254569 -164694 -10615 143359 -146899 41993 69681 -87559 -2432 118557
116A18557k69908K05187O1894l48689M37450k42376j18683M06620m35678K02021
$$ 118557 -151351 53836 115730 -232959 204491 -37885 -156568 250052 -185626 16395
126A6395J20732l13217K69380o2321j26858J56065k7267j27390J58990k7431j68268
$$ 16395 137127 -176090 93290 30969 -95889 60176 32909 -94481 64509 37078 -131190
137a31190K69861j85092l6379K41978k90702J57223N4942j97411J86616o0162
$$ -131190 138671 -46421 -82800 159178 -131524 25699 80641 -116770 69846 9684
147I684o5271R2510j7370p3934Q4237Q936j34190J82542r8848o9439K05428k10023
$$ 9684 -55587 36923 19553 -54381 29856 38792 -95398 87144 -11704 -81143 124285 -85738
159h5738P9062R4235j88262J44287r259j06444J16580k3486q6337J15994l5657
$$ -85738 -6676 87559 -100703 43584 34325 -72119 44461 20975 -65362 50632 14975
170A4975r3146J65583j17780k3951J59095j90530R5997N7298j61607J50484m2966
$$ 14975 -78171 87412 -30368 -54319 104776 -85754 10243 67541 -94066 56418 13452
181A3452p5543J19935o9108k5932Q5257o4171j4318Q3080q3968J5273O9672j06501
$$ 13452 -62091 57844 -11264 -37196 48061 -16110 -30428 52652 -31316 -16043 53629 -52872
193e2872O7294J7273q4404Q8344l2035l6478O6029m0389j2678M5679l2264j3615
$$ -52872 14422 31695 -52709 35635 3600 -32878 33151 -7238 -19916 25763 -6501 -20116
205b0116N0642m5161j286N2874o7540L1963K8240o8323N8647q105m4757O0646
$$ -20116 30526 -14635 -15921 36953 -30587 1376 29616 -38707 19940 11835 -32922 27724
217B7724k9584k1258N1406l8844n250M5283m8967J3556L3282n5609L6986Q308
$$ 27724 -1860 -23118 28288 -10556 -15806 29477 -19490 -5934 27348 -28261 8725 17033
229A7033m6574N0453j8984k3415M5109l3031p21K9974l3441J1483J6876k9426
$$ 17033 -29541 20912 1928 -21487 23622 -9409 -10130 19844 -13597 -2114 14762 -14664
241a4664J7893O538k4314K2287l586j6447K2779j1288p592J8738j4884M22J2524
$$ -14664 3229 9767 -14547 7740 4154 -12293 10486 -802 -8394 10344 -4540 -4118 8406
254H406j4396M781Q035j2707O361N017j2325R570R07j0397J1621l971o370J1520
$$ 8406 -5990 -1209 6826 -5881 480 5497 -6828 2742 3649 -6748 4873 902 -5468 6052
268F052p799j672R324r726K749N771r115N989J135p043P089k150l977O408m106
$$ 6052 -1747 -3419 5905 -3821 -1072 4699 -4416 1573 2708 -4335 2754 604 -3373 3035 -1071
283a071o50M250m326J597K149l767K556r9k142K583j191m78J354j098J36Q86j134
$$ -1071 -1721 2529 -1797 -200 1949 -1818 738 639 -1503 1080 -111 -589 765 -333 -197 689 -445
300d45K36L27m19J64L78n80L59J76k37R5J35n23N63k66k80K94J44j54M74p46J97
$$ -445 -209 118 -301 -137 241 -339 20 196 -41 54 189 -334 229 -37 -317 -23 121 -33 441 -305 -108
321a08K76n15M01K26m84J55L41n81M79K05j151Q99K48j173J494n64p96J929j953
$$ -108 168 -347 54 280 -204 -49 292 -289 190 395 -756 143 391 -782 712 148 -648 1281 -672
340f72J43K139k840J032J673l699L163M33m062M906j893k924N596m323o67N424
$$ -672 -529 1610 -1230 -198 1475 -2224 939 1372 -2690 2216 323 -2601 2995 -1328 -1995 3429
356C429n957K258L748p368M635J873o903O940j052o346R350m726m053R902q688
$$ 3429 -2528 -270 3478 -3890 745 2618 -4285 2655 1603 -4743 4607 -119 -4172 5730 -2958
371b958N75Q384j0970N246M464j0733Q475J036j0043J0864k486q828J3947q065
$$ -2958 -2383 6001 -4969 277 4741 -5992 2483 3519 -6524 4340 1854 -6974 6973 -1092
385a092m877J5194j4610K987J1374j7402J0115M396j4850J3691j840j1678J5446
$$ -1092 -5969 9225 -5385 -2398 8976 -8426 1689 6085 -8765 4926 3086 -8592 6854
398F854o015q915J7322j1534m755J8634j9146N363J2993k2342J5653K227j7538
$$ 6854 839 -8076 9246 -2288 -7043 11591 -7555 -2192 10801 -11541 4112 6339 -11199
411a1199J8365n152j1185J7216p880q855J9027j2850n985K2577k3291O280J7210
$$ -11199 7166 2014 -9171 8045 165 -8690 10337 -2513 -8498 14079 -9212 -2932 14278
424A4278k9581K0985K195k2526K5074r165j2193K1473j1485q783K1940j6016n688
$$ 14278 -15303 5682 7877 -14649 10425 1260 -10933 10540 -945 -9728 12212 -3804 -9492
437i492K6529k9253R223K0039l6640K8259r89k5849L3305j7095q841K4019j8082
$$ -9492 17037 -12216 -2993 17046 -19594 8665 7676 -18173 15132 -1963 -10804 13215 -4867
450d867k136J9003j7337k300K3516k7959R876J8889l7032L0463k916k5967L5736
$$ -4867 -7003 12000 -5337 -7637 15879 -12080 -2204 16685 -20347 10116 7200 -18767 16969
463A6969k1146n198K3169k0120J101J5603j4811l499K3740k6803O769K3443m1053
$$ 16969 -4177 -9375 13794 -6326 -5225 10378 -4433 -7932 15808 -10995 -4226 19217 -21836
476b1836L1300M71l2467M2385k4355p358K9102k6218M295J6765j8856L97K2007
$$ -21836 9464 9935 -22532 19853 -4502 -11860 17242 -8976 -4681 12084 -6772 -6375 15632
489A5632k7769Q472K3078m2689L4210j024l4106M7320l0236m333L1274l3357J2693
$$ 15632 -12137 -3665 19413 -23276 10934 9910 -24196 23124 -7112 -11445 19829 -13528 -835
502h35J1892k0010P248J3226k1541Q258J7666l5795L0063j168l1326M4178k9197
$$ -835 11057 -8953 -1705 11521 -10020 -1762 15904 -19891 10172 9004 -22322 21856 -7341
515g341l012K9380l2910J4731Q219j7959Q098R590j6615N027J7965l2932K4783
$$ -7341 -10353 19027 -13883 848 9067 -8892 -794 8796 -7819 -2792 15173 -17759 7024
528G024L744l3690M3669k6056p561L3763l5472J4422J1328k2292J2330P159j7401
$$ 7024 10768 -22922 20747 -5309 -12870 20893 -14579 -157 11171 -11121 1209 8368 -9033
541i033Q280J3789k9777K4330J420l0327M1744k6240o432L3159l7072J8067Q651
$$ -9033 -753 13036 -16741 7589 9009 -21318 20426 -5814 -12246 20913 -16159 1908 10559
554A0559k3618J8259l46j2992R969N935j9825J7918Q17k3483L2912k0626n884
$$ 10559 -13059 5200 4854 -8138 1831 7766 -12059 5859 6676 -16807 16105 -4521 -10405
567a0405K8363l1850J5474P815k0947J6859j768j0002Q198M420j5576J3220L081
$$ -10405 17958 -13892 1582 9397 -11550 5309 3541 -6461 1737 6157 -9419 3801 6882
580F882k1783K7678j4706q995K7640k8249J0970J1292k2899J7207q18j1934J1181
$$ 6882 -14901 12777 -1929 -10924 16716 -11533 -563 10729 -12170 5037 4219 -7715 3466
593C466J072j3209J3533n65j6132K3111j3500o620K3308k5156J0861R491k1188
$$ 3466 4538 -8671 4862 4297 -11835 11276 -2224 -8844 14464 -10692 169 9660 -11528
606a1528J7374k995j0068J2172l618p066R942k597r119J5296r674m611J7170j8199
$$ -11528 5846 2851 -7217 4955 1337 -5729 4213 1616 -7503 7793 -1881 -6492 10678 -7521
620g521P430P542j6280J3348k179q333J0216l498n104P642j734p361J1434o264
$$ -7521 -91 7451 -8829 4519 2340 -5993 4223 725 -4379 3263 1529 -5832 5602 -662
634f62n105J4137j3890L818Q859j4603J0357K27r099R989l391n181Q269l313m698
$$ -662 -5767 8370 -5520 -1702 7157 -7446 2911 3138 -5961 4028 637 -4544 3725 412 -4286
649d286R123o085k371J0185j1277M080O162j2040R425o63o983Q572m263k386O147
$$ -4286 4837 -1248 -3619 6566 -4711 -631 5531 -6509 2916 2253 -4730 3842 -421 -2807 3340
664C340l911j876N733m496q97O200p000K436M257p868N691J4n055O382l064k238
$$ 3340 -571 -2447 3286 -1210 -2107 4093 -2907 -471 3786 -4082 1609 1623 -3432 2950 -114 -2352
680b352M770k841j509M224l134p37M562m931J323L415n805L853R86m610N094k079
$$ -2352 2418 -423 -1932 2292 -842 -1579 2983 -1948 -625 2790 -3015 838 1824 -2786 2308 229
696B29k528M598k883q59L440l197L69L009l837J333J869l752L384k63k822L547
$$ 229 -2299 2299 -584 -1443 1997 -1200 -831 2178 -1659 -326 1543 -2209 1175 912 -1910 1637
712A637j818j211K936k202j08K273k557J082J149k169J230N85k008J755Mj792
$$ 1637 -181 -1392 1544 -658 -766 1507 -1050 32 1181 -988 242 827 -1181 574 578 -1214
728a214K013o36j059J802j332P6J102j431N91Q46j082K39P04j353P88L06r84P46
$$ -1214 799 163 -896 906 -426 -350 752 -679 -88 758 -324 -85 619 -734 54 360 -624 122
746A22q6o31J321p91m21J068q57J60M42o30L19K13n89O14l25m98Q65l26l93P13
$$ 122 36 -595 726 -65 -486 582 -275 -115 327 -303 16 229 -360 254 -71 -569 296 -30 -423 290
766B90l76L01J08n16J80J76n07K86J00k45M42k20j95L13l24P8K26j02k31R9J8
$$ 290 -86 215 323 -193 -13 163 -344 -58 42 -203 239 19 -176 137 -187 -109 117 15 -216 -117 -99
787i9R1J4j92L18j85j38L28j25j77L65j27j51K40k90n2L81j72n3J1j62J93L5k90
$$ -99 -8 6 -186 132 -53 -191 137 12 -165 200 73 -78 162 -128 -180 201 29 -24 -13 -175 18 53 -237
810b37L59n3k66K79j54k65O35l19J9J80k19KJ22l16J99K66m90L36P1q11O35J24
$$ -237 122 69 -197 82 -72 -337 298 -21 -2 178 -41 -39 83 -233 -34 232 -258 78 149 -662 -27 97
832I7m48O93r4n72O35o05J00P91j136K16Q49j012O16J16q69R24j28n24Q54l13
$$ 97 -351 342 248 -324 311 -294 -194 597 -539 -323 526 -486 130 246 -623 301 173 -351 503 190
852A90p71J354r40l22J305j123K51Q03j444J243J54j687J493j60j573K201j062
$$ 190 -581 773 -167 -489 816 -307 -56 747 -697 546 700 -987 506 346 -1227 974 -88
869h8o61J980j856J45J760k343R28J317j862J028N84k358K318n87j687K895j798
$$ -88 -749 1231 -625 -480 1280 -1063 -135 1182 -680 348 932 -1426 892 305 -1382 1513 -285
886b85q01K843k637O25J907k949J301J110k443J526Q32k817L063o71k509L695
$$ -285 -1086 1757 -880 -255 1652 -1297 4 1114 -1329 197 1029 -1788 1275 604 -1905 1790
902A790k226j066L529l278O32K789l834K079R84k968K126M63l044L223k42l244
$$ 1790 -436 -1502 2027 -1251 -619 2170 -1664 415 1399 -1569 557 1020 -2024 1199 957 -2287
918b287M517k705j308M733m833J159K862m420K957Q18l651L055J07l381L782n34
$$ -2287 2230 -475 -1783 2950 -1883 -724 2138 -2282 675 1493 -2158 897 1004 -2377 1405 871
934H71l609N560l214j587N396n681J734L246n592L906L56l707L708l95l359L757
$$ 871 -2738 2822 -392 -1979 3417 -2264 -530 2716 -2876 1030 1386 -2321 1387 992 -2367 1390
950A390m42m148N979l565j999O870o698J901M171p050M744L50m102M190p09l067
$$ 1390 948 -3200 2779 -786 -2785 4085 -2613 -712 3459 -3591 1153 1503 -2599 1591 882 -2185
966b185L964r33l737N964l293k632P243p399K226M342p784O314p51m690N593k070
$$ -2185 1779 846 -2891 3073 -220 -2852 4391 -3008 -782 3560 -4224 2090 1339 -3351 2242 172
982A72k478M388j640l251N802l486k549P528p486K421M835q574O529p51m854O298
$$ 172 -2306 2082 442 -2809 2993 -493 -3042 4486 -3000 -579 4256 -4318 2211 1460 -3394 2904
998B904l091j864M158j984k533N256l217k616P437p412K198N142r487P187j13
$$ 2904 -187 -2051 2107 123 -2410 2846 -371 -2987 4450 -2962 -764 4378 -5109 2078 1965
1013A965o070P434l746j851M817k683k047M981l234k116O759p175J925N413r185
$$ 1965 -4105 3329 -417 -2268 2549 -134 -2181 2800 -434 -2550 4209 -2966 -1041 4372 -4813
1028d813P233n80o143P932m494j328M985l956l3L430k830j463N763o129J425M947
$$ -4813 2420 1840 -4303 3629 -865 -2193 2792 -1164 -1197 2233 -597 -2060 3703 -2426 -1001 3946
1044C946q916P063j96o402Q354m747j139N177m476R5L515l175j076N614n942J218
$$ 3946 -4970 2093 1897 -4505 3849 -898 -2037 3140 -1336 -1241 2274 -901 -1977 3637 -2305 -1087
1060a087M983q215O257j11o108Q225m760j537N677n054Q11L249l871O89L581m805
$$ -1087 3896 -4319 1938 1827 -4281 3944 -816 -2353 3324 -1730 -919 2330 -1541 -852 2729 -2076
1076b076J605L870p392N850l1o157Q108m893j100N686n563J754K642m257J597
$$ -2076 -471 3399 -3993 1857 1826 -4331 3777 -1116 -2216 3470 -2093 -339 2303 -1954 -357
1091c57K564m132J732K544n852M889M0m952O824l733j659N306n411J793K364l641
$$ -357 2207 -1925 -193 2351 -3501 1388 1428 -3524 3300 -433 -2092 3214 -2197 -404 1960 -1681
1107a681J555J802l456J809K057m785L781M40m844O146l678j252N068m774J298
$$ -1681 -126 1676 -1780 29 2086 -2699 1082 1522 -3322 2824 -854 -2106 2962 -1812 -514
1122e14K545l866J936J343k965J788J334l916L739p13l329N033k899r25M147m584
$$ -514 2031 -1835 101 1444 -1521 267 1601 -2315 1424 711 -2618 2415 -484 -1409 2738 -1846
1138a846J784J724l263K048M91k425K280N5k451K817j066j993L828k383q72L176
$$ -1846 -62 1662 -1601 447 938 -1487 793 848 -1603 1214 148 -1845 1983 -400 -1272 1904
1154A904l448J486J448l098K496p8k053K050k73j749K280q13j431K826k061o43
$$ 1904 -1544 -58 1390 -1708 788 710 -1343 707 434 -1315 965 152 -1279 1547 -514 -1157
1170a157K621k602Q08J579k663J840J97j956J955j24j729K214r46r31K142j832
$$ -1157 1464 -1138 -330 1249 -1414 426 623 -1333 622 498 -1231 983 37 -894 1248 -584
1186e84J25J455j903O19J198k127J795m0j568J854p77p37J344p36o96J627j092
$$ -584 -459 996 -907 -288 910 -1217 578 538 -1030 824 47 -690 654 -82 -778 849 -243
1203b43l8R04j155M72O83j351J090k73m47P20k53p87J247p01j21O72q21M30K32
$$ -243 -281 623 -532 -60 623 -728 362 89 -358 362 109 -678 569 -132 -253 419 -402 28 260
1222B60n89O41M2r76J033l23l97N97k07k19P49p70r3P18o79J37L59n82M62Q9m52
$$ 260 -329 312 354 -622 411 88 -309 288 81 -138 611 -159 -252 466 -213 -76 283 -299 163 252 -200
1243b00N64l75j70J87j17l56M98k77m8L45n27L51L25m41L53lm13L94o5P9o5j03
$$ -200 364 -11 -181 6 -111 -467 31 -246 -294 51 -476 -125 200 -241 112 109 -304 90 25 104 39 -64
1265f4R9J13m03J63J83k60L19K25n68L04q5j33N03n36j07K61J62l15N05m43K2
$$ -64 35 148 -255 -92 91 -169 150 375 -193 111 26 -107 396 -140 -247 14 176 -139 366 -77 -55
1286e5L67m93L41n8k81L88j43k15K02j93J54J52k41j88K34p7K75L8l59L77j16
$$ -55 312 -181 160 102 -179 209 66 -149 53 -140 14 166 -75 -263 -29 -106 169 207 -152 225 109
1307A09l85M09K4n10M10k2l34M02j80j78N14l85P3L18p56O06K3n59M57J47n17
$$ 109 -276 133 157 -353 57 35 -299 103 -77 -255 259 -126 -53 265 -491 115 138 -421 36 183 -334
1328c34P00m0o34O96o44q4O69o91L55L23p74K92M15q34O77L74j002R59l52o52
$$ -334 366 326 -308 388 -256 -340 329 -362 -7 316 -458 -166 249 -585 92 466 -536 423 71 -581
1348e81J401q67l17J011q01J4O59j165P02M45j012Q52M8j345J551m33q53J422
$$ -581 820 -47 -364 647 -154 -140 519 -646 56 501 -511 341 389 -956 595 162 -691 731
1366G31j088j72J536j402K86P38j288O51O36j537J281J61j701J911q34q96J918
$$ 731 -357 -529 1007 -395 -109 629 -659 -8 628 -909 372 533 -1168 743 -91 -987 931
1383I31j129m01J748k024R89O17j659J179L69j610J210L45j371J594m44j396K339
$$ 931 -198 -599 1149 -875 114 731 -928 251 620 -990 220 565 -806 788 344 -1052 1287
1400A287j793r6J830k329J240Q50j968J169L35j572J336L15j894K089r08r87K537
$$ 1287 -506 -602 1228 -1101 139 989 -979 190 525 -1047 289 604 -1290 799 -109 -1096 1441
1417A441k030J98J882k728J389Q63k294J791P0j692J817j12j702K067p91j293
$$ 1441 -589 -391 1491 -1237 152 1015 -1279 512 582 -1110 707 595 -1107 960 169 -1124
1433a124K825k253j49K436l259J570J106k527K165m32j649K181p42j305K252j091
$$ -1124 1701 -552 -701 1735 -1524 46 1152 -1375 790 358 -1291 890 148 -1157 1095 4
1449Dj327K992k660M43K480l806K343N19k534K671p58j541J909m41j541K482j200
$$ 4 -1323 1669 -991 -548 1932 -1874 469 988 -1546 1125 367 -1174 735 294 -1247 1235 35
1466C5j386L083k505l2K663l505J913R76k984K910p76j578K109r09q97K107j374
$$ 35 -1351 1732 -773 -805 1858 -1647 266 1242 -1742 1168 392 -1186 923 14 -883 1224 -150
1483a50r53K680k237j77K770l535K112O08l076L367j170j575K605j479m61J901
$$ -150 -1103 1577 -660 -837 1933 -1602 510 1118 -1958 1409 239 -1336 1269 -210 -671 1230
1499A230j488q23K766k518K40K516l821K487M52k821L384j309j517K616j775l01
$$ 1230 -258 -1081 1685 -833 -593 1923 -1898 589 1041 -1780 1604 295 -1222 1394 -381 -682
1515f82J984k066J59K002k416M95K367l530K124P71k980L379j622j295K930k256
$$ -682 1302 -764 -605 1397 -1019 -524 1843 -1687 437 1208 -1772 1607 -15 -1310 1620 -636
1531f36J20J568j663J83J827k121K18K123l469K523L53k812L272j555j427L170
$$ -636 -516 1052 -611 -428 1399 -722 -504 1619 -1850 673 1026 -1786 1486 -69 -1496 1674
1547A674k570M01J502j711O20J184k041P21J531k651J846N20k795K927j324j246
$$ 1674 -896 -495 1007 -704 -84 1100 -941 -220 1311 -1340 506 1026 -1769 1158 -166 -1412
1563a412L152k282K49J665k218R31Q76j866R36J075k377J885J33k296K684j321
$$ -1412 1740 -542 -293 1372 -846 85 961 -905 31 1106 -1271 614 747 -1549 1135 -186
1579a86q35K494k280M62J159j560R35O77j747J223K81j635J532p9j773K298j047
$$ -186 -1021 1473 -807 -345 814 -746 189 866 -881 342 623 -1012 520 441 -1332 966 -81
1596h1p99K197j928L95J310j848Q41O54j610J040M39j492J370j48j430K210j206
$$ -81 -880 1317 -611 -216 1094 -754 87 741 -869 171 610 -882 488 340 -1090 1120 -86
1613h6p25K122j917M36J148k000J200J54r45Q43R1j044J209k57j109J681j221
$$ -86 -811 1311 -606 -170 978 -1022 178 332 -613 230 321 -723 486 229 -880 801 -420
1630d20l0J364j364L73R34j290O43J76j114J007j75n75O89J81p50Q98r49J23Q68
$$ -420 -450 914 -450 -77 857 -433 210 386 -728 279 104 -471 218 399 -351 547 -402 -279 589
1649E89j217P29N36j245R96J07j174J042l45m27P72q5m41Q13o89k71P42p15R2
$$ 589 -628 101 637 -608 388 495 -679 363 18 -409 363 278 -163 650 -39 -310 432 -283 -191
1668a91O95q30M52Q3m98N98m13j44M72k75j42N60p41L70L37n14K62M36q92O79
$$ -191 504 -326 126 209 -289 309 -104 -248 224 -51 -193 367 -374 -4 333 -181 81 517 -375 304
1688C04oo82O45l73j07N56k17k01L02l20o4N48p56M15M3m01N22j66l74P50k64
$$ 304 298 -384 261 -112 -219 337 120 -81 221 -99 -163 385 -371 44 87 -314 208 42 -332 418 154
1709A54o19M61k77J97M00k82J46k4k82Q6K3l00K16J55k74K21q9j69L29p8m9K45
$$ 154 -465 -4 -281 -84 316 34 180 156 -126 -40 -17 -317 -101 54 -220 1 -88 -257 72 -6 -55 190
1731A90l96J54J44j49J63n9m00M13k4l01M27n00J62L02j85R4K20l55K14j81j09
$$ 190 -206 -52 92 -57 106 47 -353 60 36 -265 162 -338 -176 126 -59 35 255 -100 114 -67 -176
1752a76K63j03j80J75o1O4K46k69Q2O4l19J20J75j24K75l26J27j2ml43L14M7j50
$$ -176 87 -16 -196 -21 -82 -18 228 -41 41 105 -214 -94 81 -43 232 -94 33 21 17 -326 -12 35 -115
1775a15K70n0j54J27k44K00j4k86M38j06k56J14J63k49M57l24l75O20l52K21J49
$$ -115 155 105 -49 78 -166 34 20 -266 172 66 -190 -76 87 -162 295 -29 -404 216 -136 85 234
1796B34l07QK45k83k21N64m53M72l51j5J95p3k49J37K3L4J89k76O5K17n93L49
$$ 234 -73 -65 180 -103 -324 240 -213 259 -92 -107 88 15 -234 -97 -74 -40 149 -127 -62 155 -438 -89
1818h9K04k98K45n2l88O32j47l31L34j23r3K96k65j42N82o67L54J40m18J35K84
$$ -89 115 -183 62 10 -378 254 107 -224 110 -13 -106 190 -75 -217 365 -302 52 192 -226 -91 193
1839A93m84N97l1n04N47k93l22O08l76p1L74m92L99Q0o45O37j13m06M02j1l35
$$ 193 -291 306 275 -229 318 25 -297 311 -65 -136 238 -254 145 225 -420 217 104 -302 100 89 -246
1860b46N95m59J07J63m15K41K77m21K01L12p81L87J3l34P46n39j07P08o93j04
$$ -246 349 -110 -3 160 -255 -14 263 -158 43 355 -426 -39 -26 -360 386 -153 -260 448 -245 -349
1880c49P23p80L67L74n66L20j86j78N78q4l23L97r3k98M01m20N8M87o30K95L17
$$ -349 374 -406 -39 335 -231 89 -97 -275 303 219 -104 293 200 -98 303 -117 -59 428 -202 93 410
1901D10p69N85J59o14N96k90k64P23n15l18Q55p61j41P95o72L23K44r46P96j0
$$ 410 -359 226 385 -229 367 77 -187 536 21 -297 558 -203 -344 451 -221 102 346 -600 196 186
1921A86n66O58l1p19O04k85j74M96l88j66Q16q00L39M85q35M67K08p13Q41k38
$$ 186 -380 278 247 -472 132 -153 -327 169 -219 -385 431 -369 -30 455 -380 87 295 -418 423 185
1941A85n69Q78l12m13O00n78p1R10j137L92P54r40P68l26m67O11l60n18Q06l20
$$ 185 -384 494 182 -231 369 -209 -280 630 -507 -115 639 -301 467 141 -326 285 -75 -593 213 -107
1961a07j34O29n93l2Q41j310O94L03r14J007l07n28Q88m22k08O94p05j89Q98n97
$$ -107 -241 388 -205 -237 604 -706 -12 291 -623 384 77 -451 437 15 -193 501 -204 -393 505 -92
1981i2l24P63r03O32O08j250O20K6n25P56n25p7Q00o33j33N66n45j3O68q92P34
$$ -92 -416 347 -556 76 684 -566 54 80 -445 311 -214 -291 509 -124 -257 309 -236 -249 419 -473 261
2002B61K35r00M95K08p00P70l68j22O07r56L98P31j030L82N20q24L80L23p99N75
$$ 261 496 -404 91 299 -401 369 1 -121 486 -470 -72 659 -371 11 531 -293 87 410 -389 186
2022A86R0p06Q51o41l5M81m43l5M86o17R3O57o34L43L31r19P72j87p92R73m04
$$ 186 276 -430 421 -220 -255 226 -217 -252 234 -383 -290 367 -267 76 407 -512 260 73 -719 254 -150
2043a50Q3N83n77j18O01j000L38N96n27K24J04o45O48J08r77J100m58l53R21o28
$$ -150 -67 516 -61 -179 422 -578 -240 356 -171 53 157 -488 160 268 -709 391 -67 -420 501 -127
2063a27KN29p35K36K40k89L01J3o63R34l36l80M16j45k35R00q99P9O07p02K20
$$ -127 -125 404 -331 -95 145 -144 157 170 -493 441 105 -275 141 -4 -239 661 -238 -159 448 -254 -34
2084c4L72n99L05j62k1N25m05j50L91m5k57M25p82J31M94l32Q9J36k6J36j31j22
$$ -34 338 -261 44 -118 -139 386 -19 -169 222 177 -80 345 -437 -306 188 -144 -55 81 55 191 60 -62
2106f2K16o2p6L00n95k0M64k84R6K05m75K24J81l30M22j24l84M27q1l49M91n5
$$ -62 154 92 16 316 -279 -299 165 -119 -23 182 -293 -69 112 -218 204 80 -304 123 42 -307 184 129
2128A29j19K3j48K60r0l38N41j04m45M95k87q8M65l89j2K48j27Q1P2j85q8K33
$$ 129 10 33 -115 145 55 -283 258 154 -291 204 -83 -171 294 -95 -107 141 14 95 167 -18 -106 127
2150A27l11J76J90m35L00K55m94J69J95l29K65j82K24q7j99M76n53K40J46p2j27
$$ 127 -184 -8 182 -253 47 302 -192 -23 172 -157 108 -74 150 63 -136 340 -213 27 173 101 -26
2171b6Q1Q6m6j25p2L11o8j63J64n4j53K18j5k64J96pr5mk77M97o9k50O5nm8P4
$$ -26 55 141 95 -30 -102 209 141 -22 142 88 -65 153 138 -126 70 63 -32 -36 -313 184 115 -135 -70 -75 -123 -49
2197d9n2L1j95K37j25J96K8j44J51p9J26K32j54ol28J58r8R1j34J74J48l13O2
$$ -49 -101 -70 -265 -28 -153 43 71 -73 78 -1 125 357 203 197 -131 27 -71 20 -114 60 208 -105 -43
2220d3O2j46K95j30j24O9n4J67j66J21n4j04q2K12Kp3N2L1k97J78k1J27p3N2J00
$$ -43 19 -127 168 38 -86 -17 -71 96 -70 51 -3 -107 -189 23 25 -48 4 35 -262 -84 -105 22 -51 1 101
2245A01j94l3N7JJ50k48MM1O3L37k49M8j37J48L7Ok28K83r3j71J48j42J67l6k51
$$ 101 -93 -126 -69 -68 82 -166 -162 -121 -58 279 30 78 -59 89 126 132 -96 187 94 -77 71 -71 96 60 -191
2270a91J75J94k59J67q3j77J8J50ml24M40O2Q4k17m9j77J1K53P3q6l8Q6j4j01
$$ -191 -16 178 -81 86 3 -174 -156 -6 -10 -334 106 168 252 35 -14 -191 -180 73 146 60 22 108 94 -7
2294gJ07l41L44k18K93o5k48k22K84j55L08l75M98K23n11j34J14J77k43M43l14
$$ -7 100 -241 103 -115 178 113 -135 -357 -73 -228 80 -295 203 426 -85 -219 -105 72 -171 272 -42
2315d2J47L8r1Nj96J96p7K9L9P2j35j67N01n02K02r9%O1nj34M37k62l97M53r4
$$ -42 105 143 52 57 -139 57 -20 9 48 120 -15 -182 319 -183 19 -80 -80 -19 -24 -158 279 17 -380 73 -21
2340b1r7J71j67J11J26k41j02L40k85J36K39k97Q1k09K32Q0o4K14k96N7k19L06
$$ -21 -118 53 -114 -3 123 -118 -220 120 -165 -29 210 -87 -6 -215 17 97 33 247 -49 8 -211 95
2362I5m2j01J18l74L44r5L4M0J88l14M44l02k29J77k19J92L13m33K90l8j74p8
$$ 95 53 -48 70 -304 40 -55 -21 19 207 -107 337 35 -194 -17 -236 -44 269 -164 126 88 -86 -164
2384a64K72k68Q2K16j85J04o2j09J81j88r5J59j14L46k46j15K44J3l27K56KJ09
$$ -164 108 -160 -78 138 -47 57 -5 -114 67 -121 -216 -57 -171 175 -71 -186 58 71 -256 0 2 111
2406A11p0P5k48M05j53j45N41n05k4L52n34J25R4m70M69J30l78N18k43m35M32
$$ 111 41 116 -132 273 120 -25 516 11 -13 339 -195 -70 24 -446 23 153 -225 293 50 -385 47
2427D7j47J76K76n99l9M13l56M41J94l81qJ20k69J71J57l89M24m09J96K7j60J03
$$ 47 -100 76 352 -247 -286 127 -229 212 406 25 17 137 -132 39 196 -193 231 -178 18 45 -115 -12
2449a2L85o89M06N7l99M67l99RM10j35l15L12m04N2N48m83J08L25o14L24J07j14
$$ -12 373 -316 90 147 -252 215 -184 -175 235 100 -215 97 -307 -255 293 -190 -82 243 -371 -47 60 -54
2471e4L11m23L6L10k36J64K12m60K78Q3l54K38J76m00J90oj61M4m9K21K49l87
$$ -54 257 -166 -130 180 -56 108 320 -140 138 221 -133 105 281 -119 71 65 -96 -52 -101 120 369 -18
2493a8J92J79n88M6L42k63L02n0l74K73L84r70N21K62k20K30l39j72N67k80o9
$$ -18 174 353 -235 -189 153 -110 192 142 -232 41 425 -545 -24 238 18 248 -91 -263 304 24 -45
2514d5J27l54L85R5m20L33M9m03M96l13j09L83m03j9L72j20n9K91n92M41Ql56
$$ -45 82 -272 113 208 -212 121 170 -233 263 -50 -159 224 -179 -198 174 54 -5 286 -306 135 143 -213
2536b13L19j5l31N14j4k70K04m11J92J64m66K82O5k87N87o6m67L55l45j79O79
$$ -213 106 91 -240 274 260 -10 194 -217 -25 139 -327 -45 20 -267 320 254 -213 142 -203 -382 297
2557B97m10j02K68k13R4J16k58M62j47l03M67j85r3J38j2k76L92j24j04M10n21
$$ 297 -113 -215 53 -160 -66 50 -208 254 107 -196 271 86 -7 131 119 -157 235 111 7 417 -104
2578a04J42J15k68J24J89l52M78m46k24K12p2N8K99j11k58K17j93J79q3j27J41
$$ -104 38 153 -115 9 198 -154 324 -122 -346 -134 -206 -148 151 40 -218 -1 -194 -15 -98 -225 -84
2599h4M01o61N18o7k19J77r6k20M07o7j8P5k39K2J23n7K18p5o3j07N8p6L9Q7k24
$$ -84 317 -344 174 107 -112 65 -31 -251 156 89 71 146 -93 -71 52 -5 213 138 75 -32 26 -50 -11 76 -148
2624a48J54o6k78N08j97J21n4k51J07j7K43k02QJ06J08k01J40J07k81J03p5J05
$$ -148 6 -60 -338 170 -27 94 40 -211 -104 -121 122 -80 -72 34 142 -59 81 188 -93 10 -65 40
2646D0P1J08j04j6q2M5j05j74J24K5rJ15j78j6J14Q3M9j12J33j54k1J02OJ66r9
$$ 40 111 219 115 99 17 62 -43 -217 -93 -68 -77 38 -140 -156 -42 41 90 -22 111 -43 -64 38 44 210 111
2671A11k91L14k9M5p4j96O9L0m2K63j63r1J6J72k07O4j38P9J95j23k05N3J53R0
$$ 111 -180 134 105 150 76 -120 -51 -21 -63 200 37 -54 -38 134 -73 -9 -147 -68 127 4 -201 -148 5 95
2695I5j64K4J61j82J17r3J81j87K10k63K82j42K07k40j23K28O0k76J56j63L51
$$ 95 -69 -45 116 -66 51 -42 139 -48 162 -101 181 39 246 6 -117 111 171 -105 51 -112 239
2716B39k32l70L23J83J2m30J10M13m27J74l0J19J28j83L5j75K30j09Q2m8P4j14
$$ 239 7 -363 -40 143 155 -275 -165 248 -179 -5 -35 84 212 29 64 -111 119 10 92 44 118 4
2738Dj84K66l21J25J81k02J09l4J92l00J82Nj7J47k5k53J73j18K90r0j42Q7r6
$$ 4 -180 86 -235 -110 71 -131 -22 -56 136 -164 18 23 6 153 128 -125 48 -70 220 130 -12 75 -21
2761b1l3p5K0k6K76j78R7j2K69k03J50p1l17j5O9J23Q1l46K45k78L62n6k65J62
$$ -21 -54 -129 -109 -135 141 -37 60 48 317 114 264 193 -124 -139 -70 53 134 -212 33 -245 117 61 -204 -42
2785d2O1j6j12J15m8or8N4J26l6r7k7L20l69M86j42k41J3K01k11P7p8p7M33m22
$$ -42 19 3 -109 6 -42 -48 -146 -92 34 -2 -99 -126 194 -175 311 169 -72 -59 142 -69 8 -70 -147 286 -136
2810a36J04J65Q1j72O3j91LJ56J41k55M8N2J12r3M3q5n9l7k62L83J21j19J1j00
$$ -136 -32 133 214 42 105 -86 -83 73 214 -41 7 59 171 78 121 36 -23 -60 -322 61 182 63 74 -26
2834b6o7J48j10J63Q2j2j95j36K07oL5j85o1J08N2k92M48j18m2J9qq4L47p8p1
$$ -26 -93 55 -55 108 190 178 -17 -153 54 48 83 -102 -163 -55 -3 -295 153 35 -7 12 4 -80 267 189 118
2859A18r3Ok5P9j37J52o4j28O9l09M83j74K12l02K34k69l3K76Q6j49P3oJ91k99
$$ 118 25 31 6 85 -52 100 36 -92 -23 -332 151 -23 189 -113 121 -148 -181 95 181 32 105 99 290 -9
2883iN9J91n2m59K31N7O9j23K93l60J82q8j20R8j71L01k92l8M05k62k00L36M5
$$ -9 50 241 189 -270 -39 18 87 -36 257 -103 79 -9 -129 -31 -202 99 -193 -231 174 -88 -288 48 93
2906I3M3O2l97K1L46k00J19j02Q9r5J63j67j65P4q7J48J68J37k29J2k54M13n9
$$ 93 136 198 -199 -178 168 -32 87 -15 74 -21 142 -25 -190 -116 -203 -55 113 250 21 33 -221 192 133
2929A33O8p2j29J47j04k13L59j39m9J02r2j41N33m93p0M16l33o3J87k09K25L2
$$ 133 201 129 0 147 43 -170 189 50 1 103 11 -130 403 -90 -160 256 -77 -140 47 -162 63 95
2951I5k33K59m1j06O7J59k89R6J97l88J44j7M13l04l02L41m57L84L9o0j75J81
$$ 95 -138 121 80 -26 41 200 -89 7 204 -184 -40 -57 356 52 -250 91 -366 18 57 -3 -178 3
2973Cj25M8O7r0J3L93k58j17J95k90J63j44K05J32k77K84l7k23l4K22l32L11j22
$$ 3 -122 -74 -7 -97 -84 309 51 -66 129 -161 2 -142 63 195 -82 202 165 -58 -92 130 -202 109 -13
2996a3K08l20K33p8j22J38j83J16k3K7J05j1k17O3Jk3JO4J75k9R9l22j33J87P1
$$ -13 195 -125 108 30 -92 46 -137 -21 -44 -17 88 77 -140 -77 -76 -99 -98 -34 141 112 211 -111 -244 -57 14
3021A4p4K1j39j0J65K78j33l30J46J70m02J75O9J41J01m19K03j88J72j57j11L84
$$ 14 -60 -39 -178 -188 -23 255 122 -208 -62 108 -294 -119 -50 91 192 -227 -24 -212 -40 -197 -308 76
3043G6j31J1K47l37J45JMm7n7L59l78J32j5j66K27p7O4j12K19j02j67R6J55j42
$$ 76 -55 -44 203 -134 11 12 16 -31 -88 271 -107 25 10 -156 71 -6 58 -54 165 63 -104 -8 147 5
3067EoJ11j67J65j87J96j46k59K28K39o2j77K62j45j99J2J75j53J7J30r3L80j62
$$ 5 -1 110 -57 108 -79 117 -29 -288 -60 179 117 -60 202 57 -142 -130 45 -108 -91 39 -54 326 164
3090A64k66M03k83m2p6j3Q1j6m2j06K62pJ77j07k92K14j80K34j87Pr8J10O9j10
$$ 164 -102 301 18 -24 -100 -113 -32 -48 -90 -196 66 59 236 129 -163 51 -129 105 -82 -75 -173 -63 6 -104
3114a04J57j19K11%j15J0N3l09J17P1J19k66K87j41N5k29J99R3j01J64R7l93J32
$$ -104 53 -66 145 145 30 40 93 -216 -99 -28 91 -175 112 -29 26 -203 -4 89 -12 152 249 -144 -12
3137a2j13K00j12j22k9J82O8j67J63Mp3K08l29J76P5j13Q1j99J73M8p3J9l3n1
$$ -12 -125 75 -37 -159 -188 -6 62 -105 58 62 -11 197 -132 44 119 6 87 -112 61 109 36 55 22 -29
3161b9j02K70k13K32j65r1J03K61j80j23J37j11L15k22Q0J81k58j70K04j03l7
$$ -29 -131 139 -74 158 -7 -98 5 266 86 -37 100 -11 304 82 162 343 85 -85 119 16 -21
3182b1P8K4k83J45K38j98QK7o5J06J09q7L7J37l62J05J54l40K79j04q2K6J04q6
$$ -21 57 81 -202 -57 181 -17 -9 18 -47 59 168 81 118 255 -107 -2 152 -188 91 -13 -95 -69 35 -51
3206e1j51J53J04r3RJ13j30R2o0Q3j65p4J51J55P8o7K0l69J50L5j02K14j85k2
$$ -51 -202 -49 55 -38 -29 84 -46 46 -14 69 -96 -170 -19 136 214 147 167 -202 -52 -17 -119 95 -90 -112
3230a12Q8J16j26J32M0k5j87k38M34k84Q9R5j57K9m1J88l15Q5L8K48q8mJ57m27
$$ -112 -24 92 -34 98 138 113 -74 -312 122 -162 -73 22 -135 -106 -147 41 -274 -189 -151 97 9 5 162 -265
3254b65J01K7j21L59k07J59k0J1P2k5J7j3k72M34o3O6k54k6J06k3j2k71L78k03
$$ -265 -164 -137 -258 101 -106 53 33 44 116 91 108 95 -177 257 194 260 6 -20 86 63 51 -220 158 -45
3278d5J46J05l70P2m7L54l59J58n7j16J28m3L43k79qq1K0J51j79J43j25l2J07
$$ -45 101 206 -164 -92 -139 215 -144 14 -43 -159 -31 -74 269 -10 -18 -99 -79 72 -107 36 -89 -121 -14
3301a4P9jK22k14K30o3l7j93J0j05J43j70K28k36P1k93K64K64l31L14l13Q0J07
$$ -14 65 64 286 72 302 239 202 9 19 -86 57 -113 115 -121 -50 -343 -79 185 -146 168 -145 -65 42
3324D2m0m2K33j00o2o9R2n4N1l39N81m44R0K05m7k44J95kM9r7j11Q9j57l0m4L97
$$ 42 2 -40 193 93 31 -38 54 0 51 -288 293 -151 -61 144 97 -147 48 46 95 -2 -113 -24 -181 -211 -255 142
3350A42q1N6j97o6J47%qM6p5j59J03J70J85j70r2o4j02K2K71L4l09K64j60J13
$$ 142 61 117 -80 -146 1 1 -7 39 -36 -195 -92 78 263 93 1 -63 -165 -143 128 162 -147 117 -43 70
3374G0r4n2K66j82o1j41J09%J72j24k01M11n1Nl2k63p7K40n6p5K27L7k51J99O6
$$ 70 -24 -76 190 8 -53 -194 -85 -85 87 -37 -238 173 122 127 95 -168 -245 -5 -61 -136 91 128 -123 76 142
3399A42m7J31m18N36l17p6J38j65j00M44l12K55l35j20K57l3j14J4J55q5J21J80
$$ 142 95 226 -192 344 27 -49 89 -76 -176 268 -44 211 -124 -244 13 -20 -134 -120 35 -50 71 251
3421B51m24J74j09OK23o4j06M5k18K72j63J81m1j58K90l18jn0L07k86K84J24m44
$$ 251 -173 1 -108 -102 121 57 -49 -4 -222 50 -113 68 27 -131 159 -159 -160 -210 97 -189 95 219 -225
3444b25L76l49J51J37j41j8N7J45q2K05J06k92J2m24N15j23j67L1m3O1K37j30
$$ -225 151 -198 -47 90 -51 -69 -12 133 51 256 362 70 82 -342 173 50 -117 -86 -129 -68 169 39
3466C9q2j75J48J47P3j55o1J68j95rJ49k2j54p6J09m7J64j48L70j12L2j12j35
$$ 39 -43 -218 -70 77 150 -5 -66 102 -93 -102 47 25 -129 -205 -96 -143 21 -127 243 131 163 51 -84
3489h4R1o8K3j2L31k50O6k06J33L8k36K56m5m0nQ4j02J68r1j17J27n7l2J88j08
$$ -84 7 -61 -38 -50 281 31 97 -109 24 62 -174 82 37 -3 -8 76 -26 142 51 -66 61 4 -28 160 52
3514E2j33j65J97Q0l6O1j30K9O5n7M6j30O5N8J15j16k12J39J73j85K24J69m71
$$ 52 -81 -246 -49 31 -5 56 -74 -45 20 -37 9 -121 -56 2 117 1 -211 -72 101 -84 140 309 -162
3537a62J08j00K10j8k95K49jj04k7K91k14O4K79j04k83L06j47l19K77r9M0m5N8
$$ -162 -54 -154 56 38 -257 -8 -9 -113 -140 151 -63 1 280 176 -107 199 52 -267 10 -89 -49 -94 -36
3560c6r0l7K1K36R1l55J2K04q1K69l21k5K49j07q1p9K55j06N3l7J27J6n54N26
$$ -36 -126 -163 -142 94 185 -170 -158 46 -35 234 -87 -112 137 30 -51 -130 125 19 72 35 162 178 -376 150
3584A50m45L83p0q2J26k51K35j97J96o5k9l1N5M7m6N3J73m16K56j64J95l15K83
$$ 150 -295 88 18 -64 62 -189 46 -151 45 -20 -49 -80 -25 22 -24 29 202 -214 42 -122 73 -242 41
3607D1j2k5M6o1Q8k70J50J91o4p8R5N4k11k8J52q7J24k88N3L32k59M3k25M36l56
$$ 41 29 4 50 -11 77 -193 -43 148 84 6 101 155 -56 -84 68 -19 105 -183 -130 202 -57 -14 -239 197 -159
3632a59K53m8k10K78k98l0J92pK41k65P1n0p1N2J1J06K14l23l9J42j10n6J49j21
$$ -159 94 46 -164 114 -184 -214 -22 -29 212 -53 18 -32 -103 -51 -40 66 280 -43 -82 60 -50 -106 43 -78
3656g8Q0J67k85N6J59k6k78K16j74qJ99n4P0J50j10k01L06k53J58l08J93l2k22
$$ -78 2 169 -116 -60 99 73 -205 11 -163 -171 28 -26 44 194 84 -117 189 -64 94 -214 -21 -53 -275
3679b75K69lj23J97k65j37J52K32k49J14MQ9Qj35K08j56N5K6k36N24k74o2K98
$$ -275 -6 -9 -132 65 -200 -337 -185 47 -202 -88 -84 5 13 -122 86 -70 -15 11 -225 299 25 -37 261
3702B61k93P5j06K77l34j61L69k6j37R7j64J14Q2J21l64N2J49j62J3K86J40k53
$$ 261 -32 43 -63 214 -120 -281 88 62 -75 22 -142 -28 54 175 -189 -137 12 -150 -137 149 289 36
3724C6j08j84J29J84k1K8N6j68J04J3l2J14NR4j49K5k95K87o7O9q5q7J36o9nO0
$$ 36 -72 -256 -127 57 36 64 120 -48 56 69 37 151 156 250 101 126 -169 118 51 120 35 -52 84 15 10 70
3750G0K16k88l7J3m8LJ54R5j64j43m9L40M9j25l7J7k4j11j0J8K56l08J96l6N9
$$ 70 286 -2 -39 -26 -74 -71 83 178 14 -129 -178 162 211 86 49 66 42 -69 -79 -61 195 -113 83 47 106
3775A06k59R4j9L7J1J42R0j57j50O2J20k4k03J31r8J31Q9j18J14p6m2k9%J92k4
$$ 106 -153 -59 -78 -41 -30 112 202 45 -105 -43 77 53 -150 -19 -117 14 103 -15 99 23 -19 -48 -48 144 120
3800A20k2l1j96J21l1O1l8o9J35l8J5j23O0L19m08K50j12m5JO9jrrj13J99j35
$$ 120 98 67 -129 -8 -39 22 -16 -85 50 12 27 -96 -36 283 -125 125 13 -32 -31 38 37 28 19 -94 105 -30
3826c0k5n4r2L10J1k49J80J31k54K81j29j34J50or0K8j15M4q6P5p3J40K0j82J20
$$ -30 -55 -109 -201 109 120 -129 51 182 -72 209 80 -54 96 90 0 28 -87 -43 -129 -54 -127 13 33 -149 -29
3851b9J6mj17l9P0l2m5L23q5rk3N0Qq7j03O4Q9j22J03j6j93l5L40j91j99J95K18
$$ -29 -13 -17 -134 -173 -103 -135 -180 143 58 49 26 76 84 -3 -106 -42 47 -75 28 12 -181 -216 124 -67 -266 -71 147
3878A47k19J80l3K3j25n0O8j21J52j13J49j46K05j55J29r2J55j39J39k65J56J07
$$ 147 -72 108 75 98 -27 -77 -9 -130 22 -91 58 -88 117 -38 91 -1 154 15 154 -111 45 152
3900A52k96J09k5J25l66L57q4j44J07J49q5K2p3l3J4J15J9j43K4J79R3j77M7K0
$$ 152 -144 -35 -60 65 -301 56 -28 -172 -65 84 -1 21 -52 -85 -71 44 63 -80 -56 123 216 39 86 106
3924A06j18J62k07OK08j86q6L2k5M78m63J63K7k50J13j21M01m02J64K03m2r5k28
$$ 106 -12 150 -57 -51 157 -29 -115 -83 -108 370 -93 70 97 -153 -40 -161 240 -162 2 205 163 68 -160
3947a60J00J15j02J47o3k49K68k80J02j16K83j42k27L76r0q8K49k63j15L31QJ38
$$ -160 -60 55 -47 100 37 -212 56 -224 -122 -238 45 -97 -324 52 -38 -126 123 -140 -255 76 84 222
3969B22k95K25mo6j93n9j94J45J30L21m96K51N1j01J08%kJ54j2R3j17j05o5m7
$$ 222 -73 152 148 82 -111 -170 -364 -219 -89 232 -264 -13 38 -63 45 45 43 197 185 278 161 56 -9 -56
3993e6K04m78J60L24r1j20j78M0J66m1J91j36P4Q3k96K9K41o2k46L98l6m9l56
$$ -56 148 -330 -170 154 63 -57 -235 -195 -29 -70 121 -15 59 142 -154 -125 116 54 -192 206 170 121 -235
4016b35L08m8n9O3k66J93K5o2jL12k64j05j41Q3K88k15J26J08k58J55O5K36m37
$$ -235 73 25 -34 29 -237 -44 -19 -81 -82 230 -34 -139 -280 -197 91 -124 2 110 -148 7 72 308 -129
4039a29K16j37l4P4J23Jk27j65M19j30N5n9m1J21l6p1J96l35J49K0J46j83J34
$$ -129 87 -50 -84 -10 113 114 -113 -278 141 11 66 7 -34 87 51 -20 176 -159 -10 10 156 -27 107
4062A07k02J72k61K77k15N9l1kJ55j46J13mj74J18j28K63k55K41k54K80k09j14
$$ 107 -95 77 -184 93 -122 -63 -94 -96 59 -87 26 22 -152 -34 -162 101 -154 87 -167 113 -96 -210
4084b10L89j25P6r3J73k58J03N2j03K33l94M9R2j0J0j04J49J8O2k14NM8k11M75
$$ -210 179 54 130 37 210 -48 55 107 4 237 -157 -108 -16 -26 -16 -120 29 47 109 -105 -100 -52 -263 212
4108B12l69J21M20k86k95P7J14J22p1o0K6NK32j37J88j93k85K01K15p1k14J60
$$ 212 -157 -36 384 98 -197 -120 -6 116 45 -15 11 16 248 111 299 106 -179 22 237 166 -48 112
4130A12J11m80M18p6l2J87j38K1J71l91R6Q8j89J06l5j22k37N53l13J41L6R2j11
$$ 112 223 -257 161 85 53 240 102 123 294 -97 -1 87 -102 4 -31 -153 -390 163 -150 -9 27 119 8
4153Hl1L32j66j14k43J43J68k03J67n0j83K04j2j94L56l50K32j94P3p3K02r8R4
$$ 8 -23 309 143 29 -214 -71 97 -106 61 11 -172 32 20 -174 182 -168 64 -130 -57 -130 72 -26 68
4176F8R2k57l8J7P4JM30m97r5K19L78k34jk9l5o2L7l2j21j7J47K9M2n3j16k4N0
$$ 68 160 -97 -135 -118 -44 -43 387 -110 -205 14 392 158 157 128 93 31 68 36 -85 -102 45 74 116 63 -53 -77 -27
4203b7J84l55J63J6K44l17J24r8q5J56j53J52n3j28J43j24J58M2k9P8j03n8K40
$$ -27 157 -198 -35 -19 225 -92 32 -66 -151 5 -148 4 -49 -177 -34 -158 0 42 13 91 -12 -70 170
4226A70j38k79M6Q2O5P6J39q4j00J62k31k2k02L43k23J95jN3o2J46k51J56O5q1
$$ 170 32 -247 -201 -119 -54 22 161 77 -23 139 -92 -114 -316 27 -196 -1 -2 51 -11 135 -116 40 105 24
4250B4k40L43o0j7j59J10j7J59L4J0l00L2j18K30J99q7k56k2N0N3%K3k52J62K70
$$ 24 -216 127 67 50 -109 1 -16 143 177 187 -113 -81 -199 31 230 143 -113 -135 -85 -32 -32 -9 -261 -99 171
4275A71k30M2q3jK44j45J83j31k48K62O3j09J15k44j65K22J50Ql28J90J46R4k36
$$ 171 -59 -17 -100 -101 143 -2 181 50 -198 64 127 18 133 -111 -276 -54 96 104 -224 -34 112 206 -30
4298c0N3Rj20R3J91j78r4L39k70j49J5RJ37j04J21P7k61J32J31j82J7o2L06K4
$$ -30 23 32 -88 5 196 18 -76 263 -7 -156 -141 -132 5 -99 22 99 -162 -30 101 -81 -64 -126 180 204
4322B04j89r3J60k05J47k12K57R1q7J47m5j52n2j00K17l96J86L11k33K8NJ06k41
$$ 204 15 -78 82 -123 24 -188 69 160 73 220 175 23 -29 -129 88 -308 -122 189 -44 -16 -11 95 -146
4345a46K93l14J01l7J61j18M9K8j48M2R8O9j56J25QJ81p7L5k48L4Nm9j08K66k98
$$ -146 147 -167 -66 -103 58 -60 -11 17 -131 -89 9 78 -78 47 55 236 159 194 -54 -20 -15 -64 -172 94 -204
4370b04K93rpk62J38M5J6j59L02j78k7K07k55k9N0R6k36M9J01J33p1O7j69J96
$$ -204 89 80 73 -189 -51 -6 10 -149 153 -25 -52 155 -100 -129 -79 17 -219 -170 -69 64 -7 60 -109 87
4394H7qJ01j24l5r0J36o4P5k49m4K78O4j86k9K15o2J20l36J2J83J03p8m6r9K02
$$ 87 79 180 56 21 -69 67 3 78 -171 -215 63 127 -59 -88 127 65 185 -151 -139 44 147 69 23 -76 126
4419A26r8r2K45j71O0Qm9J53J8j52k31K32j82K78r9o2Q3K00k55j59J09J57r0p9
$$ 126 28 -64 181 10 70 78 29 182 200 48 -183 49 -133 145 46 -16 67 267 12 -147 -38 119 29 -50
4443e0R2j71KJ98L2j48r1KL09N5n40J08L01L9J21k32o1L1N1N9j66J38j7n2m5K61
$$ -50 42 -129 -127 71 103 -45 -136 -134 175 230 -310 -202 99 138 259 27 -34 -3 48 107 -59 79 62 10 -35 226
4469B26k48N3K75m50K62j38%r1J06J02q1j04r2J83J43j30j73P5n1K73J37n62J72
$$ 226 -22 31 306 -144 118 -20 -20 -111 -5 97 16 -88 -180 3 146 16 -157 -82 -133 140 277 -285 -113
4492a13J17l2J79k57N2J41K3N5M7k75J71K5l55P3L89l24J14o9Q2M9j14j0r2J69
$$ -113 4 -28 151 -106 -54 87 110 165 212 -63 108 133 -222 -149 240 -84 30 -39 43 92 -22 -32 -124 45
4516D5l6J12K1k62J83k8L8Ko2J71o1j59kJ40k0j85O0R6J15l14K21j14j12rL56
$$ 45 9 121 142 -120 63 35 73 75 13 184 123 -36 -38 102 82 -103 -43 53 168 -146 75 -39 -151 -160 196
4541A96k54R8RK1n3M3K0j7M5q8J17k33J20q0J02j66J41k1l2j87L99j01j51n7J11
$$ 196 -58 40 49 70 17 60 80 63 108 20 137 -96 24 -56 46 -120 21 0 -32 -219 180 79 -72 -129 -18
4566a8k06R2K07j24J01j82L9K59k78l3J17q0O4M0k68K33J81j66O4j32m0M24k68
$$ -18 -224 -132 75 -49 52 -130 -91 168 -110 -143 -26 -106 -42 -2 -270 -37 144 -22 42 -90 -130 294 26
4589B6j15K59J49k47k50Q7J6q0M07j89j70J41j01J28j83j05K63R5J9j04l9n9P5
$$ 26 -89 170 319 72 -178 -91 -75 -155 252 63 -107 34 -67 61 -122 -227 36 131 150 46 7 -52 23
4612B3p9J03m3J20r6K13l57J11kj94NK51j97N5j0O1K22k20K37j5k54J39j30K71
$$ 23 -56 47 4 124 28 241 -116 -5 -7 -201 -196 55 -142 -87 -97 -36 186 -34 203 188 -66 73 -57 214
4636B14j66k07L2QJ19l8n6J6J79m39L00N4L4M2j46K9o9Q0j37L71k59P1j05R6k1
$$ 214 48 -159 -127 -119 0 -38 -94 -78 101 -338 -38 16 50 92 -54 -25 -94 -14 -151 220 -39 32 -73 23 2
4661BJ32l1k7k5o6rl9K70k67K96l72L17mN5m67K45j16Q3Q1N6j18k02L6L04j66
$$ 2 134 103 76 51 -15 -24 -63 207 -60 236 -136 181 177 232 -235 10 -106 -23 58 114 -4 -206 -170 134 -32
4686c2J11k42N41m29J39j53k16L64j58p0K41j78Q5J28o4q5N9r1J38k85o7K52k00
$$ -32 79 -163 378 -51 88 -65 -281 83 -75 -145 96 -82 3 131 67 -18 41 -50 88 -197 -264 -12 -212
4709b12J31R4l6K13o8l33Q3j16J40M0nK24j5q7k14P6l3K59r5n9J8%J00j53p3K57
$$ -212 -81 13 -23 190 122 -211 -128 -244 -104 -64 -69 155 140 53 -161 -85 -118 141 46 -13 5 5 105 -48 -121 136
4735A36J2k40j1J16j20K39k36K49j32o2R6k20L41pJ3j12N5k15J19K67l98J97k23
$$ 136 148 -92 -103 13 -107 132 -104 145 13 -49 47 -173 168 161 174 62 117 -98 21 288 -110 87 -136
4758a36K00O4n4M2j25j02K1R5j1K7j10J17m2j72J8L54j29Or1J4J39m0j04R0M6
$$ -136 64 128 74 116 -9 -111 -90 5 -6 21 -89 28 -14 -186 -168 186 57 63 -28 -14 125 85 -19 71 117
4783A17k63J16Qo6J52J15k40L3pQk53L35k52K13k18J80J93l11lK71j20j84O9J40
$$ 117 -146 -30 -22 -88 64 179 -61 -28 -35 -27 -280 55 -197 16 -202 -22 171 -140 -143 128 8 -176 -107 33
4807C3l5j55P0P7N7k07J08K28r3l4j79J23j05J70j44L2J50r5m9Rr6J55j00K7j04
$$ 33 -2 -157 -87 -10 47 -160 -52 176 83 49 -130 -7 -112 58 -86 -54 96 1 -48 -39 -135 20 -80 -53 -157
4832a57J82pn1r0LL49k76j97L39k39J30j85K92J25k11J12J65j81j07L7j49K4R
$$ -157 25 18 -33 -123 -120 229 -47 -244 95 -144 -14 -199 93 218 7 119 284 103 -4 33 -116 -92 -83
4855h3K1J26N9q1l8K5j11o0l50N36J6k77K73n0J64k05j40j12N43l07Q6N0l45K91
$$ -83 -62 64 123 42 4 29 -82 -142 -492 44 60 -217 56 6 170 -35 -175 -287 256 -51 35 85 -260 31
4879C1J28m14L50j83M8P9k33J56q0nJ26J13j2k44P0mQ1j13j8r%K21j08m0K02k37
$$ 31 159 -255 95 -88 -40 39 -194 -38 -118 -123 3 116 104 -140 -70 -74 7 -106 -124 -133 -133 88 -20 -60 142 -95
4905i5P5j43nK46l47R2K30j28j06K25M8k10J65J48j42o0nJ26n7n02K58r7M38k14
$$ -95 -20 -163 -168 78 -269 -177 53 -75 -181 44 92 -118 47 195 53 -7 -12 114 57 -445 -187 -284 154 -60
4929f0J16j64p1J96K06j54J02l33J13J93j91J34m03M20n7LJ09Ll5O5j37K2j01
$$ -60 56 -108 -179 17 223 69 171 -162 -49 144 -47 87 -316 104 47 50 159 162 127 192 55 77 -24
4952b4K9K53l71J31j8J4m3l2R7o1oq9P4J30k3m3J0n1p6P9lp1K5M6l9J2l6o9M8
$$ -24 5 258 -113 18 0 14 -29 -61 36 -25 -31 -120 -46 84 61 18 28 -23 -99 -20 -23 -94 -69 -23 -62 -50 -86 -155 -107
4981a07J91k40L72j70r7k20J83j00K05M8j49J29J19r1l14K24J28k47J67PJ3K72
$$ -107 84 -156 216 46 -51 -271 -88 -188 17 65 -84 45 164 73 -241 -17 111 -136 31 38 51 323
5003C23m14P0j19K17j74J39N5j67lJ67k01q4J94r2l7Q7P1j41j4J10O7k60N64k96
$$ 323 -91 -21 -140 77 -97 42 97 -70 -73 94 -107 -191 3 -89 -126 -39 32 -109 -123 -13 54 -206 358 62
5027F2J97m96K03O3RJ50j79Q3k13L7m8l7r5J28J77r5P9O0j93M5M7M2j38J18j55
$$ 62 259 -237 -34 29 38 188 9 92 -121 -84 -132 -169 -264 -136 41 -54 25 85 -108 -63 -16 26 -112 6 -149
5052a49n3K33J43k01p4q2M09l42n8J81k94L04k1J50k55K45j65J48j58K4J21J21
$$ -149 -202 31 174 -27 -101 -183 226 -116 -174 7 -287 17 -4 146 -109 136 -29 119 -39 -15 106 227
5074B27r1k14N1J82j80Q0p9N4p9J94j45J67j83k88L01j1p1m5n1O7n8K22K1j68
$$ 227 136 -78 -27 155 -25 55 -24 30 -49 145 0 167 -16 -304 -3 -14 -85 -130 -181 -114 -172 50 71 -97
5098i7J28K4mj68J00p1K27l32j1K08Qj21Q6L01n66M11K9m64L79lr0J0R9j25J14
$$ -97 31 55 51 -117 -17 -88 139 -193 -204 4 12 -109 -23 278 -288 123 152 -312 67 64 -26 -16 83 -42 72
5123G2o6J7J2L6j57K55k67M4J46j10R4J21j82j87L42j82OO6j7k77M4J75J05q5
$$ 72 6 23 35 71 -86 169 -98 -54 92 -18 76 197 15 -172 170 -12 -6 60 43 -234 -190 -15 90 5
5147ER8k39P7L24k69Q4j64K89k75j13L26l5L3k23K1o1k2J79k47J68J30n3m0J47
$$ 5 103 -136 -59 265 -4 80 -84 205 -70 -183 143 108 141 -82 -61 -122 -144 35 -212 -44 86 33 -7 140
5171A40l49J29m0J32K11l97J80j1P0q0j63J42J97m4m09L35j3p5rm7R3J27k95R4
$$ 140 -209 -80 -120 12 223 -174 6 -5 65 -15 -178 -36 161 117 -292 43 30 -45 -54 -101 -8 119 -176 -82
5195h2K41m0k17J04j1Rj33J70j6j03N6J89P3r2q9Rj72K34k10J8R5K1o6jj96K59
$$ -82 159 119 -98 6 -5 4 -129 41 25 -78 -22 167 240 148 59 68 -104 130 -80 -62 33 54 -12 -13 -209 50
5221E0J04k91J92k0j34J90k8r7J12j77J59q2K28j34j15r9k3K87P7j55J02r0p8
$$ 50 154 -137 55 35 -99 91 63 -34 78 -99 60 -22 206 72 -43 -142 -165 122 199 44 146 56 -22
5244b2R6j57k1j29Q5L40k50M9O4k25J45J73J98l54M0j2m4Q1n5O0P6k21PJ60J0
$$ -22 74 -83 -104 -233 -148 192 -58 -9 55 -170 -25 148 346 -8 32 20 -24 57 2 62 138 -83 -76 84 94
5269I4j42L4j91J07K44j59K4J4J03j81P1J04m2p6M0j75M3J42P9p3k08J63R1j57
$$ 94 -48 -14 -205 -98 146 -13 11 25 128 -53 18 122 80 4 44 -131 -88 54 133 60 -148 15 106 -51
5293e1J38k66J72j5j25pJ24k09K6K18Q9K00k14j74M03k46K9J8J51k70J9n1j64
$$ -51 87 -179 -7 -22 -147 -154 -30 -239 -213 5 94 294 80 -94 309 63 92 110 261 -9 10 -41 -205
5316b05L95n2q6M0j3oo8n6M1N7j05J35j74J00k11K42N9k90K52j2J67m10M56k76
$$ -205 190 138 52 92 79 73 5 -51 -10 47 -58 77 -97 3 -208 34 93 -197 55 43 210 -200 256 -20
5340b0q5j00J03N1k36K77M3K27n4Pj55j81J5Q2J62j32J56j71K9J72l90J21K40
$$ -20 -105 -205 -102 -51 -287 -10 33 260 206 213 58 -123 -108 -26 136 4 160 -11 18 190 -200 -79 161
5363A61P7k31r7J46l15K88L55n18J29R4l14J43l7j34J98m1%Q1j14M5j00l1K90
$$ 161 238 7 -90 56 -259 29 384 -134 -5 89 -225 -82 -119 -253 -55 -96 -96 -15 -129 -84 -184 -215 75
5386G5J67p7j93j71J94O4K05N5k40l32q2L00j55K07o6j26J55K64j42M0j73K37
$$ 75 242 165 -28 -199 -5 59 264 319 79 -253 -335 -35 -190 17 -49 -175 -20 244 102 142 -31 206
5408B06j97o6J39p3O5o0o9j18K84k95K33m70O38j88P0p0n9J59j44k7J18J8k11
$$ 206 9 -57 82 9 74 14 -55 -173 111 -184 49 -421 217 29 99 29 -30 129 -15 -42 76 94 -117
5431a17l4J91m6l33M08Q2l05j22J50J01o9j42M34m12J01J07N2j0K08m18L64l33
$$ -117 -151 40 -6 -339 69 151 -154 -276 -126 -25 -94 -236 198 -214 -113 -6 46 36 244 -174 190 -143
5453a43R2Q4O1k50R6j67o1K97r6J50J13n4k39L25k12J12k7p9j1J01k96R6MK04
$$ -143 -51 33 94 -156 -60 -227 -288 9 -87 63 176 122 -117 208 -4 108 81 2 -9 92 -204 -108 -104 100
5477A00l0l1l1K8k91K37K03O8k82J21q9K82l62J73J4KM1l59PJ98N9k75K59k8Q4
$$ 100 70 39 8 36 -255 -18 185 253 -29 92 3 285 -77 96 110 112 153 -206 -199 -1 58 -217 42 14 98
5502I8k51J20k8n2K04k0J53n3j68OL1j7J65k24M8j07n6K70j56l3n0L31j88m3k0
$$ 98 -153 -33 -61 -113 91 71 224 171 3 9 40 23 188 -36 12 -95 -151 119 -37 -70 -120 211 23 -20 -40
5527d0K9o9j31K64N6J71j95j01m8L2J29j41j7J47m1j36J99k87J19n0K05l3j84
$$ -40 -11 -80 -211 53 109 280 85 -16 -64 -32 97 -44 -61 86 45 -91 108 -179 -60 -110 95 62 -122
5550a22J33j98J50j06P8K5j20K74j5j98K58j25L9J44j22k14L36m25m8N61l53q
$$ -122 11 -187 -37 -143 -65 -40 -160 114 99 -99 159 34 73 217 95 -119 217 -208 -256 305 -48 -56
5572e6nK42j89j4L3k65O66m79J82N9m15J20Q6j10L24m12L52k34K9K63k20n7K93
$$ -56 -61 181 -8 -22 11 -254 412 -67 115 174 -241 -121 -35 -145 179 -233 119 -115 -86 177 -43 -100 193
5595A93j46n3p1K39q9j86P2J29m%k14L04k47j30K13L3J62n59M75l1J06j41M7m8
$$ 193 47 -6 -77 162 73 -113 -41 88 84 84 -130 174 -73 -203 10 43 205 -354 121 90 196 55 102 54
5619E4m6K59j96q7MJ43o9p8Q5P3k39j1r4N4l7M3j03K60N3L4j24l0l3L4K51j87
$$ 54 8 267 71 -16 -12 131 62 -16 69 142 -97 -108 -202 -148 -185 -142 -245 15 68 102 -22 -52 -85 -51 200 13
5645A3K06l92J62J12j84r4K19j94K43Lk2l22K31K04k48R8j9R5j33J20j80K06j42
$$ 13 219 -173 -11 101 -83 -177 42 -152 91 94 72 -250 -19 185 -63 35 16 111 -22 98 -82 124 -18
5668a8J95k75L86j31k48K40n3L1j06p5P1k04L59k80J75Q5k90J55q6O7j19J94K70
$$ -18 177 -98 288 157 -91 149 96 127 21 -54 17 -187 172 -108 67 152 -138 17 -69 -2 -121 73 343
5691C43m62J47M4N5j76L3j34J69j9K02j73k6j3Pj31J53j31l1O4J91o4j12K15k6
$$ 343 -119 28 72 127 -49 -16 -150 19 0 202 29 3 -10 -3 -134 19 -112 -143 -79 112 48 -64 151 125
5715A25m5o2j36Q1J80M2O6n0R3k55Oj56L18k43j07N4K70p2p0J16N2k83K28j53
$$ 125 80 18 -118 -37 143 185 251 201 294 39 45 -111 207 -36 -143 -89 181 109 39 155 207 -76 152 -1
5739ap8J00j71j01P4K70J04n5k1k42J42N9j25Q6j24n1Q9K90l98K67l6J7k5j25
$$ -1 -79 21 -150 -251 -177 93 197 142 121 -121 21 80 -45 41 -83 -134 -45 245 -153 114 78 95 70 -55
5763e5m5p9J64l0r7J06R3p9J47j28L4j67lK2J06K5j78J71p3J45n1O9j91J57r0
$$ -55 -100 -179 -15 -45 -142 -36 57 -22 125 -3 31 -136 -139 -117 -11 14 -164 7 -66 79 28 97 -94 63 -27
5788b7j64k8L05q3j22K07J61j89j26Q3k53J94OJ6O1qq7l5M9j7O0K66j74J20j81
$$ -27 -191 -219 86 3 -119 88 249 60 -66 17 -236 -42 -36 -20 41 33 -54 -89 -40 -57 3 269 95 215 34
5813C4Q7j69P0M1p7O9j11j93L70k88K26j56j74J07K3J41R1j51n5M3J15J24l93
$$ 34 121 -48 22 63 -14 55 -56 -249 121 -167 59 -97 -271 -164 -141 0 91 -60 -115 -72 43 167 -226
5836b26L48j94J31K5l32K13J84j44j20J30J45o2k08R9R8j94lJ05K51n3j67j00
$$ -226 122 -72 59 84 -248 -35 149 5 -115 15 160 98 -110 -11 87 -107 -110 -5 246 193 26 -74
5858g4K31j64J07j34l3m9N6q7J16J07j74K59j31l4K09n94P56k26Ll93K26L1J67
$$ -74 157 -7 100 -34 -67 -116 -60 -147 -31 76 -98 161 30 -4 205 -389 367 141 144 -249 -23 8 175
5881A75j34l0j36P7l3K86N1m24J65l6j42K22P7Mj36j67K79J25k72R1J04l40K55
$$ 175 41 11 -125 -48 -81 205 256 -168 -3 -39 -181 41 118 122 -14 -181 98 223 -49 42 146 -194 61
$$ [...]
8191c7
##END NTUPLES=NMR FID
##END=
