##TITLE=1H_EL28-2l
 CDCl3
 8 sc, 
 25.11.2024
##JCAMPDX= 6.0         $$ Bruker NMR JCAMP-DX V2.0
##DATA TYPE= NMR FID
##DATA CLASS= NTUPLES
##ORIGIN= UXNMR, Bruker Analytische Messtechnik GmbH
##OWNER= root
$$ XWIN-NMR		Version 3.5
$$ Mon Nov 25 13:57:25 2024 Russian Standard Time (UT+4h)  she@DPX200
##.OBSERVE FREQUENCY= 200.1315
##.OBSERVE NUCLEUS= ^1H
##.DELAY= (6, 6)
##.ACQUISITION MODE= SIMULTANEOUS
##.ACQUISITION SCHEME= undefined
##.AVERAGES= 8
##.DIGITISER RES= 18
##SPECTROMETER/DATA SYSTEM= spect
##.PULSE SEQUENCE= zg30
##.SOLVENT NAME= CDCl3
##.SHIFT REFERENCE= (INTERNAL, CDCl3, 0, 15.7039)
##AUDIT TRAIL= $$ (NUMBER, WHEN, WHO, WHERE, WHAT)
$$ ##TITLE= Audit trail, XWIN-NMR		Version 3.5
$$ ##JCAMPDX= 5.01
$$ ##ORIGIN= Bruker BioSpin GmbH
$$ ##OWNER= she
$$ F:/spectra/data/she/nmr/H-F/1/audita.txt
$$ ##AUDIT TRAIL=  $$ (NUMBER, WHEN, WHO, WHERE, WHAT)
(   1,<2024-11-25 13:52:49.23 +0400>,<she>,<DPX200>,
      <created by zg, POWCHK disabled, PULCHK disabled
       configuration hash MD5:
       00 E9 B6 7A A2 85 ED C7 34 08 36 98 17 FE 4E 26
       data hash MD5: 16K
       43 5A 9B 07 CB C4 39 FC A9 30 3E 8C 18 BC E6 0B>)
$$ ##END=
$$ 
$$ hash MD5
$$ 42 E6 AB 1E 54 E3 9F 7A BD DE 58 A0 AB E6 B3 C6
##$RELAX= 
##$RELAX= 
##$RELAX= 
##$RELAX= 
##$RELAX= 
##$RELAX= 
$$ Bruker specific parameters
$$ --------------------------
##$DU= <F:/spectra>
##$EXPNO= 1
##$NAME= <H-F>
##$PROCNO= 1
##$TYPE= <nmr>
##$USER= <she>
##$AMP= (0..31)
100 100 100 100 100 100 100 100 100 100 100 100 100 100 100 100 100 100 
100 100 100 100 100 100 100 100 100 100 100 100 100 100 
##$AQSEQ= 0
##$AQ_mod= 1
##$AUNM= <au_zg>
##$AUTOPOS= <>
##$BF1= 200.13
##$BF2= 200.13
##$BF3= 200.13
##$BF4= 200.13
##$BF5= 200.13
##$BF6= 200.13
##$BF7= 200.13
##$BF8= 200.13
##$BYTORDA= 1
##$CFDGTYP= 0
##$CFRGTYP= 5
##$CHEMSTR= <none>
##$CNST= (0..31)
1 1 145 1 1 1 1 1 1 1 1 1 1 1 1 1 1 1 1 1 1 1 1 1 1 1 1 1 1 1 1 1 
##$CPDPRG= <>
##$CPDPRG1= <>
##$CPDPRG2= <>
##$CPDPRG3= <>
##$CPDPRG4= <mlev>
##$CPDPRG5= <mlev>
##$CPDPRG6= <mlev>
##$CPDPRG7= <mlev>
##$CPDPRG8= <mlev>
##$CPDPRGB= <>
##$CPDPRGT= <>
##$D= (0..31)
0 1.2 0 0 0 0 0 0 0 0.06 0 0.03 0 0 0 0 0.0002 0 0 0 0 0 0 0 0 0 0 0 0 
0 0 0 
##$DATE= 1732528368
##$DBL= (0..7)
120 120 120 120 120 120 120 120 
##$DBP= (0..7)
150 150 150 150 150 150 150 150 
##$DBP07= 0
##$DBPNAM0= <>
##$DBPNAM1= <>
##$DBPNAM2= <>
##$DBPNAM3= <>
##$DBPNAM4= <>
##$DBPNAM5= <>
##$DBPNAM6= <>
##$DBPNAM7= <>
##$DBPOAL= (0..7)
0.5 0.5 0.5 0.5 0.5 0.5 0.5 0.5 
##$DBPOFFS= (0..7)
0 0 0 0 0 0 0 0 
##$DE= 6
##$DECBNUC= <off>
##$DECIM= 24
##$DECNUC= <off>
##$DECSTAT= 4
##$DIGMOD= 1
##$DIGTYP= 9
##$DL= (0..7)
0 120 120 120 120 120 120 120 
##$DP= (0..7)
150 150 150 150 150 150 150 150 
##$DP07= 0
##$DPNAME0= <>
##$DPNAME1= <>
##$DPNAME2= <>
##$DPNAME3= <>
##$DPNAME4= <>
##$DPNAME5= <>
##$DPNAME6= <>
##$DPNAME7= <>
##$DPOAL= (0..7)
0.5 0.5 0.5 0.5 0.5 0.5 0.5 0.5 
##$DPOFFS= (0..7)
0 0 0 0 0 0 0 0 
##$DQDMODE= 0
##$DR= 18
##$DS= 0
##$DSLIST= <SSSSSSSSSSSSSSS>
$$ [...]
##$SUBNAM2= <"">
##$SUBNAM3= <"">
##$SUBNAM4= <"">
##$SUBNAM5= <"">
##$SUBNAM6= <"">
##$SUBNAM7= <"">
##$SUBNAM8= <"">
##$SUBNAM9= <"">
##$SW= 24.0689530833862
##$SWIBOX= (0..15)
0 0 2 0 0 0 0 0 0 0 0 0 0 0 0 0 
##$SW_h= 4816.95568400771
##$TD= 16384
##$TD0= 1
##$TE= 0
##$TE2= 300
##$TE3= 300
##$TEG= 300
##$TL= (0..7)
0 120 120 120 120 120 120 120 
##$TP= (0..7)
150 150 150 150 150 150 150 150 
##$TP07= 0
##$TPNAME0= <>
##$TPNAME1= <>
##$TPNAME2= <>
##$TPNAME3= <>
##$TPNAME4= <>
##$TPNAME5= <>
##$TPNAME6= <>
##$TPNAME7= <>
##$TPOAL= (0..7)
0.5 0.5 0.5 0.5 0.5 0.5 0.5 0.5 
##$TPOFFS= (0..7)
0 0 0 0 0 0 0 0 
##$TUNHIN= 0
##$TUNHOUT= 0
##$TUNXOUT= 0
##$USERA1= <user>
##$USERA2= <user>
##$USERA3= <user>
##$USERA4= <user>
##$USERA5= <user>
##$V9= 5
##$VALIST= <valist>
##$VCLIST= <CCCCCCCCCCCCCCC>
##$VD= 0
##$VDLIST= <DDDDDDDDDDDDDDD>
##$VPLIST= <PPPPPPPPPPPPPPP>
##$VTLIST= <TTTTTTTTTTTTTTT>
##$WBST= 1024
##$WBSW= 4
##$XGAIN= (0..3)
0 0 0 0 
##$XL= 0
##$YL= 0
##$YMAX_a= 120906
##$YMIN_a= -85146
##$ZGOPTNS= <>
##$ZL1= 120
##$ZL2= 120
##$ZL3= 120
##$ZL4= 120
##$ABSF1= 10
##$ABSF2= 0
##$ABSG= 5
##$ABSL= 3
##$ALPHA= 0
##$AQORDER= 0
##$ASSFAC= 0
##$ASSFACI= 0
##$ASSFACX= 0
##$ASSWID= 0
##$AUNMP= <proc_1d>
##$AZFE= 0.1
##$AZFW= 0.1
##$BCFW= 1
##$BC_mod= 2
##$BYTORDP= 1
##$COROFFS= 0
##$CY= 11.3945322036743
##$DATMOD= 1
##$DC= 2
##$DFILT= <>
##$DTYPP= 0
##$F1P= 15.6554695791079
##$F2P= 12.8336369535428
##$FCOR= 0.5
##$FTSIZE= 0
##$FT_mod= 4
##$GAMMA= 1
##$GB= 0.15
##$INTBC= 1
##$INTSCL= 1
##$ISEN= 128
##$LB= 0.24
##$LEV0= 0
##$LPBIN= 0
##$MAXI= 10000
##$MC2= 0
##$MEAN= 0
##$ME_mod= 0
##$MI= 1.114404
##$NCOEF= 0
##$NC_proc= 0
##$NLEV= 6
##$NOISF1= 3.799351
##$NOISF2= 2.8
##$NSP= 1
##$NTH_PI= 0
##$NZP= 0
##$OFFSET= 15.70392
##$PC= 1
##$PHC0= -26697.15
##$PHC1= 1.987439
##$PH_mod= 1
##$PKNL= yes
##$PPARMOD= 0
##$PSCAL= 0
##$PSIGN= 0
##$REVERSE= no
##$SF= 200.130013532006
##$SI= 16384
##$SIGF1= 3
##$SIGF2= 2
##$SINO= 400
##$SIOLD= 16384
##$SREGLST= <1H.CDCl3>
##$SSB= 0
##$STSI= 0
##$STSR= 0
##$SW_p= 3612.71676300578
##$SYMM= 0
##$S_DEV= 0
##$TDeff= 0
##$TDoff= 0
##$TI= <>
##$TILT= no
##$TM1= 0
##$TM2= 0
##$TOPLEV= 0
##$USERP1= <user>
##$USERP2= <user>
##$USERP3= <user>
##$USERP4= <user>
##$USERP5= <user>
##$WDW= 1
##$XDIM= 8192
##$YMAX_p= 0
##$YMIN_p= 0
$$ End of Bruker specific parameters
$$ ---------------------------------
##NTUPLES= NMR FID
##VAR_NAME=  TIME,          FID/REAL,        FID/IMAG
##SYMBOL=    X,             R,               I
##VAR_TYPE=  INDEPENDENT,   DEPENDENT,       DEPENDENT
##VAR_FORM=  AFFN,          ASDF,            ASDF
##VAR_DIM=   8192,          8192,            8192
##UNITS=     SECONDS,       ARBITRARY UNITS, ARBITRARY UNITS
##FACTOR=    0.0002076,     1,               1
##FIRST=     0,             0,               0
##LAST=      1.7004516,     0,               0
##MIN=       0,             -85146,          0
##MAX=       1.7004516,     120906,          0
$$ Real data points
##PAGE= N=1
##DATA TABLE= (X++(R..R)), XYDATA
0 0 0 0 0 0 0 0 0 0 0 6 -8 8 -8 8 -9 16 -16 22 -24 30 -32 40 -47 53 -60 70 -80 91 -103 116 -132 148 -165
33 -165 186 -208 232 -257 285 -317 351 -390 430 -477 529 -586 648 -722 802 -895 1000 -1125
51 -1125 1274 -1453 1676 -1961 2339 -2871 3673 -5038 7941 -27428 84488 99875 -73831 -56138
65 -56138 46658 27533 -44665 -8194 29729 119 -26203 6506 18662 -10212 -14517 26004
77 26004 16021 -32271 -13548 40012 9284 -37539 -5047 25441 -1761 -1688 16600 -8286 -20068
90 -20068 15850 18322 -14801 -12803 10253 11973 6286 -1404 -8930 2170 13756 3691 -4028 -1675
104 -1675 -1294 5238 8022 -7635 -3000 22194 6023 -26229 -2564 29596 8169 -17149 -7322
117 -7322 5008 9115 6462 -8516 -6387 18201 14933 -12222 -11900 5990 8416 2490 -5672 -8685
131 -8685 6108 10023 -9908 -7400 14212 3811 -11242 3676 2340 -17724 -2699 16954 -3171
144 -3171 -13803 8633 13314 -4055 -8128 -4622 -1216 6157 3327 -8164 -5390 3580 4099 154
158 154 -6371 -6560 7787 6240 -16495 -12253 10338 1497 -11327 4600 5524 -12121 -2449 9108
172 9108 -8830 -9415 12212 3319 -15029 -524 11752 -1622 -7130 1371 3136 -358 -2516 -3234
186 -3234 31 195 -1991 3042 2308 -9003 -3036 9099 -1981 -9788 4881 3874 -9611 1354
200 1354 9650 -6178 -4045 12399 183 -10932 7489 10813 -9684 -7688 9506 8003 -948
213 -948 -2505 -1422 2453 5166 1128 -807 -1065 -4152 2106 7989 -4134 -7405 10419 8972 -9270
228 -9270 -2095 10663 -2027 -7499 5439 5325 -2033 3295 2885 -3466 2858 7341 715 -2337 -1876
243 -1876 -2278 4999 5740 -6422 -3878 9093 2172 -6278 3399 2986 -8085 -691 8148 -2273 -5726
258 -5726 4306 2576 -3961 438 4340 1038 -3134 -4934 1752 7301 -3565 -9211 4865 7104
272 7104 -6679 -2902 6138 -5472 -7136 8248 2730 -11313 -1428 6899 -3902 -4219 3955 -184
286 -184 -4333 -558 -1048 -1655 1581 -1054 -3928 164 1211 -397 860 -4126 -6251 4197 5106 -7376
302 -7376 -5347 4252 -390 -2213 3845 -2106 -7056 3928 4323 -7103 -2660 4727 -2287 -2494 3907
317 3907 -259 -2573 3525 -239 -5158 3369 4880 -4873 -3745 3274 2164 1181 940 -2569 -783 4095
333 4095 368 -1662 404 -1594 480 6470 -383 -5993 4712 6898 -5220 -1336 8153 -1018 -5836
348 -5836 5049 3756 -3804 2973 5255 -4496 -1762 7288 2556 -4618 -2051 2238 4149 2174 -3671
363 -3671 -1451 5509 1804 -2595 2106 744 -3668 3058 4807 -4286 -1468 6391 -176 -4423 3265
378 3265 2971 -2577 88 -326 -2586 3371 3362 -5738 -2855 5568 1172 -3004 719 -2164 -3248 4360
394 4360 2599 -5934 -2110 3880 10 -1176 107 -2245 -493 2622 -2359 -3566 2213 944 -3172
409 -3172 -605 -248 -915 2678 -1629 -7933 1405 7253 -4437 -7540 3160 2043 -3131 1847 186
424 186 -6997 304 6405 -2681 -6562 1149 2985 -671 -1553 -1533 382 2222 -1981 -3289 1990 1249
440 1249 -2721 289 347 -3039 2832 4801 -5539 -5578 6335 4317 -4664 -2078 1218 406 3254 1764
456 1764 -4689 -559 5582 340 -2572 1427 -100 -593 3721 286 -4108 3192 4941 -3533 -2725 4501
472 4501 2742 -1423 -848 -272 1901 3994 -101 -2924 1184 2330 1209 2564 -1824 -4805 4751 7238
488 7238 -4855 -4548 6123 2455 -3844 1757 2502 -3633 1145 4665 -2757 -2742 4994 2016 -4160 -1673
504 -1673 2902 2849 -770 -3899 -974 4312 1377 -3145 -570 29 -1349 3412 2077 -6634 -2562 7225
520 7225 733 -6918 1013 3516 -2751 -1548 1776 -2133 -975 2220 -2157 -3153 1962 1138 -2560 -1057
536 -1057 -1144 -558 2461 -689 -5242 -487 3724 -461 -2353 -1139 -1533 696 3192 -2676 -4363 2294
552 2294 2051 -3025 -336 1310 -2393 -195 2158 -2943 -1720 3483 -287 -4302 559 2349 -789
567 -789 -371 -820 -2334 2644 3585 -3681 -3581 3240 2120 -880 140 -1081 -1343 3299 2457 -3091 -1089
584 -1089 2456 153 -73 1121 -492 492 1992 -1680 -1117 3968 1060 -2828 1061 1828 -889 2306
600 2306 2600 -3770 -1006 6250 1008 -4454 1446 2786 -1053 1335 2590 -2482 -1136 3912 1326
615 1326 -2138 124 1516 525 -677 -354 2082 2206 -2858 -1667 4513 955 -3972 1413 2781 -3762
631 -3762 54 6378 -2436 -6782 4356 5324 -4573 -2930 3820 201 -2592 757 1012 -1472 -1020 488
647 488 634 -985 -2359 499 1767 -2949 -2603 4063 818 -5970 -390 4735 -1955 -3239 2122 -784
663 -784 -3726 2161 2561 -4024 -2294 2417 677 -1694 -1243 -1344 62 981 -1747 -1247 1313 -1014 -2468
680 -2468 1642 1139 -2499 150 632 -2920 61 3424 -1669 -3549 1868 2180 -1398 -383 -405 -1388 1316
697 1316 1858 -1265 -1022 228 -409 1323 1447 -1885 -470 3152 -1264 -2770 3490 2675 -3500 -325
713 -325 3864 -700 -1310 2805 259 -2570 2291 3068 -1621 -1843 982 2099 1389 -697 -1274 1754 1422
730 1422 -1239 820 1956 -1720 -308 3553 -72 -2896 2749 2155 -2987 614 4126 -1265 -2697
745 -2697 1847 928 -884 1673 645 -1953 396 2289 -844 -953 669 227 467 515 -1094 -407 909
762 909 -457 -312 1243 -1232 -1453 1715 -272 -2709 2316 2795 -3996 -2202 3786 104 -3193 550
778 550 428 -2052 1097 1478 -3006 -2223 2235 900 -1709 -1528 -689 704 471 -2055 -1177 1838 -445
795 -445 -2015 679 70 -2219 981 1593 -3127 -944 3274 -962 -3830 1144 2294 -1060 -772 -643
811 -643 -1687 628 2131 -835 -1689 225 133 1152 1266 -2396 -1465 3063 1267 -2972 181 2174 -1064
828 -1064 -485 1833 -52 -319 1725 -914 -1960 1805 2462 -796 -1318 -176 863 2490 -158 -2846
844 -2846 805 3430 -27 -1200 1091 -650 -741 3344 990 -3106 866 3220 -1722 -1535 3158 1440
860 1440 -1783 390 789 -322 1480 882 -1265 -415 1312 889 259 -1429 -1353 2723 2647 -2140 -1722 2269
878 2269 391 -917 1858 -36 -2455 1757 2705 -3117 -1964 3507 405 -2853 60 1290 -870
893 -870 -372 -419 -1184 790 1168 -1430 -1813 -645 442 1528 4 -3196 -733 2612 -345 -2656 458
910 458 329 -1177 1142 454 -3367 -542 2630 -1060 -2506 1635 748 -2266 -360 632 -937 282
926 282 661 -1559 -1028 1315 147 -1002 -863 -745 984 1643 -1619 -2392 1917 1269 -1684 155 1011
943 1011 -1632 -294 2076 -894 -1744 1837 881 -1889 253 1376 -220 -192 -43 -592 1650 1219 -1917
960 -1917 -764 2372 696 -431 1069 -756 -1432 2473 2161 -2410 -672 2749 592 -1025 486 587
976 587 -116 1080 447 -457 606 605 -203 785 177 -454 1609 756 -2544 605 3675 -393 -2394 1806
994 1806 1327 -1717 1107 1499 -2049 -618 3188 360 -2275 139 1461 -262 -416 -19 91 166 -589
1011 -589 -262 1390 151 -1545 805 943 -2055 85 2091 -1760 -2849 2436 1643 -3138 -927 1653
1027 1653 -864 -667 1005 -968 -1673 727 165 -1055 -240 -126 -790 147 -376 -1111 888 303 -2074
1044 -2074 -478 1454 -736 -1422 129 -604 -622 1579 -201 -2668 124 1602 -706 -712 298 -1111 -107
1061 -107 1698 -784 -1648 1001 804 -1071 331 723 -896 163 852 -1051 -45 1503 -523 -1596
1077 -1596 1195 973 -326 152 -270 -670 1057 1111 -1044 -555 1086 203 410 908 -884 -404 1999 352
1095 352 -1145 1166 1033 -1279 112 1837 -267 -440 1369 -522 -808 1934 1077 -1408 112 1191
1111 1191 158 657 274 -1055 147 1789 -126 -806 438 296 138 1125 -321 -1123 1435 554 -1356
1128 -1356 459 1215 -895 -275 1131 -556 -795 1606 -88 -2231 808 1685 -1023 -1024 363 -247 225
1145 225 905 -940 -1441 694 605 -791 -223 -515 -662 754 61 -1504 -65 785 -1442 -656 1042 -623
1163 -623 -1148 618 -460 -1189 1053 634 -2211 -668 1479 -338 -986 541 -832 -766 1217 -24 -1757
1180 -1757 -28 722 -535 202 413 -981 -107 911 -703 -805 1052 -144 -1135 617 263 -338 705
1197 705 -222 -1170 922 1341 -1251 -819 1282 -82 -107 1228 -522 -1554 1487 1690 -1307 -326 1656
1214 1656 25 -515 894 273 -152 608 8 -141 990 443 -308 493 75 -262 1509 839 -1768 -28
1232 -28 2488 -27 -1299 627 474 -340 1043 781 -1427 164 1644 -181 -532 1006 -94 -132 590
1249 590 -168 -270 997 194 -1423 501 1373 -516 -715 277 -480 194 1028 -709 -1383 819 790 -588
1267 -588 76 -242 -729 644 685 -1340 -384 937 -667 -865 626 -350 -911 711 -188 -1505 677 794
1285 794 -1664 -991 1011 -54 -713 188 -576 -982 1232 502 -1477 -741 398 407 273 -521 -1274 338
1303 338 985 -1055 -728 922 -346 -1110 628 187 -1092 932 854 -1840 -343 1973 -12 -1480 155
1320 155 630 27 440 -181 -1263 662 1309 -450 -499 245 196 385 643 -662 -350 1308 456 -763 567
1339 567 671 -384 571 237 -877 663 1621 -1155 -1101 1750 869 -817 201 495 -644 900 1195
1356 1195 -867 -859 1346 817 -138 100 -451 396 1318 -24 -732 792 474 -746 504 754 -663 172
1374 172 1078 -859 -654 1423 274 -1591 227 955 -331 144 135 -871 25 1022 -770 -959 215 16
1392 16 -157 607 -620 -1374 844 425 -1366 -48 797 -858 -689 502 -486 -552 428 -369 -1131 475
1410 475 595 -945 -523 26 -187 414 277 -1308 -432 1175 -456 -991 702 -221 -1231 777 350 -1557
1428 -1557 -228 1121 -743 -819 763 116 -1194 -34 164 -348 328 121 -603 20 468 148 153 -168 -770
1447 -770 657 1341 -832 -867 1406 464 -964 650 890 -1108 -44 1573 -536 -897 1149 475 -814
1464 -814 415 962 -150 -86 104 142 883 443 -748 121 594 -57 341 711 -775 -451 1449 531 -1286
1483 -1286 407 867 -677 -55 1080 -462 -431 896 64 -877 827 502 -840 99 436 -166 23 187
1501 187 -694 67 1043 -156 -855 369 34 -84 659 -204 -1238 746 941 -924 -352 749 -343 -541
1519 -541 616 23 -693 237 -130 -711 319 387 -689 -227 -206 -662 411 673 -1151 -920 1016 157 -1072
1538 -1072 131 179 -920 54 747 -891 -625 731 97 -650 161 44 -180 -34 -295 -236 484 -50 -1010
1557 -1010 300 686 -559 -296 441 -1005 -427 1645 -14 -1631 560 920 -861 -269 736 -311
1573 -311 -362 1042 274 -589 119 259 -100 185 30 145 601 -180 -364 1016 816 -959 -205 1119 -184
1592 -184 -196 1191 -485 -927 1202 1144 -970 -643 931 110 -219 565 18 -266 554 107 -178 397 166
1611 166 -217 298 132 -256 580 441 -847 -75 1520 91 -1145 421 223 -518 513 346 -1169 -6
1629 -6 909 -141 -460 327 -195 -120 580 -325 -821 400 246 -854 244 409 -750 -30 247 -580 -226
1648 -226 800 -250 -1282 245 466 -497 -177 -314 -503 163 224 -885 -375 553 -289 -373 84 -608 -680
1667 -680 594 -83 -1096 523 410 -1043 -603 847 -393 -533 425 -220 -515 819 427 -1124 -180
1684 -180 572 143 -292 -32 -517 62 605 -250 -411 630 -77 -116 500 81 -585 842 557 -832 116
1703 116 1241 -82 -622 587 243 -240 601 105 -822 365 960 -196 -346 116 112 301 679 -217 -148
1722 -148 803 158 -228 304 240 -267 626 410 -640 292 744 -570 -632 959 394 -517 375 301 -437 462
1742 462 511 -772 -363 843 -78 -458 282 -226 -122 625 96 -807 83 606 -528 -101 303 -448 -146
1761 -146 551 -374 -311 620 -109 -593 99 255 -388 73 70 -606 271 837 -604 -787 191 -1 -196 268 -260
1782 -260 -1028 455 564 -959 -171 437 -386 -480 308 -239 -473 460 -165 -677 -5 278 -522 -296 132 -397
1802 -397 255 471 -838 -276 785 -37 -720 -47 87 -384 516 348 -753 -150 614 -60 -624 263 -103
1821 -103 -396 479 177 -375 482 324 -644 31 804 -207 -319 406 -126 -119 681 -228 -652 579 597 -354
1841 -354 297 286 -513 276 785 -318 -279 716 58 -492 427 423 -330 296 267 -447 318 788 -346 -280 653
1862 653 108 -221 266 -74 -112 596 466 -734 12 379 -31 92 205 -382 -83 772 -146 -392 521 231
1882 231 -451 156 268 -591 -246 291 -609 -242 814 -9 -740 8 123 -128 365 -117 -700 -21 478 -441
1902 -441 -415 217 -279 -160 287 -201 -456 422 56 -555 139 251 -402 -106 234 -472 -121 572 -464 -591
1922 -591 391 89 -578 -232 5 -648 8 438 -556 -515 622 233 -587 74 -75 -441 332 44 -121 204
1942 204 216 -474 -74 358 -391 26 307 -156 -285 722 292 -732 217 681 107 -38 280 -500 169 746
1962 746 -244 -415 373 153 -109 234 131 -316 186 520 -349 70 675 -273 -213 437 57 98 274 -80 -433
1983 -433 778 347 -406 -125 299 -211 156 463 -189 -370 781 16 -698 241 135 -305 189 470 -393
2002 -393 144 320 -166 -229 489 209 -562 -15 176 -213 243 -108 -404 16 161 -214 -229 74 -343 -112 513
2023 513 -97 -717 395 279 -653 50 436 -369 -411 297 -168 -517 41 -232 -660 158 133 -381 -21 192
2043 192 -371 7 229 -500 -374 297 -96 -364 96 -112 -506 229 67 -399 9 331 -281 -177 430 -133
2063 -133 -411 260 48 -354 372 169 -536 -144 421 -124 -24 181 -369 -32 721 6 -504 256 202 -52
2083 -52 390 212 -234 176 256 -49 -241 595 -85 -341 360 312 -45 318 71 -271 332 446 -267 -237 384
2104 384 25 142 474 -287 -431 264 338 -221 194 364 -254 -94 344 -248 -102 468 -114 -33 124 67 -427
2125 -427 114 -85 -443 303 111 -648 84 585 -163 -247 185 43 -140 476 143 -640 -126 338 -369 -210
2145 -210 138 -84 -200 258 -309 -356 385 -65 -450 39 66 -406 117 -20 -369 -70 393 -433 -556 369 -15
2166 -15 -339 157 -335 -551 146 490 -458 -193 215 -15 -209 220 -228 -465 233 108 -348 185 138 -228 -42
2187 -42 132 -114 -19 261 -471 -147 326 131 -464 -10 243 -92 122 195 -353 -176 360 98 -176 310 -189
2208 -189 -239 449 128 -267 343 358 -400 -131 296 35 -170 475 -8 -226 207 -25 -168 135 458 -144 -103
2229 -103 119 -176 116 68 -291 -157 353 128 -81 392 76 -298 245 68 -140 -140 128 -264 -294 318 122
2250 122 -153 89 -10 -164 311 130 -503 -107 130 -93 -103 -34 -309 -213 251 10 -364 88 12 -94 82 294
2272 294 -280 62 399 -344 -258 347 -488 -268 219 -2 -301 -52 51 -299 -142 352 -347 -278 120 -78 -281
2293 -281 126 -218 -234 240 176 -129 -130 192 -252 -148 213 -23 -190 365 -166 -288 179 151 -351 183 240 -215
2315 -215 12 298 -348 -67 437 45 -263 282 17 -89 280 96 -331 205 422 -7 146 320 -179 -121
2335 -121 222 -28 -131 386 45 -386 158 186 -201 179 241 -29 120 445 -3 -417 191 278 -3 286 322
2356 322 -122 154 377 -198 -84 355 -36 -215 269 220 -230 68 8 -163 175 210 -207 88 326 -160 -87
2377 -87 130 -176 -314 158 31 -688 143 -51 -74 114 72 -101 -221 254 -151 -162 270 -152 -473 37 139
2398 139 -111 283 35 -368 -52 253 -211 -141 3 -73 -102 120 -125 -383 346 159 -292 18 142 -248 38
2419 38 146 -252 -384 162 -49 -544 119 284 -331 -148 -62 -266 -94 154 -366 -242 339 138 -203 -151 -1
2440 -1 -11 242 122 -222 122 246 24 -119 385 54 -156 164 16 -162 93 21 -363 173 331 21 -71 324
2462 324 -318 50 314 -15 -264 125 172 119 55 244 -194 134 318 -4 -32 224 49 -116 354 -4 -112
2483 -112 -33 133 -15 143 209 -134 -206 302 -4 18 179 185 -163 401 126 -217 13 194 -415 53 124 -188
2505 -188 -38 412 61 -153 116 -17 -334 205 380 -62 149 142 -389 -11 221 -54 -245 39 -32 -116 333
2526 333 20 -617 45 112 -96 -25 129 -386 -290 104 -118 -302 -45 -97 -33 -12 126 -141 77 263 -209 8
2548 8 275 -247 -208 72 124 -120 -61 -182 -361 158 372 -320 -117 164 -64 30 173 -44 -305 260 13 -225
2570 -225 19 126 -95 -88 261 -68 -58 72 -198 -27 303 121 -162 230 137 -99 -81 83 45 -189 374 6
2592 6 -384 302 231 -130 49 200 -336 370 434 -107 42 315 -90 -172 315 69 -17 190 198 -108 176 337 75
2615 75 -94 134 -111 -80 308 -316 -209 371 347 -415 77 -31 -275 46 166 -184 135 82 -92 -116 165 90
2637 90 99 -110 -71 -246 88 41 -226 -27 472 -117 -241 -78 -125 -281 268 -36 -375 -89 28 -203 -106 72
2659 72 -420 -180 212 -289 -377 218 -181 -339 -15 99 -243 -12 298 -254 149 317 -58 -148 340 -67 115
2680 115 -80 -116 -36 57 386 -310 -158 76 -215 -66 185 -1 -88 129 -25 -101 247 214 -125 137 70 -176
2702 -176 -36 213 -120 -194 264 45 -172 -44 73 -118 118 251 -160 82 221 -75 207 309 7 117
2722 117 280 -13 -16 193 -60 -278 -1 307 -281 28 182 42 -95 236 156 -239 238 298 -51 130 110 -360
2744 -360 232 339 -171 -146 168 68 -123 120 150 -237 68 -24 41 117 290 138 -1 6 -42 -244 244 -148 -377
2767 -377 340 -30 -271 14 60 -280 94 -57 -267 -320 227 -42 -208 95 101 -447 -62 91 -145 -298 53
2788 53 -191 147 270 -74 -210 60 -32 -257 267 34 -306 -83 182 -117 2 82 -88 -144 53 -175 -171 180
2810 180 -10 -105 -9 160 -306 -350 155 -12 -46 164 -126 -242 292 175 -383 65 44 -155 0 53 -286 5
2832 5 237 -131 -7 -37 -21 -185 191 107 -129 5 172 -13 -67 328 -6 -149 197 -93 -62 140 26 -260
2854 -260 178 301 46 -124 96 -241 70 261 15 -212 52 189 -97 84 90 63 205 -35 -233 12 183
2875 183 -185 -84 197 -256 -249 154 68 -39 107 229 -256 -107 22 51 -144 305 22 -174 135 -43 -203
2896 -203 -35 112 -452 -152 8 -332 -137 20 -42 -120 119 -82 -147 144 17 -334 212 -9 -420 135 163
2917 163 -209 4 25 -42 -192 85 -17 -349 -104 171 -74 46 76 -162 -46 214 -41 -152 170 30 -395
2938 -395 -83 203 -352 -88 -2 -91 10 93 -224 -41 303 142 -138 175 -106 -225 194 -26 -111 -76 283 140
2960 140 136 232 44 -20 298 60 -117 50 -1 -181 58 60 12 145 124 -253 -93 222 -185 -217 78 87 -131 309
2984 309 146 104 53 167 30 143 307 -167 -48 263 -114 -329 301 146 -160 275 360 -425 13 -41 37 -176
3006 -176 196 -127 -318 -45 107 63 160 -68 -283 105 15 -41 -184 112 -79 -270 133 -157 -182 40 -84 -251
3028 -251 -43 104 -217 -250 236 -102 13 -48 -107 13 172 -29 -245 -169 100 -129 -129 -72 -182 -191 287 -78 -106
3051 -106 -54 -85 -287 89 280 -109 68 231 -351 21 167 -138 -161 -30 138 -166 -121 -9 -53 121 -42 -57
3073 -57 -3 100 -172 42 195 -119 9 254 108 -107 102 147 -101 -246 120 -46 52 78 -173 -125 342 37
3095 37 -71 97 70 -237 267 168 -50 224 39 -67 -100 160 -178 4 426 81 -192 -205 162 -208 -90 137
3117 137 -104 77 232 -183 -160 -27 -39 -356 133 -43 42 232 -99 -53 -108 130 -155 -178 -28 185 -95 -40
3139 -40 -166 -140 -130 -13 -117 -112 49 -35 -49 -10 -44 -288 75 -20 -124 106 -65 -201 -22 -79 -222 -97 30 -367
3163 -367 -137 176 -284 -148 181 -58 -206 -6 229 -139 77 47 -151 -12 100 91 -228 122 89 -27 134
3184 134 96 -349 -51 167 -73 -108 134 72 141 155 108 -153 87 161 -84 101 173 -123 66 191 -145 -97 258
3207 258 -23 -107 188 96 -84 -65 157 -76 163 191 -235 42 369 -40 -279 297 87 -58 123 -7 14 -185
3229 -185 150 -22 -105 -1 76 -29 -21 -141 -23 7 145 -137 79 -16 -12 -71 120 -117 -56 124 -55 -295 98
3252 98 167 -256 -135 77 -52 -56 142 -217 -53 138 -28 -75 70 -1 2 -56 142 -9 109 56 -98 107 -44
3275 -44 -134 -40 70 -372 -213 88 224 55 130 59 -128 -32 23 -329 2 93 19 -72 28 -46 -35 190 10 -100
3299 -100 79 -11 -144 -137 210 97 -218 -18 -83 -26 190 127 -177 87 14 -180 -23 -44 -242 -2 150 -94 32
3322 32 9 57 -326 291 54 -188 -115 -154 38 -24 162 -45 -51 170 -120 71 282 81 -31 -7 99 -58 15
3345 15 157 -239 74 18 7 -30 73 268 -100 114 -30 -54 180 261 43 43 59 29 -172 232 136 -64 -8 -29
3369 -29 -19 -78 -26 -116 31 358 -24 -7 92 29 165 -33 172 -206 -73 -149 -58 70 -86 103 59 97 19 46 -23
3394 -23 37 -164 73 185 -193 -98 5 59 -48 -37 -230 -136 148 70 111 126 -30 -119 -23 -288 -84 -78 56 -220
3418 -220 12 125 -81 -150 6 -24 166 8 138 -72 45 62 44 -72 -32 -226 75 230 -203 -11 4 28
3440 28 -26 221 -117 -175 -17 179 99 8 49 108 -44 193 -49 -78 51 -186 26 7 153 -11 -52 192 116 95
3464 95 106 54 -213 -23 123 -160 -5 112 -23 194 90 -76 174 203 3 -82 171 209 -29 7 -104 -69 -70
3487 -70 -166 -103 15 150 -113 125 266 -67 64 -55 -112 94 55 169 -76 -12 62 -116 112 161 -55 149 -43
3510 -43 -120 15 -143 73 -157 47 22 -3 -204 -64 43 -29 52 72 -174 -35 168 -142 102 57 -35 -229 20
3533 20 -50 -29 5 -95 -46 8 -89 -129 -116 -118 -131 34 12 77 5 107 -56 46 1 -178 -232 -101 29 -14 10 8 -65
3560 -65 4 230 -96 112 191 -73 -83 130 186 -276 -54 -97 30 100 44 -70 -154 80 96 -17 23 -97 -148 -97
3584 -97 33 -62 259 156 -164 76 9 -95 10 37 10 -87 173 111 66 -12 54 175 -6 144 167 102 -24 188
3608 188 -57 -4 15 0 68 136 -231 -80 110 125 -125 44 -99 269 196 -113 24 -9 80 -124 108 9 -108
3631 -108 -103 44 65 -118 207 -75 33 -110 -88 -213 -263 38 -3 173 -43 3 -2 7 210 -36 -188 -213 -122 -44 107
3656 107 -12 92 222 -146 125 41 -161 83 265 88 -101 -196 30 -31 -159 199 -182 -129 20 -154 -151 51
3678 51 -49 -75 66 -58 108 44 -206 -216 22 15 -68 25 116 -105 -128 80 18 -91 -20 -12 241 26 87 -166 3
3703 3 204 10 81 222 27 86 33 5 70 304 91 -147 -36 51 19 -116 6 -22 8 -152 44 -89 22 112
3727 112 9 -66 27 -170 95 88 64 49 118 72 -252 -33 7 131 96 39 -59 36 22 -83 -86 63 -59 -197 -121 -163
3753 -163 -34 -181 -61 -28 149 -38 -33 -217 -186 -6 -90 184 -98 136 -21 -45 -203 -122 -32 -160 -42 124 -96
3776 -96 -174 125 -147 -104 -131 75 -127 46 -115 -32 -45 -34 -123 72 8 -138 -226 38 162 -68 82 2 172 -41
3800 -41 59 -111 -28 41 -34 37 221 41 -39 51 -63 -43 -48 126 -25 54 -5 -87 -226 -86 5 -76 48 121 -72
3825 -72 209 138 -43 19 67 -59 68 16 -206 -74 -23 -89 -52 5 18 54 -22 -53 -47 -4 124 -120 8 122 114 10
3851 10 96 -38 -87 -45 -8 27 29 77 -21 -104 162 87 -111 89 -137 210 148 -11 -2 52 -85 8 7 16 -60 43 134 43
3879 43 179 -54 -53 -5 26 239 -191 -96 -91 -242 39 82 -31 81 88 -74 60 9 -101 8 3 25 85 96 86 51
3905 51 -65 18 -141 -66 14 -141 -8 216 113 -35 -98 3 -93 -100 30 1 -91 20 -83 -56 140 -49 -28 82
3929 82 96 -73 122 34 -181 -124 -239 45 -89 15 3 96 -79 -145 32 8 23 78 134 -117 -76 218 33 6
3953 6 -88 19 -148 13 170 -6 42 169 42 -134 239 160 147 82 26 60 -28 76 198 -18 -12 -187 140 76
3977 76 60 33 -152 150 210 -111 -75 156 -93 19 -16 -91 -151 -41 97 -3 123 -40 19 59 -29 32 -2 9 -98
4002 -98 26 130 -65 -15 -2 -64 18 23 -51 47 80 62 -71 -214 43 -128 -70 -70 28 -204 112 231 20 -5 42 213
4028 213 -91 58 -86 -197 -18 -89 -7 -39 27 89 127 239 -174 52 -19 -70 -12 162 -16 69 82 44 -8 -74 -60
4053 -60 32 205 93 19 125 29 82 55 167 -112 -32 -53 -51 -13 -110 133 -7 41 151 51 -82 -95 53 23 91
4078 91 70 14 -70 16 14 66 -34 -29 113 8 -37 -292 5 36 -105 33 8 -129 -55 -195 32 -52 125 2 -25
4103 -25 -141 -81 -36 287 19 -12 95 10 20 -73 -53 -155 115 -22 -153 -82 10 -242 67 63 -67 3 75 80 160 -115
4129 -115 9 12 -11 89 -184 8 108 185 -26 -27 18 -57 -115 -36 -106 93 161 -184 -131 -64 -3 -33 54 -90 3 39
4155 39 85 -147 -31 77 -240 45 124 76 -189 -124 -140 -183 114 -51 65 -6 114 -44 79 -3 -85 124 41 8
4179 8 -4 -79 -30 -125 -57 19 101 41 -5 144 -76 82 -112 122 -24 75 -105 14 25 100 18 139 -44 160 267
4204 267 -39 55 102 -57 -54 216 317 -115 134 3 121 187 -59 172 -102 -2 -64 65 164 7 -158 -108 -43
4227 -43 -96 279 325 -32 362 13 5 47 -25 60 -58 -4 46 -2 42 -3 119 130 3 209 226 -104 -52 -87 4 96
4253 96 -6 49 114 -93 -117 219 -58 -131 0 -195 57 24 7 -227 -227 362 -29 171 132 54 -45 83 68 -2 -170
4278 -170 17 -38 -16 -77 -78 86 -3 157 122 -5 -194 222 -89 18 104 -145 77 -217 166 111 -76 15 -110
4301 -110 -30 15 -25 -8 30 11 -79 145 233 148 -95 73 40 -137 -122 87 39 194 -32 -112 -133 -99 -44 -57 168 -122
4327 -122 -172 -153 21 -92 -94 166 51 45 48 -207 13 -109 -30 -239 -71 230 -157 57 38 -113 -141 -28 -23 168
4351 168 -41 -127 29 12 62 -87 -68 75 -71 116 -52 -156 -40 -104 -97 -214 122 30 -9 -18 -26 -239 53 -17 -56
4376 -56 63 153 24 -77 148 58 87 -54 -42 -39 -64 72 63 23 -94 -2 68 -50 18 68 -4 215 -39 -25 33 210
4402 210 7 27 -13 49 -16 147 -104 -285 101 -70 -75 69 44 179 -5 -27 20 -21 27 -134 81 135 159 96 106
4427 106 -24 13 -71 8 -86 -13 92 5 96 58 123 6 -2 90 -200 73 -137 -55 -263 -27 15 -156 238 -32 -65
4452 -65 2 -211 184 210 67 -103 -25 132 5 5 196 -147 -29 -27 84 137 -84 27 -19 236 43 140 -15 -30
4476 -30 -220 5 77 -42 -133 141 -101 149 -25 45 -170 21 -28 50 112 169 69 -19 147 -16 -114 86 135 158
4500 158 130 31 -21 -176 65 140 -83 127 74 102 -70 249 75 53 -148 99 17 -11 42 -121 -78 -44 3 90 -24
4525 -24 -26 90 -129 -19 -156 -112 249 -29 9 130 -41 106 -145 -18 96 138 -17 35 112 -147 20 90 100
4548 100 -36 -157 10 25 -4 143 -37 12 8 24 -29 -22 143 167 132 -83 78 -33 54 -112 37 -25 -130 -25
4572 -25 35 39 -49 85 36 -13 20 -302 -97 52 42 36 -2 66 -95 202 -30 -99 -228 -93 -59 152 134 -58 61
4597 61 31 88 196 58 -43 -16 -12 -122 88 82 -209 98 -151 69 -115 -244 -144 -38 -40 66 -35 -10 -66 111
4621 111 69 -133 -43 -40 0 -37 -119 -10 344 -56 92 -39 79 -176 -47 44 120 -92 -159 -153 101 -56 61 -15
4645 -15 -51 0 53 -142 -62 -129 57 -73 32 -6 -12 128 25 28 -152 3 -38 105 -53 55 -208 53 -189 -55
4669 -55 -8 -8 108 -4 -53 -59 94 87 -101 54 48 -96 127 45 14 -116 20 -99 73 157 33 -61 -126 32 -107
4694 -107 -17 -4 58 -19 -5 19 67 -11 -184 252 66 -21 49 118 -51 51 -34 -220 -43 -214 -155 44 -55 -4 -266
4719 -266 63 35 -69 42 69 135 -68 86 -84 50 139 -43 45 135 -164 22 -179 -111 -118 -103 84 165 -48 -43
4743 -43 -214 -97 8 45 96 -110 208 74 2 -38 -185 -71 -180 -73 115 -47 51 9 -65 -135 38 -31 79
4766 79 -96 -146 67 -217 40 -9 191 110 75 -93 -79 -43 -34 -99 44 -211 0 96 72 -131 170 133 -202 143
4790 143 75 -24 42 30 -37 31 -6 -27 95 73 -109 56 -102 40 -82 -59 -159 134 -31 136 -155 -105 -27 66
4814 66 204 105 -32 34 160 96 -7 -61 -3 -12 107 -6 9 -35 -71 99 -1 45 -54 89 -44 -77 162 -115 -158
4839 -158 34 -172 190 91 1 54 -23 -123 40 -69 -85 -33 -87 -130 138 92 66 -38 163 -78 -82 -217 5 81
4863 81 163 103 97 -48 -194 1 -31 61 -48 -112 -14 -273 192 141 94 79 -66 48 87 109 -179 27 -84 -5 -58
4888 -58 62 41 -155 -92 -4 -19 -18 13 114 1 78 -9 144 -62 -113 6 81 209 133 -29 219 29 -93 -13 22
4913 22 -111 -33 -64 -53 -57 32 -38 -90 182 -159 67 51 74 -20 6 -59 35 -66 -53 55 40 85 -101 -106 29 95 38
4940 38 -170 -72 24 7 -63 -107 120 -91 92 -10 -255 -93 91 -27 45 51 -94 -41 192 55 18 0 83 -169
4964 -169 73 61 -106 67 -80 -65 63 -116 60 -55 -107 25 101 45 -5 -43 -55 52 -140 -47 -98 131 83 55
4988 55 -60 207 -184 7 -125 -169 80 -24 -32 -35 -79 45 141 -72 46 248 36 33 -43 109 88 -24 -25 -46 95
5013 95 133 27 198 -3 -58 158 41 -149 49 -48 -13 -135 -32 -46 -146 50 213 -68 70 38 -3 68 -55
5036 -55 23 -169 -131 35 6 36 26 58 -57 32 -28 63 130 8 62 -5 31 72 152 -128 55 169 104 -57 140 13
5062 13 -31 138 24 94 -116 -117 -121 87 177 -117 14 14 -98 -133 28 65 -87 -67 31 93 -27 -234 -191 6 -63 79
5088 79 -94 16 93 111 -29 -90 63 -197 -178 -200 51 107 -30 -169 53 -50 -77 131 -53 126 -59 -84 -86 101
5112 101 19 193 49 20 47 40 -22 -61 -156 121 128 -73 -41 19 110 115 122 -158 -25 6 -5 -173 188 160 -107 -145 13
5139 13 133 36 28 121 -123 10 30 179 157 54 12 -126 171 -9 -84 47 15 -107 -10 -21 -139 -28 -127 16
5163 16 4 -13 87 -57 59 106 -23 -100 138 -57 -82 -46 45 7 -63 75 13 19 -19 -13 -84 59 -32 17 -41 58 136
5190 136 97 -31 51 138 -46 122 -73 -219 0 -73 -157 47 91 33 -73 99 -9 99 -76 130 -123 -184 -51
5213 -51 -109 202 14 246 162 89 59 153 222 -215 -201 247 -81 90 -43 -4 19 -7 -15 -131 -164 20 43 -49 160
5238 160 16 -149 -34 137 -181 -66 28 -2 183 -149 3 44 -191 -70 2 -143 -5 -30 7 107 -186 93
5260 93 107 264 -164 129 -99 -118 -46 72 54 168 51 -22 -61 -60 4 -107 -47 -55 -110 30 107 4 145 58 -81
5285 -81 142 50 -54 48 163 3 -199 -27 -5 94 62 98 -47 58 -46 -152 -45 104 46 -95 133 -163
5307 -163 69 275 -44 -32 -105 -71 -106 -4 -156 105 56 32 107 10 104 -9 -39 -5 -76 -111 -13 -135 -34 69 -101
5332 -101 -254 5 30 55 67 83 -15 -150 -230 21 50 103 199 -145 -56 -130 -79 -23 138 191 -28 132 233 19 96
5357 96 24 -121 -3 -127 -55 49 -14 -104 -170 15 129 101 -16 0 2 16 -71 80 -195 149 -35 -21 -197 234
5381 234 -16 -55 -41 14 -105 -91 -137 28 4 1 132 -286 -15 -63 -170 -81 11 -153 18 -128 79 47 99 15 117
5406 117 -277 -198 16 -71 -54 132 -9 -169 -166 211 41 -126 -30 65 -138 100 68 -69 -109 -151 161 -73 213
5429 213 -83 -99 73 -61 -111 75 -180 -71 147 -160 10 -37 109 284 -78 90 -113 1 116 11 143
5450 143 -19 36 -2 30 51 -190 -129 32 25 -265 61 -204 -89 140 -160 -68 -31 -53 147 -174 -37 217 31
5473 31 -46 88 -279 -50 -33 -136 100 -23 21 -108 145 -270 75 23 127 -4 148 -69 -71 -75 -37 -120 -27 -204
5497 -204 -162 129 15 66 104 68 -199 -96 135 -39 -7 -153 29 -17 25 6 104 -134 -35 56 106 17 69 26 10
5522 10 -140 -7 11 33 -67 75 -88 -39 -206 106 -170 57 28 -81 165 -5 97 -186 20 6 -111 7
5544 7 78 -85 27 -77 167 -180 -142 -20 69 -38 -69 91 49 54 -10 -52 40 96 158 124 66 128 190 64 -154 -165
5570 -165 -33 1 -100 117 -21 12 -111 117 287 101 -57 -6 -93 40 189 6 -67 160 -9 86 13 -35 -8
5593 -8 -36 135 63 57 -193 43 -8 -18 -26 -56 -58 -4 -7 -13 -189 40 -89 -259 149 -66 16 86 173 34 -66 -54 -122 45
5621 45 -3 79 -72 8 68 -27 -67 -176 -79 120 144 -152 -83 80 -129 -3 39 -111 -152 -136 -91 -88 -116 235 22 -96
5647 -96 -21 103 -68 -18 -162 -178 64 -24 -107 41 190 112 -80 227 -50 68 -10 82 91 57 -6 -31 -79 -59 5 -40
5673 -40 92 -104 199 -14 134 -40 120 -34 77 238 92 -149 110 -164 -219 24 11 247 82 112 -37
5694 -37 112 -21 54 -162 -7 -68 34 173 -91 -81 -154 86 -284 -55 53 -12 165 90 116 65 50 -62 -34 -66
5718 -66 44 -59 -135 -246 22 -126 9 86 -173 139 -28 -74 13 99 98 131 -246 119 27 132 189 -50 33 -151
5742 -151 -138 42 -29 16 -204 117 -194 -75 -2 215 187 -26 33 -210 -48 88 59 -92 48 35 -207 135 139
5765 139 79 21 -33 -52 31 31 -50 126 -71 135 -8 51 261 240 -55 24 -17 20 194 8 -69 -78 -143 -32 -60 62
5791 62 -1 71 264 54 67 -75 5 86 -17 -125 87 65 -223 68 -196 21 -28 -32 2 32 -55 108 -179 -52
5815 -52 103 24 126 -35 159 -159 -81 -116 32 123 66 101 118 -80 94 -68 -114 -239 -103 -109 -138 -58 195 31
5839 31 -92 187 17 100 88 163 63 -29 34 25 -77 156 -26 -194 236 23 179 -7 38 39 -206 -24 -95 -49
5863 -49 79 -212 -132 206 102 115 73 -79 -4 -91 -259 -19 -45 121 -101 -70 36 -105 -142 151 -35 -93 52
5886 52 -132 227 -37 -72 84 -127 17 -40 -164 -8 25 -72 209 41 -180 14 -84 -159 -168 67 187 -18 -96
5909 -96 -27 -90 4 -48 -185 111 94 -3 -180 -97 -124 69 162 37 -137 -163 19 -94 -34 -7 -162 -50 82 114 285
5934 285 45 58 90 75 5 90 35 -22 -42 6 -129 -14 110 -11 3 -122 195 -64 -138 129 195 -188 258 -56
5958 -56 35 -47 -27 -29 -64 137 -262 -70 74 59 63 46 97 -8 43 -1 34 17 41 -78 -202 196 -37 64 29 84
5984 84 94 235 -1 -122 17 45 -178 14 119 -151 -224 119 -60 -149 142 126 13 -42 113 35 16 70 17 175
6008 175 66 -75 175 102 6 -108 22 -61 -49 -37 -82 -120 27 152 127 -197 1 -82 -6 -101 292 115 89 46
6032 46 -27 147 18 -118 -28 19 83 224 -143 -42 40 109 -96 52 -10 218 -46 -155 34 95 72 134 -7 2
6056 2 252 5 -59 47 -28 90 42 140 -30 -151 -41 41 46 182 58 -144 69 119 34 184 32 -103 47 72
6080 72 176 -119 -48 -149 -255 135 77 -283 -41 -142 180 -88 91 188 138 -17 -52 22 -88 -67 -2 127 30
6103 30 -11 122 -171 -46 -107 64 149 -89 2 -115 -129 -117 -46 43 -74 49 -45 63 -15 84 -74 39 -17 -85 157
6128 157 100 -86 -29 84 38 17 12 45 -98 -69 -39 -3 36 34 -43 43 6 -95 95 -155 -59 15 232 43 184 -104
6154 -104 -50 -88 141 2 106 -122 77 64 60 178 75 -121 -28 89 -14 -39 -126 -155 -77 112 -6 47 -71 35
6178 35 11 124 184 15 182 23 97 112 -20 45 -41 70 71 -50 104 154 136 5 119 -79 49 92 -71 53
6202 53 241 144 -92 22 39 117 -208 -25 -65 14 76 47 61 26 -45 0 102 -250 101 -87 -10 -72 -49 -254 59
6227 59 4 -113 42 89 103 -124 172 162 -226 -42 116 -32 -53 93 -81 -86 57 102 70 -143 51 91 63 98
6251 98 -80 -149 -34 -86 -116 -218 -15 -28 116 -89 -27 -10 -133 113 -44 -85 22 144 -27 -5 -75 -16 74 -72
6275 -72 134 58 79 -86 94 -38 -22 34 51 201 -126 81 51 -57 42 -45 69 141 5 89 41 125 -170 124
6299 124 200 144 106 54 -58 55 33 -33 23 103 -147 -15 57 -217 113 -34 209 -77 34 35 -57 51 -49 106
6323 106 -39 21 66 125 -124 57 127 22 -184 -99 -99 16 -101 204 22 -132 97 -61 62 55 1 137 -14
6346 -14 -50 -142 -172 70 -57 -17 74 -158 108 -39 -128 -70 -139 42 -212 -89 45 197 76 -40 64 3 -57 173
6370 173 -21 -12 -51 -24 -144 22 76 -212 -101 88 153 -84 -30 -31 85 -92 -28 54 112 197 -126 59 24 29 -290
6395 -290 125 -129 -123 70 -69 11 45 95 38 -249 115 137 15 -52 -28 -63 -98 66 -56 59 137 -8 -50 78
6419 78 -29 -95 -18 -82 -2 33 148 -218 206 41 21 -22 97 -55 4 65 133 192 100 101 94 1 8 -93 -161 -24 -20 176
6447 176 187 -106 173 7 -56 120 267 256 65 122 62 -121 18 -78 8 72 127 100 102 -101 -27 -12 284 -30 73
6472 73 71 -99 -16 -137 -16 24 -153 -14 -22 79 -58 -91 -28 -114 0 -27 -174 -102 169 -54 138 151 -17 58 198
6497 198 -155 -16 42 -69 -61 -33 94 12 -25 -15 -9 34 -29 47 -101 -78 53 167 63 -98 101 -110 -200 -126 196
6522 196 56 -51 68 26 22 43 -38 16 41 175 -156 78 1 -84 5 51 19 -18 -71 -45 -27 42 85 -31 48 58 -93
6549 -93 55 107 -17 -82 2 121 -135 75 -122 -179 -14 170 -32 -115 23 -1 -48 -64 147 12 110 44 -62 10
6573 10 112 -140 91 -220 1 -191 6 -53 45 108 -28 -167 -150 -66 -226 77 -161 -104 60 25 -126 -62 66
6596 66 -57 -40 -55 67 -79 102 139 86 -35 32 -111 34 16 6 -180 61 44 -17 122 -92 -86 -17 -6 -106 -3
6621 -3 -12 32 14 76 118 -119 194 -87 -161 73 -80 -30 -36 -81 -258 -69 183 102 131 92 133 -74 -70 89 -5 -31 65
6648 65 74 -136 -78 109 211 -71 0 8 136 17 -62 14 -21 -86 -160 36 -12 17 111 -91 -9 -70 23 -97 -82 4 79
6675 79 171 105 -137 -89 280 -42 57 -121 -23 66 -107 -22 -69 57 139 30 -61 -166 -102 -78 -59 -112 -52 143 -114
6700 -114 -270 -28 11 -57 17 192 63 2 -15 -82 -241 -182 99 9 136 -212 19 12 -16 -177 -98 32 -17 -140
6724 -140 11 -179 7 165 -214 223 -101 -71 -54 143 29 -2 42 -5 -189 -30 336 -37 -250 -117 -67 -49
6746 -49 107 -64 6 26 -86 16 -79 -23 -143 -76 -187 -36 76 32 91 -78 -49 19 64 68 -49 -51 -37 -150 20
6771 20 -28 -232 201 128 243 -22 -113 136 -77 -49 88 61 -72 -73 34 119 -172 118 157 80 176 26 -140 33
6795 33 299 18 186 -43 -102 -131 -20 78 -117 37 10 180 -14 -87 -86 -71 113 -83 -127 -15 23 4 154 214
6819 214 -27 -54 13 -27 67 100 28 -62 173 -59 -71 25 124 12 -23 -27 -217 17 -24 -53 -68 59 15 -249 109 -83
6845 -83 -188 58 137 -135 -104 121 -37 -58 87 47 -38 116 -37 -26 36 101 -188 95 -88 -4 -37 38 -39 90
6869 90 128 -8 20 -74 60 -120 52 -23 -102 67 166 -42 -32 80 -51 66 -86 -129 -175 -16 104 -40 -5 9
6893 9 -70 -75 125 -1 84 -24 2 -109 114 179 102 61 169 -126 120 15 -12 -63 -46 195 204 -17 -43 45 -106 38
6919 38 60 86 74 60 -44 -37 95 -136 47 14 -23 89 123 -49 -22 100 67 -36 38 -119 -125 82 43 -47 1 -28
6945 -28 80 64 -108 64 -31 -116 92 96 143 -115 -60 119 100 51 80 -87 -11 125 -54 -41 55 -116 -59 11 164
6970 164 -42 -76 13 -19 -37 -108 -52 -164 68 -10 6 19 208 160 16 -109 -36 27 -111 91 129 16 201 15
6994 15 -68 98 -57 -201 -295 -223 84 139 280 -92 -69 -37 146 81 -24 -82 -52 153 86 -72 124 196 85 111
7018 111 139 -22 93 7 -23 -19 34 18 -102 -50 133 -13 -101 91 -149 -42 -21 -61 -111 116 -20 -183 178 218
7042 218 -29 12 -9 65 -4 -8 -6 93 8 -2 54 133 155 -28 17 105 -3 97 59 220 -144 -145 -12 -96 -250 -152 72
7069 72 155 -16 91 -13 107 -174 186 -41 -106 -97 -63 42 60 108 70 -48 36 -31 -141 98 -102 58 -44 -172
7093 -172 -253 92 -103 -24 69 8 -194 230 -89 -21 -114 -157 -51 36 119 -25 147 -20 33 -31 2 163 -6 -163
7117 -163 113 56 19 -119 -92 23 46 -39 149 120 -24 86 -162 88 39 4 136 189 -117 -186 26 131 26
7140 26 -126 101 -42 -88 -44 108 -11 120 6 -35 65 -10 -188 30 255 -16 91 -158 -87 -2 120 155 146
7163 146 -127 -23 -7 -19 66 41 65 -65 -9 -93 89 3 -50 78 -102 56 73 50 -14 155 89 -32 -149 151
7187 151 -47 -33 10 182 17 218 -85 -1 239 59 -265 135 140 -160 -21 199 11 77 105 84 58 139 12
7210 12 -2 -5 69 5 84 -101 14 10 36 12 -99 -71 -162 9 -220 53 11 168 218 255 40 153 -124 -5 77 -73
7236 -73 -110 45 104 -157 112 -35 179 22 -17 -96 24 185 -34 -84 -26 -26 -35 111 121 56 146 2 126 105 -218
7261 -218 -91 169 -241 80 155 -149 23 -60 188 -19 -88 113 10 19 -73 -40 -86 163 -33 -212 -42 145 -10
7284 -10 -22 159 154 82 150 138 -212 -116 -12 84 116 78 28 -27 -16 -82 24 217 28 -48 -5 37 17 -27 30 64 -62
7311 -62 113 -125 162 73 43 -59 -5 276 -6 16 81 36 -19 105 51 -120 193 31 123 132 -4 59 178 54
7335 54 186 -49 -54 -94 -263 11 117 -102 -2 94 -203 8 -150 35 61 193 -261 -29 -23 185 -15 88 -89
7358 -89 52 231 -59 -46 -77 30 -39 -50 114 -58 33 -70 193 -101 -32 94 -47 64 70 24 -187 171 -110
7381 -110 161 -87 41 -52 -119 -36 -6 -47 34 -172 -28 300 90 144 -27 14 90 105 -31 -97 -56 -26 31 101 -168
7406 -168 101 -143 24 -61 -105 -29 149 -1 -78 128 7 64 324 82 -75 -237 77 216 73 51 122 19
7428 19 9 35 -99 -96 28 63 49 84 -138 89 -191 246 57 -50 -170 -1 72 -175 -92 -57 -88 55 -197 -43
7452 -43 47 -68 -129 224 97 -143 -200 -147 63 -4 -20 58 -124 13 -99 -148 -9 91 24 -165 -27 2 13 -58
7476 -58 125 -132 -147 31 67 -5 -83 -18 -66 62 -171 -183 -31 -47 -243 44 152 60 -200 -134 -59 -67 -8 -36 -155
7501 -155 15 154 -2 -187 2 -192 79 85 -118 -77 -28 -66 -247 -63 134 -12 59 -79 -8 12 130 60 -87
7524 -87 -14 165 -72 89 88 131 36 -5 -15 8 75 -90 55 12 -135 -15 119 104 23 136 36 -298 63 65 -34
7549 -34 90 13 -171 -38 96 -7 -81 179 -220 -127 -89 -10 4 37 54 46 -158 -127 -11 90 -33 111 -55 20
7573 20 164 -87 -8 -63 191 -211 -41 -113 -62 167 67 0 198 73 26 27 -61 -24 -131 139 15 56 -34 -119 -11
7598 -11 116 -226 -3 -115 225 97 19 22 19 -184 108 -234 -24 -71 53 44 -23 15 -137 16 -153 -57 -64 -6 5
7623 5 -102 72 93 14 126 92 65 52 -283 27 138 204 -100 -27 70 21 7 -103 -141 70 -146 -17 111 60 236
7648 236 -110 143 199 -33 45 43 -58 41 87 109 -31 -141 -75 -48 95 -21 124 132 34 33 33 -12 128 10 180 -74
7674 -74 -134 139 -83 99 -19 -44 39 38 74 101 -7 85 160 -300 173 -102 225 111 6 -32 -160 -85 35 -18
7698 -18 134 -356 209 151 -90 -28 -193 -63 27 -150 -122 258 32 -29 169 -68 -48 47 -196 221 -60 -14 80
7721 80 195 79 83 -73 -172 96 45 85 88 7 -69 -80 -24 27 43 -119 -98 41 140 -158 38 -60 -68 72 -51 -83 149
7748 149 -8 -68 91 126 -50 -36 -26 51 -124 22 59 58 50 104 -67 -35 73 97 128 88 -169 7 -39 203 195 109
7774 109 82 -171 11 -208 -56 125 -78 -182 100 140 111 -20 174 67 30 70 189 -199 164 -117 -88 200
7796 200 -167 -236 52 -67 40 110 -15 -15 -52 -33 3 -35 -44 -11 -22 -161 -80 212 -83 -34 123 -252 64 -92 105
7821 105 129 47 29 -9 4 -32 5 -34 44 73 75 -125 33 45 -17 95 -63 -52 -3 -2 2 100 6 42 -139 95 -23 19
7849 19 -34 69 -102 94 8 30 202 -12 -49 117 37 102 -119 10 -109 -17 -70 -101 45 -138 114 -31 18 35
7873 35 -20 -42 -62 169 -22 1 138 32 90 -89 -31 -35 -199 172 49 -32 -27 -114 -190 -41 -106 -86 109 35 -10 123
7899 123 69 25 115 8 -39 -9 -157 -117 -35 91 -177 -64 85 104 -33 39 -117 -52 -6 -67 -193 3 -14 -16 -144
7924 -144 -115 -31 -91 46 10 137 -12 148 -141 -44 86 12 -65 -81 -79 32 185 -86 -132 -45 127 -52 31 -3 78
7949 78 -13 282 55 -86 94 66 -47 -101 -75 86 54 218 -119 -26 -22 100 -25 -116 63 -121 -43 -63 -53 18 0
7974 0 55 110 58 -44 -96 240 -70 49 -50 -209 46 -54 -30 35 96 87 -45 -27 -102 -37 -17 -16 -68 -1 170 65 -17
8001 -17 -50 -39 -51 181 -28 -79 193 221 109 44 -153 -113 -108 -32 148 -205 232 -67 30 15 88 92 59 185 -52 -93
8027 -93 -41 -33 -140 13 40 15 6 239 51 40 101 243 98 103 -27 70 -96 -47 -115 -273 -50 -112 74 33 -83 89
8053 89 103 41 -5 -232 -30 -174 -8 125 -14 -166 209 -58 -352 30 -16 14 -2 25 -73 -51 -163 132 -90
8076 -90 -5 39 -91 121 30 114 103 -115 -33 94 -102 97 -193 18 -8 -204 80 141 -58 -66 -4 -62 87 126 82
8101 82 -131 14 -126 -135 -86 90 61 210 -108 -49 117 99 -25 -96 7 1 -182 47 -35 62 171 32 5 68 -29
8126 -29 -42 -47 1 77 12 16 -87 -16 143 19 -138 -8 97 -139 27 117 -10 84 -27 -153 138 -84 -70 -43 86
8151 86 48 -115 -115 -24 245 60 29 -61 199 160 13 94 132 -9 68 115 185 -27 -22 -33 74 31 91 9 -1 263 -110
8178 -110 -126 22 -102 52 40 -40 47 16 -171 -2 -125 52 -9
8191i
$$ Imaginary data points
##PAGE= N=2
##DATA TABLE= (X++(I..I)), XYDATA
0 0 0 0 0 0 0 0 0 0 8 -8 8 -8 8 -16 16 -23 24 -32 32 -40 48 -56 64 -72 85 -96 111 -126 142 -160 180 -203
32 -203 228 -252 283 -315 349 -388 432 -477 531 -586 649 -719 796 -884 983 -1095 1224 -1377
50 -1377 1554 -1771 2037 -2373 2817 -3429 4335 -5806 8608 -15808 71416 120906 -85146 -69667
64 -69667 55621 44682 -47690 -12930 36647 7440 -26888 7266 23150 -4831 -15883 18942
76 18942 13800 -29902 -17048 37074 11407 -38179 -5508 36296 5649 -9609 12360 -1506
88 -1506 -17552 14815 21311 -14416 -14231 15180 14137 -182 -5380 -7059 2028 12596 511 -10589
102 -10589 -4452 -905 754 3086 -7576 -7184 13573 3795 -25363 -3819 29416 4992 -25007
115 -25007 -8858 10150 7478 1287 -7979 -6074 14313 11250 -16016 -14526 8691 9423 -3304 -8517
129 -8517 -8133 3172 7719 -9664 -11161 10629 4261 -15516 -2660 4746 -12835 -4057 16969 -552
143 -552 -16323 5724 12721 -8280 -11857 -768 3200 6201 3253 -7368 -4703 5926 3842 -2955
157 -2955 -6311 -4808 5336 5502 -13341 -10151 14315 7917 -10809 1456 8193 -9963 -5365 10495
171 10495 -3448 -9090 11790 7714 -12655 -340 15074 260 -8794 2164 5068 -978 -2099
184 -2099 -1055 2103 3385 488 2692 3615 -5296 -2227 10250 1459 -9600 3926 8024 -6599
198 -6599 199 11579 -2371 -5627 11045 3873 -11241 4549 11698 -8577 -8636 11159 9107 -4403
212 -4403 -4350 212 3277 4488 -163 -3219 -777 -1240 1682 6766 -2381 -7480 7877 9291 -9530
227 -9530 -5790 10325 -152 -9357 4038 6360 -4421 -1212 2085 -4163 -446 5168 -2193 -6163
241 -6163 -1894 -954 2714 3828 -6430 -5948 7263 2389 -8931 -483 3896 -6807 -2221 8117
255 8117 -1587 -7752 2894 3283 -5341 -1792 2763 -1366 -4751 -4168 1097 5350 -3043 -9314 3195
270 3195 7685 -7094 -6534 5504 -2562 -7627 6672 4699 -10352 -2065 9648 -1151 -5804 4033
284 4033 1568 -4961 -190 1627 -880 1381 455 -2767 1120 2963 -502 -302 -1944 -3803 4166 6200
300 6200 -6000 -5179 6867 3322 -2499 3291 987 -4827 4046 6728 -4922 -2726 7018 1110 -2622
315 -2622 4632 2161 -2779 2918 2054 -3748 2618 5668 -3834 -3827 5280 3805 -286 439 -1522 -395
331 -395 4286 1340 -2279 812 796 546 4895 745 -5821 2885 6992 -4786 -3990 7407 661 -7052
347 -7052 3515 5278 -4578 -192 4585 -4170 -3503 6147 1678 -6672 -1962 3403 2682 -37 -4124
362 -4124 -2372 4367 1646 -4627 -575 1106 -3670 563 4373 -4224 -3937 4752 90 -6324 1149
377 1149 2873 -4078 -2167 508 -2265 1045 2601 -5484 -4103 5207 1240 -5371 -856 -390 -2847
392 -2847 2924 2350 -5997 -2984 4656 634 -3231 -508 -1335 -965 2192 -1320 -3656 1879 1949 -3123
408 -3123 -758 1509 -519 1314 -367 -5526 1456 8192 -2934 -7536 4129 5246 -2962 423 1914
423 1914 -4367 434 7529 -1366 -6588 2501 5172 -574 -1628 194 1191 2389 -534 -2268 2444
438 2444 3224 -2043 36 2675 -1061 1606 4601 -3401 -4886 7102 5865 -5167 -2551 3897 1861
453 1861 1779 1391 -3746 -808 5853 1130 -3785 1245 1800 -712 2417 1184 -3608 1664 5104 -3249
469 -3249 -3644 4540 2993 -3085 -1613 915 1347 2402 -1021 -3650 950 2762 -198 15 -1779 -4072
485 -4072 3012 5872 -5224 -6477 5543 3431 -5547 -739 2766 -3421 -1135 3730 -2337 -4172 3415
500 3415 1949 -5247 -2217 3033 1281 -2510 -3879 -744 3791 463 -4553 -1783 1290 -884 1076
515 1076 1069 -5750 -2956 6814 1601 -7824 -266 4926 -2363 -2780 1813 -886 -1918 2087 -890 -3140
531 -3140 1966 1902 -2658 -1192 885 85 1449 -195 -4018 120 4907 110 -3245 -167 488 1000
547 1000 2795 -1333 -3884 2927 3607 -2484 -875 2750 -687 -416 2873 -936 -1794 3559 1321 -3388
563 -3388 1050 4076 -479 -1034 690 -665 2483 3778 -2755 -3203 4193 3683 -1713 -267 462 -237
579 -237 2853 2731 -3114 -1401 3223 1134 -930 901 -9 -3 1755 -659 -1328 3055 1439 -3355 315
596 315 2667 -831 350 1770 -3166 -1867 5442 945 -5521 507 3706 -1475 -786 1642 -2320 -2206
612 -2206 3118 791 -3542 -644 1528 -451 -1345 -677 918 912 -2865 -2551 3273 1388 -4835 -526 3204
629 3204 -3018 -1798 4786 -1808 -7350 3082 5677 -5056 -4689 3695 957 -3850 -296 1460 -1545
644 -1545 -1452 732 200 -1247 -2055 163 1986 -1853 -2653 3111 1419 -5543 -725 5653 -859 -4424
660 -4424 1975 976 -3224 1660 3136 -3185 -2349 3344 1452 -1899 -468 109 814 1343 -767 -1007 1955
677 1955 407 -1640 1800 1959 -1774 -16 2196 -1169 31 4051 -357 -3225 2381 3333 -1323 -794
693 -794 906 -40 1440 2160 -1141 -1034 1365 648 919 1480 -1133 -619 3157 115 -2584 2971 3348
710 3348 -3227 -1010 3898 -118 -2301 2266 825 -2743 1392 2903 -1970 -2397 1262 2003 306 -1366
726 -1366 -1484 1004 1413 -1661 -280 1609 -1347 -1476 3067 194 -3760 1377 2367 -3305 -1092 3614
742 3614 -1320 -3732 1583 1528 -1901 26 455 -2724 -663 1780 -1468 -2210 357 121 -571 -130 -1270
759 -1270 -965 767 -465 -1157 247 -831 -1730 1178 352 -2432 1129 2430 -3611 -2753 3764 946
775 946 -3918 -12 1700 -1818 15 1569 -2497 -2159 2804 1628 -2070 -1462 491 1061 657 -1294
791 -1294 -995 1944 531 -1943 559 1205 -1484 815 2125 -1844 -1115 3343 142 -3598 1430 3623
807 3623 -953 -1541 508 -272 1087 2374 -630 -1630 927 1149 769 1014 -1287 -1278 3309 2008 -2820
824 -2820 -338 2959 -12 -1017 1943 665 -862 1310 -146 -1601 1783 2746 -1241 -1652 662 1348
840 1348 1435 -474 -2623 237 3513 -310 -2082 852 -6 -935 2409 988 -3390 -47 2979 -1453
856 -1453 -2391 2493 1140 -2643 -496 861 -446 197 517 -1557 -735 1108 127 -918 -1395 -1125 1812
873 1812 1817 -2800 -2466 2021 691 -1979 568 586 -2687 791 2412 -2799 -2539 3239 711 -3464 -602
890 -602 1766 -950 -1240 15 -705 385 1130 -1120 -2029 256 1027 762 -499 -2490 -564 2722 65
907 65 -2835 240 1494 -858 560 700 -2478 -588 3036 -159 -2575 1394 1502 -2082 -540 2024
923 2024 -281 -287 1023 -777 -669 1549 1034 -845 74 437 1112 1485 -1138 -1964 1926 2337 -1447 -400
941 -400 1739 -803 -323 2270 -63 -1694 1529 1637 -1630 -15 2025 -77 -351 437 226 1105 1178
958 1178 -1660 -927 2515 1090 -1331 270 310 -1132 1509 2101 -2347 -1533 2816 740 -2018 111
974 111 945 -283 615 234 -998 259 424 -519 -51 102 -848 674 316 -2201 -438 2872 -603 -3446
992 -3446 913 1538 -2285 -263 1465 -2016 -1271 2653 77 -3144 -503 1691 -455 -1133 -275 -183 -362
1009 -362 -451 -293 641 -133 -1700 93 1079 -1381 -660 1834 -1224 -2590 2048 1972 -3174 -1466 2063
1026 2063 -204 -1154 1060 -233 -1559 921 958 -1100 -237 434 -235 149 173 -568 517 766 -1237 -191
1044 -191 2058 -32 -1398 582 585 -373 1157 282 -1958 147 2519 -305 -977 854 21 52 1765
1061 1765 -141 -1554 1066 1516 -959 110 1218 -535 -9 1452 -499 -335 1537 128 -1321 1086
1077 1086 1455 -510 -286 173 -461 1029 1459 -1008 -709 1293 507 -371 579 -611 -652 1543 527 -1641
1095 -1641 505 1468 -1238 -598 1715 -272 -821 766 -127 -1092 1098 772 -1920 -574 1545 14
1111 14 -569 69 -928 -53 1315 -361 -1500 -34 371 -449 338 -383 -1449 627 694 -1709 -532 1064
1129 1064 -752 -1176 807 -224 -1283 812 -11 -2315 190 1898 -1171 -1867 511 125 -362 575
1145 575 -662 -1644 717 829 -887 -422 -19 -278 416 416 -1144 -70 1187 -877 -847 1141 46 -1174
1163 -1174 660 355 -944 987 1051 -1610 -471 1826 180 -969 493 125 -345 1271 543 -1403
1179 -1403 249 1382 -231 -145 652 -371 130 1082 -113 -431 1310 314 -740 559 1228 -155 205
1196 205 229 -546 1023 1505 -781 -861 1579 604 -262 928 82 -1272 1163 1791 -1504 -690 1842 270
1214 270 -966 504 435 -440 206 379 -476 494 252 -732 -243 351 -581 462 456 -1752 -577 1992 -132
1233 -132 -1904 210 808 -638 226 434 -1265 -336 1506 -606 -1226 394 166 -970 290 -100 -1031
1250 -1031 460 189 -1557 130 1299 -653 -1134 151 -273 -119 698 -850 -1750 730 929 -1063 -686
1267 -686 279 -702 299 705 -1253 -811 1136 -102 -1122 677 97 -793 431 290 -1373 432 1106
1284 1106 -1416 -1178 1518 420 -1048 97 -20 -484 1013 894 -1265 -733 1346 472 163 13 -786
1301 -786 487 1264 -760 -732 1121 414 -1125 459 1008 -927 592 1218 -1023 -485 2243 417 -1569
1318 -1569 217 1335 29 332 72 -701 873 1629 -517 -884 614 281 355 605 -549 -518 1264 630
1336 630 -958 435 870 -461 225 573 -930 109 1473 -998 -1479 1511 938 -1316 -151 646 -497
1353 -497 264 1080 -1087 -1166 1187 658 -699 -593 -180 256 715 -445 -1326 520 586 -832 -78 822 -908
1372 -908 -637 889 -704 -1180 1172 533 -1849 -244 946 -304 -663 136 -849 -271 833 -638 -1354
1389 -1354 253 290 -361 270 -339 -1138 417 889 -1273 -460 1061 -513 -953 493 -15 -761 517 96
1407 96 -922 442 778 -842 -573 411 196 494 364 -882 -281 1403 148 -1067 476 385 -800 558
1425 558 969 -1148 -348 1727 17 -974 986 735 -697 162 963 -114 145 378 -261 136 829 222
1443 222 83 116 -452 490 1248 -419 -951 1344 1007 -984 411 1260 -936 -231 1526 -140 -1150 733
1461 733 772 -931 131 1039 -360 -472 232 149 352 239 -710 -103 904 -82 -303 571 -464 -798 1218
1480 1218 463 -1369 -3 1156 -573 -642 811 -340 -846 631 179 -926 203 209 -904 -480 371
1497 371 -44 -477 220 -793 -177 824 -315 -1089 218 228 -422 283 -43 -1144 100 1078 -832 -708
1515 -708 777 -216 -980 495 255 -808 217 262 -573 106 625 -582 -445 159 -446 159 665 -854
1533 -854 -1016 1545 667 -1469 93 686 -513 38 939 -365 -613 678 427 -729 257 455 -99 40
1551 40 177 34 465 173 -758 378 1023 -255 -142 489 -154 -226 1464 454 -1515 481 1634 -547
1569 -547 -523 963 -31 -396 873 520 -866 76 690 -134 -10 418 -141 67 37 -295 582 553 -589 -302
1589 -302 1192 -174 -697 619 41 -1047 723 1203 -1187 -815 1092 551 -756 116 -34 -475 71
1606 71 128 -441 111 -57 -589 -190 104 -429 49 274 -1064 -343 1024 -42 -1309 -53 444 -367 249
1625 249 147 -1000 -288 902 -40 -955 -16 24 -368 205 -129 -845 560 200 -817 -134 693 -501 -408
1644 -408 596 -232 -617 491 7 -1107 252 946 -501 -553 201 -61 -97 344 -521 -487 609 54 -206
1663 -206 161 -186 -511 385 479 -625 213 745 -587 -421 952 145 -712 446 224 -508 598 716 -768
1682 -768 -276 1171 312 -177 305 -242 251 774 -214 -435 487 396 -113 205 38 -634 483 795 -354
1701 -354 -145 1144 -85 -941 688 559 -475 243 541 -555 370 1064 -275 -722 477 259 -5 242
1719 242 -205 -503 666 566 -466 -147 246 -273 299 233 -717 46 695 -314 -917 744 356 -1052 -102
1738 -102 310 -226 178 406 -947 -583 696 12 -740 -84 60 -253 301 6 -956 -27 664 -471 -315
1757 -315 423 -214 -390 347 -433 -313 479 62 -924 146 612 -325 -87 109 -434 130 543 -384 -832 321
1777 321 321 -364 72 -28 -749 332 507 -753 -561 651 143 -699 212 277 -187 405 277 -448 210 580
1797 580 -234 -128 413 125 133 312 -376 -187 956 389 -829 185 525 -133 371 499 -510 1 945
1816 945 47 -693 588 311 -219 655 428 -69 267 284 -252 170 774 104 -363 330 22 103 623 -44
1836 -44 -449 480 559 -400 2 320 -227 112 777 -368 -354 558 35 -624 347 479 -509 -305 322 -178 -161
1857 -161 582 -191 -541 631 141 -561 96 -242 -153 335 244 -669 -267 211 -175 -277 -40 -592 -355 694
1877 694 -83 -835 288 255 -659 -89 247 -486 -237 237 -310 -592 593 -98 -920 -87 316 -91 212 -44
1897 -44 -546 92 594 -482 -157 324 109 -223 56 -155 -484 102 461 -472 -72 395 -405 -202 435 -71
1917 -71 -253 567 -13 -361 459 411 -510 69 462 -41 57 472 -321 -157 691 364 -200 109 303 -15 341
1938 341 546 -119 320 429 -493 38 735 -16 -187 451 -29 -273 597 335 -618 176 863 -232 -258 102
1958 102 55 184 429 92 -506 347 325 -257 251 223 -507 173 502 -436 -3 601 88 -433 282 230 -210
1979 -210 230 -74 -436 426 393 -501 -283 418 -182 -280 227 -305 -430 528 190 -572 9 419 -269 -78 128
2000 128 -261 -376 501 -57 -375 449 -1 -454 -164 25 -222 2 67 -557 21 326 -109 -435 180 38
2020 38 -467 388 15 -551 388 254 -545 -165 592 -241 -310 590 90 -378 -15 286 -311 -13 334 -244 -8
2041 -8 216 -70 221 288 -252 -157 500 81 -291 285 202 -228 391 482 -472 -61 672 65 -141 619 134 90
2063 90 385 285 -210 564 367 -220 -94 510 130 -170 216 0 -44 631 60 -442 435 561 -11 116 82
2084 82 -168 -14 469 -163 -420 138 33 -351 288 258 -429 133 148 -265 123 432 -246 -248 240 96 -89 142
2106 142 -204 -444 376 390 -470 -371 307 -313 -169 71 -139 -317 287 42 -388 50 -54 -409 -282 31 -373
2127 -373 242 127 -559 -296 747 -203 -657 157 -34 -388 99 20 -732 -240 575 -239 -534 -45 -128 -274
2147 -274 222 -167 -289 24 106 -359 -65 177 -239 -138 54 -206 -30 353 -299 -387 427 424 -236 305 -15
2168 -15 -376 275 646 -250 -464 445 211 -158 386 -29 -64 131 354 -143 35 308 -192 -2 350 -101 -47
2189 -47 351 -195 -136 670 479 -266 9 470 -86 187 444 -147 -34 569 55 -479 135 45 -275 165 160 -273
2211 -273 73 348 -307 101 423 -21 -394 321 117 -257 223 248 -427 -78 330 -318 -118 -15 -28 179 359
2232 359 -519 -196 434 99 -464 57 172 -234 -35 241 -174 -241 253 -274 -443 194 30 -353 -27 -50 -260
2253 -260 141 108 -306 -352 274 -67 -342 -148 1 -285 170 -8 -393 18 261 -157 -21 82 -148 -52 218
2274 218 -30 -232 309 -34 -590 157 330 -389 -71 218 -204 6 394 -113 -475 273 243 -194 223 80
2294 80 -167 285 222 -113 -92 189 -106 -95 304 -12 -35 235 -12 -33 243 237 -494 -64 138 -87 5 397 -276
2317 -276 -44 481 320 -124 -150 113 90 137 137 -256 36 346 -48 -81 376 -90 10 228 90 -81 320 362
2339 362 -464 -7 353 -138 -181 403 -7 -235 309 -225 -542 104 183 -169 -105 92 -371 -129 428 -393 -133
2360 -133 195 -203 -245 30 69 -135 123 138 -210 59 130 -365 -328 171 82 -273 -283 -285 -288 265 166 -528 -89 244
2384 244 -289 -205 70 -30 -237 201 -86 -478 111 222 -312 10 204 0 10 -110 -97 -85 354 78 -310
2405 -310 205 46 -178 335 9 -445 122 275 -210 130 298 -57 -194 154 -63 -281 193 187 -297 175 417
2426 417 -21 -105 355 -33 -71 407 -122 -235 304 347 9 97 158 157 252 170 -77 91 608 77 -143 240 33
2449 33 -47 162 58 -361 112 247 -184 67 367 -24 -378 154 68 -122 219 -84 -359 177 533 38 85
2470 85 7 -148 73 379 -127 -315 162 133 -141 255 50 -204 -51 170 -238 77 186 -130 -286 188 -8
2491 -8 -335 31 -98 -48 11 123 -300 -91 437 40 -180 128 -135 -118 298 156 -370 -27 291 -188 -106 83
2513 83 -123 -94 16 -121 -302 402 -165 -336 -33 171 -184 -177 236 -391 -33 379 -189 -60 205 36 -7 264
2535 264 157 -276 -131 95 -109 164 228 -43 74 432 19 -69 213 251 -204 333 263 -266 142 317 -114
2556 -114 123 291 -210 -110 280 -28 -292 134 72 -208 413 407 -331 -51 231 1 -8 595 1 24 17 84 -68
2579 -68 324 165 -570 -114 307 -175 -10 -180 -282 -62 207 -33 -311 179 27 -193 357 144 -382 -35
2599 -35 208 -247 -220 184 -130 -193 14 131 -107 34 16 -247 108 409 -267 -213 51 -107 -112 243 -407 -147
2621 -147 229 133 -199 -114 130 -172 -22 284 -322 -326 225 -54 -265 200 44 -340 -37 -336 -354 9 33 -141
2643 -141 -132 197 -77 -153 164 -94 -58 382 216 -336 -145 236 -241 168 -55 -282 -214 274 202 -326 142 8
2665 8 -227 143 248 -381 -8 24 -215 -51 391 -121 -212 217 8 -62 84 203 -47 59 369 -158 -69 331
2687 331 200 -41 352 132 -85 88 -6 -91 88 306 -120 3 168 70 81 248 39 -66 148 47 -99
2708 -99 52 17 -112 195 395 -54 -137 123 -197 -228 33 135 -99 160 114 -210 2 23 -148 52 303 -44
2730 -44 -133 46 -18 -45 58 -174 -169 278 222 -292 -95 11 -325 103 170 -92 -98 353 155 -212 28 201 -331
2753 -331 -78 24 -196 16 58 -179 -305 39 -142 -274 11 4 -184 263 254 -287 58 222 -231 -150 94 22
2775 22 -119 190 -8 -212 180 144 -177 -42 68 -348 -20 213 -12 -10 267 209 -380 108 300 111 9 115
2797 115 -92 84 173 -173 72 325 -35 -60 392 28 -199 90 490 -169 74 41 -138 -46 296 234 -102 347
2819 347 -114 -143 79 114 -228 130 187 -30 35 127 19 -99 83 54 -96 184 -75 -147 56 336 -123 -20
2841 -20 369 -136 -216 115 -151 -307 177 144 -311 125 15 -245 -88 343 -151 11 201 -90 -20 119 -39
2862 -39 -324 -105 154 -167 -60 -164 -453 75 129 -1 -321 121 -61 -96 -23 -90 -202 87 25 -277 166 22
2884 22 -226 -168 134 -23 24 131 140 -13 -4 56 -315 -16 120 -198 -22 155 -174 34 151 -51 -49 283 107
2907 107 -61 170 206 -246 84 116 -304 -118 218 70 -18 66 9 -58 -5 -29 -388 145 197 -255 -104 234 -87
2930 -87 73 87 20 -9 296 158 -290 163 -89 -135 -93 106 89 -7 281 105 -92 252 -49 41 23 -113 -48 14
2954 14 177 155 14 408 -186 -177 26 191 -181 25 107 -35 314 51 -232 -84 113 -227 -287 68 -105 -66
2976 -66 301 -73 -265 113 -19 9 162 -4 -215 65 285 -209 -230 99 -98 -113 -108 5 -98 155 -5 -226
2998 -226 283 -31 -240 -130 -127 20 -199 58 -135 -167 41 -2 -274 0 -22 16 43 114 -306 -212 153 10 -213
3021 -213 156 -52 -255 118 39 -215 26 60 -66 -18 148 99 -55 42 -102 20 226 -47 -103 -61 358 155
3043 155 42 116 -82 111 170 18 -315 18 166 -134 35 215 -146 148 262 -43 -1 274 -190 -189 202 150
3065 150 -112 79 71 82 192 181 -263 -2 252 61 61 185 -19 -120 154 60 -138 29 8 -13 32 363 -58
3088 -58 40 1 -69 -57 93 20 -203 -59 259 6 6 72 -221 -79 96 -108 -118 0 -25 -358 73 201 -331 1
3112 1 -8 -34 38 104 101 -179 60 281 -103 128 79 -124 -15 30 -173 -150 -162 -151 -63 44 -245 -156 88 63 -138 154
3138 154 75 -231 -13 211 -29 -212 44 24 -122 180 -110 -169 -184 76 -213 69 22 -228 9 96 -117 -75
3160 -75 128 70 -24 62 94 -240 68 196 -143 95 207 -109 -87 255 50 156 -30 131 -73 -40 194 -33
3182 -33 -11 -13 -39 -84 97 101 -51 149 -76 -28 172 -82 -47 118 255 -335 85 -70 -195 3 273 69 -63
3205 -63 81 73 -46 286 84 -82 9 95 -43 122 -30 -71 -161 147 -155 -492 29 168 -68 -8 98 -185 -18
3228 -18 197 44 -55 107 -47 -142 94 -115 -107 69 -83 -69 -56 60 -125 43 53 88 -67 52 93 -53 -5 186
3252 186 -175 87 -2 -189 -89 16 -141 -175 -35 -93 -88 289 30 63 73 -187 -17 93 31 19 -110 219 127
3275 127 175 56 -17 69 104 38 -170 40 18 -37 -125 -184 -73 -166 99 71 -127 182 106 -70 -82 199 -215 30
3299 30 41 -163 -77 172 45 -3 -10 128 -228 219 -98 -198 118 128 -12 97 175 -140 172 89 38 -44 232 6
3323 6 -77 146 270 -20 -146 143 64 -19 82 -46 -210 279 -142 -103 41 16 -115 28 101 -309 -15 193 -109
3346 -109 88 47 -5 -211 70 321 20 -58 66 -9 -51 110 -151 -95 -13 -67 -53 178 -113 -287 -214 -16 109
3369 109 -34 144 -10 13 19 -122 -136 29 -76 -139 -71 182 -138 38 90 -200 69 193 -144 -142 206 -3 64
3392 64 144 115 -25 43 -51 -26 66 -116 -128 -87 39 44 -307 63 57 -28 135 -1 -151 -9 200 -122 77 -46 -90
3417 -90 19 -26 -63 -66 33 -76 36 -40 58 -74 -130 133 -8 -30 48 90 -161 56 -31 7 76 100 -105 183 -26
3442 -26 91 38 -49 -31 135 56 -15 -86 103 92 -74 120 116 109 -88 95 28 -129 112 -67 -85 337 120 -50 112
3467 112 63 -164 8 -115 -83 4 168 -62 -48 -74 -191 -136 60 32 -123 -53 72 46 -16 51 -308 -200 11 16
3491 16 3 -44 56 -188 -97 155 24 -126 109 70 -345 30 -172 -127 -87 196 -193 187 61 -190 -98 122 -114
3514 -114 37 18 82 -11 183 26 -152 118 -14 38 96 124 59 28 -63 -62 101 168 -39 -18 32 -75 -88 166 -82
3539 -82 94 38 41 8 36 80 -195 77 93 32 -204 25 18 -34 -23 -54 -165 -13 107 -56 147 197 91 18 49 18
3565 18 -173 133 116 78 -59 30 -62 141 63 -20 -27 17 -51 42 155 137 -164 -137 199 -114 7 11 27 -122 154 -227
3591 -227 -120 3 85 -70 118 120 -41 20 99 155 52 5 -78 -47 121 202 -75 -75 -65 -86 79 62 88 -40 68
3616 68 -22 1 150 -186 8 76 -33 -12 25 74 -138 111 -125 -86 -38 8 -80 -154 183 8 14 124 -55 -76 23
3641 23 27 -56 -41 86 -124 26 -51 63 46 -33 192 -185 -28 11 -138 -12 33 86 -167 57 -142 -4 60 145
3665 145 -4 53 30 -115 -10 218 -54 142 17 -93 -135 29 -136 -48 163 -200 161 232 217 -75 -68 283 54
3688 54 -171 184 155 -172 77 71 54 137 45 37 123 71 -40 187 -130 -18 -138 33 -109 -97 62 -79 116 -92
3712 -92 174 -18 -47 36 -3 -74 128 85 32 85 87 -40 -14 -49 -8 48 129 -89 19 192 30 93 -2 -160 -7 -96
3738 -96 135 -99 3 121 -126 -231 -49 -107 123 -65 -35 -185 95 -130 -114 200 3 -11 -82 88 -89 -1
3760 -1 44 -131 -111 -18 -124 11 -41 -45 -57 -168 53 43 -58 -86 77 40 -189 136 95 115 220 1 -7 74 -71 8
3786 8 127 5 -3 -55 84 4 -125 25 -24 96 50 -248 79 25 60 92 29 -209 148 67 -4 132 40 93 -5 -71
3812 -71 -181 -100 -87 225 82 -299 -221 13 -4 139 -121 -151 -28 -8 11 -126 5 -238 3 178 61 -26 -40
3835 -40 74 -24 -125 71 -75 -53 63 -53 -23 114 20 151 -72 34 16 -45 -67 -118 81 43 -130 -56 1 2 -38
3860 -38 -3 260 1 -104 -42 -43 89 -20 -89 -8 38 -26 -240 82 -41 -19 10 -135 -123 -163 31 -92 -82 -36 8
3885 8 14 175 -47 -136 -71 -7 -184 108 -156 162 -140 2 -59 -34 78 -258 161 7 108 -79 237 25 -46
3908 -46 -75 28 -170 -177 135 67 32 -22 -59 10 -19 12 167 142 203 91 97 48 1 -177 -95 -23 -37 69 45 -116 -77
3935 -77 4 89 -118 -39 -267 -17 164 44 -99 41 0 223 47 -2 -74 8 -39 59 58 -150 -88 -22 2 -234 -232 158
3961 158 23 -18 -23 70 140 111 6 30 -77 -117 83 87 44 -21 200 -27 -40 -24 147 139 13 117 6 -163 147
3986 147 96 21 -15 -35 179 -290 81 -53 -184 -173 -7 -91 151 171 -176 -118 66 7 137 -43 -8 -122 -192 65
4010 65 23 20 174 -98 53 65 -137 102 72 -35 86 144 10 -62 -15 -182 -60 45 266 84 -182 -158 -34
4033 -34 -64 -49 -37 -6 48 73 -17 71 -9 -31 20 -77 73 44 96 -112 59 22 -17 144 -15 25 -111 -118 86 42 138
4060 138 48 4 -53 39 2 -48 42 27 -142 145 129 -99 -58 227 -97 -98 -42 93 -91 163 -28 47 42 75 -248 167
4086 167 40 99 58 -126 -48 60 169 15 -29 128 -27 -113 245 -116 -62 19 20 -59 -140 37 -18 -106 142 -294
4110 -294 -86 13 -15 50 -215 96 44 -94 -8 46 29 154 189 1 210 95 159 28 54 79 52 -40 16 -122 -42
4135 -42 -148 -53 -173 -31 28 -133 16 191 -10 -113 -177 -47 139 13 185 55 62 42 -60 119 -154 -5
4157 -5 35 -106 38 -51 -63 -91 74 -95 24 35 226 15 193 111 -149 -155 210 207 139 141 -160 -188 46 -151 -235 8
4183 8 76 184 -202 118 4 -6 -62 23 -12 20 11 -126 -101 -27 -28 7 278 -182 201 151 306 -70 79 216 -195
4208 -195 -83 151 -108 -7 84 8 60 20 -51 197 -12 -186 -113 81 -110 -3 151 -155 139 26 30 180 -205
4231 -205 177 5 13 182 -1 68 39 39 244 27 104 -97 -135 103 6 136 20 -43 66 121 146 18 -36 -2 -28
4256 -28 -55 -162 -56 23 60 -191 74 29 50 9 11 14 2 38 -35 -21 6 235 25 13 231 67 -166 105 110 90 96
4283 96 -310 -51 133 89 -26 -120 -5 -70 -103 47 80 -20 -133 13 -33 -124 18 -26 -28 -46 -118 162 -26 15 21
4308 21 33 122 -74 126 9 -119 58 -21 80 106 -27 -116 38 44 -198 -128 237 22 -28 14 -16 115 -95 -43
4332 -43 -4 255 -60 -55 15 116 -37 -53 -98 181 -19 -137 132 -126 53 52 -4 -82 95 -49 -17 -136 -30 -82
4356 -82 -95 15 151 -83 204 -221 128 74 130 8 -3 149 -111 141 -205 -123 18 102 65 -55 -173 7 -27
4379 -27 -79 -88 84 -28 193 -270 -68 58 127 -56 60 -23 14 21 -21 -24 58 -6 52 10 -213 63 -80 21 -217
4404 -217 -51 -39 -74 9 137 56 57 -73 127 9 10 120 -87 70 -107 -181 128 -38 -101 -46 13 -125 25 17 -6
4429 -6 -71 36 24 -29 143 144 114 111 -28 -185 41 -38 -75 73 -87 230 32 -160 -163 20 120 -36 44 111 -56
4454 -56 -33 87 200 18 -114 193 25 16 96 -146 98 -95 -8 -10 0 55 43 -1 124 29 22 -94 -211 -72 123
4479 123 4 -172 -118 204 35 103 -17 132 209 161 98 5 -32 -19 -73 -48 -98 11 30 -4 43 78 -127 16 74
4504 74 -28 -11 26 -55 55 9 -30 149 -180 20 264 71 235 174 15 75 -44 123 -412 22 90 -14 16
4527 16 132 43 -88 68 -78 56 -165 16 -151 -75 118 93 72 -78 -58 -181 38 95 -7 -73 12 32 -29 10
4551 10 -81 -59 24 95 60 -83 15 44 -5 45 103 -35 37 -33 -10 -37 47 7 -22 -33 -193 -328 -74 33 -98 102
4577 102 33 138 112 12 -109 -116 2 -72 -170 -68 -78 -67 -2 3 88 -129 203 125 2 -25 79 -22 20 -76 15 -112
4603 -112 -70 3 -153 -24 179 -45 -173 -108 -146 105 41 -117 -96 -44 -221 104 -101 271 -106 -49 -149 202 -2
4626 -2 29 -4 -16 -69 85 128 -76 9 -74 104 -10 -43 -297 147 114 -10 39 -62 27 150 -215 -38 -6 -198 119
4651 119 191 108 9 226 -25 -18 10 121 151 67 -69 14 15 -35 135 -10 37 -108 -1 9 21 -108 -102 20 207 22
4677 22 107 52 -72 -174 71 47 -62 107 35 -206 60 98 33 -32 16 126 9 48 167 46 70 -118 -5 22
4701 22 86 -102 -89 13 -195 5 195 24 -85 -50 125 -63 7 104 82 -7 -28 -40 -198 -98 -81 -193 84 7
4725 7 -54 -49 40 -13 -135 80 137 -158 78 235 -50 63 18 -24 -65 -76 60 33 -155 40 -43 -99 -16 6 211 -8
4751 -8 98 114 34 -124 23 -58 93 -151 10 -23 65 73 -122 93 -215 -85 166 51 12 32 -68 -7 67 -29 20
4776 20 -149 142 66 -63 42 -136 77 64 8 175 108 -59 -82 85 60 107 10 -184 -69 108 -60 -147 251
4799 251 40 97 -117 52 -158 34 -29 66 -7 -80 55 105 -130 166 28 -9 260 -144 35 30 -84 -61 60
4822 60 89 -26 132 64 62 301 28 20 -87 -93 -30 -52 -104 86 197 -71 32 -51 -46 308 -17 83 184 -47 -117
4847 -117 -14 40 119 216 -59 176 31 -186 55 -137 40 218 104 188 49 44 -101 165 26 -5 57 12 -74
4870 -74 58 20 85 -215 -65 174 1 -53 -82 -37 -132 42 163 -13 71 54 35 -156 35 160 16 -39 50 -135
4894 -135 -3 136 35 -72 20 85 -73 -105 -65 1 86 -89 -19 -106 -116 -3 12 12 -24 -154 -12 175 134 -139 99
4919 99 307 -33 -145 -90 -78 -8 -85 -22 217 227 6 77 34 -74 -47 -13 213 -119 -74 -15 -124 106 -81 40
4943 40 130 9 -235 217 106 0 69 -84 -84 76 -3 -152 -41 133 22 -76 -164 -194 154 -101 145 -5 88
4966 88 85 -124 -118 -93 -18 48 75 -73 30 -16 -44 25 51 143 -60 -7 -55 61 63 206 82 -199 -120 11 32 110 -32
4993 -32 -112 -32 -39 82 43 -33 -15 124 45 106 46 -98 -109 67 132 53 -57 94 -63 68 -36 173 1 -181 53
5018 53 -265 102 -6 -162 -169 104 -77 58 -141 -82 14 -51 -215 181 125 23 71 112 93 -159 180 -231 171
5041 171 -85 -166 -13 -36 124 208 -188 -17 -9 67 -66 42 81 44 -217 -4 151 -147 16 -76 -92 130 67 -25
5065 -25 -135 65 51 -95 170 15 -159 -67 -77 -80 6 42 -261 164 -16 -5 -166 -44 67 -28 -117 90 22 -15
5089 -15 79 -206 121 118 24 -71 111 139 7 75 -130 28 108 -62 -106 -114 -53 -57 -174 -136 23 47 36 91 216 -145
5115 -145 -63 -4 175 -94 -8 -21 -35 124 -15 -34 67 -26 -6 -78 -299 24 85 -34 3 -60 -177 -73 -7 82 63
5140 63 16 37 130 70 41 -35 -9 -20 31 -75 -69 -58 108 -288 -76 -16 95 -154 2 27 -87 -95 129 -125 1 -35
5166 -35 -70 19 12 131 70 116 -136 2 -219 82 40 67 21 -96 111 162 9 -17 105 -23 60 2 -110 -114 261
5191 261 -82 -120 -19 -253 119 -173 54 6 110 -4 11 -44 29 13 57 84 71 -67 -145 168 176 -45 -189 126
5215 126 151 -165 175 -152 -62 104 36 69 194 -81 -206 -96 24 -10 176 -6 -33 6 54 -246 147 30 -21
5238 -21 -175 -221 82 -94 -53 76 90 -348 -107 40 -114 39 40 -176 -50 1 25 -33 -100 -107 126 -12 -53 -81 -162
5263 -162 105 -36 -9 -58 158 -58 8 125 -164 78 -24 51 -72 74 45 183 57 34 22 44 -83 61 7
5286 7 -42 179 -99 -234 -123 49 -7 25 104 95 55 154 -58 -139 156 -121 -80 84 105 -63 74 -45 -8 55 -151
5311 -151 -18 -3 -10 278 -4 38 44 -110 183 -107 -20 -54 60 -16 -63 0 -19 74 -37 36 -247 -24 -77 -2 53 124
5337 124 -112 -116 40 -19 -69 55 58 135 36 13 19 -22 -95 147 55 93 43 116 15 88 -13 42 133 -37 93 44 -10
5364 -10 156 -36 153 -45 -146 -107 -64 198 6 -32 -115 -4 -73 -103 88 -126 -32 155 140 101 -176 178 -52
5387 -52 -236 142 -156 -64 38 76 -82 157 51 -32 133 7 162 -144 -13 -62 -63 -151 -16 76 -15 -58 17 84
5411 84 112 85 -129 7 -26 37 -49 -22 -140 135 148 -161 -129 56 101 -33 178 -73 -6 17 39 -97 -58 -72 -89
5436 -89 60 -4 61 26 51 -97 18 92 244 104 201 83 -4 -139 197 44 39 -67 27 142 -109 54 -65 171
5460 171 -198 -110 -49 55 2 163 139 60 -46 -92 -66 -32 -107 -84 100 -10 -11 -35 62 78 -3 -40 -68 -24 73 -92 -61
5487 -61 38 -65 25 -91 3 -46 -119 -16 83 -176 -34 -72 -88 -11 -48 -4 2 -78 66 -15 30 58 -69 -190 -46 -100
5513 -100 24 77 0 118 -61 191 -75 -14 -28 106 -340 -46 -13 -142 36 1 -244 32 137 110 -30 11 35
5536 35 86 70 150 -63 82 2 145 169 41 32 -31 83 -146 67 74 34 27 -156 121 13 -193 -276 123 139 -306
5561 -306 31 -19 -65 25 121 99 -80 190 29 -256 -1 -20 -78 -53 41 77 -54 36 -136 -25 -133 108 85 -38
5585 -38 -139 -51 -8 128 -125 113 -47 -115 -73 36 29 127 -3 -109 204 78 -47 -179 130 45 117 -110 30
5608 30 -62 177 -97 105 -24 -60 -63 211 34 37 -20 -117 122 -223 -105 -4 23 -22 -32 147 0 23 2 -43 -1
5633 -1 90 -127 -62 2 156 17 -49 81 -231 -46 -45 139 150 -297 132 0 126 208 -23 80 260 155 -4
5656 -4 59 161 20 -25 126 21 -46 -1 -139 2 94 128 53 52 2 -78 66 -5 20 -69 4 -95 282 216 57 106 222
5683 222 129 67 8 -95 -80 225 -41 -21 -103 -96 149 -16 237 14 147 2 -108 -53 38 -198 45 159 156 -74
5707 -74 -131 69 -143 17 105 -53 102 -42 8 -108 -91 -80 80 50 -118 -146 -72 196 -157 -73 -72 14 16 -121 -59
5732 -59 -140 -67 -172 27 113 149 44 -16 98 -168 -132 -65 15 -45 171 -43 -117 2 43 135 54 154 -15 -178 -126
5757 -126 -116 -87 147 15 57 -41 55 82 -27 -14 227 -112 -38 -135 26 -3 -13 -142 -92 0 168 -14 42 -109 48
5782 48 140 -29 148 84 21 -45 196 207 37 11 -55 -120 52 150 -16 16 111 -29 -50 170 -76 -90 -58 14 94 101
5808 101 91 87 -191 -75 -223 -32 13 -228 105 -94 -61 -102 101 105 -94 -33 74 69 -53 70 71 110 2 -96 129
5833 129 109 -78 -21 -289 133 153 -130 177 -122 -97 215 -188 -73 122 84 -108 42 -36 68 -183 164 232
5855 232 16 159 8 -3 20 74 -75 -45 -10 95 -6 54 76 -147 -111 -21 61 182 -138 7 -61 184 -30 -30
5879 -30 -117 58 -179 -43 -96 210 141 13 14 99 229 130 223 -122 152 116 -74 -69 -64 92 -1 -23 36 42 28 34 204
5906 204 107 275 122 -218 -69 52 245 50 -53 28 -44 152 -111 171 51 -26 0 160 -152 19 -21 234
5928 234 2 2 125 207 203 -88 7 43 -24 -45 125 30 47 75 112 51 37 -62 -63 -27 9 16 -55 -194 -126 181 -9 133
5956 133 83 -6 -8 18 -7 -113 132 -64 188 61 -86 -66 52 44 -144 100 -34 105 53 57 -108 -2 147 -102
5980 -102 -52 -39 -130 121 -87 127 -213 330 109 28 25 -223 -230 24 271 47 86 -111 -56 -64 -24 71 -5 -70 -24 -80
6006 -80 111 -37 41 -26 107 45 100 53 143 -28 -43 123 32 -207 -75 120 46 224 72 -1 58 -72 -60 138
6030 138 40 5 78 -88 -58 123 83 -160 -129 64 91 34 -33 68 -115 8 216 -62 -89 -25 -26 121 -72 -60 -125
6055 -125 148 130 -87 97 -20 -158 154 13 -4 -218 69 175 -93 -11 -15 160 11 36 -129 96 153 142 -153
6078 -153 47 -245 -77 18 107 149 3 -1 53 -87 87 52 -73 -57 -30 -42 -75 -137 -45 -122 335 98 91 35 -190 -112
6104 -112 171 -47 74 67 -23 -2 -41 -51 -75 74 -178 -94 -89 51 56 34 -53 82 -101 134 128 -24 36 56 104 -24
6130 -24 -66 -135 35 52 -143 -104 -68 113 89 127 126 14 -92 -8 -26 -78 119 80 152 60 -122 28 106 -86 122 117
6156 117 104 -150 10 -14 -30 62 34 105 158 -133 111 -21 61 8 -79 123 79 -9 -99 30 -84 67 70 108 -90
6181 -90 -11 -56 32 -3 66 2 145 -42 62 -190 186 -42 88 199 -124 86 -36 -106 -16 -58 142 -87 37
6204 37 77 90 -118 -27 125 120 -130 -7 273 -160 154 -124 139 -97 -17 -131 84 114 1 93 -45 -42 -73 -223
6228 -223 139 -57 -3 50 -176 8 74 -78 83 -110 9 88 -70 -17 -69 16 -230 -63 -133 -69 -32 -99 83 132
6252 132 142 77 -79 -48 87 -128 17 -108 -4 -187 156 65 50 42 73 -132 -13 -34 -116 182 4 13 80 82 37
6277 37 58 -10 24 -53 -55 -39 -117 146 -7 -217 -95 -4 13 -83 -52 10 -71 160 21 -130 142 38 71 104 91 68
6303 68 201 112 -167 -65 98 -28 -9 -91 154 -1 141 -11 -6 -100 9 233 -43 3 -28 7 -4 -126 -162 -120
6327 -120 -41 117 21 169 1 -5 -40 12 22 -18 -48 -24 176 128 33 -139 95 -81 -147 -139 -3 195 50 -35 -2 148
6353 148 112 -84 -131 104 -23 8 -47 7 -34 -13 -212 219 17 -13 54 10 45 -167 137 -69 -175 -96 -84 99
6377 99 -63 -12 46 -130 72 -40 -37 -128 82 27 129 -3 -58 183 -51 3 17 11 24 -79 198 1 -64 57 8
6402 8 -222 67 -12 -10 110 157 151 -63 72 -30 -181 72 199 100 56 -62 38 -64 234 -75 -21 -92 13 44
6426 44 -50 203 -106 -95 -86 -34 -93 -17 -3 170 -54 -53 -9 123 20 146 77 147 -25 29 72 -181 94 -70 -273
6451 -273 -55 -234 -80 -142 129 -22 -65 -98 -8 142 38 24 4 40 238 18 109 -196 35 -21 109 -90 -92 67
6475 67 -37 -44 83 245 -89 -49 -46 -30 86 -29 24 108 -55 163 90 42 286 -45 76 -93 81 -27 67 203
6499 203 1 135 100 76 130 10 -13 37 -25 -34 -95 115 -19 -67 55 29 -199 16 -90 14 -204 -16 108 47
6523 47 48 -250 88 23 6 3 228 13 -49 -104 54 -69 60 109 -104 160 -12 211 -83 18 62 83 -31 -180
6547 -180 -21 -20 17 155 152 -69 35 -191 179 130 -126 -209 -72 173 -9 139 -66 -115 150 222 -17 92 30
6570 30 93 -102 -124 -261 92 -82 83 -22 -58 -108 19 59 203 -73 43 86 73 40 113 -8 -138 82 11 -20
6594 -20 69 -26 -163 -20 -179 -59 -62 -67 0 106 62 112 -156 -44 26 175 -119 111 45 38 129 -222 94 12 -41 -32
6620 -32 177 -47 48 51 5 -174 -336 -91 92 -55 81 14 108 -191 -272 23 -62 19 -102 -131 -55 60 30 71 -60
6645 -60 -102 -85 -15 45 38 -39 30 119 3 189 128 60 -90 77 219 -184 30 -17 -19 39 301 -153 235 -25 -31 -41
6671 -41 -233 285 140 -91 32 -138 -2 169 -24 155 103 -39 64 61 -123 -52 -139 38 -102 76 -80 -42
6693 -42 209 23 -49 -85 -144 -28 -137 -33 -21 61 -124 -118 -70 -36 156 -60 -93 11 -209 16 56 50 -69 25 56
6718 56 169 -137 16 52 83 220 -73 -52 187 11 -121 -12 50 -41 106 41 76 -78 -144 -219 -311 252 28 -111
6742 -111 -119 -62 57 -37 38 204 -171 -75 -192 21 -96 -48 206 117 4 31 -140 -80 104 -22 -88 140 99 -59
6766 -59 -8 -96 -244 26 13 -53 107 191 24 139 -169 -76 -66 128 0 -63 -28 151 147 20 -53 -49 228 -27 149
6791 149 176 -85 -28 61 -63 129 2 65 -103 -51 128 -30 -105 77 68 83 31 186 23 -121 270 -55 14 -151
6815 -151 188 93 -81 -12 127 26 67 -80 62 -39 -96 19 -49 -26 -1 -117 67 -61 63 -194 60 58 -34
6838 -34 -119 -45 63 -37 -80 -27 -119 -13 -151 14 -58 -152 48 14 -119 -89 123 -62 -1 15 1 -71 59 123 22
6863 22 27 30 211 48 -50 138 20 -109 -171 -52 13 -21 51 -94 58 261 -101 65 -179 60 -150 37 97 -81
6887 -81 -135 49 -40 -116 73 -181 -27 -30 -40 -216 -81 -88 -70 -83 -56 -106 166 41 84 11 181 11 -64 0 -67 -125
6913 -125 -104 119 -28 -29 -114 -138 85 -44 -97 -156 -54 108 -304 -46 -69 -185 -63 -75 -53 -18 162 -1 -2 -54 -53
6938 -53 76 2 138 -65 113 114 83 -37 137 -61 -19 -28 -93 -22 194 -87 -93 70 62 -37 62 155 -53 -89 -168 -64
6964 -64 -197 52 -99 -107 -186 -132 -99 38 62 -230 173 -83 -37 70 -39 14 98 -75 37 -115 88 16 112 98
6988 98 -134 116 70 -11 -81 -184 95 -21 25 171 190 88 -160 55 -245 -88 41 -51 199 -48 1 -3 149
7011 149 -106 115 24 99 1 -95 -220 -118 23 47 -119 33 -12 247 -8 -17 70 -59 -104 193 78 23 250 -32
7035 -32 72 38 -52 -23 116 24 -40 12 2 17 184 37 65 -45 219 33 -266 157 -89 183 -8 177 21
7058 21 -76 75 -93 55 12 -51 -49 31 -14 130 -158 -155 -141 -110 145 120 -2 173 -5 7 147 -51 -152 144 86
7083 86 -124 39 259 12 -101 299 -122 -87 15 -13 -14 15 51 -40 63 -182 213 -114 94 -140 -21 89 -89
7106 -89 64 148 -73 64 15 -116 -174 113 21 98 -119 -60 145 -13 56 -51 165 83 237 -36 170 127 -144
7129 -144 -106 -239 240 104 83 234 109 56 146 29 185 57 20 -91 -87 -24 -200 42 5 167 64 -70 85
7152 85 162 -205 44 -101 -64 -48 8 212 -25 120 35 -22 51 -17 -35 -85 -29 60 -253 143 208 -50 70 -58 57
7177 57 66 -10 45 54 -82 21 -38 30 -29 -189 63 -1 11 88 41 -126 -58 131 73 75 53 -16 -54 -18 16 28 22 -91 -59
7206 -59 141 45 -60 -159 11 -122 -34 -52 38 162 -15 63 -191 1 37 -217 23 109 11 31 -122 -137 221 -72
7230 -72 139 -149 -19 65 152 -33 -81 -45 -41 -33 6 -13 79 -73 1 251 -135 123 281 -54 -55 147 -8 24 -24 -58
7256 -58 28 59 14 58 -215 22 135 -138 89 79 136 -104 -30 19 -68 -119 76 222 -28 4 -23 -94 26 -23 -28 35
7282 35 149 -88 120 192 -102 2 38 10 106 104 -77 -78 -148 -8 79 -58 -65 37 71 19 -60 59 -198 46 4 -28
7308 -28 170 23 -111 -43 54 18 -46 97 28 72 91 -113 233 45 111 86 -23 1 -144 -183 151 -75 -110 22
7332 22 -157 -176 32 189 -31 198 21 7 -31 -263 3 -12 182 -128 71 -94 -123 193 7 84 -48 -119 119
7355 119 67 -29 -227 -45 117 -143 -84 101 157 -180 22 116 9 82 -107 -73 -37 0 14 -20 47 -81 41 214
7379 214 -23 20 120 -71 148 51 -89 83 18 178 100 34 -63 32 19 -68 -74 -155 158 -10 87 45 160 76 121
7404 121 197 18 -90 -118 8 102 -23 40 80 152 -46 -22 -44 27 -29 -21 29 161 -239 79 -35 165 40 164
7428 164 87 -10 77 -79 71 26 55 -89 -126 -48 157 68 -103 -105 -42 31 4 5 -167 80 -15 -130 237 88 38 114
7454 114 -14 59 90 175 144 -116 -11 -78 135 122 -137 48 -29 151 -94 -13 -23 -135 192 -176 -87 -85 -151 -42
7478 -42 181 14 108 53 15 125 65 129 -82 -55 95 72 -177 89 81 -61 89 56 174 -34 209 -32 -99 205
7502 205 92 53 -15 -42 -107 253 -127 -129 151 168 -38 -32 -52 192 -32 -13 75 57 -130 33 -87 156 115 -11 -202
7527 -202 40 13 114 151 3 43 -65 -47 -43 68 -171 -294 116 -53 140 -59 202 65 -33 31 124 82 -77
7550 -77 -13 -265 136 -94 -127 32 288 -116 113 101 75 -107 55 171 46 -18 -260 284 143 3 41 61 148
7573 148 -74 109 7 98 43 61 3 -40 23 67 62 -5 148 -93 -33 145 149 105 15 -57 169 66 -130 -183 60 -192
7599 -192 -148 132 53 105 -141 -35 65 -105 59 54 -27 3 167 -69 -86 88 -44 -53 26 116 93 -282 176 -60
7623 -60 -66 -68 -228 136 -178 66 -70 140 -41 47 -4 -10 -96 24 -68 -25 145 -12 -51 -107 118 51 -59 -201 14
7648 14 -145 4 55 15 -37 19 13 50 -10 -56 -55 71 -49 -7 68 -79 71 55 185 54 -100 -45 -95 27 -31 -78
7674 -78 -12 136 10 -22 60 -23 -122 -28 -33 68 106 33 -8 -77 41 -13 -118 -13 -110 -110 -166 -269 -13 -218 38 -85
7700 -85 -83 -77 -64 -127 -12 8 -40 -152 -50 205 -174 62 -47 -15 -44 169 -70 -54 13 248 62 -102 9 41 -12
7725 -12 -65 -84 -111 -33 85 -84 -32 -151 95 -113 48 3 2 68 372 60 -134 57 334 193 27 68 -113 -48
7749 -48 35 81 11 11 -112 -46 -67 -297 -11 49 26 168 272 71 -6 -43 -91 -73 -145 -58 86 -126 55 -32 63 -76
7775 -76 -101 -95 -74 233 50 -49 35 95 135 72 33 -119 34 -82 -83 54 -7 156 -170 -69 -2 3 57 -56 -211 215
7801 215 167 -109 203 -101 149 -70 -161 83 -25 -11 -89 -149 -78 -35 163 -43 72 11 -193 15 -57 32 7 -27
7825 -27 124 -119 -119 -46 67 -177 -163 148 118 -95 114 -7 -59 -234 120 55 -99 92 -104 6 5 -120 -68 -18
7849 -18 -17 -61 -55 161 151 -136 -50 -43 201 73 49 107 16 12 -94 -15 152 -110 44 -22 -89 -165 113 -71 41 -81
7875 -81 52 91 72 -60 19 -80 127 15 7 -31 -177 82 40 -127 -87 33 65 -182 65 -153 -88 128 -158 53
7899 53 -212 -39 65 -220 -156 50 40 -183 85 -144 -137 -8 -25 107 38 -203 -34 182 -130 -130 138 -5 14
7922 14 106 106 -46 1 -38 17 167 -48 65 -91 -134 189 -23 44 125 -33 33 -91 15 -85 60 -71 106 104
7946 104 -30 -136 -107 -61 -155 -60 10 52 -60 83 -18 -130 -30 -43 -115 -23 32 89 -246 -30 -212 -56 -249 67
7970 67 105 4 -169 39 50 23 -6 -88 48 113 -110 -54 140 -28 52 -21 43 -65 -14 117 -47 40 114 40 -151
7995 -151 -81 182 66 -2 -3 23 47 125 -55 -89 159 -27 165 96 86 -120 -92 -44 26 -231 -194 -231 156 -90 23
8020 23 85 53 -116 -260 119 -171 -56 -35 62 -8 89 82 29 127 34 -113 -67 28 13 -8 29 71 213 69 3 190
8046 190 181 90 -36 78 -164 -83 -55 -8 -27 11 -80 -241 -18 -47 -88 -7 -16 -54 86 -7 10 60 114 203 -23 118 10
8073 10 51 159 44 243 180 46 -120 152 -95 -32 -36 157 6 96 -4 37 25 -35 124 13 -30 -91 45 54 -12
8098 -12 17 50 -59 84 194 -1 54 59 8 -37 -206 -94 -13 186 112 109 5 -25 -24 19 2 95 64 136 84 -106 74
8125 74 103 61 -104 152 -126 -37 19 4 -163 -17 -68 -52 -171 65 -99 -41 -260 27 -2 -130 121 -133 -67 120
8149 120 -39 -166 -78 43 1 -45 182 32 311 164 21 -74 72 73 -33 -70 24 92 22 -125 12 -118 -96 247
8173 247 95 56 108 88 -263 -153 -93 -18 8 66 -43 92 81 115 -112 64 -66 -39
8191c9
##END NTUPLES=NMR FID
##END=
