##TITLE=1H_EL-3
 CDCl3
 8 sc, 
 26.12.2023
##JCAMPDX= 6.0         $$ Bruker NMR JCAMP-DX V2.0
##DATA TYPE= NMR FID
##DATA CLASS= NTUPLES
##ORIGIN= UXNMR, Bruker Analytische Messtechnik GmbH
##OWNER= root
$$ XWIN-NMR		Version 3.5
$$ Tue Dec 26 15:49:27 2023 Russian Standard Time (UT+4h)  she@DPX200
##.OBSERVE FREQUENCY= 200.1313
##.OBSERVE NUCLEUS= ^1H
##.DELAY= (6, 6)
##.ACQUISITION MODE= SIMULTANEOUS
##.ACQUISITION SCHEME= undefined
##.AVERAGES= 8
##.DIGITISER RES= 18
##SPECTROMETER/DATA SYSTEM= spect
##.PULSE SEQUENCE= zg30
##.SOLVENT NAME= CDCl3
##.SHIFT REFERENCE= (INTERNAL, CDCl3, 0, 15.7039)
##AUDIT TRAIL= $$ (NUMBER, WHEN, WHO, WHERE, WHAT)
$$ ##TITLE= Audit trail, XWIN-NMR		Version 3.5
$$ ##JCAMPDX= 5.01
$$ ##ORIGIN= Bruker BioSpin GmbH
$$ ##OWNER= she
$$ F:/spectra/data/she/nmr/H-F/1/audita.txt
$$ ##AUDIT TRAIL=  $$ (NUMBER, WHEN, WHO, WHERE, WHAT)
(   1,<2023-12-26 15:48:18.34 +0400>,<she>,<DPX200>,
      <created by zg, POWCHK disabled, PULCHK disabled
       configuration hash MD5:
       00 E9 B6 7A A2 85 ED C7 34 08 36 98 17 FE 4E 26
       data hash MD5: 16K
       EA E0 64 FA B1 AD 25 83 10 DA D9 46 56 DE C2 3F>)
$$ ##END=
$$ 
$$ hash MD5
$$ 93 86 CF D2 96 A0 C4 D9 FE 2A 6F 91 11 A9 29 DB
##$RELAX= 
##$RELAX= 
##$RELAX= 
##$RELAX= 
##$RELAX= 
##$RELAX= 
$$ Bruker specific parameters
$$ --------------------------
##$DU= <F:/spectra>
##$EXPNO= 1
##$NAME= <H-F>
##$PROCNO= 1
##$TYPE= <nmr>
##$USER= <she>
##$AMP= (0..31)
100 100 100 100 100 100 100 100 100 100 100 100 100 100 100 100 100 100 
100 100 100 100 100 100 100 100 100 100 100 100 100 100 
##$AQSEQ= 0
##$AQ_mod= 1
##$AUNM= <au_zg>
##$AUTOPOS= <>
##$BF1= 200.13
##$BF2= 200.13
##$BF3= 200.13
##$BF4= 200.13
##$BF5= 200.13
##$BF6= 200.13
##$BF7= 200.13
##$BF8= 200.13
##$BYTORDA= 1
##$CFDGTYP= 0
##$CFRGTYP= 5
##$CHEMSTR= <none>
##$CNST= (0..31)
1 1 145 1 1 1 1 1 1 1 1 1 1 1 1 1 1 1 1 1 1 1 1 1 1 1 1 1 1 1 1 1 
##$CPDPRG= <>
##$CPDPRG1= <>
##$CPDPRG2= <>
##$CPDPRG3= <>
##$CPDPRG4= <mlev>
##$CPDPRG5= <mlev>
##$CPDPRG6= <mlev>
##$CPDPRG7= <mlev>
##$CPDPRG8= <mlev>
##$CPDPRGB= <>
##$CPDPRGT= <>
##$D= (0..31)
0 1.2 0 0 0 0 0 0 0 0.06 0 0.03 0 0 0 0 0.0002 0 0 0 0 0 0 0 0 0 0 0 0 
0 0 0 
##$DATE= 1703591297
##$DBL= (0..7)
120 120 120 120 120 120 120 120 
##$DBP= (0..7)
150 150 150 150 150 150 150 150 
##$DBP07= 0
##$DBPNAM0= <>
##$DBPNAM1= <>
##$DBPNAM2= <>
##$DBPNAM3= <>
##$DBPNAM4= <>
##$DBPNAM5= <>
##$DBPNAM6= <>
##$DBPNAM7= <>
##$DBPOAL= (0..7)
0.5 0.5 0.5 0.5 0.5 0.5 0.5 0.5 
##$DBPOFFS= (0..7)
0 0 0 0 0 0 0 0 
##$DE= 6
##$DECBNUC= <off>
##$DECIM= 32
##$DECNUC= <off>
##$DECSTAT= 4
##$DIGMOD= 1
##$DIGTYP= 9
##$DL= (0..7)
0 120 120 120 120 120 120 120 
##$DP= (0..7)
150 150 150 150 150 150 150 150 
##$DP07= 0
##$DPNAME0= <>
##$DPNAME1= <>
##$DPNAME2= <>
##$DPNAME3= <>
##$DPNAME4= <>
##$DPNAME5= <>
##$DPNAME6= <>
##$DPNAME7= <>
##$DPOAL= (0..7)
0.5 0.5 0.5 0.5 0.5 0.5 0.5 0.5 
##$DPOFFS= (0..7)
0 0 0 0 0 0 0 0 
##$DQDMODE= 0
##$DR= 18
##$DS= 0
##$DSLIST= <SSSSSSSSSSSSSSS>
$$ [...]
##$SUBNAM2= <"">
##$SUBNAM3= <"">
##$SUBNAM4= <"">
##$SUBNAM5= <"">
##$SUBNAM6= <"">
##$SUBNAM7= <"">
##$SUBNAM8= <"">
##$SUBNAM9= <"">
##$SW= 18.0517328524113
##$SWIBOX= (0..15)
0 0 2 0 0 0 0 0 0 0 0 0 0 0 0 0 
##$SW_h= 3612.71676300578
##$TD= 16384
##$TD0= 1
##$TE= 0
##$TE2= 300
##$TE3= 300
##$TEG= 300
##$TL= (0..7)
0 120 120 120 120 120 120 120 
##$TP= (0..7)
150 150 150 150 150 150 150 150 
##$TP07= 0
##$TPNAME0= <>
##$TPNAME1= <>
##$TPNAME2= <>
##$TPNAME3= <>
##$TPNAME4= <>
##$TPNAME5= <>
##$TPNAME6= <>
##$TPNAME7= <>
##$TPOAL= (0..7)
0.5 0.5 0.5 0.5 0.5 0.5 0.5 0.5 
##$TPOFFS= (0..7)
0 0 0 0 0 0 0 0 
##$TUNHIN= 0
##$TUNHOUT= 0
##$TUNXOUT= 0
##$USERA1= <user>
##$USERA2= <user>
##$USERA3= <user>
##$USERA4= <user>
##$USERA5= <user>
##$V9= 5
##$VALIST= <valist>
##$VCLIST= <CCCCCCCCCCCCCCC>
##$VD= 0
##$VDLIST= <DDDDDDDDDDDDDDD>
##$VPLIST= <PPPPPPPPPPPPPPP>
##$VTLIST= <TTTTTTTTTTTTTTT>
##$WBST= 1024
##$WBSW= 4
##$XGAIN= (0..3)
0 0 0 0 
##$XL= 0
##$YL= 0
##$YMAX_a= 209828
##$YMIN_a= -249952
##$ZGOPTNS= <>
##$ZL1= 120
##$ZL2= 120
##$ZL3= 120
##$ZL4= 120
##$ABSF1= 10
##$ABSF2= 0
##$ABSG= 5
##$ABSL= 3
##$ALPHA= 0
##$AQORDER= 0
##$ASSFAC= 0
##$ASSFACI= 0
##$ASSFACX= 0
##$ASSWID= 0
##$AUNMP= <proc_1d>
##$AZFE= 0.1
##$AZFW= 0.1
##$BCFW= 1
##$BC_mod= 2
##$BYTORDP= 1
##$COROFFS= 0
##$CY= 11.3945322036743
##$DATMOD= 1
##$DC= 2
##$DFILT= <>
##$DTYPP= 0
##$F1P= 15.7292609196834
##$F2P= 12.9074282941183
##$FCOR= 0.5
##$FTSIZE= 0
##$FT_mod= 4
##$GAMMA= 1
##$GB= 0.15
##$INTBC= 1
##$INTSCL= 1
##$ISEN= 128
##$LB= 0.24
##$LEV0= 0
##$LPBIN= 0
##$MAXI= 10000
##$MC2= 0
##$MEAN= 0
##$ME_mod= 0
##$MI= 1.114404
##$NCOEF= 0
##$NC_proc= 0
##$NLEV= 6
##$NOISF1= 3.799351
##$NOISF2= 2.8
##$NSP= 1
##$NTH_PI= 0
##$NZP= 0
##$OFFSET= 15.70392
##$PC= 1
##$PHC0= -24592.39
##$PHC1= 11.65273
##$PH_mod= 1
##$PKNL= yes
##$PPARMOD= 0
##$PSCAL= 0
##$PSIGN= 0
##$REVERSE= no
##$SF= 200.130013532006
##$SI= 16384
##$SIGF1= 3
##$SIGF2= 2
##$SINO= 400
##$SIOLD= 16384
##$SREGLST= <1H.CDCl3>
##$SSB= 0
##$STSI= 0
##$STSR= 0
##$SW_p= 3612.71676300578
##$SYMM= 0
##$S_DEV= 0
##$TDeff= 0
##$TDoff= 0
##$TI= <>
##$TILT= no
##$TM1= 0
##$TM2= 0
##$TOPLEV= 0
##$USERP1= <user>
##$USERP2= <user>
##$USERP3= <user>
##$USERP4= <user>
##$USERP5= <user>
##$WDW= 1
##$XDIM= 8192
##$YMAX_p= 0
##$YMIN_p= 0
$$ End of Bruker specific parameters
$$ ---------------------------------
##NTUPLES= NMR FID
##VAR_NAME=  TIME,          FID/REAL,        FID/IMAG
##SYMBOL=    X,             R,               I
##VAR_TYPE=  INDEPENDENT,   DEPENDENT,       DEPENDENT
##VAR_FORM=  AFFN,          ASDF,            ASDF
##VAR_DIM=   8192,          8192,            8192
##UNITS=     SECONDS,       ARBITRARY UNITS, ARBITRARY UNITS
##FACTOR=    0.0002768,     1,               1
##FIRST=     0,             0,               0
##LAST=      2.2672688,     0,               0
##MIN=       0,             -249952,         0
##MAX=       2.2672688,     209828,          0
$$ Real data points
##PAGE= N=1
##DATA TABLE= (X++(R..R)), XYDATA
$$ plain form
0 0 0 0 0 0 0 0 0 0 0 0 0 0 0 0 0 -1 8 -8 8 -8 8 -8 16 -16 16 -20 24 -26 32 -34 40 -45 50 -57 63 -71 80 -89
38 -89 98 -109 121 -134 149 -165 181 -199 219 -241 265 -291 322 -356 391 -433 479 -535 596 -671
58 -671 758 -865 997 -1165 1387 -1694 2143 -2849 4086 -6669 14050 -73754 -249952 105505
72 105505 127388 -164719 -16008 154731 -57713 -84792 94472 24655 -59219 55698 25100
83 25100 -84080 12124 58968 -45365 -14511 32893 -42007 -19911 39485 -20251 -19521 43203
95 43203 7427 -25242 14181 8215 -24235 7243 32924 -7344 -9591 28632 -13110 -44296 24741
108 24741 31009 -41129 -36902 9695 13966 6405 7998 13051 7778 -13076 -16285 11387 32012 2530
122 2530 -35699 -8679 13300 -15917 2807 26298 -19504 -14228 28589 -1666 -11580 22761 -674
$$ packed form
0@%%%%%%%%%%%%%%%jRj6J6j6J6j6K4l2L2l6M4n0N8o6P4q5R5j07J20j34J51j69
38h9J87k07K30k55K83l14L46l80M18m60N06n56O13o78P47q24R12j014J131j267
58f71J429j623J862k162K552l081L837m992O935j0755K0719q7804j76198L55457
72A05505K1883k92107J48711J70739k12444k7079J79264o9817q3874J14917l0598
83B5100j09180R6204M6844j04333L0854M7404p4900K2096N9396n9736P30O2724
95D3203l5776l2669L9423n966l2450L1478K5681m0268k247L8223m1742l1186O9037
108B4741O268p2138M227M6597M271p561J593N053n273k0854l209K7672K0625k9482
122B530l8229K7020K1979k9217J8724K3491m5802N276M2817l0255r914L4341k3435
$$ plain form
135 -674 -26310 -2284 695 -7545 9667 5000 -13741 12352 22462 -23564 -12889 33146 -2706
148 -2706 -17061 26972 -5519 -30295 23651 8229 -26498 15688 5304 -39688 706 26211
160 26211 -10289 -3181 15599 -16609 -11982 33164 15023 -13391 13425 2037 -26658 9006
172 9006 10500 -22202 4983 1937 -32115 10566 29651 -18710 -4478 24123 -10060 -12559 19474
185 19474 1618 -16836 10948 9279 -21623 -181 20708 -13887 -9449 23467 -1934 -17272
197 -17272 7381 875 -7268 9141 2798 -11267 -4513 4112 953 -2432 7141 2177 -16305 371
211 371 15154 -5585 2928 17575 -12448 -12494 20404 5226 -17633 4126 7314 -22140 -9369
224 -9369 19551 -6240 -17057 19317 3347 -20284 19213 17387 -19000 6391 16323 -15217 -3058
$$ packed form
135f74k5636K4026K979q240J7212m667j8741K6093J0110m6026J0675M6035l5852
148b706j4355M4033l2491k4776N3946j5422l4727M2186j0384m4992M0394K5505
160B6211l6500P108J8780l2208M627M5146j8141k8414K6816j1388k8695L5664
172I006J494l2702K7185l046l4052M2681J9085m8361J4232K8601l4183k499L2033
185A9474j7856j8454K7784j669l0902K1442K0889l4595M438L2916k5401j5338
197a7272K4653o506q143J6409o343j4065O754Q625l159l385R573m964j8482J6676
211C71J4783k0739Q513J4647l0023m6L2898j5178k2859K1759L188k9454J2771
224i369K8920k5791j0817L6374j5970k3631L9497j826l6387K5391R932l1540J2159
$$ plain form
237 -3058 10770 -10496 -5361 10120 -5572 -11254 6401 3744 -9460 3958 9610 -8233 -2797
250 -2797 6755 -4043 3703 8458 -7942 -2026 5138 -5127 2970 4590 -6465 1854 174 -7300
264 -7300 6307 5664 -7023 -215 2014 -6535 354 6326 -5046 -6497 7703 1203 -9950 9530
278 9530 10542 -10859 4796 11029 -11592 1951 11113 -13745 -3419 10784 -11311 -8604 9335
291 9335 -2810 -7827 6915 3251 -7321 3959 10425 -4741 -1556 11745 -2992 -7885 7820
304 7820 504 -5570 3076 -2435 -5132 785 -1088 -446 -1172 -2837 5140 -365 -6133 7256 4843
319 4843 -7438 1412 4824 -2665 843 2178 -1822 563 3200 -2942 -3947 6372 1138 -10132
333 -10132 4467 5415 -12578 2205 8734 -12902 113 12495 -9652 -3709 14172 -2337 -6687
$$ packed form
237c058J3828k1266N135J5481j5692n682J7655k657j3204J3418N652j7843N436
250b797R552j0798P746M755j6400N916P164j0265Q097J620j1055Q319j680p474
264g300J3607o43j2687O808K229q549O889N972j1372j451J4200o500j1153J9480
278I530J012k1401J5655O233k2621J3543R162k4858J0326J4203k2095K707J7939
291I335j2145n017J4742l664j0572J1280O466j5166L185J3301j4737m893J5705
304G820p316o074Q646n511k697N917j873O42p26j665P977n505n768J3389k413
319D843j2281Q850L412p489L508J335m000K385K637o142j005J0319n234j1270
333a0132J4599R48j7993J4783O529k1636J3015J2382k2147N943J7881j6509m350
$$ plain form
346 -6687 8680 3068 -6958 2736 5100 -6645 -2593 6325 -5432 -7062 6470 -1848 -6886 4699
360 4699 550 -3699 4538 840 -680 3170 145 1729 792 -2370 4488 -32 -6735 3887 1275
375 1275 -7926 1541 3023 -6908 -1109 6257 -3891 -5164 8220 2593 -10626 6181 10345 -11310
389 -11310 658 13153 -9359 -3014 12528 -7635 -5688 11429 -5078 -9737 8611 661 -10430
402 -10430 3210 5343 -7848 -495 7681 -5088 -2581 10745 -3589 -5844 12027 -286 -8756
415 -8756 8852 1855 -8466 4154 2149 -5764 477 515 -3040 -1198 -544 288 -342 -1028 1171 1036
431 1036 1157 751 636 2724 -370 -1176 3535 -1733 -2773 4821 -2901 -5098 4512 -1868 -5410 3018
447 3018 -532 -2514 1541 -898 111 2171 -179 1072 1546 726 2022 -793 -465 2754 -1418 -2475
$$ packed form
346f687J5367n612j0026R694K364j1745M052Q918j1757j630J3532q318n038J1585
360D699m149m249Q237l698j520L850l025J584r37l162O858m520o703J0622k612
375A275r201R467J482r931N799P366j0148j273J3384n627j3219J6807M164k1655
389a1310J1968J2495k2512O345J5542k0163J947J7117j6507m659J8348p950j1091
402a0430J3640K133j3191P353Q176j2769K507J3326j4334k255J7871j2313q470
415h756J7608o997j0321J2620k005p913O241L8l555J842O54Q32o30o86K199j35
431A036J21m06j15K088l094q06M711n268j040P594p722k197R610o380l542Q428
447C018l550j982M055k439J009K060k350J251M74q20J296k815L28L219m172j057
$$ plain form
463 -2475 818 -228 -2165 -1693 1281 -508 -4848 3251 2506 -7044 4042 6737 -9045 1882 9919
478 9919 -8271 -1115 11449 -6678 -5143 11130 -2641 -9888 8440 2865 -13212 3093 9332
491 9332 -12527 -2275 14480 -10038 -7992 17732 -4382 -13455 16917 2696 -15998 11200 8944
504 8944 -14396 2679 11730 -10274 -4743 11847 -5233 -11518 10062 1283 -14360 6921 7666
517 7666 -12931 3262 11685 -9556 -556 12826 -4879 -5255 9040 1167 -7245 2205 4418 -5725
531 -5725 -2962 6106 -3614 -6902 6572 -113 -8280 5157 3968 -7292 1693 6146 -3169 -881
545 -881 5512 -474 -4061 4457 3667 -7136 1436 6812 -8475 -2473 9498 -6488 -5663 9289 -4101
560 -4101 -7442 8390 383 -8351 4614 4493 -5847 1462 7720 -3360 -2318 7837 -2297 -5553
$$ packed form
463b475L293j046j937M72K974j789m340Q099p45r550J1086K695j5782J0927Q037
478I919j8190P156J2564j8127J535J6273j3771p247J8328n575j6077J6305O239
491I332k1859J0252J6755k4518K046K5724k2114r073L0372j4221j8694K7198k256
504H944k3340J7075R051k2004N531J6590j7080o285K1580q779j5643K1281P45
517G666k0597J6193Q423k1241R000J3382j7705l76J4295p873q412R450K213j0143
531e725K763R068r720l288J3474o685q167J3437j189j1260Q985M453r315K288
545h81O393n986l587Q518p90j0803Q572N376j5287O002J1971j5986Q25J4952j3390
560d101l341J5832q007q734J2965j21j0340P309O258j1080J042J0155j0134l256
$$ plain form
574 -5553 7961 -1676 -9240 5981 735 -8688 4577 1202 -7715 4773 2900 -5495 3912 4077
588 4077 -4789 2094 5539 -2995 -917 5269 -3099 -4255 7075 -1152 -9221 5599 2016 -10419
602 -10419 4901 5233 -10406 2252 7883 -7473 373 8748 -3942 -4064 6500 1167 -4282 2454
616 2454 2375 -4945 1014 5600 -5020 -2074 5622 -4756 -4265 5957 -2018 -5339 3704 394 -3217
631 -3217 2824 3118 -1904 -1475 4276 2710 -3907 2057 3858 -5971 -1044 5547 -4452 -3282 4267 -3244
647 -3244 -4605 3966 1150 -5197 336 4075 -2308 -58 6991 -2037 -4439 7906 237 -6706 6922
662 6922 1444 -10050 3975 4149 -7328 788 3078 -6332 -525 5970 -2105 -3194 4314 458 -4405
677 -4405 4112 3169 -5785 2146 4022 -4978 2947 5029 -6410 -321 3952 -5047 437 3359 -5193
$$ packed form
574e553J3514r637p564J5221n246r423J3265l375q917J2488j873q395R407J65
588D077q866O883L445q534K078O186q368j156J1330q227q069J4820l583j2435
602a0419J5320L32j5639J2658N631j5356P846Q375j2690j22J0564n333n449O736
616B454p9p320N959M586j0620K946P696j0378M91J0222p975l321R043l310l611
631c217O041K94n022M29N751j566o617N964J801r829M927O591r999J170P549p511
647c244j361Q571k816o347N533L739o383K250P049r028k402J2345p669o943J3628
662F922n478j1494J4025J74j1477Q116K290r410N807O495q075j089P508l856m863
677d405Q517r43q954P931J876r000P925K082j1439O089M273q999N484K922q552
$$ plain form
692 -5193 -1502 3498 -2074 -1420 2549 -798 -2299 2882 2889 -1466 1937 2192 -3958 1848 4895 -4709
708 -4709 -325 3955 -5319 -535 4658 -5005 -2840 3406 -3666 -1570 5532 31 -3074 2577 2991
723 2991 -1838 936 4141 -3218 -2940 5527 -350 -4600 3565 -756 -6112 2227 2349 -3196 -384 1147
739 1147 -1041 -1121 1953 2353 -3511 -778 5706 -1692 -1734 6128 -1748 -5030 5052 943 -5231 2340
755 2340 1697 -5274 -102 4741 -3206 -5061 4452 -229 -5976 6124 3550 -8264 3414 6555 -6931
770 -6931 2390 7798 -6788 -2062 7473 -2946 -3760 4683 -2144 -7133 2997 3549 -6379 231 5449
785 5449 -5611 -1542 8258 -2865 -3436 6888 -1082 -3208 6107 390 -4291 2105 795 -2709 519
800 519 758 -1859 -2086 961 733 -1789 696 506 -1454 1635 1646 -257 1739 -632 -507 3004 -501
$$ packed form
692e193L691N000n572O54L969l347j501N181Pm355L403K55o150N806L047r604
708d709M384M280r274M784N193r663K165O246p072K096P102n501l105N651M14
723B991m829K774L205p359K78Q467n877m250Q165m321n356Q339J22n545K812J531
739A147k188q0L074M00n864K733O484p398m2P862p876l282J0082m109o174P571
755B340o43o971N172M843p947j855R513m681n747J2100k574j1814J1678L141j3486
770f931R321N408j4586M726R535j0419q14Q443o827m989J0130N52r928O610N218
785E449j1060M069R800j1123n71J0324p970k126R315n717m681O396j310l504L228
800E19K39k617k27L047k28k522K485j90j960L089J1j903J996k371J25L511l505
$$ plain form
817 -501 -734 1873 -2152 -1088 2477 -1905 -749 946 -3164 -851 1624 -959 -462 183 -344 150 888
834 888 1234 307 -477 1619 273 -227 1821 -1187 -1638 1347 -1693 -1299 1442 -2309 -1373 1235 -1687
851 -1687 792 1430 -2501 1306 2597 -1476 1371 2566 -1897 -157 2276 407 -962 371 148 -3040
867 -3040 405 2587 -4011 -993 3797 -3978 -1461 5855 -2614 -2918 4872 -710 -2236 4132 911
882 911 -2536 1717 1660 -1763 -336 2224 -1637 -3029 2408 -246 -3988 1828 440 -3421 1628 1064
898 1064 -1665 1811 379 -640 2170 211 405 1213 -1085 978 1285 -2045 -7 1183 -2241 -839
914 -839 1116 -782 -1857 141 1110 -1242 130 3034 -1162 -841 4276 -1565 -1365 5002 -1510 -3210
930 -3210 4463 -939 -3743 2762 59 -3716 790 1347 -2453 -828 2460 -954 -2384 3492 1257
$$ packed form
817e01k33K607m025J064L565m382J156J695m110K313K475k583M97O45n27M94P38
834H88L46r27p84K096j346n00K048l008m51K985l040L94K741l751R36K608k922
851a687K479O38l931L807J291m073K847J195m463J740K433j869j369J333k23l188
867c040L445K182o598L018M790p775K517P316q469l04P790n582j526O368l221
882I11l447M253n7l423J427K560l861j392N437k654l742N816j388l861N049n64
898A064k729L476j432j019K810j959J94Q08k298K063L07l330K038J190l424J402
914h39J955j898j075J998R69k352J372K904m196L21N117n841K00O367o512j700
930c210P673n402k804O505k703l775M506N57l800J625L288l414j430N876k235
$$ plain form
945 1257 -3609 2786 2504 -3348 1353 2986 -2708 389 1983 -1726 -521 297 -772 -679 -752 551 -421
962 -421 -2004 1605 582 -2040 1967 1832 -1417 1163 2001 -272 -83 1072 670 -1344 -241 1483
978 1483 -2626 -1264 2688 -2982 -2596 3516 -1923 -2582 3800 -486 -2355 3483 794 -1854 2286 1593
994 1593 -1483 80 2538 -1087 -1984 2200 -698 -3773 2103 263 -3616 2043 735 -3135 2155
1009 2155 991 -2610 2063 1238 -1079 1462 886 -708 949 351 -480 -219 399 -506 -1504 569 -175
1026 -175 -2018 1100 -278 -2590 1840 556 -2867 2901 1429 -2959 2685 2165 -2689 1469 2300 -1869
1042 -1869 -608 1343 -715 -1891 391 192 -2502 -141 1744 -2516 -519 3016 -1714 -519 3157
1057 3157 -619 -261 2111 29 -24 692 136 78 -1104 152 328 -2137 -40 1264 -2619 -116 2072
$$ packed form
945A257m866O395k82n852M701J633n694L097J594l709J205Q18j069R3p3J303r72
962d21j583L609j023k622M007j35l249K580Q38k273J89J155m02k014J103J724
978A483m109J362L952n670L86O112n439o59O382m286j869N838k689k648M140o93
994A593l076J563K458l625q97M184k898l075N876j840l879N659j308l870N290
1009B155j164l601M673q25k317K541n76j594J657n98q31K61O18r05r98K073p44
1026a75j843L118j378k312M430j284l423N768j472m388N644n20m854M158Q31m169
1042a869J261J951k058j176K282j99k694K361J885m260J997L535m730J195L676
1057C157l776L58K372k082n3P16n56n8j182J256J76k465K097J304l883K503K188
$$ plain form
1074 2072 -2195 -420 2112 -451 -338 1521 1053 -750 307 2439 -1033 -1264 2830 -1379 -2903 3189
1090 3189 -754 -3923 3021 197 -4422 2555 1462 -3128 1149 2309 -1651 -181 2693 -154 -1700
1105 -1700 2604 1048 -3168 1870 2007 -4006 1009 2581 -4190 -52 2327 -2957 -433 1870 -1868
1120 -1868 -328 1816 -776 -38 1527 573 -550 921 1474 -1149 -37 1535 -1596 -795 1385 -2372
1136 -2372 -616 1471 -2590 -115 2388 -1982 -458 2306 -1002 -567 1623 187 143 745 520 93
1152 93 -285 889 -490 -1522 1408 -794 -2349 1384 -360 -2188 1013 311 -1615 722 731 -60 219
1169 219 773 1351 -523 -54 2336 -1277 -1096 2777 -1700 -2559 2702 -792 -2652 1888 402 -2724
1185 -2724 456 1814 -1775 -1188 3176 -285 -2601 3805 1492 -4255 2970 2928 -4392 1458 3418 -4346
$$ packed form
1074B072m267J775K532k563J13J859m68j803J057K132l472k31M094m209j524O092
1090C189l943l169O944k824m619O977j093m590M277J160l960J470K874k847j546
1105a700M304j556m216N038J37o013N015J572o771M138K379n284K524K303l738
1120a868J540K144k592P38J565r54j123J471N53k623J112J572l131Q01K180l757
1136b372J756K087m061K475K503m370J524K764l308M35K190j436m4O02k25m27
1152I3l78J174j379j032K930k202j555L733j744j828L201p02j926K337Rp91K79
1169B19N54N78j874M69K390l613J81L873m477q59N261l494j860M540j486l126
1185b724L180J358l589N87M364l461k316O406k313n747P225m2p320N850J960p764
$$ plain form
1201 -4346 -388 3587 -3143 -2003 3031 -1138 -3480 2007 1792 -3343 927 3616 -2656 -408 4471
1216 4471 -2143 -1678 4549 -1787 -2823 3718 -437 -3395 1634 478 -2838 -122 1167 -961 -1101
1231 -1101 1496 365 -1476 1760 1137 -2192 1764 1936 -1870 792 1596 -1212 69 463 -835 -342
1247 -342 -844 80 -324 -1488 665 -145 -1707 1520 139 -1401 1749 785 -1194 1327 969 -772 783
1264 783 455 72 -566 117 -124 -1084 -164 359 -2122 43 1396 -1998 309 1541 -1806 704 2235
1281 2235 -1503 608 1824 -1447 40 1669 -999 -819 771 5 -1340 74 476 -1683 -336 1738
1297 1738 -1847 -669 2591 -1532 -716 3547 -1240 -1335 2942 -415 -1614 2143 169 -1772 804 865
1313 865 -1575 -498 1075 -1005 -1867 1436 -8 -2468 1896 801 -2070 1380 1132 -1466 1301 1221
$$ packed form
1201d346L958L975o730J140N034m169k342N487k15n135M270K689o272K248M879
1216D471o614M65O227o336j036O541m155k958N029j156l316K716J289k128j40
1231a101K597j131j841L236o23l329L956J72l806K662Q04k808J281L94j298M93
1247c42n02R24m04j164K153q10j562L227j381j540L150r64j979K521l58j741J555
1264G83l28l83o38O83k41r60R20N23k481K165J353l394K307J232l347K510J531
1281B235l738K111J216l271J487J629k668J80J590p66j345J414M02k159J347K074
1297A738l585J178L260m123Q16M263m787r5M277l357j199L757j974j941K576O1
1313H65k440J077J573k080q62L303j444k460M364j095k871L450k48k598K767q0
$$ plain form
1329 1221 -862 457 775 -143 -498 -336 354 -885 -1129 883 -778 -1526 932 -319 -1178 1147 318
1346 318 -483 610 876 506 101 866 1085 -1286 242 1396 -1872 -349 1776 -2125 -1337 1948 -1553
1363 -1553 -1302 1607 -792 -928 1081 554 -410 311 1384 -202 -320 1993 -107 -1504 1597 -214
1379 -214 -1840 1530 -31 -2265 758 267 -1423 585 34 -541 479 -31 525 408 107 822 5
1396 5 -96 1123 -91 -229 376 -429 316 -488 -944 598 -878 -1206 1174 -463 -1144 1541 -465 -1066
1414 -1066 1915 86 -730 1565 35 -701 730 440 -402 -509 653 -360 -1333 610 264 -1953 603
1431 603 480 -1529 962 775 -939 1314 837 -502 755 392 -284 693 -69 -207 225 -611 104 -173
1449 -173 -993 20 -316 -988 12 -222 148 13 -225 1139 221 -268 1848 -42 -831 1639 -309 -1155
$$ packed form
1329A221k083J319L18r18l55J62O90j239k44K012j661p48K458j251q59K325q29
1346C18q01J093K66l70m05P65K19k371J528J154l268J523K125l901P88L285l501
1363a553K51K909k399j36K009n27r64P21J073j586j18K313k100j397L101j811
1379b14j626L370j561k234L023m91j690K008n51n75J020n10N56j17l01P15q17
1396Ej01J219j214j38O05q05P45q04m56J542j476l28K380j637o81K685k006o01
1414a066K981j829q16K295j530p36J431k90q42j07J162j013r73J943l46k217K556
1431F03j23k009K491j87j714K253m77j339J257l63o76R77p62j38M32q36P15k77
1449a73q20J013l36o72J000k34L70j35k38J364r18m89K116j890p89K470j948q46
$$ plain form
1467 -1155 1574 -467 -1530 652 -56 -1426 -214 141 -466 -220 286 429 -695 502 850 -1124 693
1484 693 1478 -1236 580 1198 -1255 344 550 -1209 -120 5 -704 44 -664 -223 299 -708 248 734
1502 734 -339 423 447 -170 340 429 -43 288 -433 167 -253 -822 657 -809 -1407 963 -577 -1708 1530
1521 1530 48 -1539 1663 533 -812 942 933 -305 270 923 -182 -544 584 432 -1883 121 697
1538 697 -1841 -104 847 -1775 111 983 -1165 268 1175 -800 367 680 -122 191 157 252 108 -402
1556 -402 407 -78 -781 281 -392 -390 170 -843 109 335 -784 360 746 -913 662 1193 -631 502
1574 502 569 -626 552 813 -580 170 88 -358 -99 -460 46 -637 -587 621 -633 -333 963 -441 14
1593 14 826 -147 298 691 -332 169 101 -483 203 36 -767 339 -736 -886 315 -673 -537 612 -175
$$ packed form
1467a155K729k041j063K182p08j370J212L55o07K46N06J43j124J197L48j974J817
1484F93P85k714J816O18k453J599K06j759J089J25p09P48p08M41N22j007R56M86
1502G34j073P62K4o17N10Q9m72L31p21O00m20n69J479j466n98K370j540j131L238
1521A530j482j587L202j130j345J754rj238N75O53j105l62J128j52k315K004N76
1538F97k538J737R51k622J886Q72k148J433R07j975J167L13q02L13l4R5j44n10
1556d02Q09m85p03J062o73KN60j013R52K26j119J144L86j659J575N31j824J133
1574E02O7j195J178K61j393P50q2m46K59l61N06o83N0J208j254L00J296j404M55
1593A4Q12r73M45L93j023N01o8n84O86j67q03J106j075j50J201r88J36J149p87
$$ plain form
1612 -175 -425 445 265 198 258 838 245 -484 1199 732 -1259 991 643 -1903 467 945 -1895 185
1630 185 942 -1417 -314 1121 -507 -437 938 466 -597 399 1205 -638 -27 1854 -1058 -466 1915
1647 1915 -970 -1449 1208 -866 -821 829 -476 -628 439 424 -56 -122 590 647 -273 857 1053 -636
1665 -636 235 576 -809 126 534 -899 -224 58 -647 -239 -428 87 -19 -693 714 593 -900 1136
1683 1136 597 -1022 885 736 -589 457 523 -511 -174 163 -492 -957 -172 225 -649 -216 923 -1075
1701 -1075 -412 1219 -719 118 1598 -615 -124 1325 -355 149 840 -513 -81 204 -314 -208 -115 74
1719 74 -349 -543 428 -64 -294 868 -122 -354 1267 -227 12 1241 -796 -31 1073 -637 -373 905
1737 905 -428 -491 300 -471 -471 -240 -33 -20 -688 396 167 -471 1107 234 -375 963 222 -514 846 14
$$ packed form
1612a75k50Q70j80o7O0N80n93p29J683m67j991K250l48k546K370M78k840K080
1630A85P57k359J103J435j628P0J375m72j063R96Q06j843O11J881k912N92K381
1647A915k885m79K657k074M5J650j305j52J067j5m80o6P12N7r20J130J96j689
1665f36Q71L41j385R35M08j433O75K82p05M08j89N15j06o74J407j21j493K036
1683A136n39j619J907j49j325J046O6j034L37L37o55m65P85L97q74M33J139j998
1701a075O63J631j938Q37J480k213M91J449j680N04O91j353M32K85n18J06R3J89
1719G4m23j94R71m92k30J162r90k32J621j494K39J229k037P65J104j710K64J278
1737I05j333o3P91p71%K31K07J3o68J084k29o38J578q73o09J338p41p36J360q32
$$ plain form
1757 14 -669 642 -289 -359 134 -621 -133 -31 -384 246 42 -403 719 157 -286 772 87 -20 641 38
1777 38 297 -122 -65 264 -836 -85 632 -928 -271 608 -681 -321 983 -609 -179 1179 -55 -61 547
1796 547 101 16 370 452 -59 -284 690 -122 -825 655 -295 -1194 681 -182 -1088 620 -99 -457 811
1815 811 199 61 279 -93 373 82 65 457 94 -198 400 -633 -309 71 -590 -162 49 -505 365 -109
1835 -109 -198 936 -363 -324 1079 -110 51 1276 -426 -255 699 -508 -401 794 -423 -333 -209 -148
1853 -148 -347 -403 228 -89 -942 546 589 -732 546 381 -649 783 545 -688 618 272 -712 284
1871 284 -176 -482 -294 -303 92 -260 -641 157 -357 -81 504 32 44 415 -142 316 157 -292 327 -260 -584
1892 -584 504 -277 -644 351 -648 -686 423 -416 -529 568 -288 -235 47 239 162 -57 568 309 -275 541
$$ packed form
1757A4o83J311r31p0M93p55M88J02l53O30k04m45J122n62m43J058o85j07O61o03
1777C8K59m19N7L29j100P51P17j560O57Q79j289L60J304j592M30J358j234oO08
1796E47m46q5L54Q2n11k25R74q12p03J480r50q99J875q63r06J708p19l58J268
1815H11o12j38K18l72M66k91j7L92l63k92N98j033L24L80o61M28K11n54Q70m74
1835a09q9J134j299L9J403j189J61J225j702J71R54j207J07J195j217R0J24O1
1853a48j99n6O31l17q53J488M3j321J278j65j030J432k38j233J306l46r84R96
1871B84m60l06J88rL95l52l81P98n14K76N85m72J2L71n57M58j59m49O19n87l24
1892e84J088p81l67R95r99l8J109q39j13J097q56N3K82J92p7k19O25k59n84Q16
$$ plain form
1912 541 506 -821 275 101 -1055 157 89 -1016 157 -85 -616 394 -75 -108 374 16 252 236 -120
1931 -120 471 296 41 306 -329 -32 195 -377 -242 135 -733 -157 -154 -799 331 -58 -802 479 222 -178
1951 -178 964 253 -111 507 18 -306 295 -23 -76 -480 -236 -148 -416 135 240 -770 240 585 -747
1970 -747 292 580 -487 444 603 -307 579 81 -295 547 -326 -102 139 -635 92 -5 -668 110 -154 -450
1990 -450 356 -207 -329 525 -148 394 588 -357 601 290 -217 656 -95 -639 432 -218 -906 66 -129 -604
2010 -604 -27 -169 -250 -162 -78 493 -206 303 824 -322 134 727 -130 -125 300 -530 -136 313 -653 -10 120
2031 120 -761 1 148 155 353 -262 -212 271 -131 279 342 -420 552 272 -386 322 -196 -182 46 -719 -64 159
2053 159 -855 86 176 -758 622 118 -496 699 40 -407 489 233 -165 -78 -30 348 -401 -299 345 -542
$$ packed form
1912E41l5j327J096j74j156J212o8j105J173k42n31J010m69l3M82l58K36j6l56
1931a20N91j75k55K65o35K97K27n72J35L77q68N76Lo45J130l89p44J281k57m00
1951a78J142p11l64O18m89l24O01l18n3m04K44Q8k68N51J05j010J010L45j332
1970g47J039K88j067R31J59r10Q86m98l76Q42q73K24K41p74P27r7o63P78k64k96
1990d50Q06n63j22Q54o73N42J94r45R58l11n07Q73p51n44J071o50o88R72j95m75
2010f04N77j42q1Q8Q4N71o99N09N21j146M56N93q57NM25q30L94M49r66O43J30
2031A20q81P62J47PJ98o15N0M83m02M10O3p62R72k80o58P08n18J4K28p65O55K23
2053A59j014R41R0r34J380n04o14J195o59m47Q96k56l98Q7M8L78p49J02O44q87
$$ plain form
2073 -542 -410 314 -610 -270 494 -736 -253 655 -436 34 628 -179 493 201 -243 366 -325 -177 404
2092 404 -333 121 4 -362 181 -175 -434 160 -417 -422 639 -366 208 493 -709 243 624 -417 628
2111 628 649 -270 424 288 -418 98 -146 -489 -385 -134 -231 -266 -487 204 -118 -361 879 -359 -133 1018
2131 1018 -66 -293 643 -69 -25 559 -515 -99 259 -221 291 -451 -445 160 -413 -197 314 -221 324 385
2151 385 -167 552 199 -16 553 17 -67 371 -418 -96 139 -920 186 364 -830 176 316 -542 116
2170 116 439 -311 445 277 253 289 -64 324 125 -63 167 -261 -609 640 -422 -415 286 -507 -316 406 -464
2191 -464 -69 483 -322 8 412 134 312 78 11 40 -141 290 310 -470 429 -80 -490 309 -139 -542 550
2212 550 -362 -717 433 -191 -150 529 -101 60 436 124 105 316 -71 299 -149 -60 8 -469 -130 125 -737
$$ packed form
2073e42J32P24r24L40P64j230M83R08j091M70N94q07O72k92m44O09o91J48N81
2092D04p37M54j17l66N43l56k59N94n77nJ061j005N74K85j202R52L81j041J045
2111F28K1r19O94j36p06N16k44l43J04K51r7l5k21O91l22k43J240j238K26J151
2131A018j084k27R36p12M4N84j074M16L58m80N12p42OO05n73K16N11n35N45O1
2151C85n52P19l53k15N69n36q4M38p89L22K35j059J106J78j194J006J40q58O58
2170A16L23p50P56j68k4L6l53L88j99j88K30m28l48J249j062PP01p93J91P22q70
2191d64L95N52q05L30M04k78J78k34o7K9j81M31K0p80Q99n09m10P99m48m03J092
2212E50r12l55J150o24M1O79o30J61L76l12j9K11l87L70m48Q9O8m77L39K55q62
$$ plain form
2233 -737 265 -106 -833 517 244 -216 581 90 -5 273 -180 236 435 58 319 134 -675 61 -36 -680
2253 -680 327 -101 -363 216 -134 -175 -39 -209 301 -6 134 528 -555 139 1015 -327 -8 705 -812
2272 -812 -277 474 -397 -616 247 -342 -290 71 96 -34 -197 243 116 -101 753 -180 -521 935 90 -534
2292 -534 615 72 -964 529 -212 -607 41 -107 -43 -175 231 140 61 -89 459 -77 116 699 -231 202
2312 202 473 -564 30 475 -510 128 252 -570 193 -332 -211 221 -287 -146 210 -405 342 287 -302 513
2332 513 463 -284 477 -67 -293 112 -212 -193 -61 -402 -161 -78 -600 182 -203 -837 367 -303 -378 459 -4
2353 -4 137 542 -83 6 447 -121 131 203 -168 64 -261 -338 36 -280 -150 110 -531 228 -67 -660 549
2374 549 281 -390 927 -34 -532 655 -36 -585 424 -146 -589 9 -301 -175 -243 -209 23 -445 -44 341
$$ packed form
2233g37J002l71p27J350k73m60P97m91r5K78m53M16J99l77K61j85q09P36r7o44
2253f80J007m28k62N79l50m1J36j70N10l07J40L94j083O94Q76j342L19P13j517
2272h12N35P51q71k19Q63n89N2L61K5j30j63M40j27k17Q54r33l41J456q45o24
2292e34J149n43j036J493p41l95O48j48O4j32M06r1p9j50N48n36J93N83r30M33
2312B02K71j037N94M45r85O38J24q22P63n25J21M32n08J41L56o15P47n5n89Q15
2332E13n0p47P61n44k26M05l24J9J32l41K41Q3n22P82l85o34J204o70p5Q37m63
2353dJ41M05o25Q9M41n68K52P2l71K32l25p7L74l16J30K60o41P59k95n93J209
2374E49k68o71J317r61m98J187o91n49J009n70m43N98l10J26o8L4K32m68M01L85
$$ plain form
2394 341 -533 34 686 -411 422 637 -205 214 384 -321 79 -10 -332 322 -270 -31 -33 -346 -10 -9 -259
2415 -259 261 -111 -303 432 -246 8 500 25 251 404 -128 462 67 -270 100 -164 -312 92 -111 -364
2435 -364 386 -123 -219 599 -310 79 187 -89 192 22 -15 175 -221 29 164 -482 245 100 -616 -65 -60
2456 -60 -555 169 181 -437 245 88 85 536 148 240 427 142 452 112 -243 -19 -145 -229 358 -202 -249 273
2478 273 -526 160 300 -447 210 237 -244 288 115 126 353 154 -131 448 -167 -155 19 -242 40 -394 -366
2499 -366 204 -385 -111 502 -458 -218 283 -355 18 330 -343 194 187 -315 189 360 -119 207 -264 -54 -35
2520 -35 -427 -137 21 -469 65 40 -274 250 -55 -261 507 -39 202 600 -105 235 559 -380 -66 194 -314
2541 -314 12 -27 -600 67 -211 -256 425 -115 0 355 -153 434 82 -37 498 -35 -62 465 -64 -137 276
$$ packed form
2394C41q74N67O52j097Q33K15q42M19J70p05M00q9l22O54n92K39kl13L36Jk50
2415b59N20l72j92P35o78K54M92m75K26J53n32N90l95l37L70k64j48M04k03k53
2435c64P50n09r6Q18r09L89J08k76K81j70l7J90l96K50J35o46P27j45p16N51N
2456f0m95P24J2o18O82j57lM51l88R2J87k85L10l40l55K24j26q4N87n60m7N22
2478B73p99O86J40p47O57K7m81N32j73J1K27j99k85N79o15J2J74k61K82m34K8
2499c66N70n89K74O13r60K40N01o38L73L12o73N37pn02N04J71m79L26m71K10J9
2520c5l92K90J58m90N34k5l14N24l05k06P68n46K41L98p05L40L24r39L14K60n08
2541c14L26l9n73O67k78m5O81n40J15L55n08N87l52j19N35n33k7N27n29p3M13
$$ plain form
2562 276 -387 -78 298 -205 2 10 -341 -74 171 -195 110 -198 98 262 -58 439 297 -210 153 32 -295
2583 -295 146 -94 -263 141 -193 -183 330 -521 -116 -77 -367 242 147 -363 305 119 -241 417 170 -165 320
2604 320 -177 26 -163 -461 216 -203 -158 332 165 -276 323 -293 -53 275 -415 10 80 -140 -143 412 -154
2625 -154 135 266 126 -24 -287 120 -49 -413 271 33 -767 2 84 -484 418 41 -189 502 160 -70
2645 -70 435 -60 -52 145 -5 290 130 -171 105 -268 -285 475 -216 31 146 -344 130 219 -205 167 397 -301
2667 -301 457 345 68 131 -4 167 254 -396 106 -305 -91 95 -41 -496 183 -244 -457 196 -227 93 166
2688 166 164 305 165 -6 237 -70 189 275 -541 -186 331 -561 -394 435 -603 -149 300 -455 -116 230 25
2709 25 86 228 267 4 -27 531 263 -317 305 -70 -647 66 -42 -678 322 90 -400 174 94 -298 45
$$ packed form
2562B76o63L09L76n03K07Ql51K67K45l66L05l08K96J64l20M97j42n07L63j21l27
2583b95M41k40j69M04l34J0N13q51M05L9k90O09r5n10O68j86l60O58k47l35M85
2604C20m97K03j89k98O77m19M5M90j67m41N99o16K40L28o90M25P0k20lN55n66
2625a54K89J31j40j50k63M07j69l64O84k38q00P69Q2n68R02l77k30O91l42k30
2645g0N05m95QJ97j50K95j60l01K76l73j7P60o91K47J15m90M74Q9m24L72K30o98
2667c01P58j12k77O3j35J71Q7o50N02m11K14J86j36m55O79m27k13O53m23L20P3
2688A66kJ41j40j71K43l07K59Q6q16L55N17q92J67Q29j038M54M49p55L39L46k05
2709B5O1J42L9k63l1N58k68n80O22l75n77P13j08o36J000k32m90N74q0l92L43
$$ plain form
2730 45 45 253 -81 117 240 17 89 429 -216 -88 403 -451 -148 379 -295 -340 -40 -246 -10 56 -45 -7
2752 -7 -117 87 139 -215 244 589 -307 514 22 -296 263 -72 -472 335 -69 -235 227 -117 -443 -245 -404
2773 -404 59 243 145 422 -94 -112 385 240 -14 388 -272 -173 377 -290 -65 367 -370 -91 107 -105 -280
2794 -280 -230 164 95 -265 469 59 6 476 159 -383 576 119 -431 239 -203 -404 312 -218 -223 130 -647 -20
2816 -20 -373 258 329 -216 137 328 -37 98 371 -328 -119 318 -425 97 211 -497 106 82 -338 -95 -184
2837 -184 -168 -128 -164 241 281 -249 474 -256 -148 464 16 -482 277 76 -230 332 3 -217 20 -228 -121
2858 -121 -290 -217 301 -210 -122 152 -98 243 457 -277 143 256 -139 48 391 -155 -286 333 -226 100 -196
2879 -196 155 -31 -346 256 36 -198 266 82 -272 113 157 99 534 258 -214 223 107 21 150 -166 -126
$$ packed form
2730D5%K08l34J98J23k23P2L40o45J28M91q54L03N27o74m5L00k06K36O6j01L8
2752gj10K04N2l54M59L45q96Q21m92l18N59l35m00Q07m04j66M62l44l26J98j59
2773d04M63J84r8K77n16j8M97j45k54M02o60R9N50o67K25M32p37K79J98k12j75
2794b80N0L94o9l60P34m10n3M70l17n42R59m57n50O70m42k01P16n30nL53p77O27
2816b0l53O31P1n45L53J91l65J35K73o99K09M37p43N22J14p08O03k4m20K43q9
2837a84J6M0l6M05M0n30P23p30J08O12m48m98P59k01l06N62l29k20K37k48J07
2858a21j69P3N18n11Q8K74k50L41K14p34M20J13l95J87L43n46j31O19n59L26k96
2879a96L51j86l15O02k20k34M64j84l54L85M4n8M35k76m72M37j16q6J29l16M0
$$ plain form
2900 -126 -133 -192 4 -477 -115 189 -577 19 217 -335 350 369 -279 60 354 -24 122 229 -152 104 309
2921 309 187 -237 -255 134 -31 -116 297 -149 -123 219 -294 -165 338 10 -7 426 60 -146 304 197 -82
2942 -82 -172 -96 215 -213 96 269 -606 8 195 -164 181 387 -427 -107 211 -122 323 142 339 52 -236
2963 -236 -80 110 -195 135 -97 -640 276 30 -56 323 222 72 326 61 83 393 50 172 79 100 239
2984 239 -190 178 304 -288 -300 13 -538 -58 107 -475 144 151 -599 43 121 -156 178 112 185 -145 -272 195
3006 195 57 -201 232 -95 -377 287 -195 -378 76 -408 -170 376 -162 59 177 -91 115 235 90 224
3026 224 -202 87 326 -223 84 138 39 -63 75 -268 -42 107 -242 46 -199 -96 147 -26 109 102 117 230
3048 230 418 -173 250 5 -161 221 -274 -220 177 -281 -253 157 -62 -27 184 -130 105 93 -226 473 -59
$$ packed form
2900a26pn9J96m81L62L04p66N96J98n52O85J9o48L39K94l78J46J07l81K56K05
2921C09j22m24j8L89j65q5M13m46K6L42n13J29N03l28j7M33l66k06M50j07k79
2942h2r0P6L11m28L09J73q75O14J87l59L45K06q14L20L18l33M45j81J97k87k88
2963b36J56J90l05L30k32n43R16k46q6L79j01j50K54k65K2L10l43J22r3K1J39
2984B39m29L68J26n92j2L13n51M80J65n82O19Pp50O42P8k77L34o6P3l30j27M67
3006A95j38k58M33l27k82O64m82j83M54m84K38N46n38K21J18k68K06J20j45J34
3026B24m26K89K39n49L07N4r9j02J38l43K26J49l49K88k45J03K43j73J35pJ5J13
3048B30J88n91M23k45j66L82m95N4L97m58K8M10k19L5K11l14K35j2l19O99n32
$$ plain form
3069 -59 175 370 47 69 107 -82 90 -7 -180 155 -95 -68 -173 -170 -11 93 -199 56 251 55 391 127
3091 127 -38 308 212 -219 170 -140 -400 238 -41 -31 -44 13 0 -91 -305 -104 -33 -156 -10 -218 13 176
3113 176 254 -26 -10 36 144 241 -43 47 -147 -258 258 -116 -231 238 -215 -67 226 -339 121 104 -194 101
3135 101 329 -340 209 237 -328 16 -149 17 168 -449 241 149 -276 260 118 68 178 -389 -18 243 -28
3156 -28 -195 103 -40 21 30 32 69 -118 -126 36 26 55 179 -143 -98 18 -247 69 60 -233 -2 168 -69 68 33
3181 33 -107 320 21 -13 157 -116 62 45 -412 320 -275 -36 27 -183 -9 257 -228 27 -115 -66 -36 -113
3203 -113 -337 419 -78 -228 136 -97 -20 306 -146 -123 287 -146 -247 -64 -250 -419 56 78 95 78 19 288
3225 288 -215 46 62 -414 156 52 -277 162 -95 -259 263 -147 -313 19 -102 -213 169 -83 224 42
$$ packed form
3069e9K34J95l23K2L8j89J72r7j73L35k50K7j05LJ59J04k92K55J95j96L36k64
3091A27j65L46r6m31L89l10k60O38k79J0j3N7j3r1k14K01P1j23J46k08K31J63
3113A76P8k80J6M6J08R7k84R0j94j11N16l74j15M69m53J48K93n65M60j7k98K95
3135A01K28o69N49K8n65L44j65J66J51o17O90r2m25N36j42n0J10n67L71K61k71
3156b8j67K98j43O1RKL7j87qJ62j0K9J24l22M5J16k65L16rk93K31J70k37J37l5
3181C3j40M27k99l4J70k73J78j7m57P32n95K39O3k10J74K66m85K55j42M9L0p7
3203a13k24P56m97j50L64k33P7L26m52K3M10m33j01J83j86j69M75K2J7j7n9K69
3225B88n03K61J6m76N70j04l29M39k57j64N22m10j66L32j21j11L82k52L07j82
$$ plain form
3245 42 63 91 -101 137 314 -265 15 445 -124 -178 297 -108 -185 -234 -252 175 24 -18 -238 -156 29 292 -194
3268 -194 187 80 -505 421 1 -251 99 20 -362 -135 67 -237 155 -141 -73 -68 -220 -59 -145 62 100 -232
3290 -232 -216 -71 -423 -226 280 -225 127 147 -369 -257 35 -279 37 -48 -249 -5 177 -218 126 -230 117
3311 117 12 -268 235 -99 -137 378 -40 9 340 -86 -395 107 -7 -168 15 -95 97 -11 97 85 35
3332 35 191 324 -132 187 203 -186 111 99 -466 -333 -105 -318 42 -80 -215 -162 151 56 81 -176 8 70
3354 70 -70 138 67 -91 273 74 -89 403 102 -74 39 -13 67 152 -110 37 -63 -124 243 -130 -59 238
3376 238 -153 134 92 6 251 210 0 -48 319 -92 2 295 -166 160 17 170 -104 -353 109 96 -162 154
3398 154 -250 -119 324 36 -215 162 135 -13 72 58 85 90 -19 54 -136 -15 90 -350 -221 54 -352 -199
$$ packed form
3245D2K1K8j92K38J77n79K80M30n69n4M75m05p7m9j8M27j51m2k20Q2J85K63m86
3268a94L81j07n85R26m20k52L50p9l82K27K02l04L92k96O8Nj52J61q6K07L8l32
3290b32J6J45l52J97N06n05L52K0n16J12K92l14L16q5k01K44J82l95L44l56L47
3311A17j05k80N03l34l8N15m18M9L31m26l09N02j14j61J83j10J92j08J08j2n0
3332C5J56J33m56L19J6l89K97j2n65J33K28k13L60j22j35N3L13r5K5k57J84O2
3354G0j40K08p1j58L64j99j63M92l01j76J13n2Q0Q5k62J47j00o1L67l73P1K97
3376B38l91K87m2q6K45m1k10m8L67m11R4K93m61L26j43J53k74k49M62j3k58L16
3398A54m04J31M43k88k51L77k7j48Q5j4K7Nj09P3j90J21J05m40J29K75m06J53
$$ plain form
3420 -199 322 -214 52 271 33 175 206 1 -83 -41 -146 -207 -184 173 -23 -380 347 -141 -332 152 79 -562
3442 -562 240 108 184 398 173 -156 235 -111 299 -177 -91 275 -213 -57 247 -252 -219 68 -201 54 96
3463 96 -42 109 308 -384 40 -79 -3 95 142 -100 23 5 206 -16 -113 -327 -17 -292 194 36 -345 62
3485 62 -15 -215 284 129 -6 328 -117 -40 37 -45 186 92 -37 289 -180 224 63 -362 2 101 -331 -22
3507 -22 350 -369 -119 204 -150 149 -45 231 381 -127 174 345 -128 361 -122 -25 138 -43 -241 312 91
3528 91 -210 304 -347 101 225 -57 -122 223 288 172 9 108 24 -347 -69 442 -102 -26 339 -250 60 -152
3550 -152 -353 104 -123 -277 28 48 -24 445 61 72 384 -175 99 153 5 446 1 -86 -173 -293 9 132
3572 132 -134 -40 -175 -338 188 -133 -6 310 -33 -65 251 13 -53 366 -195 155 217 -288 -146 34 -66
$$ packed form
3420a99N21n36K66K19k38J42L1k05q4M2j05o1K3L57j96l57P27m88j91M84p3o41
3442e62Q02j32P6K14k25l29L91l46M10m76Q6L66m88J56L04m99L3K87k69K55M2
3463I6j38J51J99o92M24j19P6R8M7k42J23j8K01k22r7k14L10k75M86j58l81M07
3485F2p7k00M99j55j35L34m45P7P7q2K31r4j29L26m69M04j61m25L64R9m32L09
3507b2L72p19K50L23l54K99j94K76J50n08L01J71m73M89m83R7J63j81j98N53k21
3528I1l01N14o51M48J24k82o5L45O5j16j63R9q4l71K78N11n44P6L65n89L10k12
3550a52k01M57k27j54L05K0p2M69l84J1L12n59K74N4j48M41m45q7q7j20L02J23
3572A32k66R4j35j63N26l21J27L16l43l2L16k38o6M19n61L50O2n05J42J80j00
$$ plain form
3593 -66 -221 70 -378 76 -206 146 193 -53 9 112 -84 10 157 -34 146 145 -118 3 185 -149 231 -80
3615 -80 -42 38 -212 -67 -368 -97 27 69 -87 5 -36 -57 91 -160 -239 192 -282 -49 25 -324 151 -54 -119
3638 -119 23 -188 -169 75 -18 158 44 -100 -109 91 -1 111 -120 -189 84 -201 -30 -51 -169 1 12 -209 -378
3661 -378 11 -299 85 -27 -8 23 -133 69 112 -245 274 116 -103 18 -5 -67 46 -96 -83 -7 -87 -172 -218
3684 -218 -254 31 -108 -84 178 -119 -15 147 155 -185 234 -68 113 -248 -157 44 341 -213 -126 -52 -249 32
3706 32 46 -140 205 -117 -102 109 -3 -79 -68 -66 266 -20 -47 535 140 183 164 -128 -65 223 5 -197 113 -328
3730 -328 0 -271 52 399 -124 318 225 -88 -110 84 66 286 188 -170 318 17 -92 292 -15 -87 83 -219
3752 -219 -48 -14 -178 81 178 -208 55 100 -125 88 -69 -82 231 -16 78 65 -337 65 119 -225 -250 30 105
$$ packed form
3593f6j55K91m48M54k82L52M7k46O2J03j96R4J47j91J80jk63J21J82l34L80l11
3615h0L8Q0k50J45l01K71J24M2j56R2m1k1J48k51p9M31m74K33P4l49M75k05o5
3638a19J42k11J9K44r3J76j14j44rK00r2J12k31o9K73k85J71k1j18J70J1k21j69
3661c78L89l10L84j12J9L1j56K02M3l57N19j58k19J21k3o2J13j42J3P6q0q5m6
3684b18l6K85j39K4K62k97J04J62Ql40M19l02J81l61R1K01K97n54Q7P4j97K81
3706C2J4j86L45l22J5K11j12p6J1KL32k86k7N82l95M3j9k92O3K88k18k02L10m41
3730c28L28k71L23L47n23M42r3l13k2J94j8K20r8l58M88l01j09L84l07p2J70l02
3752b19J71L4j64K59R7l86K63M5k25K13j57j3L13k47R4j3m02M02N4l44k5K80P5
$$ plain form
3775 105 -159 -160 174 -59 -139 11 294 -80 130 -19 -270 382 -105 -305 331 50 -55 -131 -208 211 96 -172
3797 -172 -9 181 -115 132 207 116 268 2 382 153 -17 116 489 38 10 -60 -138 195 -56 -164 221 -79
3819 -79 -129 218 -349 -41 172 -194 245 95 23 406 26 -115 158 3 -166 -150 -139 19 -182 -114 40 -60
3841 -60 108 122 -380 -176 300 -54 -172 368 -337 -218 87 -147 228 66 -36 -118 -125 -70 191 -347 -25 -74
3863 -74 -157 210 31 55 169 35 -323 222 39 -66 99 -68 -19 95 -178 -140 -109 256 24 -156 -132 30
3885 30 -199 11 186 -14 176 232 -123 54 105 -246 129 180 39 7 36 -86 -71 -225 160 -75 12 279 122
3908 122 -200 -70 -174 -368 420 193 -232 128 226 147 301 207 52 51 132 80 88 -150 158 -233 -250 191 17
3931 17 -19 252 -192 -315 240 126 -110 -78 193 -94 -121 -294 268 -216 41 -40 46 273 76 -307 133 225
$$ packed form
3775A05k64jL34k33q0J50K83l74K10j49k51O52m87k00O36k81j05p6p7M19j15k68
3797a72J63J90k96K47P5r1J52k66L80k29j70J33L73m51k8p0p8L33k51j08L85l00
3819g9n0L47n67L08K13l66M39j50p2L83l80j41K73j55j69J6J1J58k01O8J54j00
3841f0J68J4n02K04M76l54j18N40p05J19L05k34L75j62j02q2pN5K61n38L22m9
3863g4q3L67j79K4J14j34l58N45j83j05J65j67M9J14k73L8L1L65k32j80K4J62
3885C0k29K10J75k00J90N6l55J77N1l51L75N1j41l2K9j22J5j54L85k35Q7K67j57
3908A22l22J30j04j94P88k27m25L60R8p9J54r4j55jQ1n2Qk38L08l91j7M41j74
3931A7l6K71m44j23N55j14k36L2K71k87k7j73N62m84K57q1Q6K27j97l83M40R2
$$ plain form
3953 225 118 513 66 -67 364 29 -30 151 41 50 139 198 31 -93 -227 -32 -255 171 80 -110 0 285
3975 285 -171 -163 95 -136 213 37 -15 109 176 -48 85 14 32 45 -4 62 -179 -30 107 -185 -122 155 80 6
3999 6 45 66 -276 126 110 -113 209 143 34 34 -185 130 -192 -159 108 102 -73 25 -262 28 -207 -12 47 -197
4023 -197 -90 57 158 192 82 -255 -66 57 56 -95 -216 3 203 65 -49 189 -56 66 205 124 -73
4044 -73 93 7 114 108 133 50 -87 -123 -1 -152 -37 152 -70 -25 61 -50 97 73 -128 20 23 -51 41 -52 -254
4069 -254 26 -165 315 138 -220 199 142 -251 128 -144 -80 172 -88 -154 34 87 -193 10 74 55 -67 -269
4091 -269 217 49 -23 304 -137 -50 12 -247 264 -342 -151 -63 9 -271 67 -10 155 143 92 -28 199 -217 79
4114 79 116 -179 192 -266 -227 147 67 -190 131 -156 -284 137 -133 -77 -56 93 35 -182 -95 60 -82 -241 252
$$ packed form
3953B25j07L95m47j33M31l35n9J81j10RQ9N9j67j24j34J95k23M26r1j90J10K85
3975B85m56QK58k31L49j76n2J24O7k24J33p1J8J3m9O6k41J49J37k92O3K77p5p4
3999FL9K1l42M02j6k23L22o6j09%k19L15l22L3K67oj75R8k87K90k35J95N9k44
4023a97J07J47J01L4j10l37J89J23jj51j21K19K00j38j14K38k45J22J39q1j97
4044g3J66q6J07oK5q3j37l6J22j51J15J89k22M5Q6j11J47k4k01J48Lp4R2r3k02
4069b54K80j91M80j77l58M19n7l93L79k72O4K52k60o6J88N3k80K03O4j9j22k02
4091b69M86j68p2L27m41Q7O2k59N11o06J91Q8P2k80L38p7J65j2n1j20K27m16K96
4114G9L7k95L71m58L9L74q0k57L21k87j28M21k70N6K1J49n8k17Q7J55j42j59M93
$$ plain form
4137 252 -299 -190 -24 -376 16 132 -131 90 -128 -215 101 91 -274 122 -82 -231 222 -220 120 81 -245
4158 -245 -76 -158 110 87 -83 43 421 -230 37 248 -210 84 32 6 -154 94 -60 118 -52 -51 -12 -71 23
4181 23 40 -117 142 188 -207 -118 -152 -37 0 31 -11 -158 -189 -131 -191 -299 141 -2 -334 79 -104 72 45 -116
4205 -116 -77 -82 33 37 -21 -73 1 128 -184 97 26 -141 15 107 -270 183 -178 -26 5 -182 -28 34 -21 389
4229 389 116 -42 148 243 -1 -286 -232 -82 299 -28 -9 -10 -157 42 88 -171 43 -277 174 347 38 44 259
4252 259 -279 85 227 44 42 -40 64 105 -303 -166 -119 -176 -30 10 -120 -114 158 -99 -9 -138 -148 -7 -41 -5
4276 -5 440 -39 -82 66 -265 165 306 -255 -182 182 -80 -165 -31 -211 269 67 -123 87 51 115 156 -212 37
4299 37 -178 -18 -171 -150 -309 227 -32 -16 -96 -79 -52 -39 0 72 18 -47 343 -78 -53 206 45 170 313 129
$$ packed form
4137B52n51J09J66l52L92J16k63K21k18q7L16j0l65L96k04j49M53m42L40l9l26
4158b45J69q2K68k3j70J26L78o51K67K11m58K94n2k6j60K48j54J78j70JL9n9R4
4181B3J7j57K59M6l95Q9l4J15L7L1m2j47l1N8o0j08M40j43l32M13j83J76k7j61
4205a16L9nJ15Mn8n2P4J27l12K81p1j67J56R2l77M53l61J52L1j87J54O2n5M10
4229C89k73j58J90R5k44k85N4J50L81l27J9jj47J99M6k59K14l20M51J73l09OK15
4252B59n38L64J42j83kq2J04M1m08J37M7n7J46M0j30OK72k57R0j29j0J41l4L6
4276eM45m79m3J48l31M30J41n61P3L64k62q5J34j80M80k02j90K10l6O4M1l68K49
4299C7k15J60j53K1j59N36k59J6q0J7K7J3L9P2n4o5L90m21K5K59j61J25J43j84
$$ plain form
4323 129 15 -9 175 102 -233 49 -10 -65 96 218 -203 232 316 -25 73 249 -235 93 146 -209 263 51
4345 51 -34 164 66 113 171 177 202 73 -79 48 168 54 -119 -67 283 104 -140 -187 224 222 278 21 -108 1
4369 1 -5 -5 -70 -130 -189 21 -50 69 379 -189 47 332 105 234 39 -138 156 -261 35 -105 -15 -145 -122 -179
4393 -179 -1 126 -28 -7 -288 -71 145 -211 139 362 93 74 53 142 -216 214 -41 -50 97 51 -196 -7
4415 -7 -133 93 -286 64 -22 -14 58 -249 -84 117 8 54 85 102 84 121 -73 110 -29 111 221 11 200 72
4439 72 -78 5 -57 -148 -134 -7 -182 213 186 254 -22 -101 84 -3 103 -54 162 -83 31 199 -91 453 73
4462 73 -470 -69 -2 -90 83 153 -4 -27 -128 -54 28 157 -233 186 -69 201 0 -10 114 -99 -44 137 27
4485 27 -30 -28 -127 -126 7 -246 269 -149 -102 272 188 -115 105 143 198 211 -84 113 -44 -283 153 -8 136 85
$$ packed form
4323A29j14k4J84p3l35K82n9n5J61J22m21M35Q4l41R8J76m84L28N3l55M72k12
4345E1q5J98r8M7N8OK5j29j52J27J20j14j73N2L50j79k44m7M11kN6k57j29J09
4369Ao%o5o0n9K10p1J19L10n68K36K85k27J29j95j77K94m17K96j40R0j30K3n7
4393a79J78J27j54K1k81K17K16l56L50K23k69j9k1Q9l58M30k55rJ47m6k47J89
4415gj26K26l79L50q6QP2l07J65K01j09M6L1J7j8L7j94J83j39J40J10k10J89j28
4439G2j50Q3o2r1J4J27j75L95k7O8k76p9J85q7J06j57K16k45J14J68k90N44l80
4462G3n43M01O7q8J73P0j57k3j01P4Q2J29l90M19k55K70k01j0J24k13N5J81j10
4485B7n7Kr9JJ33k53N15m18M7L74q4l03K20L8N5J3k95J97j57k39M36j61J44n1
$$ plain form
4509 85 -156 -267 304 40 -10 190 -58 244 -30 -91 18 43 183 202 -1 235 66 -14 3 -38 -107 88 141
4532 141 -108 219 64 -221 152 -21 105 262 24 349 39 -40 -10 -130 -243 -290 271 -538 -53 49 110
4553 110 72 -50 -10 -68 -213 -154 -142 -44 -64 -39 -78 104 -53 174 268 -52 209 255 -151 159 70 -57 6 -232
4577 -232 -53 46 -160 5 -7 -101 54 -209 82 249 95 -47 -52 14 -267 153 24 -62 46 -161 -158 262 -224
4600 -224 107 -34 -126 -63 -148 199 242 128 111 348 166 285 110 306 -44 -41 -106 232 173 -43 38 10 -164 -76
4624 -76 -73 -137 -5 -429 293 -47 -69 58 -48 13 294 -67 -28 21 54 34 -73 -380 -118 57 -230 -291 -70 -25
4648 -25 20 -165 -72 322 -203 19 311 -134 188 195 -38 111 94 -5 27 -80 50 21 -31 -241 -129 -119 146 91
4672 91 -129 178 -324 -222 97 -119 261 70 121 112 -1 -127 68 1 -393 -235 -11 -19 -158 -142 -27 118 -333
$$ packed form
4509H5k41j11N71k64n0K00k48L02k74o1J09K5J40J9k03K36j69q0J7m1o9J95N3
4532A41k49L27j55k85L73j73J26J57k38L25l10p9L0j20j13m7N61q09M85J02O1
4553A10l8j22M0n8j45N9J2R8k0K5l9J82j57K27R4l20K61M6m06L10q9j27O3k38
4577b32J79R9k06J65j2r4J55k63K91J67j54j42nO6k81M20j29q6J08k07LM20m86
4600b24L31j41r2O3q5L47M3j14j7K37j82J19j75J96l50Lo5L38n9k16Q1k8j74Q8
4624g6Lo4J32m24P22l40k2J27j06O1K81l61L9M9L3k0j07l07K62J75k87o1K21M5
4648b5M5j85R3L94n25K22K92m45L22Pk33J49j7r9L2j07J30k9n2k10J12J0K65n5
4672I1k20L07n02J02L19k16L80j91N1rj13j26J95o7l94J58K24qj39J6J15J45m51
$$ plain form
4695 -333 101 101 -148 251 114 -184 198 -127 -5 -114 36 -6 256 84 -121 -73 -297 -4 -173 -62 -9 10
4717 10 138 43 -243 -1 159 -279 25 -155 -137 336 156 -2 45 -157 -102 175 207 -44 -10 -51 85 -182 81
4740 81 23 348 -114 -105 259 -270 245 -35 1 264 -37 -16 -179 29 -64 96 -185 -96 120 45 143 61 46 28
4764 28 -159 39 -22 -121 209 -130 -177 117 -31 -143 116 -146 -136 175 92 1 -68 -24 -154 68 174 118 -44
4787 -44 -18 70 395 190 -77 -104 3 -257 -226 72 -358 -204 -216 -108 -93 177 -219 173 223 -72 326 1 80
4810 80 -37 -45 78 -217 98 94 226 -34 -176 83 228 -204 -140 183 -56 -1 -104 -171 -203 -95 296 32 4
4833 4 203 -101 19 -10 -99 24 51 -347 -31 -47 -86 -3 -187 40 161 169 139 22 -326 200 8 -54 188 -194
4857 -194 254 38 -206 -54 -44 2 14 -96 -28 255 -127 10 75 -146 -87 -82 103 -101 -87 -220 238 -145 -92
$$ packed form
4695c33M34%k49L99j37k98L82l25J22j09J50m2K62j72k05M8k24K93j69J11N3J9
4717A0J28r5k86K42J60m38L04j80J8M73j80j58M7k02N5K77L2k51L4m1J36k67K63
4740H1n8L25m62RL64n29N15k80L6K63l01K1j63K08r3J60k81Q9K16p5R8q2j5j8
4764B8j87J98o1r9L30l39m7K94j48j12K59k62J0L11q3r1o9M4j30K22J06n6j62
4787d4K6Q8L25k05k67k7J07k60L1K98m30J54j2J08J5K70l96L92N0k95L98l25P9
4810H0j17qJ23k95L15mJ32k60j42K59J45m32O4L23k39N5j03o7l2J08L91k64k8
4833DJ99l04J20k9q9J23K7l98L16j6l9Q3j84K27J21Ql0j17l48N26j92o2K42l82
4857a94M48k16k44J52J0M6J2j10O8K83l82J37O5k21N9NJ85k04J4j33M58l83N3
$$ plain form
4880 -92 163 0 -121 117 -166 120 -234 -226 42 -164 -182 33 23 91 172 -16 -251 118 23 -122 -30 -117 -102 21
4904 21 -63 -18 -330 163 117 -166 -253 104 -132 -5 -96 -38 -32 77 99 108 29 -74 432 -140 -131 207 -88 -74 67
4929 67 -100 -50 -186 -55 -8 116 -168 65 -21 169 -44 47 33 67 -25 -149 -26 -6 0 129 -115 30 -134 147
4953 147 243 283 91 -252 -83 -41 17 220 91 -103 21 90 17 89 -163 141 35 -256 -178 -187 -9 -337 15
4976 15 -350 -10 8 62 1 -56 -59 1 -84 40 236 77 63 160 -111 -110 91 -299 80 -19 -184 -32 122 -1 26
5001 26 184 -379 -21 -344 181 25 -154 43 13 -65 2 160 -184 -3 101 36 237 26 -290 -150 -27 -48
5023 -48 196 29 -363 120 -396 102 -255 -69 35 267 -13 -16 97 -55 -163 -103 25 -2 -119 -138 -235 -141 -77
5046 -77 65 -253 -16 -116 147 -44 -38 13 -31 -240 112 -147 19 -162 -51 -339 96 -121 -84 58 -128 -104
$$ packed form
4880i2K55j63j21K38k83K86l54QK68k06j8K15j0O8Q1j88k35L69r5j45R2q7J5J23
4904B1q4M5l12M93m6k83q7L57k36J27r1N8OJ09K2Rp9j03N06n72RL38k95J4J41
4929F7j67N0j36J31M7J24k84K33q6J90k13R1j4L4r2j24J23K0OJ29k44J45j64K81
4953A47R6M0j92l43J69M2N8K03j29j94J24O9p3P2k52L04j06k91P8rJ78l28L52
4976A5l65L40J8N4o1n7lO0q5J24J96j59j4R7k71JK01l90L79r9j65J52J54j23K7
5001B6J58n63L58l23N25j56j79J97l0p8O7J58l44J81J04o5K01k11l16J40J23k1
5023d8K44j67l92M83n16M98l57J86J04K32k80lJ13j52j08O0J28k7j17j9r7R4O4
5046g7J42l18K37j00K63j91ON1m4k09L52k59J66j81J11k88M35k17L7J42j86K4
$$ plain form
5068 -104 -47 -29 -127 12 118 318 171 131 127 -78 85 43 -49 -197 -157 -182 202 58 -75 -82 -170 60 78 -17 -28
5093 -28 75 -77 -12 -57 23 -158 174 118 256 121 14 47 -195 105 -55 51 206 -48 252 159 -48 189
5115 189 -97 182 -173 -23 -247 119 154 212 97 78 -26 62 157 98 97 -324 -67 3 -121 73 39 154 56 -14
5139 -14 -21 13 -45 114 236 4 262 191 82 -57 109 285 40 11 -159 -25 80 -260 -99 -193 143 8 -101
5162 -101 173 -219 9 43 221 -126 -26 137 16 167 -324 -41 -149 -59 59 -75 -124 -154 172 51 -64
5183 -64 33 -71 195 139 -33 342 161 13 171 49 132 286 -210 -129 315 39 175 -234 101 -120 -189 207
5205 207 123 -140 82 21 -15 -52 62 -113 -32 19 -191 -17 10 56 109 -77 18 -169 -68 -89 19 -70 76 207
5229 207 97 136 -66 -29 159 -200 -199 -10 83 30 -73 -39 210 41 131 46 43 -223 -199 -66 -47 -124 99 87 145
$$ packed form
5068a04N7J8r8J39J06K00j47m0mk05J63m2r2j48M0k5L84j44j33pq8K30J8r5j1
5093b8J03j52O5m5Q0j81L32n6J38j35j07L3k42L00j60J06J55k54L00r3k07K37
5115A89k86K79l55J50k24L66L5N8j15j9j04Q8R5n9jm21K57P0j24J94l4J15r8p0
5139a4pL4n8J59J22k32K58p1j09j39J66J76k45k9j70J34J05l40J61r4L36j35j09
5162a01K74l92K28L4J78l47J00J63j21J51m91K83j08R0J18j34m9l0L26j21j15
5183f4R7j04K66n6j72L75j81j48J58j22Q3J54m96Q1M44k76J36m09L35k21o9L96
5205B07q4k63K22o1l6l7J14j75Q1N1k10J74K7M6N3j86R5j87J01k1J08q9J46J31
5229B07j10L9k02L7J88l59JJ89R3n3j03L4K49j69R0q5lk66K4J33J9p7K23j2N8
$$ plain form
5254 145 -68 186 -215 -160 169 -4 177 166 125 104 -131 -95 -45 -122 190 176 -58 -183 -19 -70 98 28 138
5277 138 189 42 -68 -169 134 72 81 141 266 -176 -85 -74 -107 -71 -145 -7 3 31 100 -116 150 -152 183 222 -16
5302 -16 155 48 -160 -89 142 -77 59 9 -263 -27 -164 -36 -48 -2 -216 -38 119 -368 158 -83 170 -14
5324 -14 -160 -102 7 25 165 212 -169 224 -68 -31 64 -139 208 -209 -355 -63 71 -33 -12 234 -244 69
5346 69 207 85 -17 324 -62 10 212 181 -75 90 135 -29 -57 26 152 -62 -71 119 316 172 303 175 -115
5369 -115 0 131 -264 132 270 139 221 -78 157 -53 -101 -242 -107 -88 86 18 93 57 -77 133 -149 187
5391 187 64 289 48 27 116 -19 143 59 5 -92 -107 15 41 24 175 53 -146 -28 -10 -19 63 60 -65 323 9
5416 9 123 79 159 -332 -108 52 -363 -85 -84 61 4 -47 72 -35 63 119 -10 -106 -65 -98 276 87 -228 171
$$ packed form
5254A45k13K54m01N5L29j73J81j1m1k1k35L6N0p7L12j4k34j25J64n1J68p0J10
5277A38N1j47j10j01L03o2RO0J25m42R1J1l3L6p4J38J0K8O9k16K66l02L35L9k38
5302a6J71j07k08P1K31k19J36n0k72K36j37J28j2M6k14J78J57m87N26k41K53j84
5324a4j46N8J09J8J40M7l81L93k92L7R5k03L47m17j46K92J34j04K1K46m78L13
5346F9J38j22j02L41l86P2K02l1k56J65M5j64k8Q3J26k14rJ90J97j44J31j28k90
5369a15J15J31l95L96J38j31Q2k99K35k10m8j41J35J9J74o8P5l6j34K10k82L36
5391A87j23K25k41k1Q9j35J62q4n4r7j5J22K6j7J51j22j99J18J8rQ2lj25L88l14
5416IJ14m4Q0m91K24J60m15K78JJ45n7n1J19j07R8N6j29r6M1l3L74j89l15L99
$$ plain form
5440 171 -6 94 131 -5 -95 167 -90 -146 66 -81 57 163 -145 116 53 -32 192 188 62 -172 69 -18 -73
5463 -73 -89 75 -7 61 136 -8 -123 -198 33 243 62 80 -43 -33 147 -59 140 59 260 -8 8 -139 -206 -20
5487 -20 -61 -80 -244 -283 105 -241 -225 -34 -8 -9 -67 -108 61 -48 35 -34 -210 64 -112 -168 2 -182 25 56 -256
5512 -256 140 -82 76 395 -269 -23 153 105 -111 134 346 111 124 162 -27 340 27 -148 42 43 -23 -208
5534 -208 4 -61 29 134 -95 -7 34 15 -115 227 200 96 -161 19 -30 -76 295 -96 75 -180 101 -191 134
5557 134 -75 -36 -174 261 -29 46 90 120 82 -6 -177 -96 -42 86 81 -100 -196 42 -62 304 -41 23 -21 -302
5581 -302 -184 -158 -221 -67 -9 11 10 229 -44 -151 321 -111 -142 -271 -120 110 -12 -207 79 -332 -181 113
5603 113 -74 -74 -68 142 174 164 -138 -44 134 178 -195 69 -77 246 133 -242 281 -45 -269 -97 60 -13 115
$$ packed form
5440A71j77J00L7j36r0K62k57n6K12j47J38J06l08K61o3q5K24mj26k34K41q7n5
5463g3j6J64q2O8P5j44j15p5K31K10j81J8j23J0J80k06J99q1K01k68J6j47o7J86
5487b0m1j9j64l9L88l46J6J91K6jn8m1J69j09Q3o9j76K74j76n6J70j84K07L1l12
5512b56L96k22J58L19o64K46J76m8k16K45K12k35J3L8j89L67l13j75J90Jo6j85
5534b08K12o5R0J05k29Q8M1j9j30L42k7j04k57J80m9m6L71l91J71k55K81k92L25
5557A34k09L9j38M35k90P5M4L0l8q8j71Q1N4J28nj81r6K38j04L66l45O4m4k81
5581c02J18K6o3J54N8K0jK19k73j07M72m32l1j29J51K30j22j95K86m11J51K94
5603A13j87%OK10L2j0l02R4J78M4l73K64j46L23j13l75N23l26k24J72J57p3J28
$$ plain form
5626 115 -29 -35 -94 96 50 -90 135 98 231 75 20 -92 -191 -226 44 -167 -27 -152 -18 -114 26 105 32 -51
5650 -51 -70 14 83 111 120 343 5 71 -57 93 140 -31 114 148 -13 -84 177 -44 -221 143 175 -112 -1 -105
5674 -105 183 -205 -184 118 43 -121 181 15 -100 -118 -156 4 35 144 126 98 40 -59 11 45 -101 -2 -77 2 1
5699 1 -124 111 -215 -98 32 41 79 102 193 131 -85 -149 110 361 -119 -317 -144 -297 135 -73 23 246 37
5722 37 203 -163 -189 29 -17 144 171 -57 -98 271 -32 -182 -34 -25 -12 277 -97 32 23 17 0 -129 -8 -183
5746 -183 2 -22 -223 178 -6 145 -158 322 59 298 88 160 236 -303 -247 -106 97 -106 45 -54 -47 104
5768 104 -150 122 64 -101 25 102 -51 109 79 106 41 -181 -171 -126 -47 33 43 -29 88 -87 182 138 288 38
5792 38 317 -73 91 27 40 -151 213 52 -48 291 53 -52 -12 -90 -99 195 -59 90 40 -33 -77 29 121 20
$$ packed form
5626A15j44on9J90m6j40K25l7J33j56n5j12r9l5K70k11J40j25J34r6J40P9p3q3
5650e1j9Q4O9K8RK23l38O6j28J50M7j71J45L4j61p1K61k21j77L64L2k87J11j04
5674a05K88l88K1L02p5j64L02j66j15j8l8J60L1J09j8k8n8r9P0L4j46R9p5P9j
5699Aj25K35l26J17J30RL8K3R1o2k16o4K59K51m80j98J73j53M32k08R6K23k09
5722C7J66l66k6K18m6J61K7k28m1L69l03j50J48RJ3K89l74J29roj7j29J21j75
5746a83J85k4k01M01j84J51l03M80k63K39k10P2P6n39N6J41K03k03J51r9PJ51
5768A04k54K72n8j65J26P7j53J60l0K7o5k22J0M5P9Q0J0p2J17j75K69m4J50k50
5792C8K79l90J64o4J3j91L64j61j00L39k38j05M0p8rK94k54J49n0p3m4J06R2j01
$$ plain form
5816 20 91 115 -116 -59 -19 -200 -48 17 -53 -39 -153 -98 107 -127 -275 -216 -228 -106 -248 -141 -108 236 -55 -30
5840 -30 -60 -37 172 43 -100 -119 54 -72 121 -80 105 -71 -96 -117 -9 10 79 108 5 -14 -136 -45 11 -149
5864 -149 179 118 103 120 68 92 -4 45 -235 -70 -29 14 -47 -66 64 145 147 167 58 71 -31 153 -17 -118 102
5889 102 -211 48 -212 220 44 129 -225 39 90 76 -112 40 194 -251 259 50 -261 -60 -212 113 4
5910 4 47 -3 30 48 16 -104 83 212 131 -159 -223 276 418 -38 -65 -66 -133 186 175 180 128 -252 -191 -257 -17 66 97
5937 97 104 15 -130 21 -53 39 -66 42 243 35 38 200 213 -138 132 -95 64 49 -246 -109 -105 -47 -131 -101 77
5962 77 -39 78 -45 -35 -140 -34 -31 -19 48 38 257 -207 207 -79 -63 -112 -80 -10 108 210 67 22 80 80 -101
5987 -101 226 -118 85 50 -83 154 -201 -40 47 -102 109 61 -237 75 -159 -115 -110 115 -152 -20 116 193
$$ packed form
5816B0P1K4k31N7M0j81J52O5p0J4j14N5K05k34j48N9j2J22j42J07L3L44k91K5
5840c0l0K3K09j29j43j9J73j26J93k01J85j76k5k1J08J9O9K9j03j9j22R1N6j60
5864a49L28o1j5J7n2K4r6M9k80J65M1M3o1j9J30Q1KK0j09J3j02J84j70j01K20
5889A02l13K59k60M32j76Q5l54K64N1j4j88J52J54m45N10k09l11K01j52L25j09
5910DM3n0L3J8l2j20J87J29q1k90o4M99J42m56k7jo7L19j1Nn2l80O1o6K40Q3L1
5937I7Pq9j45J51p4R2j05J08K01k08LJ62J3l51K70k27J59j5k95J37MN8q4L0J78
5962G7j16J17j23J0j05J06LJ2O7j0K19m64M14k86J6m9L2P0J18J02j43m5N8%j81
5987a01L27l44K03l5j33K37l55J61Q7j49K11m8k98L12k34M4NK25k67J32J36P7
$$ plain form
6009 193 -116 -95 15 -9 -15 213 -78 42 96 -387 158 -234 -112 -32 -217 -182 90 -23 -205 128 132 39 268
6032 268 151 36 38 -24 -163 76 97 80 -115 -117 28 -226 33 2 -209 -52 257 78 11 142 -154 -69 230
6055 230 281 23 -78 -107 -3 37 128 -112 141 -198 -342 188 164 -15 78 132 63 318 -353 -127 120 32 222
6078 222 163 78 -24 -69 -225 -144 117 -47 109 40 -117 -93 -102 89 96 77 207 168 -122 98 -246 254 347 -52
6102 -52 221 146 111 351 167 53 -115 -222 -116 29 -25 -66 -220 -276 -165 -101 -17 10 23 214 250 120 5 134
6126 134 -180 -53 233 9 -91 273 -75 -81 77 -70 92 -93 -86 -223 -78 -139 -27 164 -97 55 -59 52
6148 52 -400 -8 348 -127 45 -114 49 5 -71 -142 -166 -19 84 -165 -19 -33 -79 201 -160 -2 29 146 -79
6171 -79 278 -110 21 96 -31 -29 -498 -78 -183 19 261 29 28 158 147 93 -68 19 -218 -312 -30 0 145 191
$$ packed form
6009A93l09K1J10k4oK28k91J20N4m83N45l92J22Q0j85L5K72j13j82L33Mr3K29
6032B68j17j15Ko2j39K39K1j7j95kJ45k54K59l1k11J57L09j79o7J31k96Q5K99
6055B30N1k58j01k9J04M0R1k40K53l39j44N30k4j79R3N4o9K55o71K26K47q8J90
6078B22n9q5j02m5j56Q1K61j64J56o9j57K4rJ91Pj9J30l9k90K20l44N00R3l99
6102e2K73p5l5K40j84j14j68j07J06J45n4m1j54n6J11O4Q4K7J3J91L6j30j15J29
6126A34l14J27K86k24j00L64l48oJ58j47J62j85Pj37J45o1J12J91k61J52j14J11
6148E2m52L92L56m75J72j59J63m4p6p1k4J47J03k49J46j4m6K80l61J58L1J17k25
6171g9L57l88J31P5j27Km69M20j05K02K42k32jJ30j1n4j61Q7k37r4K82L0J45M6
$$ plain form
6195 191 219 -41 -162 60 -26 -209 214 -45 70 -3 79 -3 -173 -6 -24 139 246 -51 -358 -25 31 -74
6217 -74 93 182 -91 -76 -11 -142 -131 -229 234 271 42 -7 114 -167 113 90 -99 -74 -109 -170 144 -115 -113 39 93
6242 93 -56 200 -39 -121 173 -44 -132 78 3 285 24 68 67 -264 13 -4 -126 23 159 278 -43 65 -102
6265 -102 106 189 -209 -4 -67 -71 178 -14 -203 143 -13 124 139 -126 -97 85 -146 86 -220 98 -194 -53
6287 -53 95 -182 -13 209 68 98 88 38 89 -27 44 -28 141 -137 -106 -136 65 127 -323 112 182 -70 31 193
6311 193 -165 9 71 25 98 32 16 173 191 408 -151 -222 -141 98 -279 101 264 -77 -308 -30 50 -18 18 106
6335 106 -17 14 -87 38 31 175 83 138 117 61 129 30 -54 43 258 -191 -127 86 131 -14 11 40 -146 -159 60
6360 60 54 -15 -15 -155 5 -54 143 -93 -16 -91 78 -62 78 -160 -42 245 -32 -17 45 -254 -90 -148 109 -75
$$ packed form
6195A91K8k60j21K22q6j83M23k59J15p3Q2q2j70J67j8J63J07k97l07L33N6j05
6217g4J67Q9k73J5O5j31J1r8M63L7k29m9J21k81K80k3j89K5l5o1L14k59KJ52N4
6242I3j49K56k39q2K94k17q8K10p5K82k61M4jl31K77j7j22J49J36J19l21J08j67
6265a02K08Q3l98K05o3mK49j92j89L46j56J37J5k65K9J82k31K32l06L18k92J41
6287e3J48k77J69K22j41L0j0n0N1j16P1p2J69k78L1l0K01O2m50M35P0k52J01J62
6311A93l58J74O2m6P3o6j6J57J8K17n59p1Q1K39l77L80J63l41k31K78Q0o8L6Q8
6335A06j23L1j01J25pJ44r2N5k1n6O8r9q4R7K15m49O4K13M5j45K5K9j86j3K19
6360F0oo9%j40J60n9J97k36P7p5J69j40J40k38J18K87k77J5O2k99J64n8K57j84
$$ plain form
6384 -75 182 -176 -38 -254 -98 -6 -204 -84 -235 -25 74 209 93 -93 -218 -122 15 -41 -140 -23 -237 136
6406 136 -122 199 -134 -11 -133 -32 148 30 -79 -32 -28 104 68 18 132 -52 118 255 -35 -181 -116 187
6428 187 193 98 -18 -30 -36 1 -123 0 14 60 131 292 -143 124 119 263 26 112 -82 -65 -198 117 59 -132 -74
6453 -74 -219 -96 -75 -16 169 230 -80 43 109 -55 -142 253 37 57 -125 174 -45 201 48 -86 -294 51
6475 51 -30 235 -137 -40 -30 -37 71 -30 -136 189 77 84 64 -39 89 131 -88 -57 -54 -138 -104 -31 20 240 120 286
6501 286 -51 32 273 204 -51 -77 -153 4 239 23 210 101 -9 -69 -116 -155 211 -6 -251 -148 -179 88 -336
6524 -336 -9 231 22 138 72 164 -77 337 162 -124 51 -80 -148 76 145 197 68 -11 -132 82 245 -22
6546 -22 41 -138 -92 86 -16 76 97 -122 -84 -92 74 20 52 46 -162 -212 -9 -146 63 280 -119 121 87 -202 184
$$ packed form
6384g5K57l58J38k16J56R2j98J20j51K10R9J35j16j86j25R6J37n6r9J17k14L73
6406A36k58L21l33J23j22J01J80j18j09M7MJ32l6n0J14j84J70J37k90j46O5L03
6428A87Or5j16j2oL7j24J23J4M6P1J61m35K67nJ44k37Q6j94J7j33L15n8j91N8
6453g4j45J23K1N9J85O1l10J23O6j64q7L95k16K0j82K99k19K46j53j34k08L45
6475E1q1K65l72R7J0pJ08j01j06L25j12Pk0j03J28M2k19L1Lq4L4P3N1K20j20J66
6501B86l37Q3K41o9k55k6p6J57K35k16J87j09j10o0m7l9L66k17k45J03l1K67m24
6524c36L27K40k09J16o6R2k41M14j75k86J75j31o8K24O9N2j29p9j21K14J63k67
6546b2O3j79M6J78j02R2K1k19L8qJ66n4L2ok08n0K03j37K09K17l99K40l4k89L86
$$ plain form
6571 184 22 -108 -16 113 -107 155 166 -27 -23 -65 65 -98 62 31 45 15 39 -22 -127 146 127 63 -83 -139
6595 -139 161 -97 -171 111 -90 -96 53 26 -49 91 -254 4 190 100 -55 -117 -179 -182 -162 -15 128 99 -73 -121
6619 -121 -219 88 -17 213 -231 146 -69 16 195 91 -75 -70 -95 -107 155 123 82 88 -55 56 43 -131 -31 -219
6643 -219 58 90 0 -12 -12 -81 137 -6 58 -36 -225 -39 -171 -49 128 -35 187 -167 154 211 -6 -21 -27 -97
6667 -97 -137 61 25 125 -61 -127 -57 21 -43 59 164 -148 261 -12 -180 136 130 15 114 134 4 54 135 32
6691 32 39 -4 -52 223 -42 58 -58 -225 -37 -38 -53 20 34 184 -135 0 69 -27 202 -96 246 -81 55 107
6715 107 -8 -35 -80 -195 -226 -95 4 -282 -57 -149 -9 195 91 -168 85 280 -53 30 -142 79 133 -36
6737 -36 -10 218 128 -30 27 31 -180 57 49 69 79 73 60 -17 132 -318 120 -98 0 -94 30 191 -68 -54 133 -5
$$ packed form
6571A84j62j30R2J29k20K62J1j93Mm2J30j63J60l1J4l0K4o1j05K73j9o4j46n6
6595a39L00k58p4K82k01oJ49k7p5J40l45K58J86r0j55o2o2lK0J47J43k9j72m8
6619a21r8L07j05K30m44L77k15Q5J79j04j66Nk5j2K62l2m1Oj43J11j3j74J00j88
6643b19K77L2r0j2%o9K18j43O4r4j89J86j32J22J77j63K22l54L21N7k17j5op0
6667i7m0J98l6J00j86o6P0P8o4J02J05l12M09k73j68L16oj15R9K0j30N0Q1j03
6691C2Pm3m8K75k65J00j16j67J88jj5P3J4J50l19J35O9r6K29k98L42l27J36N2
6715A07j15k7m5j15l1J31R9k86K25r2J40K04j04k59K53J95l33Q3j72K21N4j69
6737c6K6K28r0j58N7Mk11K37qK0J0oj3p7J49m50M38k18R8r4J24J61k59J4J87j38
$$ plain form
6763 -5 -84 -39 -49 132 -271 -115 68 138 -15 132 166 124 332 -74 -44 54 -272 33 62 54 26 9 -17 72 -160 1
6789 1 4 -235 -13 -34 -75 -3 59 71 131 -120 -175 180 -309 23 -58 -189 -105 -90 -235 -18 -91 -20 -68 -37 -21 -95 62
6816 62 213 73 -89 12 145 -23 180 19 135 18 -265 -98 -134 165 -56 102 152 -53 82 77 -122 -90
6838 -90 284 3 -466 33 206 -3 -113 103 -149 -136 109 -34 140 229 -236 -29 -11 100 16 174 94 -69
6860 -69 243 -144 -177 -78 74 -5 97 248 -85 70 -109 -253 95 -275 -36 -204 222 -62 -104 140 210 74
6882 74 -159 99 331 -94 -61 17 38 91 -12 -61 -88 -102 68 -52 -100 95 205 -203 73 -291 -277 161 -142
6905 -142 -27 -169 -25 -337 -21 68 -12 -194 -158 160 -93 124 -109 -107 62 -30 -142 -238 -126 -53 202 142 -129
6928 -129 72 10 92 -52 -151 144 -170 -127 49 153 83 -41 24 -239 29 -127 108 15 -106 -95 -11 14 -46 29
$$ packed form
6763ep9M5j0J81m03J56J83P0j53J47L4m2K08m06L0R8l26L05K9qk8j7k6Q9k32J61
6789ALk39K22k1m1P2O2J2O0k51n5L55m89L32q1j31Q4J5j45K17p3P1m8L1J6p4J57
6816F2J51j40j62J01J33j68K03j61J16j17k83J67l6K99k21J58N0k05J35nj99L2
6838i0L74k81m69M99J73k09j10K16k52J3K45j43J74Q9m65K07J8J11q4J58q0j63
6860f9L12l87l3R9J52p9J02J51l33J55j79j44L48l70K39j68M26k84m2K44P0j36
6882G4k33K58K32m25L3P8K1N3j03m9k7j4J70j20m8J95J10m08K76l64J4M38l03
6905a42J15j42J44l12L16Q9q0j82L6L18k53K17k33KJ69r2j12r6J12P3K55o0k71
6928a29K01o2Q2j44r9K95l14M3J76J04p0j24O5k63K68j56K35r3j21J1Q4K5o0P5
$$ plain form
6952 29 -293 -94 42 -34 106 30 7 -20 51 137 105 -326 -19 154 -57 158 30 38 -60 -131 -122 -205 -14 66 272
6977 272 -145 197 205 21 -372 88 -103 21 -113 -159 143 -175 -4 22 -79 201 -52 167 47 -105 -66 -100
6999 -100 -153 -148 -167 -74 -166 2 28 -134 61 -6 135 -92 142 -45 -154 -84 20 -15 -28 137 320 3 -204 -56
7023 -56 40 193 -115 75 90 62 -248 203 -43 -147 -115 226 47 -96 8 -208 124 62 -116 -11 -26 65 101
7046 101 65 268 -224 78 96 143 37 -97 112 188 104 -113 264 89 75 108 -6 279 -181 398 -126 -200 98
7069 98 -18 26 63 -18 -38 -166 66 62 -92 -198 -50 75 -43 -104 -148 76 -78 -25 80 -107 -95 111 61 -364
7093 -364 113 250 -309 -127 -322 28 -42 144 113 152 285 -216 -66 -85 -162 159 110 -59 14 -82 -138 -113 258
7116 258 -102 15 -44 -117 -3 -121 -124 -3 121 -137 60 -45 -74 116 -74 4 -19 297 -144 -185 162 19 83
$$ packed form
6952B9l22J99J36p6J40p6k3k7P1Q6l2m31L07J73k11K15j28Qr8p1Rq3J91Q0K06
6977B72m17L42Qj84l93M60j91J24j34m6L02l18J71K6j01K80k53K19j20j52L9l4
6999a00n3Nj9R3r2J68K6j62J95o7J41k27K34j87j09P0J04l5j3J65J83l17k07J48
7023e6R6J53l08J90J5k8l10M51k46j04L2L41j79j43J04k16L32o2j78J05j5R1L6
7046A01l6K03m92L02J8M7j06j34K09P6q4k17L77j75j4L3j14K85m60N79n24p4K98
7069I8j16M4L7q1k0j28K32mj54j06J48J25j18o1m4K24j54N3J05j87J2K06n0m25
7093c64M77J37n59J82j95L50p0J86l1L9J33n01J50j9p7L21m9j69P3r6n6K5L71
7116B58l60J17n9p3J14j18lJ21J24k58J97j05k9J90j90P8k3L16m41m1L47j43O4
$$ plain form
7139 83 349 64 -168 227 25 9 73 8 -60 175 -275 6 -174 126 -69 70 199 -40 1 -79 57 151 -200
7162 -200 -60 186 34 -276 -104 248 54 77 18 -50 -35 101 -101 -135 -210 33 -51 78 -34 21 -76 -2 152
7185 152 -3 14 -280 65 8 158 57 7 -113 -93 -59 119 44 -221 81 29 120 -81 -294 -131 -95 130 -210
7208 -210 -39 -59 5 66 90 131 153 -110 87 -38 -170 -46 -80 210 146 128 4 246 -86 60 12 186 190 -77
7232 -77 40 -166 96 92 27 158 -83 318 -69 181 -39 146 98 -114 -122 196 50 -139 180 304 110 -67
7254 -67 -138 -152 -124 34 83 155 108 13 -115 -9 -99 -87 101 -138 -226 65 -104 70 196 10 57 -22 358 -17
7278 -17 251 -158 222 -82 -277 -17 8 240 66 124 317 -22 -6 -207 -32 35 -122 35 109 -246 -33 -139
7300 -139 -94 276 -225 -151 6 -89 66 6 145 17 -62 -37 36 60 42 -30 13 -1 -98 -51 157 14 -87 -93 -487
$$ packed form
7139H3K66k85k32L95k02j6O4o5o8K35m50K81j80L00j95J39J29k39M1q0J36R4l51
7162b00J40K46j52l10J72L52j94K3n9o8J5J36k02l4p5K43q4J29j12N5r7P4J54
7185A52j55J7k94L45n7J50j01n0j20K0L4J78p5k65L02n2R1k01k13J63L6K25l40
7208b10J71k0O4O1K4M1K2k63J97j25j32J24l4K90o4j8j24K42l32J46m8J74Mk67
7232g7J17k06K62mo5J31k41M01l87K50k20J85m8k12qL18j46j89L19J24j94j77
7254f7p1j4K8J58M9P2m7r5j28J06r0J2J88k39q8K91j69J74J26j86M7p9L80l75
7278a7K68m09L80l04j95K60K5K32j74N8J93l39J6k01J75O7j57J57P4l55K13j06
7300a39M5L70n01P4J57r5J55o0J39j28p9K5P3K4j8p2M3j4r7M7K08j43j01ol94
$$ plain form
7325 -487 -228 17 -18 29 44 -58 -195 -48 -196 17 -14 61 -73 -142 63 -19 62 303 64 275 -150 -1 -171
7348 -171 163 -123 -36 -104 238 107 -173 24 -83 117 159 -71 80 209 -32 98 169 75 21 -135 11 128
7370 128 -48 7 -67 169 -199 54 40 127 -51 36 101 140 55 -62 269 -43 33 -120 292 103 246 74 -467
7393 -467 106 -198 287 140 146 -70 194 3 157 -198 206 199 -61 67 22 -65 133 144 -56 15 59 86 -92
7416 -92 -204 -21 -60 -29 -98 -79 -141 70 84 -109 -217 130 98 30 -92 67 121 172 176 -86 188 -85 -73 123 -391
7441 -391 -195 277 -232 -29 18 -107 -194 133 -126 -125 131 86 78 235 -202 65 -19 13 112 349 83 -245 144
7464 144 -252 68 -147 81 -56 -82 -56 20 -94 -45 -118 -92 132 85 54 192 126 94 134 -61 -253 225 -126 215
7488 215 111 -99 58 -182 -36 100 46 183 -36 75 22 -37 -87 -143 -198 -125 -43 -57 -193 -9 -72 149 174 -58
$$ packed form
7325d87K59K45l5M7J5j02j37J47j48K13l1P5j34o9K05q2Q1K41k39K11m25J49j70
7348a71L34k86Q7o8L42j31k80J97j07K00M2k30J51J29k41J30P1r4n4j56J46J17
7370A28j76N5p4K36l68K53j4Q7j78Q7O5L9q5j17L31l12P6j53M12j89J43j72n41
7393d67N73l04M85j47Ok16K64j91J54l55M04pk60J28m5q7J98J1k00P1M4K7j78
7416i2j12J83l9L1o9J9o2K11J4j93j08L47l2o8j22J59N4N1Mk62K74k73J2J96n14
7441c91J96M72n09K03M7j25q7L27k59JK56m5qJ57m37K67q4L2R9K37k66l28L89
7464A44l96L20k15K28j37k6K6P6j14M9p3K6K24m7l1J38o6l2M0j95j92M78l51L41
7488B15j04k10J57k40J46J36n4J37k19J11n3n9n0n6n5P3Q2j4j36J84o3K21K5k32
$$ plain form
7512 -58 109 -149 -34 150 42 -158 6 92 -49 -264 -99 -20 173 152 60 -19 -38 12 -4 141 11 42 -36 15
7536 15 -25 -184 -5 -119 16 213 126 -182 3 202 56 -204 56 85 42 110 0 236 0 60 143 65 -113
7559 -113 80 -193 249 24 -189 38 -139 -47 85 -189 -113 -281 -1 229 148 -393 244 -248 201 175 105 169
7581 169 50 27 208 -63 146 62 -129 -59 266 -301 5 29 -303 120 119 -182 76 273 -99 -94 32 164 -143
7604 -143 121 202 -68 53 4 -160 -9 16 -20 -18 -109 88 -167 -18 255 159 99 -28 11 4 -124 -34 -239 -97
7628 -97 -116 -180 31 198 -38 -194 -262 3 -77 -27 66 -135 -192 136 -178 75 -232 -134 62 -124 52 -4 109
7651 109 -103 38 115 -293 148 -143 -96 -20 -110 -24 85 -43 -61 -37 61 45 -124 -159 -8 -62 54 121 9 116
7675 116 -111 52 -91 252 -172 102 24 -214 16 311 -44 -37 134 -76 33 -88 -10 -158 95 185 48 -179
$$ packed form
7512e8J67k58J15J84j08k00J64Q6j41k15J65P9J93k1r2p9j9N0j6J45j30L1p8N1
7536A5m0j59J79j14J35J97q7l08J85J99j46k60K60K9m3O8j10K36k36O0Q3p8j78
7559a13J93k73M42k25k13K27j77R2J32k74P6j68K80K30q1n41O37m92M49k6p0O4
7581A69j19k3J81k71K09q4j91P0L25n67L06K4l32M23jl01K58J97l72NJ26J32l07
7604a43K64Q1k70J21m9j64J51K5l6Kr1J97k55J49K73r6o0j27L9pj28R0k05J42
7628i7j9o4K11J67k36j56o8K65q0N0R3k01n7L28l14K53l07R8J96j86J76n6J13
7651A09k12J41P7m08M41k91M7P6r0Q6J09j28j8K4R8j6j69l5J51n4J16O7j12J07
7675A16k27J63j43L43m24K74p8k38K30K95l55PJ71k10J09j21P8j48K53R0j37k27
$$ plain form
7697 -179 -305 -34 69 -275 -108 -79 -79 89 -221 117 -44 86 187 -115 166 163 -40 -173 16 -14 -95 49
7719 49 -55 196 13 -119 335 -128 -70 -264 -113 148 261 -90 -116 -100 -148 -18 -251 -88 206 -339 0 212
7741 212 -205 4 -18 -65 -109 -38 -28 191 171 29 164 -11 73 183 -58 147 220 44 -114 -29 14 110 120 -159
7765 -159 -27 138 -170 60 83 56 -75 -86 -235 -15 -33 31 17 306 75 73 -3 -66 120 128 184 -38 170 -30
7789 -30 186 -135 58 -29 135 112 55 63 -134 -127 7 -62 25 -17 -106 -209 -253 39 227 52 27 -101 -244 -156 -202
7814 -202 -88 -49 313 -38 109 -166 -52 81 -23 -44 26 -10 156 -30 51 114 23 -23 79 9 -19 92 -133
7837 -133 62 15 -30 366 -198 25 156 -108 -212 -54 -75 -185 256 94 105 31 -343 129 -11 -240 66 -93
7859 -93 -56 97 80 108 167 135 311 169 53 -20 79 -62 124 -158 134 -168 53 3 198 100 23 -38 77 117
$$ packed form
7697a79j26K71J03l44J67K9%J68l10L38j61J30J01l02K81lk03j33J89l0q1J44
7719D9j04K51j83j32M54m63N8j94J51K61J13l51k6J6m8J30k33J63K94n45L39K12
7741B12m17K09k2m7m4P1J0K19k0j42J35j75Q4J10k41K05P3j76j58Q5M3R6J0k79
7765a59J32J65l08K30K3k7j31j1j49K20j8O4j4K89k31kp6o3J86QN6k22K08k00
7789c0K16l21J93q7J64k3n7Qj97PJ34o9Q7m2q9j03m4K92J88j75k5j28j43Q8m6
7814b02J14L9L62l51J47k75J14J33j04k1P0l6J66j86Q1O3r1m6J02p0k8J11k25
7837a33J95m7m5L96n64K23J31k64j04J58k1j10M41j62J1p4l74M72j40k29L06j59
7859i3L7J53j7K8N9l2J76j42j16p3R9j41J86k82K92l02K21n0J95r8p7o1J15M0
$$ plain form
7883 117 203 1 167 95 2 -12 80 110 -107 -88 167 114 -23 -13 -172 15 -45 41 27 62 -69 54 98 -158 -208
7908 -208 257 37 230 83 -188 87 120 30 -82 -89 -19 97 -112 35 178 -155 -198 -157 111 7 59 36 -136
7931 -136 -112 133 39 -187 432 90 -54 -8 -93 -336 -86 -141 213 106 3 115 40 -127 -109 125 -220 -134 -259
7954 -259 157 358 -56 -154 68 -193 -46 -85 -85 327 9 108 228 274 -137 -60 -43 -174 -9 -18 -71 -92 40 -110
7978 -110 2 -207 49 54 98 -51 -127 -90 -122 -122 -111 71 57 -32 29 234 147 78 -127 -79 -179 -63 92 -181 -115
8003 -115 -43 -127 -145 -45 -14 65 67 89 -48 76 -131 44 146 120 -46 -23 15 -87 69 -40 30 138 47 -234
8027 -234 33 43 -27 -181 -79 16 -78 18 -56 92 -2 165 98 -232 -53 84 28 38 45 -63 -237 -79 89 -56
8051 -56 -275 27 123 144 190 -198 -11 218 -101 -122 112 50 133 -4 -118 -246 207 122 -122 61 72 -119 149
$$ packed form
7883A17Q6k02J66p2r3j4R2L0k17J9K55n3j37J0j59J87o0Q6j4L5j31J23M4k56n0
7908b08M65k20J93j47k71K75L3r0j12pP0J16k09J47J43l33m3M1K68j04N2k3j72
7931a36K4K45r4k26O19l42j44M6q5k43K50n5L54j07j03J12p5j67J8K34l45Q6j25
7954b59M16K01m14r8K22k61J47l9%M12l18R9J20M6m11P7J7j31J65rn3k1J32j50
7978a10J12k09K56NM4j49p6L7l2%J1J82j4q9O1K05q7o9k05M8j00J16J55k73O6
8003a15P2q4j8J00L1P9KK2j37J24k07J75J02k6j66K3L8j02J56j09P0J08r1k81
8027b34K67J0p0j54J02R5r4R6p4J48r4J67o7l30J79J37n6J0Pj08j74J58J68j45
8051e6k19L02R6K1M6l88J87K29l19k1K34o2Q3j37j14j28M53q5k44J83J1j91K68
$$ plain form
8074 149 -124 26 -186 -191 147 -20 -159 -29 -76 52 23 63 12 -51 -194 -32 -269 -126 153 -248 -39 -74 -87
8097 -87 -171 39 -171 221 116 -2 -134 -41 -36 -44 -176 262 -159 -42 67 66 -75 30 -228 -162 -133 -56 -19 19 -56
8122 -56 66 229 -235 73 -139 -234 -133 -89 43 -47 34 348 -77 -9 -2 74 77 9 -70 -81 157 -182 -121 -66 164
8147 164 44 -38 -31 -17 101 55 32 69 -207 225 178 -24 47 64 336 129 125 -62 0 204 -16 -95 -48 143 -58
8172 -58 106 -2 6 -271 32 -112 -207 -57 -3 99 31 113 36 -31 -90 -240 94 -109 111
$$ packed form
8074A49k73J50k12nL38j67j39J30m7J28k9M0n1o3j43J62k37J43K79m01K09l5j3
8097h7q4K10k10L92j05j18j32R3Nqj32M38m21J17J09jj41J05k58O6K9P7L7L8p5
8122e6J22J63m64L08k12r5J01M4J32r0Q1L14m25O8PP6Lo8p9j1K38l39O1N5K30
8147A64j20q2PJ4J18m6k3L7k76M32m7k02P1J7K72k07mj87O2K04k20p9M7J91k01
8172e8J64j08Qk77L03j44r5J50N4J02o8Q2p7o7n9j50L34k03K20
8191A11
$$ Imaginary data points
##PAGE= N=2
##DATA TABLE= (X++(I..I)), XYDATA
$$ plain form
0 0 0 0 0 0 0 0 0 0 0 0 0 -8 8 -8 8 -16 16 -20 24 -32 32 -40 48 -56 72 -80 96 -110 126 -144 165 -188 214
33 214 -241 273 -308 346 -388 433 -484 537 -598 662 -734 811 -898 990 -1091 1203 -1326
50 -1326 1460 -1608 1773 -1956 2161 -2392 2654 -2954 3304 -3714 4207 -4809 5563 -6541 7867
65 7867 -9769 12752 -18107 30676 -125004 33956 209828 -158033 -58466 161174 -17056
76 -17056 -124580 92527 55896 -72862 18300 48731 -77130 -2012 76279 -29436 -41189
87 -41189 43102 -20378 -28703 43266 -304 -33272 34260 9623 -39101 686 15325 -20400
99 -20400 2525 32274 -3809 -21351 18984 -989 -37239 20433 39793 -34628 -33142 29083
111 29083 28507 2417 -1345 -492 -5527 -19130 -16322 9942 21420 -7155 -36990 -7684 28456
$$ packed form
0@%%%%%%%%%%%qJ6j6J6k4L2l6M4n6O4p2Q8j04J28j52J76k06K36k70L09l53M02
33B14m55N14n81O54p34Q21r17J021j135J260j396J545j709J888k081K294k529
50a326K786l068L381l729M117m553N046n608O258p018P921r016J0372j2104J4408
65G867j7636K2521l0859M8783j55680J58960J75872l67861R9567K19640j78230
76a7056j07524K17107l6631j28758R1162L0431j25861P5118P8291j05715j1753
87d1189Q4291o3480q325P1969m3570l2968O7532k4637m8724L9787J4639l5725
99b0400K2925K9749l6083j7542M0335j9973l6250N7672J9360p4421J486O2225
111B9083n76k6090l762Q53n035j3603K808K6264J1478k8575k9835K9306L6140
$$ plain form
124 28456 1637 -181 29223 -6570 -18130 29495 7968 -22426 11109 56 -32343 -4844
136 -4844 10334 -5750 3875 6444 -12605 2621 19323 -17099 -17522 32983 9195 -24151 18307
149 18307 8512 -29902 17315 21174 -28849 2417 14163 -32897 -3270 34582 -7653 -16411 12444
162 12444 -7888 -13767 27764 15846 -25043 -1638 7277 -23045 4409 22431 -15886 -1529
174 -1529 16684 -17994 6833 35816 -15471 -19005 20930 -7028 -22790 12687 4247 -21444 3092
187 3092 13202 -16655 -3691 25183 -4138 -12949 23341 6292 -20337 7351 10094 -8386 4199
200 4199 3247 -13673 -6352 4974 457 -5436 559 983 -12594 -1057 19158 -276 -4352 14762
214 14762 -6467 -14151 19534 10315 -19749 -1435 11147 -14902 -9914 21233 1842 -20329 12764
$$ packed form
124B8456k6819j818K9404l5793j1560M7625k1527l0394L3535j1053l2399K7499
136d844J5178j6084R625K569j9049J5226J6702l6422m23N0505k3788l3346M2458
149A8307r795l8414M7217L859n0023L1266J1746m7060K9627L7852m2235q758K8855
162A2444k0332n879M1531j1918m0889K3405Q915l0322K7454J8022l8317J4357
174a529J8213l4678K4827K8983n1287l534L9935k7958j5762L5477q440k5691K4536
187C092J0110k9857J2964K8874k9321q811L6290j7049k6629K7688K743j8480J2585
200D199r52j6920P321J1326m517n893N995M24j3577J1537K0215j9434m076J9114
214A4762k1229p684L3685r219l0064J8314J2582k6049M988L1147j9391k2171L3093
$$ plain form
227 12764 10480 -21868 7691 19880 -21600 -6755 18403 -12657 -9355 15242 -3190 -6381 13196
240 13196 1674 -9232 7616 8695 -7914 -389 8743 -8456 -8839 6026 -3054 -3653 5962 -8035
254 -8035 -6627 7890 -901 539 7742 -3610 418 6311 -3262 4724 7732 -7740 -4027 3141
268 3141 -5749 -2988 4279 -4658 -8934 4849 3886 -9287 5084 12318 -9465 -1865 13927 -7495
282 -7495 -4059 13652 -7894 -7378 13664 -4805 -10982 10708 1771 -9810 4455 4331 -8755 -807
296 -807 8314 -5174 -7261 8171 -725 -10190 6911 5761 -6140 3575 2831 -3539 3708 2819 -492
311 -492 710 -2391 2038 202 -8237 1895 4218 -10121 -3302 5460 -2716 -1381 3691 39 871
326 871 4488 223 -2118 5915 4057 -8358 1229 8187 -10119 -3536 10185 -9805 -6480 12815
$$ packed form
227A2764k284l2348K9559J2189m1480J4845K5158l1060L302K4597j8432l191J9577
240A3196j1522j0906J6848J079j6609P525R132j7199l83J4865r080n99R615j3997
254h035J408J4517q791J440P203j1352M028N893r573P986L008j5472L713P168
268C141q890K761P267q937m276J3783r63j3173J4371P234k1783P600J5792k1422
282g495L436J7711k1546N16K1042j8469o177K1690q937j1581J4265j24j3086P948
296h07R121j3488k087J5432q896r465J7101j150j1901R715p44o370P247q89l311
311d92J202l101M429j836q439J0132K323j4339O819Q762q176J335N072l652Q32
326H71L617m265k341Q033j858j2415R587O958j8306O583J3721j9990L325J9295
$$ plain form
340 12815 -6531 -9558 13024 426 -10521 6764 5764 -6648 1314 7204 -3697 -3416 7244
353 7244 -997 -7356 6356 2300 -8312 3103 2895 -6031 1450 830 -4230 1348 -159 -1215 1201
368 1201 -1648 3028 2733 -4735 3401 6077 -5493 1367 6643 -4375 -2567 5696 -2656 -7159 4413
383 4413 2867 -11287 135 10491 -9946 -5499 13801 -4559 -7708 13563 -1149 -8756 12291
396 12291 1667 -10761 8090 5083 -10636 916 7107 -7425 -4749 6939 -3678 -7139 7625
409 7625 -922 -9321 8780 3899 -10368 6689 7151 -8215 3240 6711 -4979 167 3723 -2407
423 -2407 -1125 518 -642 -727 -1860 -558 -499 -1065 -354 -614 944 362 -1480 3284 1161 -2511 4844
440 4844 1289 -4441 4837 2061 -5783 2293 1447 -4212 403 -803 -2405 665 -1431 -1207 854 -424
$$ packed form
340A2815j9346l027K2582j2598j0947J7285j000j2412P962N890j0901K81J0660
353G244q241o359J3712m056j0612J1415k08q926P481o20n060N578j507j056K416
368A201k849M676k95p468Q136K676j1570O860N276j1018J808Q263q352m503J1572
383D413j546j4154J1422J0356k0437M447J9300j8360l149K1271j4712p607K1047
396A2291j0624j2428J8851l007j5719J1552O191j4532K676J1688j0617l461J4764
409G625q547q399J8101m881j4267J7057M62j5366J1455L471j1690N146L556o130
423b407J282J643j160q5j133J302N9n66P11k60J558n82j842M764k123l672P355
440D844l555n730R278k776p844Q076q46n659M615j206j602L070k096K24K061j278
$$ plain form
456 -424 638 130 -704 3209 577 -1452 2699 2036 -476 -161 1824 828 -3607 886 3261 -6805
472 -6805 -1104 6219 -8348 -3964 9886 -5721 -6077 11531 -2290 -7667 10966 2444 -10025 6729
486 6729 7752 -10844 126 11494 -8854 -7451 13625 -4976 -13674 13627 1137 -18154 11329
499 11329 8891 -17346 5408 14530 -12715 -1779 15032 -6155 -7573 12358 270 -12049 7723
512 7723 6429 -13687 1929 11029 -11881 -3522 12731 -8127 -7375 11638 -2817 -9151 8354
525 8354 3681 -7385 2196 7074 -2907 -2921 7024 729 -6525 4810 3141 -8972 1927 5322 -8150
540 -8150 -2165 5704 -3855 -3739 4273 393 -4574 2850 5237 -4775 81 8952 -3958 -4177 10658
555 10658 -1959 -8538 8016 -168 -10243 5730 2567 -10515 1315 6315 -5830 -1959 7368
$$ packed form
456d24J062n08q34L913k632k029M151o63k512L15J985r96m435M493K375j0066
472f805N701P323j4567M384J3850j5607l56J7608j3821n377J8633q522j2469J6754
486F729J023j8596J0970J1368k0348J403K1076j8601q698K7301j2490j9291K9483
499A1329k438k6237K2754R122k7245J0936J6811k1187j418J9931j2088j2319J9772
512G723j294k0116J5616R100k2910Q359J6253k0858P52J9013j4455o334J7505
525H354m673j1066R581M878r981j4R945o295p254J1335j669j2113J0899L395j3472
540h150N985P869r559J16Q012l880m967P424K387j0012M856Q871j2910k19J4835
555A0658j2617o579J6554q184j0075J5973l163j3082J1830N000j2145L871R327
$$ plain form
568 7368 -1772 -4739 6918 1429 -6249 6134 2994 -8670 4683 6015 -8305 1959 5251 -7513
582 -7513 1288 4754 -6895 -150 4225 -5387 -1279 5240 -2422 -3056 5036 -181 -4015 6431 3197
597 3197 -7824 3952 6758 -8457 1322 8240 -9222 -2315 8978 -6851 -5120 7924 -3381
610 -3381 -7604 5311 2665 -4867 1939 4565 -2727 596 6857 -1979 -3679 6012 -1301 -5537 5521
625 5521 315 -7393 2108 1335 -4594 808 2426 -2869 -2038 3099 3098 -3268 -50 5087 -3162 -1994
641 -1994 7547 -1323 -4386 4949 147 -4898 3461 2152 -5888 -1619 3876 -1991 -2917 4466 -985
656 -985 -6544 5395 2939 -7620 4736 5476 -8293 2566 8565 -5747 -1150 5842 -4138 -2119
670 -2119 5939 -1877 -5856 1784 831 -5826 1068 3680 -5706 -490 6134 -2910 477 6534 -4262
$$ packed form
568G368r140k967J1657n489p678J2383l140j1664J3353J332j4320J0264L292j2764
582g513Q801L466j1649O745M375r612M108O519p662o34Q092n217l834J0446l234
597C197j1021J1776K806j5215R779O918j7462O907J1293j5829J731J3044j1305
610c381m223J2915k646p532O806K626p292L323O261q836j700R691p313m236J1058
625E521n206p708R501p73n929N402J618n295Q31N137jo366L218N137q249J168
641a994R541q870l063R335m802n045Q359j309q040M269N495n867r26P383n451
656i85n559J1939k456j0559J2356P40j3769J0859N999j4312M597O992r980K019
670b119Q058p816l979P640r53o657O894K612r386N216O624r044L387O057j0796
$$ plain form
685 -4262 -2017 6752 -2386 -1405 5038 -3648 -3139 4077 -1605 -3619 1360 -1129 -3211 1184 2480 -2446
701 -2446 -372 2316 -2692 627 5934 -2944 -2194 5673 -2146 -2374 5796 -2811 -4294 4225 -1266 -3259
717 -3259 4288 -223 -5162 824 2268 -2864 -1142 3172 -1684 -3149 5366 2685 -4544 3064 3040 -4402
733 -4402 1999 4421 -3023 -1528 1354 -1411 -2043 321 646 -3588 -2186 4573 -429 -3631 4739 364
749 364 -5033 4753 4313 -4622 1650 4067 -3823 -667 4898 -2269 -5964 3065 1819 -6438 2392 4684
765 4684 -8502 -582 8080 -5560 -1781 8998 -4609 -4513 8501 339 -5295 4581 1206 -6149
779 -6149 2690 5408 -4947 -2452 5627 -3995 -4898 6549 -1682 -6952 4752 1021 -5400 4663
793 4663 2313 -5103 2420 3612 -1755 920 2384 -1014 -1125 1334 977 -2057 -925 124 -2226 -97
$$ packed form
685d262K245Q769r138R81O443q686N09P216n682k014M979k489k082M395J296m926
701b446K074K688n008L319N307q878P50P867p819k28Q170q607j483Q519n491j993
717c259P547m511m939N986J444n132J722M314m856j465Q515k681p229P608k4p442
733d402O401K422p444J495K882k765o32K364L25m234J402O759n002l202Q370m375
749C64n397R786m40q935O272K417p890L156N565p167l695R029j246q257Q830K292
765D684j3186P920Q662j3640L779J0779j3607R6J3014q162n634R876l375p355
779f149Q839K718j0355K495Q079r622r03J1447q231n270J1704l731o421J0063
793D663k350p416P523J192n367K675J464l398j11K459l57l034J132J049k350K129
$$ plain form
809 -97 1109 -1755 -389 -481 -1205 2595 819 -1275 2209 -63 -648 3672 123 -1583 1444 -1454 -1604
826 -1604 2051 -911 -1986 -168 -1078 -636 275 -39 -95 -788 802 932 -459 1823 738 -1318 2120
843 2120 791 -1256 2140 -468 -1740 1847 -1093 -931 1138 -2769 -911 2546 -2059 -904 2077
858 2077 -1555 -975 2413 1068 -819 733 1380 -1252 536 3283 -1961 -2274 3975 -2161 -3836 4456
874 4456 -1412 -5593 3288 673 -4675 2569 1719 -2979 1014 2771 -1221 -140 2803 125 -2052
889 -2052 2574 1631 -3733 837 1930 -3700 -60 1810 -2849 -192 559 -1786 1092 617 -1110 1265
905 1265 -188 429 2204 -893 83 2405 -1077 -658 1865 -200 -1859 -308 849 -1613 -1520 1760
921 1760 -1317 -2873 2930 -336 -3136 3868 519 -3784 4039 2340 -3792 2966 2627 -3264 306
$$ packed form
809i7J206k864J366r2p24L800j776k094L484k272n85M320l549j706L027k898j50
826a604L655k962j075J818r10M42R11l14n6o93J590J30j391K282j085k056L438
843B120j329k047L396k608j272L587k940J62K069l907J858L457m605J155K981
858B077l632N80L388j345j887J552O47k632J788K747n244l13O249o136j675Q292
874D456n868m181Q881k615n348P244q50m698L993J757l992J081K943k678k177
889b052M626r43n364M570J093n630L640J870m659K657P51k345K878m75j727K375
905A265j453O17J775l097R76K322l482M19K523k065j659J551J157k462R3L280
921A760l077j556N803l266k800P004l349m303P823j699o132O758l39n891L570
$$ plain form
936 306 2709 -2073 -1711 1905 -590 -3199 1429 1189 -4125 756 3468 -3468 -355 3972 -1996 -521
952 -521 3124 -704 -318 1630 66 -394 -381 79 -310 -2052 452 386 -2835 -39 1969 -2171 -546
969 -546 1845 -430 -232 1269 1148 -303 123 2309 -431 -1389 3182 -892 -3067 2939 -371 -4217
985 -4217 2397 139 -4042 1613 994 -3144 1038 1638 -1833 -500 2438 -241 -1626 2462 1503 -2836
1001 -2836 1495 2146 -3424 673 2198 -3806 -98 1680 -3326 246 1569 -2091 292 1418 -1002
1016 -1002 371 884 129 618 1014 561 -333 820 952 -1476 369 907 -2600 404 1157 -3434 543
1033 543 1876 -3650 611 2944 -2814 99 3359 -1231 -389 2626 480 -1030 1250 1479 -1526 -618
1049 -618 2070 -2030 -1891 2547 -1281 -2650 2174 -623 -2081 1543 65 -823 975 290 406 145
$$ packed form
936C06K403m782L62L616k495k609M628k40n314M881K712o936L113M327n968J475
952e21L645l828L86J948j564m60J3M60l89j742K504o6l221K796K008m140J625
969e46K391k275J98J501j21j451M26K186k740r58M571m074k175O006l310l846
985d217O614k258m181N655o19m138M182O00l471J333K938k679j385M088r59m339
1001b836M331O51n570M097J525o004L708J778n006L572J323l660K383J126k420
1016a002J373N13p55M89L96m53q94J153J32k428J845N38l507L004P53m591L977
1033E43J333n526M261K333n758K913L260m590Q42L015k146j510K280K29l005R08
1049f18K688m100J39M438l828j369M824k797j458L624j478q88J798o85J16k61
$$ plain form
1065 145 443 1397 -715 89 2065 -1801 -1052 2025 -1683 -1931 1216 -944 -2250 674 619 -974 -298
1082 -298 1913 160 -1291 2893 608 -2609 3160 1863 -4039 2505 2344 -4535 872 2731 -3722
1097 -3722 -726 2442 -1859 -1785 1671 169 -2186 1499 1904 -2464 1073 3464 -2413 -166 4003 -2352
1113 -2352 -1290 3699 -2183 -1577 2615 -1712 -1510 1389 -939 -1374 708 145 -1088 383 1492 -474
1129 -474 -408 2177 -278 -662 2470 -469 -1057 2302 -1201 -1527 2366 -1597 -2101 1857 -953 -1789 1064
1146 1064 -347 -818 337 295 252 -6 1022 453 -729 1427 901 -1745 1154 605 -2266 667 987
1163 987 -2244 -487 238 -936 -607 -303 424 -448 -468 2041 87 -1810 3144 680 -2511 2855 1410
1180 1410 -2982 1547 1444 -2880 -302 1972 -1556 -2408 1774 78 -3477 1675 2370 -3856 838 4477
$$ packed form
1065A45K98R54k112Q04J976l866P49L077l708k48L147k160j306K924n5j593O76
1082b98K211j753j451M184k285l217N769j297n902O544j61o879N407J859o453
1097c722K996L168m301P4L456j502k355L685M05m368L537K391n877K247M169o355
1113b352J062M989n882O06M192m327K02K899k328m35K082n63j233J471J109j966
1129d74O6K585k455l84L132k939n88L359l503l26L893l963n04L958k810q36K853
1146A064j411m71J155m2m3k58J028n69j182K156n26k646K899n49k871K933L20
1163I87l231J757P25j174L29L04P27q72k0K509j954j897M954k464l191N366j445
1180A410m392M529j03m324K578K274l528q52M182j696l555N152O95o226M694L639
$$ plain form
1196 4477 -3806 -232 5141 -2866 -1828 4698 -1390 -2961 3397 454 -3807 1148 1937 -3329 -1218
1211 -1218 2810 -2207 -2551 3650 -1212 -3445 3968 556 -3270 3452 1769 -3451 1686 2301 -2278
1226 -2278 -5 1736 -1090 -1653 792 420 -2310 197 869 -2020 -19 2103 -1852 -31 2379 -599
1242 -599 -387 1539 273 331 163 432 444 -1291 264 132 -1851 316 609 -2013 180 815 -1912 588
1260 588 1096 -745 164 678 118 326 602 750 -135 -44 843 -900 -533 1616 -1587 -1102 1527 -1647
1278 -1647 -1353 1884 -1492 -854 2097 -1082 -593 2195 -53 -769 1446 667 -843 278 1282 -1108
1294 -1108 -737 1602 -1174 -2054 1950 -1357 -2630 2594 -223 -2644 2541 681 -2456 1918 1444 -1767
1310 -1767 1039 1659 -913 -376 1632 76 -1820 997 756 -2642 471 1496 -2719 -225 1698 -2147
$$ packed form
1196D477q283L574N373q007J038O526o088j571O358k943m261M955P89n266K111
1211a218M028n017l44O201m862k233P413l412l826O722j683n220N137O15m579
1226b278K273J741k826n63K445l72k730K507O72k889K001K122l955J821K410k978
1242e99K12J926j266N8j68K69J2j735J555j32j983K167K93k622K193O35k727K500
1260E88N08j841R09N14n60K08K76J48q85R1Q87j743L67K149l203M85K629l174
1278a647K94L237l376O38K951l179M89K788k248p16K215p79j510J121J004k390
1294a108L71K339k776q80M004l307j273N224k817k421N185j860l137M374m74l211
1310a767K806O20k572N37K008j556j896K817k41l398L113J025m215K494J923l845
$$ plain form
1326 -2147 -6 1642 -983 259 1300 49 136 125 542 197 -791 1183 319 -1268 460 323 -1703
1343 -1703 36 217 -1342 -412 621 -185 -311 159 861 -714 114 2212 -564 -644 2545 -612 -1430
1360 -1430 2382 -602 -1845 1354 -104 -1964 606 307 -1571 -255 603 -337 -878 1475 1027 -1539
1376 -1539 1456 1385 -1658 1130 1351 -1885 705 992 -1684 13 377 -977 111 -190 -558 -43 -371
1393 -371 -100 286 -304 890 143 -190 618 665 300 447 -408 570 103 -1184 1102 -105 -1774 766
1411 766 -28 -1936 1079 188 -1612 902 675 -767 741 739 -197 244 817 517 -725 706 605 -1422
1429 -1422 -12 863 -1760 -349 713 -1734 -109 936 -1245 227 619 -567 898 639 -78 516
1445 516 225 325 611 -379 200 163 -556 206 -298 -603 -135 -728 292 -26 -1098 743 553 -1042 1171
$$ packed form
1326b147K141J648k625J242J041j251Q7j1M17l45r88J974q64j587J728j37k026
1343a703J739J81j559R30J033q06j26M70P02j575Q28K098k776q0L189l157q18
1360a430L812k984j243L199j458j860K570k99j878J316Q58r40n41K353m48k566
1376a539K995p1l043K788K21l236K590K87k676J697L64j354J088l01l68N15l28
1393c71K71L86n90J194p47l33Q08M7l65J47q55R78m67j287K286j207j669K540
1411G66p94j908L015q91j800K514k27j442J508kr36M41N73l00j242J431j01k027
1429a422J410Q75k623J411J062k447J625J045k181J472L92j186J465k59p17N94
1445E16k91J00K86r90N79l7p19P62n04l05M68n93J020l18j072J841j90j595K213
$$ plain form
1464 1171 976 -1482 1416 1036 -1395 759 945 -1049 114 261 -744 -460 -169 -93 -893 -430 668
1481 668 -1105 -220 1327 -850 -175 1361 -463 161 1703 -511 343 826 -463 125 118 -477 206 -431
1499 -431 -563 381 -764 -409 535 -621 223 622 116 269 231 452 189 -379 715 453 -1283 708 451
1518 451 -1722 850 390 -2039 537 674 -1653 -83 777 -848 -56 910 282 -499 633 1102 -722
1535 -722 323 1531 -909 -312 1423 -951 -816 1141 -1393 -840 1151 -962 -544 601 -309 -98 390
1552 390 110 440 108 468 471 -146 557 466 -505 283 -158 -366 560 -713 -721 599 -954 -612 502 -575
1572 -575 -296 697 -441 212 774 -309 351 539 164 417 -321 54 141 -761 248 -445 -802 271 -447
1591 -447 -935 510 -522 -490 913 -340 -164 963 -179 674 695 -395 774 314 -758 355 236
$$ packed form
1464A171j95k458K898l80k431K154J86j994J163J47j005K84K91P6q00M63J098
1481F68j773Q85J547k177O75J536j824O24J542k214Q54M83j289N88pn95O83o37
1499d31j32R44j145L55R44j156Q44L99n06J53l8K21k63n68J094k62j736J991k57
1518D51k173K572m60k429K576J37k327J570Q60j625P92R66o28p81J132M69j824
1535g22J045J208k440N97J735k374J35J957k534N53J991k113M18J145r10K11M88
1552C90k80L30l32L60Lo17P03r1r71P88m41k08R26j273qJ320j553L42J114j077
1572e75K79R93j138O53N62j083O60J88l75K53p38L75Q7r02J009o93l57J073p18
1591d47m88J445j032L2J403j253J76J127j142Q53K1j090J169m60j072J113j19
$$ plain form
1608 236 -888 75 -188 -737 105 26 -683 -301 48 235 -631 475 906 -1074 842 1455 -1018 292
1626 292 1633 -1332 -502 1615 -1111 -683 1111 -555 -1064 553 141 -988 -153 1243 -741 -530 1646
1643 1646 -401 -1065 2074 204 -1227 1929 297 -1323 914 246 -923 -32 -2 -739 -373 -28 105
1660 105 -737 -178 580 -515 26 1353 -547 90 1295 -164 27 887 -88 -229 -185 -177 -120 -1055 -111 412
1680 412 -1057 -89 742 -1185 18 884 -869 150 1115 -79 -65 827 339 -105 4 261 -591 -514 584
1699 584 -599 -1044 926 -360 -1027 1146 -321 -830 1112 -164 -163 1091 -40 164 654 30 -128 298
1717 298 -2 -7 -284 309 -197 -940 113 -166 -1332 593 -41 -817 925 -15 -363 1252 -99 -417 1411
1736 1411 23 -573 685 -208 -304 180 -111 -330 -385 -55 15 -876 193 186 -1123 488 725 -702 646
$$ packed form
1608B36j124R63k63n49Q42p9p09L82L49J87q66J106M31j980J916O13k473J310
1626B92J341k965Q30K117k726M28J794j666n09J617m12j129Q35J396j984K11K176
1643A646k047o64L139j870j431L156j632j620K237o68j169Q91L0p37L66L45J33
1660A05q42N59P58j095N41J327j900O37J205j459J91Q60r75j41M4QN7r35R44N23
1680D12j469R68Q31j927J203Q66j753J019R65j194J4Q92m88m44J09K57q52P7J098
1699E84j183m45J970j286o67K173j467n09J942j276JJ254j131K04M90o24j58M26
1717B98l00nk77N93n06p43J053k79j166J925o34p76J742r40l48J615j351l18J828
1736A411j388n96J258q93r6M84k91k19n5L30P0q91J069pj309J611K37j427J348
$$ plain form
1755 646 632 -307 778 516 -260 375 81 -355 323 -474 -77 88 -613 135 154 -832 168 -282 -502 256
1775 256 314 165 681 146 557 88 -556 835 -314 -519 1231 -301 -820 841 -404 -1153 644 -540
1793 -540 -747 756 54 -323 269 302 504 -147 790 710 -717 809 429 -982 586 406 -1041 247
1811 247 296 -1075 42 200 -798 137 18 14 59 -224 534 289 -164 574 249 -95 426 177 -458 209 -504
1832 -504 -75 71 -552 76 -200 -760 347 -152 -717 907 -81 -490 1049 108 -487 837 299 -228 225
1851 225 132 -141 -275 -137 -212 -878 115 125 -1072 149 637 -1034 463 685 -497 328 646 -336 765
1870 765 288 -3 244 167 -70 120 -629 237 -164 -518 179 -145 -557 274 -226 -19 444 -277 396 479 -376
1891 -376 754 443 -355 473 333 -796 511 -130 -949 263 -154 -657 263 -69 -524 -132 27 456 -12
$$ packed form
1755F46j4r39J085k62p76O35k94m36O78p97L97J65p01P48J9r86J000m50k20P58
1775B56N8j49N16n35M11m69o44J391j149k05J750j532n19J661j245p49J797j184
1793e40k07J503p02l77N92L3K02o51R37q0j427J526l80j411J568j80j447J288
1811B47M9j371J117J58r98R35j19mM5k83P58k45m53P38l25l44N21k49o35O67p13
1832e04M29J46o23O28k76n60J107m99n65J624r88m09J539r41n95J324n38n27M53
1851B25r3k73j34J38p5o66R93J0j197J221M88j671J497K22j182Q25L18r82J101
1870G65m77k91K47p7k37J90p49Q66m01l54O97l24m12Q31n00K07M63p21O73Q3q55
1891c76J130l11p98Q28j40j129J307o41q19J212m17n03R20l32m55L92J59M29m68
$$ plain form
1910 -12 79 928 -339 161 753 -708 427 851 -695 118 547 -913 195 253 -843 184 -392 -232
1928 -232 430 -103 148 305 149 389 414 -48 638 66 -40 372 -311 70 273 -776 -41 231 -1012 200
1948 200 300 -754 366 353 -830 442 128 -346 275 263 313 316 132 333 -178 13 595 -322 -378 687
1968 687 -683 -161 517 -747 -106 574 -515 39 332 -222 133 358 190 693 -69 211 584 -541 -19
1987 -19 -84 -297 70 37 -460 167 -269 -286 154 -617 369 816 -648 399 587 -596 284 496 -603 444
2007 444 459 -611 -35 159 -263 -286 -263 -432 -408 -552 449 -425 -274 870 -196 29 1119 -370 -149
2026 -149 785 -356 -8 711 -400 -165 -166 -278 143 -243 -462 192 -539 -91 187 -294 446 475 -282 333
2046 333 201 34 495 87 315 262 -600 -3 281 -746 -163 225 -754 51 56 -636 143 234 -370 95 -44
$$ packed form
1910a2R1Q49j267N00N92j461J135M24j546Q13M29j460J108N8j096J027n76J60
1928b32O62n33K51J57j56K40K5m62O86n72j06M12o83L81K03j049P35K72j243J212
1948B00J00j054J120j3j183J272l14m74O21j2N0Lj84K01n11J91N82r17n6J065
1968F87j370N22O78j264O41O80j089N54K93n54L55K25j68N03p62K80L73j125N22
1987a9o5k13L67l3m97O27m36j7M40p71R86M47j464J047J88j183Q80K12j099J047
2007D44J5j070N76J94m22k3K3j69K4j44J001q74J51J144j066K25J090j489K21
2026a49R34j141L48P19j111K35jj12M21l86k19O54p31M48K78m81P40K9p57O15
2046C33j32j67M61m08K28n3q62N97K84j027N83L88r79Q05No92P79R1o04M65j39
$$ plain form
2067 -44 205 141 -218 638 229 -355 612 -22 -361 714 -420 -560 741 -277 -536 344 -527 -70 320
2086 320 -400 166 410 -21 625 89 319 714 -139 187 256 -59 4 -137 -322 53 -621 -671 497 -377 -609
2107 -609 483 -387 -161 740 -397 56 773 -144 503 388 -284 179 -135 234 -176 -494 64 -385 -499
2126 -499 470 11 -584 459 -121 -558 545 94 -340 674 207 -17 375 176 -84 68 -254 301 -64
2145 -64 -241 318 -578 -420 178 -433 -438 226 -154 155 337 -283 470 12 -179 861 -97 -93 629 -456 -200
2166 -200 432 -750 -309 212 -536 119 -41 -231 102 233 217 -110 -252 548 151 -335 612 -1 -312 724
2186 724 -115 -422 770 -505 -842 486 -249 -333 148 -209 -333 -99 -109 176 -297 -28 596 -162 78 420
2206 420 -260 58 357 -425 313 -157 -769 289 -236 -600 144 -44 -395 498 -133 -7 399 28 30 70 216
$$ packed form
2067d4K49o4l59Q56m09n84R67o34l39J075j134j40J301j018k59Q80q71M57L90
2086C20p20N66K44m31O46n36K30L95q53L26O9l15O3j41j85L75o74n0J168q74k32
2107f09J092q70K26R01j137M53P17r17O47j15o72M63l14L69m10l18N58m49j14
2126d99R69m59n95J043n80m37J103m51m34J014m67k24L92j99k60J52l22N55l65
2145f4j77N59q96J58N98o11nO64l80L09J82o20P53m58j91J040r58MP22j085K56
2166b00O32j182M41N21p48O55j60j90L33J31j6l27j42Q00l97m86R47o13l11J036
2186G24q39l07J192j275l37J328p35q4M81l57j24K34j0K85m73K69O24p58K40L42
2206D20o80L18K99p82P38m70o12J058n25l64P44j88l51Q93o31J26M06l71KM0J46
$$ plain form
2227 216 407 -179 232 501 -742 -164 79 -718 27 33 -545 156 253 -393 212 -54 -246 249 -212 208 389
2248 389 -242 259 423 -288 351 348 -590 118 108 -468 1 4 -200 -87 -212 164 -138 -597 758 -24 -516
2269 -516 863 -410 -408 779 0 -479 746 -243 -367 301 -118 -611 -244 -177 -158 -350 188 408 -718 511
2289 511 459 -598 467 773 -596 312 522 -684 79 370 -619 47 15 -189 -320 -129 -177 -160 -172 420
2309 420 -58 -294 459 95 -46 600 -137 -156 324 -199 102 329 -228 -43 -174 -502 -81 -454 -90 145
2329 145 -345 -245 127 -458 111 214 -139 249 285 36 346 -134 83 173 -45 152 37 -478 269 59 -696
2350 -696 5 40 -328 359 -171 -513 281 -16 -125 308 48 62 292 36 103 180 -206 323 -307 -61 165
2371 165 -501 11 198 -474 179 229 -216 332 185 -400 459 371 -102 296 99 -103 238 -43 -111 -147 -215 113
$$ packed form
2227B16J91n86M11K69j243N78K43p97P45On78P01R7o46O05k66j92M95m61M20J81
2248C89o31N01J64p11O39lr38P08j0n76M69Lk04J13j25L76l02m59J355p82m92
2269e16J379j273KJ187p79m79J225r89j24O68m19m93L67O7J9j92N38K20j126J229
2289E11n2j057J065L06j369R08K10j206P63K91r89O66l2k04j31J91m8J7j2N92
2309D20m78k36P53l64j41O46p37j9M80n23L01K27n57J85j31l28M21l73L64K35
2329A45m90J00L72n85N69J03l53L88L6k49L10m80K17R0k18J97j15n15P47k10p55
2350f96P01L5l68O87n30l42P94k97j09M33k60J4K30k56O7P7l86N29o30K46K26
2371A65o66N12J87o72O53N0m45N48j47n85Q59q8m73L98j97k02L41k81o8l6o8L28
$$ plain form
2393 113 -387 -299 577 -268 -519 590 -351 37 775 -326 -3 351 62 17 120 222 223 -133 -72 247 -413
2414 -413 -77 77 -679 180 -76 -515 26 81 -18 519 -177 -42 510 -292 357 161 -276 97 86 -470 123
2435 123 -319 -536 252 -332 -124 84 -196 -171 36 -156 48 411 -149 371 -235 87 362 -319 -219 394
2455 394 -382 18 238 -451 -154 93 -551 228 -138 -465 262 -190 66 328 -66 405 9 104 56 178 -333
2476 -333 233 -12 3 272 -372 -20 200 -496 28 266 -809 33 208 -458 444 308 -84 141 -57 1
2496 1 276 -92 184 -112 -251 279 -236 -393 87 -195 -464 292 -43 -266 390 -16 35 595 -452 346 83
2517 83 -20 579 -235 -157 197 -262 -224 221 -553 -306 70 -350 136 -61 27 277 -202 -325 219 156 -21 313
2539 313 -166 408 604 -373 128 95 -315 153 -248 -237 109 -160 -53 -79 -209 -13 -125 -169 363 126 -61
$$ packed form
2393A13n00Q8Q76q45k51J109r41L88P38j101L23L54k89m5J03J02Jl56O1L19o60
2414d13L36J54p56Q59k56m39N41N5r9N37o96J35N52q02O49j96m37L73j1n56N93
2435A23m42k17P88n84K08K08k80K5K07j92K04L63n60N20o06L22K75o81J00O13
2455C94p76M00K20o89K97K47o44P79l66l27P27m52K56K62l94M71l96R5m8J22n11
2476c33N66k45J5K69o44L52K20o96N24K38j075Q42J75o66R02j36l92K25j98N8
2496AK75l68K76k96j39N30n15j57M80k82k69P56l35k23O56m06N1N60j047P98k63
2517H3j03N99q14P8L54m59L8M45p74K47L76m20M86j97Q8K50m79j23N44o3j77L34
2539C13m79N74J96r77N01l3m10M68m01J1L46k69J07k6j30J96j12m4N32k37j87
$$ plain form
2560 -61 476 -10 -203 477 -16 -77 345 -151 -104 -26 -91 -300 -267 -173 32 -292 -271 296 -60 -86 393 -113 304
2583 304 269 -178 50 9 -76 83 -219 -34 290 -496 75 145 -488 138 8 -598 289 276 -181 442 50 55
2605 55 71 19 272 -91 -509 570 59 -357 614 -340 -580 297 -142 -410 195 -237 -145 248 -62 344 235
2626 235 -16 204 28 -18 204 -329 301 270 -317 66 -30 -344 -9 -132 -540 287 -134 -510 -44 -224 -55
2647 -55 288 -104 189 335 -141 199 81 -214 217 98 -232 200 -289 -265 89 -300 -294 54 -456 70 80 -192
2669 -192 504 -25 -65 310 15 -61 373 -274 40 186 -306 18 189 -346 -128 -60 -505 196 -28 -348 118
2690 118 -242 297 -133 35 513 30 -59 386 -236 -362 183 -65 -359 346 -309 -146 319 -84 -49 -62 187
2711 187 68 -196 248 197 -283 324 515 -323 410 446 -443 81 445 -511 30 -55 -513 297 179 -90 -278
$$ packed form
2560f1N37m86j93O80m93o1M22m96M7P8o5k09L3R4K05l24K1N67l56k6M79n06M17
2583C04l5m47K28m1q5J59l02J85L24p86N71P0o33O26j30o06Q87j3m57O23l92N
2605E5J6n2K53l63m18J079n11m16R71r54k40Q77m39k68O05m32R2L93l10M06j09
2626B35k51K20j76m6K22n33O30l1n87L83r6l14L35j23m08Q27m21l76M66j80J69
2647e5L43l92K93J46m76L40j18k95M31j19l30M32m89K4L54l89OL48n10N26J0k72
2669a92O96n29m0L75k95p6M34o47L14J46m92L24J71n35K18O8m45P01k24l20M66
2690A18l60N39m30J68M78m83q9M45o22j26N45k48k94P05o55J63M65m03L5j3K49
2711A87j19k64M44n1m80O07J91q38P33L6q89N24L64r56N41q5m58Q10j18k69j88
$$ plain form
2732 -278 -72 194 -69 -101 429 -37 -24 621 61 58 376 -587 87 364 -278 -142 79 -133 -211 -60 -289 -63
2754 -63 47 -9 -39 -332 428 557 -224 177 548 -102 81 376 -15 101 -166 -192 106 41 -215 -317 -249 -75
2776 -75 -203 -426 271 -38 -347 370 210 -192 500 -173 -222 186 -15 -28 123 -250 -83 -59 -228 199 -552
2797 -552 74 -24 -473 336 473 -314 384 286 -262 473 156 -393 372 231 -157 94 -376 -57 95 -382 -34
2818 -34 -178 -285 117 -228 -33 605 -377 -158 712 -204 -209 468 -265 -93 571 -252 -4 10 -98 -179 -188 65
2840 65 -3 -226 23 -11 -258 160 -35 -320 260 482 -119 258 238 -36 116 131 36 -24 -444 105 -242 -454
2862 -454 522 -158 -355 340 -319 -176 398 -36 22 152 -101 -86 403 -60 -66 -42 280 48 -320 61 346 -562
2884 -562 -188 -63 -640 273 -65 -612 245 353 -175 270 -16 136 -207 -47 303 -233 98 271 23 -109
$$ packed form
2732b78K06K66k63l2N30m66J3O45n60lL18r63O74K77o42J36K21k12p8J51k29K26
2754f3J10n6l0k93P60J29p81M01L71o50J83K95l91J16k67k6K98o5k56j02O8J74
2776g5j28k23O97l09l09P17j60m02O92o73m9M08k01j3J51l73J67K4j69M27p51
2797e52O26r8m49Q09J37p87O98r8n48P35l17n49P65j41l88K51m70L19J52m77L48
2818c4j44j07M02l45J95O38r82K19Q70r16nO77p33J72O64q23K48J4j08q1rK53
2840F5o8k23K49l4k47M18j95k85N80K22o01L77k0k74J52J5r5o0m20N49l47k12
2862d54R76o80j97O95o59J43N74m34N8J30k53J5M89m63oK4L22k32l68L81K85r08
2884e62L74J25n77R13l38n47Q57J08n28M45k86J52l43J60L50n36L31J73k48j32
$$ plain form
2904 -109 234 -478 -201 224 -472 -86 405 -367 -359 247 -197 -359 140 68 129 134 172 71 -242 -83 115 -332
2926 -332 -160 71 -632 293 -66 -323 224 19 -282 292 -72 -122 248 190 46 -208 -22 102 143 37 180
2947 180 -93 152 262 -52 -182 90 -286 -128 362 -128 179 97 -239 172 31 53 247 -183 117 218 -132
2968 -132 -58 58 -360 2 245 -510 -46 119 -317 -34 -12 -331 54 -89 213 -162 -27 373 223 -225 328
2989 328 2 -171 390 -386 -118 -112 -135 -273 276 -76 103 314 28 20 -25 161 276 -202 361 261 -284 247
3011 247 84 -166 272 132 -493 64 -139 -356 -159 -94 -19 61 -19 -62 66 -209 -39 58 -144 465 272 -46
3033 -46 355 -301 -208 224 -96 -7 -86 -314 95 87 -307 346 -209 -128 482 15 128 128 -233 277 270 -107 238 -73
3057 -73 -106 389 -89 15 39 -174 -225 42 -102 67 274 -136 509 138 8 428 143 37 403 78 -37
$$ packed form
2904a09L43p12K77M25o96L86M91p72QO06m44j62M99p2O1NL8j01l13J59J98m47
2926c32J72K31p03R25l59k57N47k05l01N74l64n0L70n8j44k54J86J24M1j06J43
2947A80k73K45J10l14j30K72l76J58M90m90L07q2l36M11j41K2J94m30L00J01l50
2968a32P4J16m18L62K43p55M64J65m36K83K2l19L85j43L02l75J35M00j50m48N53
2989C28l26j73N61p76K68Ok3j38N49l52J79K11k86qm5J86J15m78N63j00n45N31
3011B47j63k50M38j40o25N57k03k17J97O5P5Q0q0m3J28k75J70R7k02O09j93l18
3033d6M01o56R3M32l20Q9p9k28M09ql94O53n55Q1O10m67J13%l61N10pl77L45l11
3057g3l3M95m78J04K4k13n1K67j44J69K07m10O45l71j30M20k85j06L66l25j15
$$ plain form
3078 -37 312 -175 139 81 -216 -93 -142 -13 -196 16 -156 -154 -354 -19 149 -66 107 225 -130 454 -186 -20
$$ packed form
3078c7L49m87L14n8k97J23m9J29j83K12j72Kk00L35J68k15J73J18l55N84o40J66
$$ [...]
8191I5
##END NTUPLES=NMR FID
##END=
