##TITLE=1H_EL-28-1
 CDCl3
 8 sc, 
 25.11.2024
##JCAMPDX= 6.0         $$ Bruker NMR JCAMP-DX V2.0
##DATA TYPE= NMR FID
##DATA CLASS= NTUPLES
##ORIGIN= UXNMR, Bruker Analytische Messtechnik GmbH
##OWNER= root
$$ XWIN-NMR		Version 3.5
$$ Mon Nov 25 14:09:47 2024 Russian Standard Time (UT+4h)  she@DPX200
##.OBSERVE FREQUENCY= 200.1315
##.OBSERVE NUCLEUS= ^1H
##.DELAY= (6, 6)
##.ACQUISITION MODE= SIMULTANEOUS
##.ACQUISITION SCHEME= undefined
##.AVERAGES= 8
##.DIGITISER RES= 18
##SPECTROMETER/DATA SYSTEM= spect
##.PULSE SEQUENCE= zg30
##.SOLVENT NAME= CDCl3
##.SHIFT REFERENCE= (INTERNAL, CDCl3, 0, 15.7039)
##AUDIT TRAIL= $$ (NUMBER, WHEN, WHO, WHERE, WHAT)
$$ ##TITLE= Audit trail, XWIN-NMR		Version 3.5
$$ ##JCAMPDX= 5.01
$$ ##ORIGIN= Bruker BioSpin GmbH
$$ ##OWNER= she
$$ F:/spectra/data/she/nmr/H-F/1/audita.txt
$$ ##AUDIT TRAIL=  $$ (NUMBER, WHEN, WHO, WHERE, WHAT)
(   1,<2024-11-25 14:08:18.70 +0400>,<she>,<DPX200>,
      <created by zg, POWCHK disabled, PULCHK disabled
       configuration hash MD5:
       00 E9 B6 7A A2 85 ED C7 34 08 36 98 17 FE 4E 26
       data hash MD5: 16K
       3A A2 17 E2 41 F2 14 A1 3C F8 F8 79 47 66 D8 23>)
$$ ##END=
$$ 
$$ hash MD5
$$ 74 F3 7C 79 22 4A 7C 2D 6D 1B FA 45 76 70 90 3D
##$RELAX= 
##$RELAX= 
##$RELAX= 
##$RELAX= 
##$RELAX= 
##$RELAX= 
$$ Bruker specific parameters
$$ --------------------------
##$DU= <F:/spectra>
##$EXPNO= 1
##$NAME= <H-F>
##$PROCNO= 1
##$TYPE= <nmr>
##$USER= <she>
##$AMP= (0..31)
100 100 100 100 100 100 100 100 100 100 100 100 100 100 100 100 100 100 
100 100 100 100 100 100 100 100 100 100 100 100 100 100 
##$AQSEQ= 0
##$AQ_mod= 1
##$AUNM= <au_zg>
##$AUTOPOS= <>
##$BF1= 200.13
##$BF2= 200.13
##$BF3= 200.13
##$BF4= 200.13
##$BF5= 200.13
##$BF6= 200.13
##$BF7= 200.13
##$BF8= 200.13
##$BYTORDA= 1
##$CFDGTYP= 0
##$CFRGTYP= 5
##$CHEMSTR= <none>
##$CNST= (0..31)
1 1 145 1 1 1 1 1 1 1 1 1 1 1 1 1 1 1 1 1 1 1 1 1 1 1 1 1 1 1 1 1 
##$CPDPRG= <>
##$CPDPRG1= <>
##$CPDPRG2= <>
##$CPDPRG3= <>
##$CPDPRG4= <mlev>
##$CPDPRG5= <mlev>
##$CPDPRG6= <mlev>
##$CPDPRG7= <mlev>
##$CPDPRG8= <mlev>
##$CPDPRGB= <>
##$CPDPRGT= <>
##$D= (0..31)
0 1.2 0 0 0 0 0 0 0 0.06 0 0.03 0 0 0 0 0.0002 0 0 0 0 0 0 0 0 0 0 0 0 
0 0 0 
##$DATE= 1732529298
##$DBL= (0..7)
120 120 120 120 120 120 120 120 
##$DBP= (0..7)
150 150 150 150 150 150 150 150 
##$DBP07= 0
##$DBPNAM0= <>
##$DBPNAM1= <>
##$DBPNAM2= <>
##$DBPNAM3= <>
##$DBPNAM4= <>
##$DBPNAM5= <>
##$DBPNAM6= <>
##$DBPNAM7= <>
##$DBPOAL= (0..7)
0.5 0.5 0.5 0.5 0.5 0.5 0.5 0.5 
##$DBPOFFS= (0..7)
0 0 0 0 0 0 0 0 
##$DE= 6
##$DECBNUC= <off>
##$DECIM= 24
##$DECNUC= <off>
##$DECSTAT= 4
##$DIGMOD= 1
##$DIGTYP= 9
##$DL= (0..7)
0 120 120 120 120 120 120 120 
##$DP= (0..7)
150 150 150 150 150 150 150 150 
##$DP07= 0
##$DPNAME0= <>
##$DPNAME1= <>
##$DPNAME2= <>
##$DPNAME3= <>
##$DPNAME4= <>
##$DPNAME5= <>
##$DPNAME6= <>
##$DPNAME7= <>
##$DPOAL= (0..7)
0.5 0.5 0.5 0.5 0.5 0.5 0.5 0.5 
##$DPOFFS= (0..7)
0 0 0 0 0 0 0 0 
##$DQDMODE= 0
##$DR= 18
##$DS= 0
##$DSLIST= <SSSSSSSSSSSSSSS>
$$ [...]
##$SUBNAM2= <"">
##$SUBNAM3= <"">
##$SUBNAM4= <"">
##$SUBNAM5= <"">
##$SUBNAM6= <"">
##$SUBNAM7= <"">
##$SUBNAM8= <"">
##$SUBNAM9= <"">
##$SW= 24.0689530833862
##$SWIBOX= (0..15)
0 0 2 0 0 0 0 0 0 0 0 0 0 0 0 0 
##$SW_h= 4816.95568400771
##$TD= 16384
##$TD0= 1
##$TE= 0
##$TE2= 300
##$TE3= 300
##$TEG= 300
##$TL= (0..7)
0 120 120 120 120 120 120 120 
##$TP= (0..7)
150 150 150 150 150 150 150 150 
##$TP07= 0
##$TPNAME0= <>
##$TPNAME1= <>
##$TPNAME2= <>
##$TPNAME3= <>
##$TPNAME4= <>
##$TPNAME5= <>
##$TPNAME6= <>
##$TPNAME7= <>
##$TPOAL= (0..7)
0.5 0.5 0.5 0.5 0.5 0.5 0.5 0.5 
##$TPOFFS= (0..7)
0 0 0 0 0 0 0 0 
##$TUNHIN= 0
##$TUNHOUT= 0
##$TUNXOUT= 0
##$USERA1= <user>
##$USERA2= <user>
##$USERA3= <user>
##$USERA4= <user>
##$USERA5= <user>
##$V9= 5
##$VALIST= <valist>
##$VCLIST= <CCCCCCCCCCCCCCC>
##$VD= 0
##$VDLIST= <DDDDDDDDDDDDDDD>
##$VPLIST= <PPPPPPPPPPPPPPP>
##$VTLIST= <TTTTTTTTTTTTTTT>
##$WBST= 1024
##$WBSW= 4
##$XGAIN= (0..3)
0 0 0 0 
##$XL= 0
##$YL= 0
##$YMAX_a= 120192
##$YMIN_a= -102513
##$ZGOPTNS= <>
##$ZL1= 120
##$ZL2= 120
##$ZL3= 120
##$ZL4= 120
##$ABSF1= 10
##$ABSF2= 0
##$ABSG= 5
##$ABSL= 3
##$ALPHA= 0
##$AQORDER= 0
##$ASSFAC= 0
##$ASSFACI= 0
##$ASSFACX= 0
##$ASSWID= 0
##$AUNMP= <proc_1d>
##$AZFE= 0.1
##$AZFW= 0.1
##$BCFW= 1
##$BC_mod= 2
##$BYTORDP= 1
##$COROFFS= 0
##$CY= 11.3945322036743
##$DATMOD= 1
##$DC= 2
##$DFILT= <>
##$DTYPP= 0
##$F1P= 15.6554695791079
##$F2P= 12.8336369535428
##$FCOR= 0.5
##$FTSIZE= 0
##$FT_mod= 4
##$GAMMA= 1
##$GB= 0.15
##$INTBC= 1
##$INTSCL= 1
##$ISEN= 128
##$LB= 0.24
##$LEV0= 0
##$LPBIN= 0
##$MAXI= 10000
##$MC2= 0
##$MEAN= 0
##$ME_mod= 0
##$MI= 1.114404
##$NCOEF= 0
##$NC_proc= 0
##$NLEV= 6
##$NOISF1= 3.799351
##$NOISF2= 2.8
##$NSP= 1
##$NTH_PI= 0
##$NZP= 0
##$OFFSET= 15.70392
##$PC= 1
##$PHC0= -26710.21
##$PHC1= 20.18744
##$PH_mod= 1
##$PKNL= yes
##$PPARMOD= 0
##$PSCAL= 0
##$PSIGN= 0
##$REVERSE= no
##$SF= 200.130013532006
##$SI= 16384
##$SIGF1= 3
##$SIGF2= 2
##$SINO= 400
##$SIOLD= 16384
##$SREGLST= <1H.CDCl3>
##$SSB= 0
##$STSI= 0
##$STSR= 0
##$SW_p= 3612.71676300578
##$SYMM= 0
##$S_DEV= 0
##$TDeff= 0
##$TDoff= 0
##$TI= <>
##$TILT= no
##$TM1= 0
##$TM2= 0
##$TOPLEV= 0
##$USERP1= <user>
##$USERP2= <user>
##$USERP3= <user>
##$USERP4= <user>
##$USERP5= <user>
##$WDW= 1
##$XDIM= 8192
##$YMAX_p= 0
##$YMIN_p= 0
$$ End of Bruker specific parameters
$$ ---------------------------------
##NTUPLES= NMR FID
##VAR_NAME=  TIME,          FID/REAL,        FID/IMAG
##SYMBOL=    X,             R,               I
##VAR_TYPE=  INDEPENDENT,   DEPENDENT,       DEPENDENT
##VAR_FORM=  AFFN,          ASDF,            ASDF
##VAR_DIM=   8192,          8192,            8192
##UNITS=     SECONDS,       ARBITRARY UNITS, ARBITRARY UNITS
##FACTOR=    0.0002076,     1,               1
##FIRST=     0,             0,               0
##LAST=      1.7004516,     0,               0
##MIN=       0,             -102513,         0
##MAX=       1.7004516,     120192,          0
$$ Real data points
##PAGE= N=1
##DATA TABLE= (X++(R..R)), XYDATA
$$ [...]
1704A674j198j705J198J077j373O44N66j543M96J381j222r65J504N01j018k29
1720b12j18J85J192n19j202J017O20j169k00R30m39K98Q18j713p72K064N74k259
1738i05L44J501p43k49M29j204N74J655r00j645O48J048m37j36m22j97J407K75
1756A043j996k13J740J20q13J98m28k50J623o67j834J340J295j165p85L56k1N97
1774A40Q85j664n47J592L45j971Q25P31p08N51L99j615J81J973q80j384J079M27
1792C59n25l53J04k11J038K06j341r5J173k99l92N25n19J76J050j076j441J799
1810A78J188j803j4Q42m70J0N54j002k63J935j23j980L56J126k94K44l24q03O47
1829DJ251j440r98J569M20n22l31k59m28J621J73k069O91J232m88q16M34k63J89
$$ y = [1674, 476, -1229, -31, 1046, -327, 317, 883, -660, -164, 1217, -5, -970, 534, 1035, 17, -212, -330, -145, 1047, 528, -674, 343, 963, -206, -406, 524, 85, 383, 1201, -512, -1284, 780, 1354, -905, -561, 940, 197, -52, 377, -827, -253, 1402, 502, -1143, -495, 553, 116, -20, -442, -639, 768, 1043, -953, -1166, 574, 694, -119, 79, -349, -599, 1024, 357, -1477, -137, 1158, -7, -792, -436, -457, 140, 1025, -639, -1186, 406, 751, -1220, -395, 336, -372, 179, 578, -1037, -856, 1117, 237, -1147, -68, 359, -166, -519, -415, -626, 412, 618, -723, -818, 355, 56, -336, 189, -330, -154, 896, -180, -1621, 178, 1366, -437, -451, 391, -79, -69, 485, -517, -780, 1155, 1032, -948, -592, 534, 240, 484, 160, -643, 4, 1255, -185, -1183, 386, 806, 284, -47, -306, -734, 887, 1060, -1009, -318, 914, 426, -390, 44, -219, -30]
1848c0J395r09j853J543J232j458m64R71k98J05M00j126n43J759L60j659K16O09
1866B50p2K05m11r95J191R93j270j009J415k04k12N61n01p48J338K40j922L28
1884h23J746o20j029R34n56l6Q43m87j010J326N43j450j17O70J3J96J28j049J38
1903f40J455p49j028Q38M55m52J08k89p57J001J077j525n14J324K9q32N67l90
1921c22m98J736l59j725M56J401l70r42O30n0O6L16n06p89J214N38j146P5J90
1940h5M5M59o5j013M33J041o11j290J288J68n75O46k38q02O66J138j518n71J428
1959E44l9o84M77m7l92O84n1j172P55O10o65k89O63l81L82J30q71m08J464J58
1979H68j346K07Q51l85R7k79o61O83P87p52p64R65J41n40J84p8l93R83K23j624
$$ y = [-30, 1365, 456, -1397, 146, 1378, -80, -544, 427, 129, 234, 634, -492, -1035, 724, 1084, -575, -359, 250, 178, 383, -28, -1023, 168, 1161, -109, -1118, 297, 93, -119, 442, -59, -807, 531, 771, -1151, -823, 923, 303, -726, 208, -348, -384, 459, -28, -1038, 288, 831, -619, -736, -66, -53, 143, 271, -778, -640, 815, 66, -962, -124, 331, -121, -13, -302, -1059, -58, 1019, -506, -1020, 304, 333, -499, 68, -322, -820, 916, 557, -1168, -712, 689, 319, -623, 7, -43, 23, 339, -167, -956, 258, 796, -350, -275, -85, -40, 419, 354, -659, -226, 815, 204, -1086, 202, 370, -205, 441, 203, -599, 67, 1205, -313, -884, 544, 505, -179, 298, 251, -141, 543, 492, -680, 75, 685, 20, -269, 394, 13, 395, 525, -346, -754, 710, 868, -478, -271, 580, 195, 292, 13, -648, 35, 822, 70, -694, 271, 412, -128, 56, -22, -415, 568, 791, -833]
1999h33n0J843k73j281N17K80l23M21N8j164Q17Q71q52o15K38L11M72k88r12J03
2019f60J508n81j267R22K97m65J88K95j099O61J279j183j142J219Q32r43j49o9
2037c57J14O57k5j099o7J222q3n65No5J04P31q16o59J145O12j270j21O36k18J08
2058a1M26r53J6J228n5j411M89Q53n71O0Rn38O39P16j032n41R29L11o81J15j50
2079a52o4P47K07j543K65J338m86m87L28j14J33N11n78r03J064O64j181j6M63
2098A96J7J14J48j049M9J373m64j238R24L99m89K12j48m56N04P60j022m44R43
2117C29K83o04k13N9R9P14o02o78N38M66m00j80K75k73M01L39q09n32J121J80
2137E13j005m4J040k99n03O49p03q5P98J3j016L16O16j05j94k71l25R17J90r49
$$ y = [-833, -883, 960, 687, -594, -77, 203, -120, 301, 359, -805, 12, 883, 31, -584, -346, -35, 437, 149, -763, -660, 848, 267, -1000, -78, 219, -246, -58, 237, -862, -201, 1078, -105, -1247, -28, 804, -139, -288, -357, -243, 414, 389, -710, -777, 445, 362, -203, -198, -263, -159, 572, -244, -903, 242, 854, -416, -537, 99, -119, -11, 415, -538, -522, 706, 651, -760, -271, 582, 11, 71, 80, -458, 181, 897, -135, -676, 253, 564, -117, -2, -152, -216, 531, 738, -805, -540, 798, 312, -175, 153, 39, 172, 683, 105, -798, 266, 930, -251, -267, 196, 213, 327, 475, -574, -525, 848, 384, -854, 70, 469, -20, 192, 44, -412, 92, 852, -170, -614, 329, 612, 8, -205, -146, -47, 667, 65, -613, -75, 391, -9, -189, 86, -187, 214, 553, -256, -788, 333, 513, -492, -536, 504, 205, -298, 351, -352, -437, 361, 374, -642, -326, 290, 185, -9, -280, -605, 312, 502, -447]
2157d47j30R44l89j36L94p09k15J341m97j079O73Q99q20l53O07j37r8L04k91l46
2177d85P08K46q48R8N14k79LK26q05M63P62o83l86O90L8n16K05J72n54P40K19
2198E28r06j70R26N2n74K09j55K53K70l19q29Q69O45q68k04O08k15j07N00n32
2218a9j96P74J26j201L13O33j63j08j35l11M01M74r30k13Q05J70m66J67o3n18
2238d60P70J46r53R7J014l89q93P25P6j40L18k57q08O27P13p65j76L74J0O6o3
2259C2l90j2Q62l02p75M83M20l57J59l47m00O74M25r08k43Q31L31o37J90l19j05
2280c88O86j89p22K90P58m13m86K98o6K29J86l6p39O53L44o11k00L51q7K73m7
2301H4n68K63O33k86o74N71J26n8l13J05k65O03M59q42n38J111j1n19O0O1p8L61
$$ y = [-447, -577, 367, -22, -158, 236, -473, -688, 653, 156, -923, -250, 649, -171, -524, 83, -54, -152, 152, -139, -485, 223, 469, -379, -281, 233, -46, -43, 183, -622, -159, 603, -80, -466, 224, 262, -254, -49, 123, -431, 309, 528, -378, -548, 378, 430, -144, 65, -90, 163, 433, 114, -715, 154, 799, -69, -273, 335, 120, 13, 513, -19, -215, 559, 685, -516, -203, 430, 267, 159, 24, -287, 114, 588, -342, -555, 250, 420, -46, 121, 58, -460, 310, 456, -497, -400, 614, 225, -668, 57, 133, -7, 311, 54, -754, -127, 586, -179, -355, 19, 29, 95, 32, -358, -370, 492, 190, -585, -102, 318, -39, 120, -227, -627, 47, 472, -436, -679, 152, 483, -154, 36, -283, -388, 298, 109, -613, -323, 435, 22, -464, -166, -232, -3, 183, 147, -592, 61, 405, -206, -406, -55, -142, 131, 84, -484, -221, 412, 126, -548, 23, 149, 91, -222, -117, -382, 221, 680, -162, -700, 411, 400, -119, -59, 2, -76, 285]
2323B85N8q80M25O06m24j84K14P1j6K29l85o02J144k06p66K16N35j34P5o0l91
2344a90O8P18l81q13O40L52k89L2j26l32P23L86j021k11R72j01n17M6O4j03L58
2365B75j28p21N53P12n20l19NM1J80L09o78nP55j02o92L6N28k97N5N4p14L19R99
2388F45o92n07N60K87l39j51J90k83K53L44n53l10P12r3k50K34j74J20M17n87
2408a77k90M50L68n42l18O17l24N7M26m87k83P91j61p15M20N06n54N9J79m28K61
2429a45P16o47n77N96K62m00j43N88n36N82rn32J07N53k07k07Q3j63p0M60m04
2450i3n48P69N74r26J06K91j44J15L05q07J92O65o0p85L21N17n59J87q0j80L89
2471B49J09m19k17N01K33m14K3o2RK50J74j031O94N17o42k10L14Q1j73L98l46
$$ y = [285, 343, -537, -112, 494, 70, -114, 100, 171, 155, 384, -1, -603, 541, 335, -431, -215, 320, 186, 261, 201, -190, -122, 596, 215, -598, 42, 394, 105, 137, 11, -321, 402, 788, -233, -444, 528, 427, -90, -44, 20, -83, 275, 147, -574, -21, 691, 171, -148, -143, -102, 78, 387, -291, -296, 459, 357, -335, -299, 229, -68, -13, 41, -673, -354, 645, -47, -554, 6, 293, -46, -197, -7, -290, -37, 307, -246, -556, 156, 63, -187, 47, -127, -7, 410, -177, -467, -17, 351, -191, -509, 108, -216, -159, 267, -220, -503, 288, 127, -588, -168, 338, -216, -157, 22, -406, -145, 571, -76, -653, -57, 205, -195, -338, 250, -286, 296, 287, -245, -138, 415, 208, 1, 84, -79, -149, 311, -93, -641, 128, 702, -224, -118, 173, 29, 144, 449, -358, -166, 499, 439, -346, -25, 492, -67, 120, 40, -140, 249, 358, -61, -278, 223, 456, 42, 65, 3, 12, 262, 436, -595, 99, 616, -26, -236, 78, 159, -14, 384, 38]
2492C8m24R05M3o57k83O73k55k9P4k52j31P35l22n82M16M47l14k16M6l58N35K68
2514C57o44k39O99J11n12K93k71LM75j55o79M31N43p13Q7K87j79J63M76o06n32
2535f05O74L67o68j11L88N8n3j44j19N8N72j9q28L44K56m65L57q2j57M59Q8q12
2557d42L5P12j65j21J68k36l79O39pq08O08L62l12m19M66n2kK00l32l55O90K10
2579D60q65K08M21Rp6p3l53J81M01l31k48M60L8k33J07l98R3N54K41p89n9M40
2601A88l5m17M42J8j86N31n19l98L30M61l05m14K18J2P9K86o35J28M81M2m59J29
2623b3K53l00K26l2j78J29L90m76l59O64j02l24j3K06l36L33K95q36K13M82r1
2644A21m84M12P3l99N15k63k06K72J80m64pJ70J28j38j0k28M3L92p9l06J48M19
$$ y = [38, -386, 519, 562, -95, -378, 295, 40, 11, 85, -167, -298, 437, 115, -467, -51, 396, 82, -134, -88, -446, 89, 357, -287, -526, 173, 284, -228, 65, -206, -203, 272, 117, -562, -131, 412, -301, -214, 73, -106, 57, 533, -73, -605, 69, 436, -232, -343, 45, 103, 50, -94, -213, -155, 417, 398, -430, -86, 170, -295, 62, -20, -177, 282, 370, -442, -407, 305, 140, 19, 187, -49, -428, 211, 204, -604, 4, 366, 54, -365, 101, 49, 47, 247, -85, -440, 250, 460, -405, -197, 224, 233, 157, 84, -269, -88, 313, -18, -266, 194, 232, -1, 106, -292, -199, 355, 596, -193, -252, 188, 153, -264, 178, 196, 10, 541, 22, -376, -46, 415, 110, -304, -86, -74, 5, 291, -344, -216, 265, 307, -152, -23, 230, -70, 156, 124, -54, 75, 465, -11, -370, 294, 192, -132, -145, 61, -275, 58, 353, -483, -270, 212, 121, -363, 49, 122, -277, 238, -25, -231, 41, 221, -243, -250, -80, 48, -90, -100, -328, -285, 107, 28, -278, -130, 289]
2666B89n50R8K93l21J93N31o36m27P57k1m82K01m0l0K75j2m40J62N39l42l49J29
2688a83K42j10L64n45j79O60K00p90j37O30j71K54oo00L77M66k07n35L74J43k16
2709C1N8L0k05J87L64p15j64P56j57l27K32J29j69L02k27l35J51L04j80J0r2J00
2731H3Q2K44m53k44O93j47n28R0K32m4K43k00k87r0N46j32m20M09K46m42R6K3
2753@n6J31Q9m25j29N33m4l05J95J5j61J92l5m49L15M30m17m27N80j4k54K02k20
2776b54k45O32j0l95L8M29k14j97K40k28o6O32k74m40M58J52m50J49m4J50j09
2797d6L10j83l22M13j54m2P4m8j19M90l14n28O38K40o61J11K11m6kJ33m47N9M41
2820B08J10m40j62L39j15J37J0rj73L25k59j87L10J99k77J3O0j15K28J80n81l2
$$ y = [289, -261, -163, 130, -191, 2, 533, -103, -530, 227, 206, -276, -75, -115, -145, 130, 118, -322, -160, 379, 37, -312, -183, 59, -51, 313, -232, -411, 249, 449, -341, -478, 152, -19, 235, 229, -371, 6, 472, 265, -270, 104, 247, 31, 89, 119, -86, 101, 465, -250, -414, 342, 185, -142, 90, 219, 50, 352, 125, -210, -59, 245, 65, 75, -17, 83, 165, 409, -44, -288, 405, 258, -270, -180, 52, 8, 251, 51, -236, -326, 220, 88, -332, 77, 323, -119, -23, 0, -56, 75, 164, -261, -390, 143, 99, -206, -11, 4, -157, 35, 0, -449, -134, 296, -121, -548, 32, 18, -236, -34, -254, -499, 133, 123, -272, -234, 195, -19, -216, 24, -204, -270, 362, 88, -352, 106, 258, -192, -43, -87, 63, -46, 264, 81, -241, 172, 18, -24, 50, 2, -117, 373, 59, -469, 169, 409, -252, -141, 70, 24, 22, 155, -292, -233, 208, 318, -122, -284, 55, -60, 77, 87, 78, -95, 230, -29, -216, 94, 293, 16, 29, 89, -26, 202, 382, -199, -231]
2842b31L67J4k83K73r8j00K22l51l39O53K94m26j33L66q6j96rj3j86P90j58p70
2864d00M37J36l61o6M12l60J32L97l54l41M16lj32Lp2k6M51k64k90K40L38l71
2886g8j39J42J78o9L32m32o3K89n0j61k45K42J29k33J26l6p6L83l43l46K85M88
2908C23k99M1j02j67o2L82l53k40O76n3m19L53k20J07K46O4n68J08N67o1n56J54
2930g9K78l30M66k81l42M17o8k62J04L37l21K09oj46j04L73j93l37O63k05p2N
2952A06j82j38K49K17l66m6L82l4l65K00J06j82K39j50l80L60K80l20j36L64l19
2973a15P3K54k06l91P29p2m57L9J78o8n2J78j83J06K03m03j8L66N5l14R8k3j99
2996b22J99J53k78LK70O5l70J83J08n0KO3k80N2K79j05k57J87J54k22J46l73J57
$$ y = [-231, 136, 150, -133, 140, 42, -58, 164, -187, -526, 127, 421, -5, -138, 228, 142, -54, -63, -76, -262, 528, 370, -400, 37, 173, -188, -254, 158, -202, -70, 327, -27, -368, 48, 45, -87, -84, -156, -182, 269, 5, -285, -45, 293, -78, -217, -75, 103, 34, 366, -66, -129, 160, 110, -51, -296, -54, 75, -158, -32, -68, -144, 239, -104, -450, -165, 323, 24, 65, -37, -204, -266, 116, -237, -477, 199, 146, -273, 80, -140, -33, 213, 277, -291, -183, 384, 323, -233, -79, 199, -131, 335, 54, -288, 129, 61, -201, -97, 240, -81, 128, 122, -24, -128, 245, 52, -285, 378, 173, 101, 106, -76, -214, 35, 252, -114, -160, 222, 188, -177, 23, 129, -53, 186, 36, -344, 16, 296, -24, -160, 204, -115, -42, 212, 6, -385, 344, 272, -185, -146, 32, -36, -88, 90, -93, 13, 216, -187, -205, 161, 216, -98, 0, -23, -222, -23, 130, -148, -145, 125, 190, -180, 3, 111, 61, 63, 126, -154, -102, 177, 72, -185, 2, 156, -66, 80, -293, -136]
3019a36L10qm71K90J81l71K08O3j47J0K27Mn72L96K24l37O7J18k97K67J54l13
3041a33j44L66j98r1M9J99j31O5J28n66L10L06m45J44M88k84j14J59p2j69L02
3062A69q6k93L19J44k15k19K63m0j53L99k72k26L51J6l57K73m9j24L61j3n67J44
3084a75K28n4m2K22j99N3K4j8l57L52J60l57J97J92l98R7L03l91J1M88j48m05
3106b17L26L27m65r0L13l94L05J29m65L0M92j78k90J62R1j01J92N6m36K11K01
3127A99k34Q0j50J33N2l4j49R3J73k5k60L8K29k03R5J89m91K00J15l2k57L21N1
3150A33l8q3%j22M2J16r8j11K08q9kj35O8r1N32l72k57J97J33j57j3L0n5J88J17
3175A41j71j8J92Q3k95j40J73L6r5J43k66p5M56l8l42M60k01k8j00K28k40J95
$$ y = [-136, 174, 166, -305, -15, 166, -205, 3, 66, -81, -71, 156, 160, -412, -16, 208, -129, -62, 56, -241, 26, 180, -133, -277, 89, -109, -200, -151, 48, -83, -18, 110, -456, -146, 160, -285, -141, 347, 63, -51, 108, 36, -133, 169, 83, -210, 109, 253, 38, -181, 82, 42, -111, 288, 16, -210, 141, 157, -200, 73, 24, -100, 261, 248, -319, -175, 53, -1, -43, 179, -20, 33, 57, 39, -318, 34, 194, -163, 34, 226, -172, -75, 228, -163, -152, 336, 188, -217, 109, 436, -29, -119, 194, -200, 105, 234, -231, -201, 291, 113, -177, -15, 76, -25, 167, 223, -213, -2, 199, -35, 45, -105, 28, 80, 46, -103, -10, 163, 138, -122, -84, 145, -58, 37, 226, -265, -65, 50, 18, -239, 82, 133, 95, 12, 12, -110, -68, 48, -50, -161, 47, -42, -44, -179, -111, -202, 330, -42, -299, -102, 31, -126, -139, -109, -164, 24, 141, -30, -48, 144, 227, -68, -208, -35, 1, -94, 49, -217, -292, 164, 126, -216, 244, 43, 15, -85, 143, -97, 98]
3197I8j9k81K1L21j15j95K36j24j41J96J72m13K86K85k46j83K24Q9q3M8l21N4
3219i1L44j68k11J60jM5p4N9k41R1L29l03O0k7J24k36K25N9n3N7Rl96O7O00m53
3244b5k51K96n1r2L95m00j55L90Q2l72K63j42J2O5J58m12J43J76q5k14J23J89
3266I3l8q6J5n8R4K40k83k49M54q4k44J31M7j59L31j80j63P8K40j01j94K61K7
3289A72j24m1j07j70K45K85m68M3J96j01J32Q4k30L7K38l92m2J64J19j89J00J74
3311A25k06R9J8k38Q5M23J5n54K70no1M03l53k8J1N1o1p8l4J26j55K52p4k75K81
3336C7L04m21K33N4k11K1P8k00OL18l27J23k5L14m53J44Pp0K04l7l6j85N72l49
3360A01j44QR6O3j96j45k9K68J74k02j80K66j85R7J8m4k4J58N8m46L63j44j82
$$ y = [98, 79, -202, -181, 140, 25, -170, 66, -58, -199, -3, 169, -244, 42, 327, 81, -102, 122, 211, 128, 176, -145, -91, 253, 85, -126, 34, 33, 78, 4, 63, -178, -87, 242, -61, -1, -28, 96, -140, 85, 144, 91, 148, 157, -239, -172, 428, -25, -276, 20, -31, -123, 272, -128, -283, 107, 189, -183, 80, -62, -50, 15, 173, -239, -96, 80, -5, -219, -96, 93, 55, -31, -16, -74, 20, 260, -23, -272, 182, 98, -146, -15, 32, -127, 204, 24, -139, -61, 179, 78, -116, 145, 172, 48, 7, -100, -270, -25, 260, -208, -165, 31, -70, 62, 146, -84, -47, 191, -201, -243, -79, 40, -149, -49, 125, -81, 18, 36, -202, -117, 306, 321, -233, 37, 32, -29, 374, 21, -7, 4, 55, -6, -84, -118, 8, -147, 105, 31, -244, 37, 341, -80, 153, 207, -4, 17, 95, -105, -99, 219, -108, 15, -10, 304, -149, -5, 2, -68, 136, 99, 63, -122, 450, 101, -43, -35, 61, 124, -72, -217, -246, 22, 196, -6, -186, 80, -105, -8, 10, -34, -58, 100, 158, -288, 75, -69, -251]
3383b51K27K01k95O5J77k50J53n1K4n9j5N6k59L18O3l09L1J93k1j66J28jp3K56
3407A42j2k62R7K7J18j09o3J10p9L6m5k57M95r4k28J8O8M1m5K14j63j19K52k66
3431a24R8J3P8j27m7J25L3j42J03j55j40M80r1p2r1J07r5J41k87J59k9K09j2j65
3455c1Q8j80m1K66Mj22K19k53j75K85r7J91k65j8J63j87J94k35J54l6Q8m0J21
3478I3J39j63Q6J3k12l1J79k36J88j66J31l3N6j13K50k17p3J62k16K66J75l00
3500b2J67k69O9M6Q3j37M2P3j92k0R2j22J72Q2k03M4J20k9j72J20L3n5K5J74l13
3525a92O6M44l39j08J04NjP7j23K5J33Jr4l12L63k57K08p3J6L1R2N5n61L92K04
3550A56j78J5J0q1K91m15L60j5j96Q0j28o3K64k76L21rj96O7J51k71LK78k60l4
$$ y = [-251, -24, 177, -118, -53, 124, -126, 27, -24, 0, -59, -74, -18, -277, 41, 104, -205, -174, 19, -2, -168, -40, -41, -114, 142, 130, -132, -35, -8, 110, 1, -62, 48, -31, 5, -40, -297, 198, 104, -124, -106, -38, 3, -42, 172, 9, -110, 142, -124, -26, -13, 65, -62, -109, 16, 49, -93, 10, -145, -285, 195, 104, 32, -59, 48, -47, 94, -193, -34, -63, 146, 134, -31, 57, -123, -164, 102, 106, -16, 203, -50, -225, 60, -37, 154, -111, -129, 34, -153, 41, -194, -40, -76, 12, -28, 93, 232, 69, 155, 168, -44, -75, 104, -132, 56, -110, 21, -12, 44, -69, 181, -36, -109, 53, -163, 103, 278, -22, 145, -124, -55, -9, 74, -63, -21, 52, -140, -160, -68, -190, -18, 64, -139, -95, 25, -4, -176, -56, -23, -78, -53, 121, -192, -126, 318, -21, -129, -25, -20, -21, 56, -67, -42, 91, 92, -2, -314, 49, -208, 0, -73, -57, -26, 66, 121, -440, -48, 156, -22, -7, 3, -78, 213, -202, 158, 143, -53, 27, -101, -164, 100, -176, 145, 136, -60, 7, 158, -113, -110, 168, -92, -126]
3574a26J65j56j73L02J06k86K57J30j64n2q1J93j26M9J2j52J83m3m4J7j17K73
3596A67k68P9j60L58k14R1q9K09j86k65N12j19k62l5R5j34J64K36j51J83l68K20
3618F3j77K16j9j62J84j10j10K16j4j1j81K33j94j23J84j8o8qkqK14j32k31L55
3642I7o6j71pJ86j33j53K15J29r3l2M9j29j32J92P6J9nL9k93L12K15l46P6j34
3666h9Q1k8M0J19l6M1j55L2o0j68K68j92J28PN6R0k35qJ29l3j69P7J47Q8q8J05
3692A47k69K31j60k3J53l0Q1k8j49O4n0p1J31j87QJ15J06Kj39L7L29k50N9l21
3716b14L24k69J13K21l33K02j76J50k8O8O0Kl26M07r3j63J26K48l53k06L22r2
3738a0lO3j71N9K2j39O0L47k64P5r9J19q3J4l9%K62l20P5LpP5j92N9O7O5J36j48
$$ y = [-126, 39, -117, -290, 12, 118, -168, 89, 219, 55, 3, -78, 115, -11, 38, 50, -102, 81, 38, -6, 11, -106, 167, -101, -22, -182, 176, -38, 53, -36, 173, -13, -278, 234, 115, -147, -182, -87, -221, -57, 179, 28, 211, -157, 63, -114, 102, 83, -79, 105, -5, -115, 101, 87, 76, -105, 128, -66, -189, -5, -23, -91, -99, -101, -109, 105, -27, -258, 97, 31, -140, -147, 39, -94, -247, -32, 97, 4, -28, 21, -108, -240, -48, 28, 47, 42, 81, -212, 100, 315, -31, 45, -89, -8, -36, 4, 123, 87, 128, -27, 5, -55, -223, 45, -147, -19, -12, 44, 134, -101, -109, 20, -13, -182, -105, 42, 130, 42, 147, -122, 109, -51, -74, 79, 49, 130, 102, -47, 17, -33, -104, 27, -160, -152, -37, 69, 71, -68, -31, 298, 48, 107, -214, 110, -159, -46, 175, -158, 44, -132, 18, -10, 58, 118, 120, -206, 201, 108, -55, 71, 319, -34, -240, 82, -10, -13, 50, -121, -62, -40, -179, -119, 228, -36, 39, -60, 59, -24, -10, -49, -49, 213, -107, -32, -29, -36, 39, -153, -94, -27, 38, 174, 26]
3766B6j79L52N6j40k77L52k47RJ57j84M1l9K64m42K79q9J01l9j00J19M5klk91
3790b31K78l4R2j45j25K19p2K6j43J99J4p0j52J75Q4k99RJ67n8p2K25k61K09j03
3814f8J43k92K14j14m0K06j5j62m3L92l49M2M1J33o2j35n9K36N1j05r0R9q9j96
3838b62L68k30l6J75J24j3j50m3L7j8Q8j6l24L26L9p4nK34k36j58L78k17M1j4
3862A4L7k09N9K34j43l4j44J41N2J69j58J6k26L01j28P2j43n0J31J40mk44K44
3885A27j29n0P1K97l41k3R1k19J71N9j73L42j83q2oNJ1k5n0J58k26K65o1j7j08
3910i6K9j2MJ85m5L5k50J15P0P8j66J58j39m1m5L92m21L87k68J17n5j14K37k71
3934a16J02j25P3q3J12R3r3J3J12j5k01J37No2J49j53J18n5M4k7m4k25K90PO3
$$ y = [26, -153, 199, 255, 115, -162, 190, -57, -48, 109, -75, -34, -73, 191, -251, 28, -61, 40, 1, -99, 20, 65, 63, 60, -231, 47, 13, 105, -40, -165, 54, -18, 8, -135, 64, 78, 8, -144, 31, 115, -184, -175, -8, -66, -138, 87, -174, 35, -68, 75, -217, -3, -117, -157, 49, 34, -128, -171, 221, -128, -86, -45, 88, 26, -109, -168, 68, 119, 14, -76, 23, -66, -262, 106, -124, -160, 15, 139, 126, -24, -67, -30, -48, 40, 24, -300, 26, 65, -9, -14, 220, -16, -174, 204, -13, 28, 14, 51, -158, -99, 135, -8, -42, -186, -45, 7, 176, 18, 34, -192, 109, -19, 53, -90, -140, -9, 131, 127, -117, 127, -2, -52, 19, 316, -25, -48, 43, -176, -5, 54, -119, 223, 40, -42, -48, -43, -32, -57, -107, 51, -175, 90, 29, 12, -96, -67, -79, -75, 110, 65, 100, -150, -35, 35, 113, -53, 105, -34, -75, -120, 272, -149, 238, -30, 87, 32, -82, 155, -116, -14, -139, -66, -149, -37, 56, -37, -24, 88, 73, -128, 9, 14, -48, 101, -52, 66, 11, 55, 28, -16, -241, 49, 56, 119]
3959A19k53QK44k00rj14L44l65J15J74j00j47J38J0l3K6R0p3Jp5J06k1p2j31L20
3984A02k78L07r2Qj94J93R6k23r3K50R4j02j09M6Oj57L39j08j47J03l5j46P9n2
4008a13lQ5N0n4P3j03K5j3N0rKJL16k77j51J00J09KJ31m29J64l5Q0O0Q5N6j34
4035F8J8j02K1Q9J1j00l1K70j73mj50%J49n7j44J08J9l5K6J00k12mKJ10l4k9J73
4062H9j34r3j8J60k6r1K24L2j39j19J60j20L8J65l18J56j06J7L7K62j76L3J44
4085A77j98L6J6k25j2M33l20j27K74j17j11K65p9%K21j41n9j80L9J3P5N2J11p3
4109G0k19J00q0J24J55l69K17J63k44N0J2j30J56l9n2R6j99K05j52K19k31J22
4131b6j22J93R9n3J11j76l8L6j54m5J70k0q1rJ70m4j11K49m19L34K1q8Q1p9J46
$$ y = [119, -134, -126, 118, -82, -91, -205, 139, -226, -111, 63, -37, -184, -46, -36, -69, -43, 47, -26, -25, -100, 6, -15, -87, -218, 102, -176, 131, 39, 47, -147, 46, 142, -81, -174, 76, 170, 68, -41, 5, 11, -146, 193, 85, -62, 41, 6, -140, -61, -113, -116, -31, 19, -35, 38, -65, -40, -53, -3, -12, -10, -9, 307, 30, -121, -21, 88, 90, 221, -208, -44, -79, 1, 61, 146, 202, 68, 86, -16, 5, 94, 105, 5, -26, 244, 71, 67, -83, -83, 66, 9, -135, -27, -8, -43, -17, 83, -129, -133, -131, -21, -55, -84, 89, -45, -138, -156, 4, -22, -113, 111, 143, 4, -115, 45, -75, -37, 128, -190, -34, -140, -123, -86, 176, 0, 33, 177, -21, 15, 31, -194, -206, 227, -93, -220, 54, -63, -174, 91, 12, 12, 233, 92, 33, -147, -108, -95, -20, 32, 143, 70, -149, -49, -129, -5, 150, -219, -2, 161, -83, -33, -21, -151, 5, -34, -86, 10, -189, 16, -136, 83, -148, -26, -148, 45, 144, 91, 202, 26, -12, 24, -130, -175, -5, -25, -106, -115, 55, 11, -100, 149, -270, 64, 85, -3, 78, -1, 145]
4156A45j15o9n1N9o5J3n6p2M33k79J17o4j01J50p3L9o9O2J2m9n3J61o5k03K56
4181F3Q3k58K18on9j76J35j41R4N7L7q4j3K39k64Op1J82J07Kq0k63J18J4O1n2
4207e1J00O1j64J51k08K10J20j32l7j60K5J04M0q7j57L04l1j88J17k3j16J48J1
4230C7J8K4R5Pk16j05Q9l6O5j78k7J74J48j1r6K12j48l2k5PJ60L9k05p8K9nm2
4257a00P1P5mK3j62J69Kj75P8L7k52J49J71j23r6K6J03k7Q6jo4L7j25Q5N9j03
4283f1J58j47J31k5m5P1j80J40k9k06J30lL9L5j57Q8m9K1nj0J88j89K2J91j57
4308d9j15K33j68O1J70k37Q5k7J08j48j09K85j1k35K78j22J88l01J86l8J17j67
4330a6R5kj74P7q5K54k95R4J47k90K89k13j2J48O4j68j26K47k4Jj58K48k89K20
$$ y = [145, 30, -39, -90, -31, -96, -83, -139, -211, 222, -57, 60, -4, -105, 45, -28, 11, -58, 4, 16, -33, -86, 75, 10, -193, 63, 146, -112, 106, 100, 41, -135, 0, -141, -47, 10, 47, -37, -50, 189, -75, -69, -140, 42, 149, 151, 71, -192, -74, -60, 1, -51, 49, 110, -54, 97, -111, 99, 219, 87, 50, -110, -85, 19, 59, -28, -185, 119, 88, -100, 17, -6, -122, 26, 37, 55, 79, 174, 181, -35, -140, -51, -87, -22, -200, -227, -53, 95, 84, -12, 200, 52, 20, -5, 2, 162, 201, -4, -82, -53, -58, -100, -29, 46, 42, 65, -97, 72, 74, -101, -23, 14, -238, -89, 82, -41, -137, -111, -8, -35, 51, 50, -14, 23, -102, -17, 42, -61, 97, -50, 81, 56, 11, 82, -98, 42, 13, -193, -63, -66, -27, 8, -149, -61, -110, -89, -94, -104, 84, -105, -83, 108, -49, -164, 69, -99, -38, 132, -105, -20, -47, 61, -87, -196, 89, 78, -157, 121, -1, 187, -114, 72, 34, 151, -16, 79, 77, -97, -20, -105, 149, -146, -52, 95, -195, 94, -119, -131, 17, 81, -87, -213, 34, 10, 11, -147, 101, -188, 32]
4354C2k30N7J09R8O4o7Qq6N4k39NK45j15j4J98j90M3q8k09M01j80J64N6j10j53
4379a47K03O3o2J09j05lo0o8R3j73J98qK9o9p4J3m2J88q1o9N6N5k02J65k35J88
4405c8N9p5J23j2l1l8n4J47j11pJ89r3k45P3J98J7m1k0r8j15L40M2k46J14k38
4430a60LJ06J09m6Q5j62J71j77l3K27q0o7j37L12k01j33J09K50k40J99P8k16J01
4453I8j84q8J17J33j8j73O7L7o5P1P5j61J61Q6jl24Q4J28n9N4m2K04k50J43j45
4478e2K37j59J8r7Q6J80j59m2j0q0M7k8O7j8m9R4L6J9n2n9kN6j5k49J46J30j15
4505g0K64l94K99r2r5J98l65K99o8K80k09n0j04J70J9j32j1KO2k7j11L56l69J02
4529d6l9J48j84M0M4l2N6J41j55N7Q6R5o9j13J49oj42j01p4J88p0O2j39J40O9
$$ y = [32, -198, -141, -32, 66, 130, 63, 71, -15, 39, -200, -195, 50, -65, -79, 119, -71, -28, -116, -325, 76, -104, 60, 116, 6, -147, 56, 119, 57, 166, 61, 58, -2, -70, 23, -150, 48, 40, 69, 0, -74, -61, -103, 85, 4, -65, -9, 46, -156, 9, -226, -38, 21, -54, 69, 57, 26, -12, -66, 81, -30, -37, 152, 59, -186, -113, 85, 102, 61, 41, -57, -172, 168, 210, -36, 78, -160, -157, -51, 58, 12, 97, -65, 106, -71, -104, 123, 43, -24, -161, 151, -50, -183, -74, 176, -64, 135, 213, -3, 98, -86, -174, -57, 76, 58, -115, -48, -11, -76, -5, 70, -91, 70, 156, 155, -169, -85, 43, -16, 38, -4, 200, -50, 93, -52, 185, 26, 44, -53, 33, 213, 54, 12, 2, -78, -31, -59, 8, -10, -59, 35, 71, 90, 38, -21, -23, 33, 18, -231, -85, 45, -70, 194, -200, 99, 7, -88, 110, -255, 44, -24, 256, 47, -3, -107, 63, 82, -50, -61, -59, 3, -24, -135, 221, -148, -46, -85, 63, -121, -81, -37, -69, -13, 128, -27, 30, 116, 211, 142, 29, 178, 172, 30, -71, -145, 43, -27, 35, -104, 36, 105]
4554A05k65K10J65j33k96P7J66p8j22J44j27K54L6j73l72J91M18nk14J41Q4l4
4576A72j91P2k2r2K31j74p4r1J99j21pK17m4j67J97k01N7J83k57J9J36M1p4mj10
4601a05J11k4j65J33Q4Q3k12K79r2q4N0k2O8k95K77K2k2j81n0M0J5OJ42R2r0j34
4627g4K01k68N1oL9J12L2Nj47L13k11o1p3L2J79k20K2O9J49j25p5rP4lJ50K2j72
4654FJ39r9J26Qj15k54K29j50p1K33j4l8P2j43Q1M1k58L70k44J37r5j15J65j43
4678a32J65k1n0j31J59J39q9m5J37j88j40J38ON6k0j3R3j24J09k18r9K11o9K19
4702I3P8j70r9J13K18j79j9k8P9N8j93j50J27J69Q1j19k66K25mk7r6J83O5M0n3
4727A26j01k2nj47J89j15K2J11pj72R9o5J18J9k10j5P8l7N6K17l26K77q9k2k4
$$ y = [105, -160, 50, 215, 82, -214, -137, 29, -49, -171, -27, -154, 100, 136, -37, -409, -218, 200, 195, -19, 122, 206, 172, -19, 53, 31, -61, 170, -4, -78, -169, 30, -91, -98, 119, 75, -92, 105, -96, -39, 144, -113, -94, 42, 83, 9, 5, -105, 6, -18, -183, -50, 34, 117, -95, 184, 92, 8, 58, 36, 104, -191, 86, 108, 86, -95, -145, -105, -90, -84, 58, 150, 60, -74, 127, -141, -90, -96, -57, 55, 87, 92, -55, 258, 47, -14, -87, -55, 124, -96, -74, -5, 144, 19, -56, -65, 9, 6, 156, 178, 6, 145, 46, 172, 180, 65, -189, 40, -110, -181, 52, 38, 0, 72, -71, 10, 51, -207, 163, -81, 56, -39, -154, 11, -132, 33, 12, -38, -169, -10, 129, 40, -5, 132, -56, -196, -58, -52, 4, -16, -29, 64, -60, 49, -169, -268, -57, -126, 93, 171, 1, -98, 15, 233, 54, 35, 7, 86, 144, -49, -199, -72, 97, 178, 59, -207, 18, 14, -13, -109, 74, 139, 179, 126, 25, 3, -2, -149, 40, -75, -53, 58, 51, -121, -22, -87, 31, 50, -160, -175, -97, -134, -78, 139, -187, 90, 1, -21, -45]
4752d5K78k86J07j00n7n1K57k45J29k0o9K9L26j41N5k64jN6J43l1m7l4O6j21R7
4777C1j13Q6K93l32Qp7p4k7J60J09p0R7m8j14J17J17j81j17J21j72J39P9Jj06
4801g3N8j66J86j89K38j50RK36j07j59K25L7k77L28l54J06k5j04K15p7M5j22K62
4824A42k85N2RJ02Jj07J16oR7M8j88J23P3j58L0j40J94k59L49k41J05o2j4Q7j00
4849c2Q6j44J11m4j4J5o1K45o4k44J03Oj11M8K15n9j48J60l92K97J28r7p0n7m5
4874a68J85j21J99l9j22J96K5j76k5RJ52n0Q9L9j05QpN6q6o1j58K80Pj15j63J68
4900A7j48J86m8j76L56k69J67j75J17N6k44K23k4J69j08j90l4N6J71q3O8j84M6
4923e1%ll1Q5J04K7k8k84K56q0j98K10J37j34R8k40NJ38Pj51J46k4O1J23j14k80
$$ y = [-45, 233, -53, 54, -46, -103, -154, 103, -142, -13, -33, -102, -73, 253, 112, 167, -97, -98, -42, 101, 70, 23, -11, 55, -66, 31, -82, 4, 297, -35, -27, -104, -178, -205, -45, 64, -6, 91, 43, -71, 46, 163, -18, -135, -14, -186, -47, 32, 33, -73, -15, -181, 5, -184, 54, -96, -87, 149, 42, -117, 108, 145, -132, 196, -158, -52, -77, -181, 34, -43, 2, -120, 142, -143, -91, -82, 20, 21, -86, 30, 24, 121, 169, -19, 104, 177, 19, 49, -91, 103, -156, 193, -48, 57, -5, -19, 68, -32, 54, -90, 21, -23, -37, -22, -83, 162, 98, -146, -43, -37, -148, -100, 115, 56, -92, 68, -324, -27, 101, 4, -66, -123, -168, 17, -104, 95, 56, -66, 130, 155, -21, -46, -37, 115, 65, 154, 193, 88, 96, 89, 145, 59, -2, -160, 120, 127, 12, -151, 17, -131, 55, 7, -169, 187, -82, 85, -90, 27, 83, -161, 62, 38, 207, 99, -91, -125, -69, 102, 19, 87, -97, -51, -51, -54, -85, 0, 104, 131, 103, -181, 75, -5, -203, 7, 144, 10, 108, -132, -127, 11, 18, -133, 13, -11, 50, 173, 59, -221]
4949b21K04r5J95k42J38R8n7k45K22J25jM5j55k13L73R7k82m1J6l5R0K77k66M8
4973G5j0L02m53P7o9o6J24j2J08R4j06j99J05m7ok7K03l25J70K10k72m8K50j13
4997c5J2j8J04k44J97R0k24P4l6J08j28J80m6j0j37l6L8J6J61j23N1J01P9j02
5021G2n7J12r8k1J34j74N6O2k32J36J04k18pk3O0J11m0O4lL5QJ04k50Q7n1J33
5047A04J8j70K1J36j05pj55J81J56r8j12LL9j03NP1J9j32MK42l60J50L0J4J7p
5073c9Q3j75O6J5P8Mj04P7L5Q6j49j16N3M2K9Q4j13K31j92m2J13K8j73J81j91
5098h9K18Nl42L03j29Lk30J17JJ62j27Q0n6r3K39j83p8J54J01p7k5L4K7j06N6
5123c5l3J44M8k08K73p0k67J26r5R1J28j91N9n3K45l04K19n7J7l2L4K9o8j68L12
$$ y = [-221, -17, -112, 83, -159, -21, 77, 20, -225, -3, 122, 121, 166, 11, -202, 171, 268, -14, -55, -39, -74, 16, 293, 27, 75, 65, 367, -86, -9, -78, -144, -20, -32, 76, 170, 64, -135, -30, -77, -83, -110, 93, -232, -62, 148, -124, -172, 78, -35, -23, -41, 63, -181, 16, 106, -118, -44, -80, 28, -100, 80, 34, 24, -113, -149, -111, -95, 66, -57, -6, 95, 174, 72, 15, 127, 29, 8, 142, -32, 24, 86, -146, -10, 94, -124, -131, -154, -94, 17, -23, 41, 38, 73, 81, 185, -65, 22, -29, 104, 122, -48, -27, 109, 4, -3, -158, 23, 179, 81, -31, -28, 11, -92, -87, -16, 3, -129, -125, 117, -243, -93, -63, -49, -32, -39, 44, -131, -65, -50, 28, 32, -72, 5, 40, 126, -23, -139, -86, -44, -15, 69, -44, 187, -5, -47, 66, 94, -79, 102, -89, 129, 134, -208, 95, -34, -31, -261, -144, -143, 19, -108, -28, -84, -177, 62, -121, -199, -45, 56, -21, -46, -12, 15, -91, -35, -68, 76, 124, -84, 189, 119, -148, -22, -117, -26, 102, -89, -30, -83, 162, -142, 77, 20, 37, 5, 39, 68, 0, -168, 144]
5148A44k90r9J91mJ09n9R6j3l8l4q7J46J6Nk47m3K92j58n3K05R2k24K64j18l6
5173E7R3j14J0l2J50j39j09J30j31j02J46j3K2N3l4Q4j43J83j21m5o5j6J22j45
5197a59K32k30L1O8O4j46P4J8k5l5J17J98m08J28Qj07J68j81J28J03j1l1m0j19
5221a55N9J07NL4OM1j30J9N6l5P0n0r4K0M7p9Q9K2j04K58k58M2R0j22O8k0J04
5248I0m6j46j1J59k42K51j02q4N0JJ81j13K03j81o4j17J18j41J62J92k78J14M7
5271D3k1j88N6K99j45J5j38p3K24j60K10p1r0J95r2k35K21p0N3K8p5K00j42o5
5295b1R4k34K04j0q3r1N9P3j4pK39r2k1q4k5j43J00K8P0j76J0M3L8n1l5K64j55
5322b0K01m07j5M20k03R5j51J04m0J6j04J28p4K5j33R8rK46j98r8J15j37K69j74
$$ y = [144, -146, -245, -54, -58, 51, -8, 88, 75, 37, 3, -84, 62, 78, 83, -164, -207, 85, -73, -126, 79, 171, -53, 211, 93, 57, 150, 36, 46, 14, 164, 25, -84, 46, -85, -187, -41, -54, -32, 21, -13, 71, -72, 111, -10, -55, -120, -136, -14, -159, 73, -157, -126, -58, 6, -140, -66, -48, -73, -108, 9, 207, -201, -73, -65, -172, -4, -185, -57, 46, 35, 4, -36, -155, -96, 11, 16, 50, 56, 97, -33, -14, 42, 7, 77, 27, -67, -47, 0, -79, 10, 32, -72, 186, -72, -30, 60, -62, 6, -14, 90, 44, -102, -113, 46, -196, 55, -47, -131, -81, -80, 101, -12, 191, 10, -54, -171, -53, -194, -32, 160, -118, -4, 43, 22, -166, -110, 189, 44, 59, -79, -152, 72, -88, 122, 51, -39, 156, 64, -171, 50, -20, 33, 61, -14, 186, 44, -21, 73, -161, 43, 33, -50, -141, -82, -9, -23, -30, 209, 117, 96, 12, -13, -156, -56, -28, 42, -134, -124, -81, -43, -94, -129, 135, -20, 181, -226, -241, 179, -24, 71, -80, 24, -16, 0, -104, 24, -50, -25, -158, -60, -69, 177, -21, -119, -4, -141, 128, -46]
5346d6M3p0P9r1J11l9j82R2J55k75L78j33j07n4P0J81j15P7j31J1k8J23j5m4L8
5371B8j00R3K6j94Q5n6M2m6J99K6p0L5k40K04j03O0K1R9j25j60K03%o9M43l57
5396D4j5j03K50q3N4j23q2o0r9K78o5o7Q0k0m5J28J25l42r2J76M7k47L66j23K9
5421A1j7J35j27n1O5J64n4j46M1j27j6L3J80O1m08K46n1r5J81j04J32j16j4J6
5445f1LJ20j16Jp1P7K25j16j47R9K0qK4j92J52o9M9K5J9j14K8J38k76K41o5n1
5471f5p6J76j25j3l2K18r5n3J81k80L07j45J88l00k8Q8k15J17Q2J00n3J84r6j94
5495a29O7J10K3r8P4QkJ63n5j38r9j71K20n8J18lK01k09R5O3j84N6p2L8K55j62
5521A11o2P1j20l8M1j13qj2K08j9l1j31Q3L5J8j33J38pj13N2N7o0P2n5j29J11
$$ y = [-46, -3, -73, 6, -85, 26, -13, -195, -103, 52, -223, 155, 22, -85, -139, -69, 112, -3, 74, -57, -46, -74, 49, 34, -10, 28, -72, 21, 47, -147, -62, -118, -76, -122, 77, 103, 33, 68, -172, 32, -71, -11, 10, 109, -16, -176, 27, 27, -42, 401, 44, 29, -74, 176, 93, 147, 24, -58, -118, -217, 61, -4, -71, 9, -11, -56, 72, 197, -145, -237, -61, -14, -261, 105, -18, 11, -6, 129, 2, -49, 16, 180, 126, -20, 21, -106, -122, -89, 91, 152, -256, -10, -61, -156, 25, -79, 53, -63, -77, -61, -58, 62, -54, -53, -124, -47, 178, 62, -85, 14, 34, 26, 50, -142, 10, -59, -10, 15, 34, -80, -52, 86, -190, 51, -14, -65, -141, 35, -90, -103, -135, 83, -12, -65, 116, -164, 143, -2, 186, -114, -142, -54, -269, -152, -70, 30, -23, 161, 65, -129, -62, 48, 71, -27, 47, 55, 53, 216, 161, 23, -76, -247, -27, -85, 33, 30, 231, 22, 117, 180, -4, 52, -20, 18, 273, 111, 49, 120, 0, -38, 3, -110, -118, -130, 78, 59, 28, -103, -20, 15, 33, -100, 38, 31, -82, -30, 27, -33, 39, -16, -145, -34]
5547c4J46o0n8P1j61P9j3M7j08K34j51K2J9j23N2J28J7o0q8Q4o5J29o3k08M2J13
5573ij37J65m2M3o4J58j01m5MK8j21j74K04J02M1J5q3J26r3r1m0J45k4K31j73
5598F5j75J41n9J03l13K76K6l02M50k63K79K9m31J71k0n0L57k18k2j26J25l8N5
5621F0n1l1m8J05q2J0Q3N1j71J68K56m31nP4j51J17L4R1p6R9K0j54N2J32p5o6
5647A1Q7k04K01k6qk23J77K6o6QM6m6P8j27J12j20O8M5r8j0P0J36J09k29p0J02
5673D9O7j45R2o5l5k0R3P0j50j92J95l2L7J47o2Mj86O1K11l1j19J02j93J62k91
5698b31J92J30j74L28l2j92j43J22r2j48J83P0l8J23j23J58j24l1pj90P2N6J78
5721H7J3j51o4j6R6J92k66K03j49J80j53RR7k22L19j24k0j2P4j47J7j7J16Mo0
$$ y = [-34, 112, 52, -6, 65, -96, -17, -30, 17, -91, 143, -8, 14, 33, -90, -38, 90, 107, 47, -41, 43, -22, 107, 44, -164, -122, -9, -146, 19, -23, 20, -44, 114, 13, -32, -28, 0, -121, -295, -91, 11, 52, 67, -16, 110, 17, -74, -114, 31, 7, 238, 65, -110, 31, -28, 75, -238, 38, 64, -238, 212, -51, 228, 257, -174, -3, -23, -73, 284, 66, 44, -82, 43, 5, 60, 9, -22, -70, 35, -47, -37, 46, 97, -74, 94, 350, -81, -86, -12, -163, -46, -12, 79, 3, 102, 122, -32, 20, 152, 77, 11, 98, -106, 95, 69, 61, -162, 15, 41, -25, -17, 29, -17, 61, -66, 46, -74, -6, 39, -59, -69, 1, 137, 246, 17, -53, 49, 116, -29, 63, -2, -37, -57, 36, 106, -44, -236, -41, -73, -36, 111, 49, 53, -133, -72, 139, 108, -11, 91, -102, 60, -231, -39, 91, -83, 245, 213, 21, -122, 0, -92, -240, -57, 13, -25, 98, -25, 133, 9, -22, -29, -219, -147, -91, 87, 100, -51, -115, -131, -35, 157, -109, 94, -55, 125, -28, -19, 78, -144, 175, 51, 31, 19, 93, -54, -37, -54, 62, 66, 6]
5746Fj55K53r6J05j81j27J26J65j72J9J06O1K1k22OJ03K1k6J23j46M4j67L20k34
5770d7O5K0l5j88J48j13J90j95J4L1R2o1J40k79k1K67l9j20j15K36J52k59J48
5793C1l0j00J13J25o9k06J56J54j47m9NK01k51J7q2J60qm1Q4J2q2j26J30o7q1
5818a51J21K7R8q7J91l07Q0k3N3j79K06M3j27J5L4j11j19M32k23P8j36o2L7J15
5842Ej16O3J01or7K5q3R2J16k29q9K87k06K19o8j2k9J10j52L6O2P9m7j13J34j09
5868b7J9m0J04lm9M6k2o1n3L1J42j48o7O4J23n4l7J68M6j90J62k05MpJ7K23m4
5895A42j07J09o9k55K76k44P9J42M4j13o9M5M0P3K7j48LJ48L7j34Ko6q9L8k7J71
5921E5n3l9K5L6r1K37k54K41k18N8l7J28q8j2P8k03L0n8J56j10J87j3q1J77j35
$$ y = [6, -149, 104, 8, 113, -68, -195, -69, 96, -76, -57, 49, 110, 131, -91, -85, 18, 39, 13, 136, -10, 34, -133, 187, -47, 18, 38, 3, -185, -37, -150, 40, -155, -141, -110, -18, -79, 61, -218, -239, 28, -11, -131, -246, -10, 142, -117, 31, 1, -99, 14, 139, 70, -136, 20, 174, 27, -22, -17, 184, -67, -50, -132, 28, 20, -21, 63, 75, -7, -133, -3, -70, -151, -30, -3, 95, 8, 199, -108, -28, -51, 2, -177, 29, 72, -55, -40, -6, -117, -236, 196, -27, 51, -85, -147, -110, 5, -111, -48, 53, 47, -50, -25, -108, -16, 100, -129, -218, 69, -137, 82, 14, 2, -27, 83, -69, -33, 29, 108, 61, -52, 82, -27, -8, -48, 56, 53, 4, 50, 28, -33, -86, -55, 87, -61, -128, -64, 59, 5, -32, 136, 182, -8, 154, -51, -47, -54, -37, 186, 142, 35, 144, 75, -180, 96, -148, -69, 73, 117, 4, -65, -20, 20, 93, 120, -28, -25, 123, 160, 26, 28, -38, -127, -89, -116, 55, 2, -37, -12, 24, -67, 170, -84, 157, -61, -3, -40, 88, 0, -12, 66, -137, -107, -165, -9, -119, 68, 55, -26, 151, 16]
5946A6j03N1j53Q4R2r0J41j38J72j6o5r2K27q1K2k06K37o7k4p6o8J99j31L7J68
5971A36k34J66m3J73j98M7n7Q1j84J41j35J21l9J40J9k07l9P8J86k61RM3J1R0
5995D4J6R4j48j86K58m0L1Pj31K23j00j15q3J00J44r8m1Q2k9k2o1QP7Q7Q3j42
6021E8j24R7m5RK34k76J93j76J01R2j50o1j67K95j31o4J09R4p3O4l0r3N0P3m9
6046C0j7k19K59r6Q8o3J97j93k59J53M1oLK74r7j30K13k62M1o9O9J93k94J49j59
6071a54K36k55O4j10K14J38j17J55k49K1K9K70j70r1k4J21k28N0l5L73l11P6L39
6094C42k32j83J07Kj1m1o5J06r1l5K2K02j54j24M4J02N8Q4j9k66P0Q0j39J23l9
6119e7k3n8J33o4L8O9M9q5k0p6K19j77m8R4R7j16p7J60j01J93j52k59K61L4J1
$$ y = [16, -87, -36, -189, -105, -13, -103, 38, -100, 72, 56, -9, -101, 126, 45, 67, -139, 98, 31, 7, -69, -137, 62, -69, -32, 136, -98, 68, 25, 198, 0, 47, -10, 71, -113, 28, -107, 14, -25, 115, 134, -73, -112, -34, 152, -109, -100, -57, -46, 44, 60, 154, 6, -180, 78, 38, 69, 76, -55, 168, 68, -47, -130, -30, 114, 16, -25, 57, 28, 6, -55, -47, 30, 117, 200, 58, -66, 31, -14, -5, 229, -47, 146, -30, 71, 163, 13, -48, -215, 80, -51, -115, -6, 88, 15, 79, 49, -44, 6, 79, 30, 13, -206, 53, -43, 45, -18, 179, -14, -273, -120, -79, -85, -82, 192, 95, -35, 178, -84, -43, -112, -43, 150, -144, 5, -154, 82, -173, -109, -219, -5, 133, 16, 171, -78, -57, -28, 242, 72, -19, -43, 78, -150, -100, -135, 238, -73, 3, 342, 110, -73, 34, 36, 25, -16, -81, 25, -66, -101, -79, 123, -31, -155, -111, -9, 49, 133, 114, -152, -82, -2, -141, -18, -57, -80, -138, -5, -69, -31, 38, 87, 2, -18, -94, 125, -52, -100, -6, 91, -25, -102, 58, -43, 150, -2, -261, 0, 34, 45]
6144D5j47m6R3j0L33l70J6k8J47J04j45n4n8M00j42j11j41K23J52k72J69m8Q7
6167A97j05J3l31M34j78j85J28r1J62O2j83J60O5m6k41J69k3k11N7J08k16K90
6189C5O3l05O7J86r1R8l9N3k55L00j82jj7J77j69N5J01Nl37K04J84k50J24j3Q
6214ArJ53K5k10J49j0k1k27J69J3M1q7j11L7q2J48j3j03K04k82J88%M0j09R9j14
6240a11j2lN7J28j12K02j30j28J34j98L12j47m5JK53M8k99J27r1N0j24j0L6J21
6264E9o4o3K04M0k89k3K18n1n5J57k7k28J7M13l31J48J1j45k82M23j3J7l6j76
6288g6J68j81R4q4J49p0j4r2K46nj43n1j76J49J17P3j03L0O7j78L5P4p3j08J91
6313C9k68P3n6K33J37k58K97l01J65Lj9M1j56J4QN4mm3j20J76m2Q6q3k00J4P6
$$ y = [45, -102, -148, -55, -65, 268, -102, -86, -114, 33, 137, -8, -62, -120, 280, 138, 27, -114, 109, 261, -11, 158, 110, 197, 92, 105, -226, 208, 30, -155, -27, -118, 44, 106, -77, 83, 148, 102, -139, 30, 7, -204, -147, -39, -255, 35, 98, -207, -140, 46, -45, 53, 14, 67, -188, 112, -70, -71, -88, 89, -80, -25, 76, 81, -256, -52, 132, -118, 6, -7, 1, -8, 145, 170, -40, 109, 99, 78, -149, 20, 33, 74, -13, -124, -87, -169, -21, -34, -137, 67, -215, -27, -27, 13, -96, 3, -111, -123, -126, -69, 59, -53, 149, 19, -109, 25, -173, 139, -8, -53, -52, 201, 249, -50, 77, -14, 36, -88, -98, -62, 59, -5, -68, 136, 176, -113, -136, 82, 31, -24, 133, 106, -122, -105, 308, -23, 125, 136, -9, -291, 132, 119, 136, 100, -76, 92, -89, 5, -79, 70, 0, -14, -106, 140, 135, -8, -59, -235, -86, 31, 104, 1, 31, 98, -80, -45, 29, -44, -152, 39, -229, -156, -212, 21, 158, -100, 197, -104, 61, 64, 45, 86, -70, -56, -48, 6, 2, -41, -161, 15, -27, 59, -24, -224, -210, -134]
6339a34J23k25J81J09m5J1k71L28K9j75L8O5j9j42R7J9O5J02k21K34k44N0J63
6362A38l16J72J49j70j1OJ59m00L71j28Q6k86j4N6M67j53m7r7k8nN3K0n0K06k22
6387d4j2l2J3L39k48J82j81L7j45K16qk85J87j3Q0p7Oj93J06J28j74L7J52j52
6411h1oK36j98J29%r8L4j13L3M6j21K28q9O4Q2k34M6J22k16J24J45j30m4J8O3
6436D0k52L50k76j0P7N6j14K3P6QN9K0q0l2r0K38k38N1O1J05q1R4k72K72k75L79
6462A89k2l2j42o0K02p8N9l1m2n1QN4J0j76J18Kl7L3J74j60K4J8m5j11K42k03
6488e7p6R8k4kJ70r9J69o3j45N6k5j75N5M0J36j81K03J2J0n0m5j22R9Q1k3N0k12
6515a20K70k32P4j25Q5L6N4o8Q4J59k12Q4j52J3m3O1N1LJ24j66P9p8P2j76J4J49
$$ y = [-134, -11, -236, -55, 54, 9, 20, -251, 77, 106, -69, -31, 34, 15, -127, -30, -11, 54, 156, -65, 169, -75, -25, 138, -178, -6, 143, -27, -38, -32, 127, -273, 98, -30, 56, -230, -244, -188, 279, 126, 79, -18, -46, -51, 2, 22, -28, 178, -44, -56, -88, -75, 264, 16, 198, 17, 54, -91, 125, 117, -168, 19, 6, 86, 9, 15, -178, -72, 56, -118, -81, 71, -81, -87, 149, -49, 80, 80, -18, 16, -97, -64, -18, -139, 89, 0, 64, 146, -88, -42, 80, -136, -12, 133, 3, -41, -23, 40, -212, 138, -138, -148, -71, -15, -129, -106, -30, -22, 37, 57, -23, -55, -145, 93, -145, -94, -33, 72, -9, 85, -187, 85, -190, 189, 167, 135, -7, -67, 135, 57, 116, 85, 43, -8, 0, 54, 64, -112, 6, 8, -29, 4, 178, 18, 42, 60, 15, -96, 146, -57, -133, -35, -59, -61, 109, 10, 179, 116, -29, 27, 2, -173, -118, -78, 58, -123, 80, 92, 102, 52, 7, -115, -16, 65, 42, 92, -120, 150, -82, -8, -133, -48, -12, 42, -26, 58, 217, 5, 89, -63, -50, -93, -32, 19, 22, 146, -20, 59, -19, 53, -123, -109, 40]
6541D0m5O2q6L0j2M3j35L07q3j19L7m1q4N4Qj05J59M5o6P9l6j5J3j85J79p3J80
6568A51m7q5r3K41k23p5K75p2K6k45J43O3L6j42J27r0M8J81k05m9mp6J49j02J21
6593E3k38K4K30j89Q2K55l17K3J03Q7n8j20J38n3k20J51K50o6j80k0k6K25k10
6616g6n6J22j2J34k50K58j22J65j49r3M9q3J71r6M8J42qj43J00j47O6q1k1K32
6640A50l44J10J56J17l43J46j10pJ86j38J04l21M24j39K5q9J18M8n4J63k45J44
6662A01j35O9rp9J0L5L0QP3p5L9k0o9K43l50Q2jM7P5j29M3k07K21J4l0m8L5m8
6690g5J60j94n1J72k0o6J15K1k41K65O3j85K8l1k3N6J36k2K6k35p3J44N6k3J07
6715A10k14J03n2P2J7K2j60J99j88k6P2L4J27j40K24l43L42k52J17j28o6K44j72
$$ y = [40, -5, 57, -29, 1, -11, 32, -103, 204, 121, 2, 39, -2, -86, -32, -24, -129, 30, 75, 9, 88, 52, 37, 50, -135, 44, -29, 151, 104, 19, -74, 167, -56, -131, 144, 72, 98, -147, -4, 59, 95, -47, 80, -10, 38, 219, 14, -35, -39, -115, 34, -68, 53, -185, -161, 69, -120, -38, 217, -100, -77, 26, 113, 55, -65, 73, 20, -200, -49, 201, 135, -45, -65, -91, 134, -76, -132, -10, -22, 112, -138, 120, -2, 163, 14, -79, -30, -113, 58, -38, 10, 152, 144, 1, 101, -46, 20, -61, -82, 150, -194, -84, 72, 189, -154, -8, -118, -125, 61, -77, 27, -294, 130, -9, 16, -73, 45, 93, 39, 202, -43, 101, -34, 35, 26, -53, -43, -8, 22, 30, 103, 28, 67, 47, -22, 221, -129, -47, -48, -1, 74, -55, -12, -219, 2, 16, -14, -62, -27, -75, 85, -109, -160, 12, -8, -74, 41, 62, -179, 86, 149, -36, -8, -39, -62, -6, 130, 108, 134, -101, -174, -30, 26, 3, 110, -104, -1, -53, 19, 36, 58, -102, 97, -91, -117, -45, -11, 116, -24, 200, -143, 199, -53, 64, -64, -130, 114, -58]
6738e8J56o4j52L6K0J34jN9m0j35J25N5k98J90P6l6k29L2L12k13o2J58n5r6J81
6763I5q2K3RJ92k6k30j17J29J78l28K76k48K1J51m2r3m1J57j17M1P0M4M6j72J29
6788F5J74j39p3J56j54q0L00l93K73k74J07or8K52k55J33jl6P4m7j42M3K2K06
6812A07q1l1k1K8N2k22J19K13j44K6l0j14J18L3k8j35M6J28O9j1J39k32LK08k76
6837c6p4J88k52K17q5M1j5J18k44J49r9K15k14K36j45P7j7j15P5p4l2J52j85J97
6861G8J8j92K9L3J98L7j3k44J20n8Q9j66LJ37j68K34k08N5K37j24j54M7l0m1l
6886h6o1L35j91j5Q2j20R1p6K03j48j00K42k12P3J19j13P2n5J30j21j16J25J01
6909A59j92J72q6j22n0N1M3m2JN9L7q5O7J59r4K9m8J85j43q5m2j25K45k95K16
$$ y = [-58, 98, 34, -118, -82, -62, 72, 71, 130, 90, -45, 80, 135, -163, 27, 103, 67, -162, -130, 182, -31, -93, 65, 10, -86, 95, 13, 36, 45, 237, 211, -19, -136, -7, 171, -157, 119, -129, -108, 43, 1, -92, -133, 24, -93, -52, 18, 62, 108, -64, 65, 239, 100, 27, 183, 29, -51, 249, -144, 129, -145, -38, -44, -142, 110, -145, -12, -13, -49, 25, -22, -164, -121, -99, 107, 26, -5, -26, 2, 54, -168, -49, 164, 20, 46, 16, -98, 20, 53, 25, -110, -64, 64, 133, 122, 261, 29, 32, 240, -36, -110, 78, -174, 43, -42, -1, -16, 102, -142, 7, -92, 123, -91, 145, 0, 77, 60, -55, 20, -54, -86, 66, -119, 78, 96, -96, -67, -34, 164, 201, 188, -56, 64, 6, 95, -71, -68, 69, -99, 135, -73, -18, 219, 95, -59, -12, -42, -83, -86, -147, 188, -3, -18, 64, -56, 35, -41, 162, 14, -86, 156, -56, 17, 136, 23, 95, 40, 170, 49, -67, 58, 159, -33, 139, 53, -69, -119, -68, -25, -67, -66, -7, 30, -55, 12, 171, 77, 106, 58, 243, 100, 15, -27, -152, 93, -202, 14]
6934A4j3Ppj59J81k2j07J29o6K6ON0j7k5J86k22Q7j8o1n1L3p3j7L17j84J64j32
6961B6j3k08K85m2j56K36j38J60m33J09M1K68k12o6J25Lk9P7j37O5oJ08PJ17l09
6986a22J02N4O2k6j59J70m0J09k44rK35m6m9l4N3j86R7j05J58m5J95k55J27J8
7010F0j35J1N4R2o4o4J78J15n20K54j19J04K10k66K21l7j21J2J23j21m7R7Jq5
7034d7K2j14K89k79R9K55q6j1q1J80j05L7k15J79r1kj38J30l5J31j59J66J4j93
7058e4j8j56J56k50L29l4J56k7J8J81k88j37N2J83k89K49l38J27Q3J19L7j15K6
7081A0j13J39j9j6j73L55l25O5kQ9k7J0p9J37l09L23pJ15j72j01R9M0r6rO7Q1
7107H2j70lR6j16L7J48O9k84p4L10j31J27k68Q9J50j50J65j50m3K03P6j71M4j61
$$ y = [14, 1, 8, 1, -158, 23, 1, -106, 23, -43, -17, -11, 39, 22, -3, 183, -39, 48, 30, -31, -82, -49, -122, -139, 178, -6, 158, 26, 13, -195, 90, 48, -108, 128, -10, 150, -283, -174, -133, 135, -77, -143, -18, -15, -44, 33, -104, -39, -45, 63, 70, 187, -122, -20, 34, 96, 70, -89, 81, 41, 150, -94, -103, 132, 86, 37, 3, 56, -130, -33, -138, 20, -25, 170, -85, 42, 60, -75, -64, -10, 82, 18, -46, 132, 247, -273, -19, -138, -34, 176, -90, 131, 94, -27, -15, 108, -13, -60, 37, 38, -47, -25, -139, 150, -129, -30, 225, 139, 128, 47, 227, 122, 159, -56, 123, 32, 30, -108, 22, -13, 118, -41, 125, 139, -54, -72, -228, -72, -322, 7, -27, 129, 102, 120, 301, 13, -124, -72, 111, -178, 71, -267, -140, -57, 62, 99, -16, 10, -103, 36, 17, 1, -172, 183, -142, -77, -79, 10, -17, -7, -86, 51, -258, 65, 58, 173, 1, -100, -1, 39, -57, -66, 1, 82, -88, -91, 5, -111, -74, 74, 143, -141, -215, 95, -36, 91, -177, -88, 62, -88, 77, -73, -116, 87, 163, -8, 36, -125]
7131a25J1K70l09J41J84j71n8M9k2q5O3J12p7M3J3j9Nk3J06Jj15l0k0J91O2m42
7157b45J63o4J18J42j32R6k14J63J01k50R9J51j97K76j23o4P9j48p0O4J37j73
7179i1J77Q6j7l97K85oj67q6K82Rj27N9oo7J45j54J33n2n2j23M8J63j52J52k5
7204A7oj30K57k08J07o4P9j68J43n0J96j65O1J17j83q2j19L70n2j90k57L11N5
7227C9k39K60k16J20N1l2j74K36j65qO6l9Q1j74K88K8q5K1j18m5J96J29l23%K06
7252A03j08M3L9k01J17K9j17L15P2k19n3j25j9j09m8K49O9j00Q0M9k39K91j02
7275A6oj6M7n4r8N6j21K02o3L28l48R4j23J29r3O1k6o9o8J15J02j33m0J15q1K26
7301A52k41J93j29K46l39K08j6k9r8j24J31J5Q3o7Q5l1m9r5J78r0k5m5K75j45
$$ y = [-125, -114, 156, -153, -12, 172, 1, -57, -8, -30, -115, -52, 60, -17, 26, 39, 20, 25, 2, 108, 109, -6, -36, -56, 135, 197, -245, -82, -146, -28, 114, -18, 78, -136, 27, 128, -122, -23, 128, -69, 207, 84, 20, 99, -49, -119, -55, 82, -91, 86, 172, 155, -242, 43, 37, -130, -216, 66, 75, -52, 7, 1, -66, 79, -75, 58, 6, -46, -169, -121, 42, -110, 42, 17, 11, -119, 138, -70, 37, -27, 52, -116, 27, -23, 173, 8, 69, 186, 3, -79, -198, 172, 120, -70, -327, -16, 39, -200, 60, -156, -36, 15, -17, -191, 45, -120, -128, -62, -101, -20, -194, 94, 122, 37, 58, -60, -105, 91, 220, -103, -103, 103, -5, 38, 77, -124, -7, 22, -95, 220, 292, 73, 20, -105, -124, -233, -281, -32, 37, -63, 17, 66, -173, 118, 16, 10, -6, 41, -13, -111, -55, -176, 26, -37, 291, -57, 37, -86, 43, -50, 11, -15, -84, -152, -37, 65, -68, -108, 7, -74, 152, -89, 104, -25, 221, -118, 90, 74, 45, -53, -177, -46, -31, 52, -15, 70, 39, -10, -105, 73, -17, -42, -87, 188, 43]
7325D3j86J87j42K14q1j20J62j39ML3n0J99j26k2J00j62l1J02K12j44j89r2L10
7348H2j84J92P1j88R7n1K02j81k45K56O4k32J10N3j31k9K65k70K19j14R5k72J07
7371h4J59Nk34J15R3j93K40j36J14K7l53L08j41n5K41k54J04R7P4r7j3n6kO5J07
7396A31N8O7l08J82o9q1J6J33j00j57L20k25J61k01J06o3rK3J81k42k4J26M0M
7420F9j12o5K72j52L1q7Q2k76K52k1p6L69k15M8j24q9J25J58j87K28l98J71j72
7443a69J35L6o0N8o9j8J8Q2m8J57J9k39J07%P0J05k40j6J38m6O6r7pO1r8M1J9
7470Ej31K71j84J33j58K34j92K0M8q0l4j52K83j44J30o5J64k07J63j25M2m8K8
7493Ar2J95j57k8K12j29j33K96r9k76K99k6o3n0j2J14k64K86k1J93j51j10q4K01
$$ y = [43, -143, 44, -98, 116, 35, -85, 77, -62, -58, -25, -75, 124, -2, -24, 76, -86, -117, -15, 197, 53, -136, -228, 82, -102, 90, 161, -27, 70, 19, 221, 40, -205, 51, 115, -117, -7, 46, -85, -114, 151, -119, 100, -14, 81, -191, -84, 75, 80, -154, -39, 54, -139, 101, -35, 79, 106, -247, 61, -80, -135, 106, -148, -44, 53, 127, 30, 17, -39, -41, 24, 131, 189, 256, -52, 130, 61, -20, -4, 129, 29, -128, 192, -33, 128, -73, 33, -30, -39, -16, 165, -77, -101, 25, 65, 69, -43, -108, 164, 12, 43, -44, 38, -238, 14, -7, -83, 286, 71, 119, -5, -94, 31, 189, 2, 230, -168, 3, -169, -34, 2, -58, 0, -69, -87, -69, 13, -35, 122, 141, -98, 9, 9, 79, 184, -56, -72, 66, 20, 86, -11, -18, 43, -55, -14, 5, -126, 145, -39, 94, -64, 170, -22, -2, 46, -34, -68, -220, 63, -81, 49, -16, 148, -59, 104, -21, 21, -27, 1, -91, 104, -53, -81, 131, 2, -131, 165, 66, -210, 89, 63, 0, -50, -62, 52, -212, 74, 53, 246, 95, -15, -99, 102]
7517A02k55N4NK16k48J2l1J14J87j57k7M1K1L6K04l79J02p1Q4n9K96l79L2N0m8
7542i8K12j63O2j22K30r7Pk20R0K9J74K7j66J22j30q9J23n0J96r2k5j93O7J03
7566cj4J35j81N1J05j77J92Jj14N8L3o1j49JJ85R6j55k02J79q7J27j67J87j05
7590f5J34O5j63J60n4r6J82k53o7J91j13J99k81M6J63k6j9J25o2K3j50K71k52
7613d2J2J9J1j1N2j56L7o2J12J01J36n0j29l1k4j4q7p7K9P9J68j30J56q8n1J09
7639F9j81j7K13J0j58J51n3m5J06nr8P1J57k74J75j87J12j4j63J75j58P2K43k99
7663i8l4J73J49k36J75m3k47K10p8J54j60P4j41q2J80j28L8J87l69M20l2j63m0
7686i1J35k7Or9J03m5J8J65j27j76n7K91j44j10O9R9K4j01J45j15J6J05k85K59
$$ y = [102, -153, -99, -94, 122, -126, -114, -145, -31, 156, -1, -28, 13, 34, 70, 274, -105, -3, -74, 10, -49, 247, -132, -100, -50, -98, 114, -49, 13, -109, 121, 24, 31, -189, -99, -70, 104, 131, -35, 87, -43, -132, -9, -59, 137, 45, 20, -173, -106, -3, -17, 118, -63, -12, 93, -84, 108, 109, -5, 53, 86, 25, -124, -123, 62, 158, 3, -199, -20, -107, 20, -147, 40, -65, 69, 134, -29, 131, 77, -19, 163, -90, -157, 34, -79, 120, -161, -115, 48, 22, 3, 128, 66, 89, -61, 210, -42, -30, -11, 0, -11, 41, -115, -78, -140, -28, 73, 209, 159, 30, -1, -25, -39, -126, -203, -174, -95, 73, -57, 99, 11, -40, 69, -112, -129, 84, 94, -64, 87, 34, -11, 95, 90, -8, 63, 220, -54, 121, -66, 46, 32, -131, 44, -114, -42, 201, -98, -132, 41, 190, -46, 129, 86, -161, 49, -29, 125, -35, 39, -102, -184, -4, -132, -94, 93, -276, 144, 112, -51, -91, 44, 17, 23, -76, 27, -18, 0, 165, 38, -138, -195, 96, -48, -158, -89, 10, 34, -67, 78, -37, -21, 84, -201, 58]
7710E8l1n0J49j32j26J06J23j75R8J04j59K94j30L3l50K71L6k50K44j80J13k2
7732B4k64L50j38k5o9%N09k01k99J17P8k10J81o3n4j91K65K1K2J24k22J25k17
7755a37l3J67K3Q7j03n6R7k9J15j95q8K47l2n2L6J0j03Q6l2L7j07O3Rr3o1R2J7
7782c5j9j04J50j80K81j20j10N9K72k28l8J25j11R9j94Q0J15q0K71k63q2J02j55
7805a65R8K27r1r9O0m7j9J41j32M9j96R9L2M0j9r7j2J63j19j96J88k8J12nJ42
7830A26k32K17N6j75j24J81j11NJ81j62P5k6K02m11J58K4n8P2J51j1j71n2O7Q5
7854F7j05J35k11J18m4j2j3J23o9J98r9j18J95N4j84rK7j27k0J93J9l17k6J58
7878f7J31j32M8p8J12N2k3m1K38j26J3j70k9J89j54P1k3L6Qr4N9M6J03j16J26
$$ y = [58, 27, -23, 126, -6, -132, -26, 97, -78, 20, 124, -35, 259, 129, 162, -188, 83, 119, -131, 113, -67, 46, 24, -240, 110, -28, -53, -122, -122, 387, 186, -113, 4, 82, -128, 53, -10, -64, -255, 10, 31, 53, 177, -45, 80, -137, -170, -3, 20, 107, 4, -52, 45, 16, 131, -64, -152, 95, 63, 11, 47, 57, -46, 40, 8, 45, -62, 1, 10, -83, -144, -52, -35, -54, -158, -8, -188, 93, -27, -137, -78, 194, -34, -72, 53, -58, 41, -153, -73, 42, -38, 233, -30, -112, -10, -165, -67, 160, 69, -30, 30, -17, -36, 105, -27, 22, -174, -75, -43, -3, -22, -119, -131, 32, -87, -283, -95, -123, -11, -16, 126, -106, 111, 167, -8, -132, 49, -62, -57, 124, -38, 37, 11, 213, -198, -40, -16, -74, -2, 149, 138, -33, -85, -18, 67, -38, 97, -114, 4, -40, -52, -65, 58, -11, 187, 88, -30, 165, 219, 35, 26, 53, -74, -94, 99, 118, -199, -225, -67, 64, -68, -20, -98, 14, 66, 43, 2, 240, 114, 127, -43, -72, 117, -37, 34, 11, 47, 55, -39, 20, 66, 169, 53, 179]
7903A79j96rm3J43j31j5J43j47O6N3J1lp2J28m9o2KK5k5m7M7j8J20m8Ll99K46
7930i8K12j5r6nj09J57J24l13K45j37J06L1j05L8m0j14k2N4RJ43k45J98n3M9o5
7955e1Q2J26m0j10j52K9L1L1K0J42n9j15L09j35k50K34pK2j35R2k52R2M1R4J92
7980B31k00pk5Lq5P0J02j75P9O0q5J18Kj4N3j44R2j65j6J33n5L0L3r2j94K95L5
8007G9j7j16j38J58j25K35k4k10K57K8k57l0J1K02j70N1P8J3n5l1J18k9J4R7j2
8032A27l8OQ2l05R5k5J03Mq9l5RL3Q8j25N1J52j35qj86J16P7j12K23r0j05L12
8058B25k46K0n5K71j62jJ75k73j37J25Q1J08l07K96k16J39L4k94J83O8l5J2J80
8081A91k57NL7r5R1l5M9J39j80R8J21k72J37K74l18O9m7Qk47K55O0m4j27K79k60
$$ y = [179, -17, -26, -69, 74, -57, -72, 71, -76, -10, 43, 54, 51, -21, 107, 58, -4, -2, 23, -2, -49, -2, -20, 100, 52, 55, -344, -98, 114, 99, 3, -2, -111, 46, 170, -143, 102, -35, 71, 102, -3, 35, -5, -119, -141, -87, -78, 65, -180, 18, -35, 14, -51, 31, 157, 117, 7, -145, -116, -85, -54, -34, 108, 49, -66, 243, 108, -142, 92, 85, 107, -28, 64, -188, -96, -55, 39, 231, 31, 24, -1, 2, -83, -13, 89, -86, -7, 53, -32, 86, 88, 74, 127, -17, 75, -90, -106, 27, -28, 2, 35, -57, -251, 44, 79, 62, -54, -192, -34, -159, 76, 52, -158, 99, 127, -130, -160, -149, 53, -117, -66, 12, 25, -30, -61, 57, 28, 42, 139, 127, 89, 95, 177, -128, -33, -58, 45, 49, -40, -75, -66, -33, 55, -70, -19, 133, -2, -10, -196, -80, -3, -115, 108, 18, -87, 225, -21, -1, -56, 215, 53, 52, 227, -46, -183, -58, 23, 131, -176, 120, -96, 43, 77, -217, -34, 34, -1, 11, 191, -66, -61, -24, -119, -28, -63, -14, 125, -55, 43, 164, -108, 29, 303, -15, 54, 7, 15, -232, 23, 83, 39, -88, 191, -69]
8106f9J17J14j57Rr4J46JQ4j50j86M09k40N2j07j20K38j00j23K29M1j43R6k03
8129a56q2L25j90K24k08K39j92r4J90R4j04n4J86j52j14J85j50n7Q6J17j83J27
8151C7j17J01L3J4J89l76K76l37J22n4N0k1P3J43m1k04J31j21R0LJ07k5j45J52
8175H0o2J58k87P9O3R4n3N7j44J7M6J60k20n8n2Q9
$$ y = [-69, 48, 162, 5, 14, -80, 66, 67, 151, 1, -185, 224, -16, 36, -71, -191, 47, -53, -176, 53, 94, -49, 47, -156, -238, 87, -103, 121, -87, 152, -40, -134, 56, 150, 46, -8, 178, 26, -88, 97, -53, -110, -24, 93, -90, 37, -80, 21, 54, 68, 257, -119, 157, -180, -58, -112, -62, -83, -10, 133, 92, -112, 19, -102, -12, -9, 98, 73, -72, 80, 18, 176, -111, -32, 31, 125, 72, 129, -15, 2, 48, 208, -12, -70, -122, -33]
8191c3
$$ Imaginary data points
##PAGE= N=2
##DATA TABLE= (X++(I..I)), XYDATA
0@%%%%%%%%Qj6J6j6K0k8L2m0M8n6O7p5Q8j04J20j40J64j89K14k42K76l13L52l94
32b08M42m97N55o17O87p63Q46r37J038j151J276j413J563j731J923k141K390k680
50a418L021l428L925m549N356o450Q021j0480J4898k5222Q8047M8471k22705L0090
64g2423J48277k3829j19889M0403P0852k5234l9334L0458O957l1736L114M5607
76C3223j6607n2225K2263N6784l8413n0583M7538M3424m3515j7107K6197j6852
88e873j5839M1678N263m7150L304M0856p197k7144L499J3773K892m567q611J288
102c828N753m841L543O792j4004j490K4892j0706l5689K4868M2350l0454m3409
115c6223K0472L2966n495j8361n827J4036J7836j6125k8044J2935K5595q036j5231
$$ y = [0, 0, 0, 0, 0, 0, 0, 0, 0, 8, -8, 8, -8, 12, -16, 16, -24, 24, -32, 35, -40, 48, -56, 64, -76, 88, -101, 113, -129, 147, -166, 186, -208, 234, -263, 292, -325, 362, -401, 445, -492, 546, -605, 671, -742, 821, -910, 1013, -1128, 1262, -1418, 1603, -1825, 2100, -2449, 2907, -3543, 4478, -6002, 8896, -16326, 71721, 120192, -102513, -72423, 75854, 52025, -67864, -27461, 43391, 18157, -21177, 9281, 16238, -15498, -12384, 33223, 16616, -35609, -13346, 43438, 5025, -45558, 1980, 45404, 1889, -15218, 10979, -5873, -21712, 19966, 25229, -21921, -18617, 22239, 15042, -12102, -8603, 5170, 8062, 3495, -5116, -3828, 1925, -2916, 627, 7419, -6585, -8075, 16817, 6111, -29578, -4710, 37640, 7186, -36223, -15751, 17215, 11720, -6641, -12468, 1568, 19404, 3279, -24765, -11830, 13765, 5729, -9502]
128i502K290O745Q669k802k1751M161L2249o273l2677M468J4710p561J0395J5117
142A8238k2825j3282K8072L712k9724k636K1526N508n025n697n580O158Q479n387
156A537p578J687O679O337j1438j8949J8003L1739k0335l1028K1457J8997k3016
169e908l592J8221j0513p137K1658m383k5321J2528K1665j4704j2634J3705M999
182H584j1711n092P710R002k453r315J716N431m924K281Q067j1089p262J7687
196H632o02k1694J0139K0371j4933r070J7673n724j7953J5140R636k0850J783
209g452K4247p053k3522N847J8764J239j4004q708Q543J0257p628o668P693O30
223B185j135R438p662k0646J2344K3283j6672j8143J8696J1724j4010n974L916
$$ y = [-9502, -7212, -467, 8202, 5400, -16351, -12190, 20059, 13786, -18891, -14423, 287, -7274, 3121, 18238, -4587, -17869, 10203, 13915, -15809, -18445, 3081, 8589, 3564, -2133, -7713, -1555, 6924, 1537, -6041, -4354, 2325, 8662, -2776, -21725, -3722, 28017, 7682, -23346, -1889, 17108, -5908, -9500, 8721, -1792, -8929, 12729, 8346, -16975, -4447, 17218, 2514, -10120, 3585, 8584, -3127, -8219, -509, 8493, 6040, -3275, -1559, 3872, -1052, 1229, 9296, -1793, -9055, 8632, 8030, -13664, -3525, 16846, 1913, -7157, 10516, 4792, -13161, 1979, 11615, -9235, -7452, 16795, 9742, -13780, -7933, 10831, 12070, -1934, -10642, -2099, 8158, 530, -6138, 1555, 2185, 1050, 10488, 2826, -17820, -5476, 17807, 1135, -17008, 1688, 13412, -598, -6572, -2656]
236b656J805P016m86j4204j300J2372J888m032k015m140O227J1058j3600j5505
250a7572J7283J3071j5846n654J1305k677m805P845j762q052P107O749q927q119
264a0054M440J1515K650j5247n665J9537M747k2578l81K0472n724j2138J0024
277A598J20j2129J1432J1382j7249n905J8679K44j6481j60J0380L279k398n876
291c084j868P849K566o408j312N48N71O760k165j3877N246J8323o819j4356O735
306a291O211n014J310p70p329R234R913j3803q477J4013L746q463J076n11m029
321d184Q685L309j3902j079J5462R22j1468k808N072M938o30q004k52R143j427
336C777o279L477m43l470R066J344j6755K465J8539p604j5302J0721R114r752
$$ y = [-2656, -851, 6165, 5679, -8525, -9825, 2547, 4435, 403, -1612, -5752, 475, 11533, -2067, -17572, -289, 12782, -3064, -8718, 2587, -90, -4895, 2950, 1188, -6864, 243, 6992, -1935, -10054, -5614, 5901, 8551, -6696, -12361, 7176, 11923, -10655, -11036, 9436, 3712, -8426, 1598, 1718, -10411, 1021, 12403, -4846, -10751, 7928, 8172, -8309, -8469, 1911, 5190, 2792, -3084, -4952, 2897, 5463, -945, -2257, -1709, -1138, 5622, 3457, -10420, -5174, 13149, 6330, -8026, -1291, 4920, -94, 1216, 446, -6883, 2351, 12264, -1539, -10016, 3997, 7743, -720, 356, -155, -4184, 4501, 7810, -6092, -7171, 8291, 9213, -2255, -5063, 9, 4947, 4317, -3687, -3939, 5204, 3777, -2502, 975, 532, -2938, 6128, 7472, -9283, -6818, 11721, 4117, -11185, -464, 8650, -1102]
350a102p07M716o613J068R855n794r993O830P849l878o396l37O903M934r001p847
366i513R666N995q813j078N110l647J746O269q539o630J2717M134j2567j639P706
381I17j44J92n13o549L837J0058p737r837Q548N818n914k9R46l865N168N216r243
398c131m271R822K296o819j775J716K848L530m486n362N883L659m686r0J61l947
414d652P121N323j3128m136J7402Q65j6719L000J1577n237m024M577l258j602
428b891Q333j219r033K273O909l9m652m068K772P784k532r792M287Q388m815l055
444a350L175l353M8Q373m743r978P862R198q693n062M963J371P37P63p058k88
460d035J0195j209j0170K969O209l082k2M18n155K600Q480n628q778N752P339
$$ y = [-1102, -1809, 2907, -3706, -2638, 7217, 1423, -8570, -1740, 6109, 2231, -4165, -4502, 2401, 7335, -1666, -9513, 153, 6148, -2665, -3743, 1367, -2280, -534, 5735, -2804, -9434, 3283, 7417, -5150, -6789, 917, 773, 965, 452, -6097, -2260, 7798, 61, -9776, -1228, 4590, -1324, -1353, -407, -4272, 896, 6112, -3131, -7402, 2420, 4716, -2103, -3878, -2162, 686, 4216, -270, -5632, 251, 3910, -776, -866, -705, -4652, 2469, 7792, -5336, -9472, 7930, 8795, -7924, -4924, 6653, 1416, -2608, 1969, -1289, -2891, 5442, 4223, -4810, -2537, 4372, 4333, -319, -4387, -1615, 6169, 3637, -6155, -1868, 6520, 1705, -1350, 1825, -1528, -1480, 6893, 2150, -7828, 34, 9232, 539, -4523, 440, 1811, 2548, 3311, -3747, -4035, 6160, 4951, -5219, -2250, 3959, 877, 855, 1273, -3882, -1282, 7198, 1570, -7208, -1456, 5883]
475E883l352n553p24M570M825n563o483O309M503n879J86L338o241J902J0534
490H255p946j1968J2394R702j3705n636J1250J362n942J840l4l259M196L024n301
505a768l171L609M904j019p225j495J0269J813j1245l36R053k571l563M387l526
520a884l794R705K040j3257P90J2623k556q552K249L069M14J872l914m280O398
535I23M572o374k999L230J864J260j433n509K420P642l417o667L534K929r44R36
551A967k678l886P205M257r404k799Q842K98n289J545j38j081N190o34p866K492
567a979P491l581m182K110J60R82L077m260m077O438K813n989j342L463q9Q46
583A881J46m690R72O494k258o277K432L375N3r00l430j198P272Q64q915J160P407
$$ y = [5883, 2531, -3022, -3746, 824, 5649, 86, -6397, -88, 4415, -1464, -1278, 2060, -4181, -2279, 8255, 309, -11659, 735, 10437, -3268, -8904, 2346, 3708, -2234, -394, -428, -3687, 509, 3533, -1768, -4939, -1330, 3574, 2555, -4670, -6165, 4104, 5917, -5328, -5664, 3389, 818, -2745, 1642, -1884, -5678, 4027, 6067, -7190, -6400, 6223, 3667, -4885, -2636, 433, 847, 2719, -1195, -5475, 923, 5495, -879, -3878, -648, 1216, 2476, 1043, -4466, -2046, 5596, 2179, -4488, -954, 1975, 1031, 1967, -711, -4597, 2608, 6865, -2539, -5338, 3504, 3802, -1487, 58, -80, -1161, 4029, 3395, -4471, -1979, 5512, 1931, -2251, -141, 19, 1001, 4078, -182, -4259, 2179, 4992, -997, -2339, 1124, 1035, 1881, 2027, -2663, -1691, 4803, 2545, -3732, -1300, 2075, 2128, 1228, -2202, -3400, 3872, 4736, -4179, -3019, 4388]
600D388l726l672N093k146m124P350J134j0228K070J0111m536q155N408N012l546
615D33l154J421J444K43r40M76M97l231J159N924m071p995Q154P724j1636m812
631h364J2632Rj0234M422N906p566k98Q085m915o954P860N670p365n448M986N942
647D368k522o338J378O140j502m808K900J239l695M443L176r343j521J2258j519
662D654j2110L931J0309m566n911K919R22J57J884j666k939J817K198n1q26k825
678b103N27O279j654q251K991P396l946m119M006O30k619K759p51m614L753N147
694E431m041m926J917L847J415l190m853M087O546n221o070N207L158l671J724
709A360o8n270M084O521p609n728R618M284q736l396M703K340J68j724l092J282
$$ y = [4388, 662, -3010, 2083, -63, -4187, 3163, 4297, -5931, -3861, 6250, 1714, -6441, -1033, 3979, 433, -2721, -1300, 144, 387, -553, -77, 420, -2811, -1652, 4272, 201, -7794, 360, 8084, -3552, -8364, 4268, 4277, -5957, -1535, 4371, -3195, -3493, 4592, -323, -7277, 583, 6253, -1112, -6560, -1574, 4368, 1846, -4492, -3114, 3026, 1524, -3284, -384, 855, -2840, 1603, 4779, -4564, -6085, 6173, 4654, -7456, -3525, 6784, 2218, -3693, -774, 148, 305, 2189, 523, -2416, -599, 1599, 1548, 722, -2103, -1576, 4703, 3049, -5202, -2211, 5185, 1239, -2880, 1126, 1756, -863, 1896, 1145, -3469, 284, 5431, 1390, -3536, -1619, 2228, 3643, 453, -4400, -313, 6233, 1012, -5058, 149, 3307, -364, 1360, 1292, -3978, 106, 6627, -982, -6710, 2908, 7192, -1544, -4940, -237, 2103, 2271, 547, -2545, -1263]
725a263L659n44k894j162N38M582J311p900j999Q928P86o955R65L840l028Q34
741c02K654o124q76J0021n43j0308P46P446m03l275o39r12K607L382l683m757
757d966L031M919j59m142l010L414M733m253m865N966L263n496q57L139l128J172
773a239N938m581o547P261M199p792j861O653L04l190J029p24j403K142J103j597
789c05j51M03O93K27k732l20N670L18p252O42O272k826k722L389n50k260M447
806B943o4o940J283P230j588n097R40K247R48q15l541J410N527j490o140J380
822a767L645j476Q36N20l894J264N305l109n670L627M451k050k191l33l42K283
838A099Q45k494j52K064j184m57N13k180J574M955l650o036N180M041n648j266
$$ y = [-1263, 2396, 1852, -1042, -2204, -1666, 2916, 4227, -3673, -5672, 3256, 4042, -2913, -1948, 1892, -1136, -302, 2352, -3772, -4648, 5373, 4830, -5478, -4732, 2714, 2311, -964, -1603, -2515, 92, 3474, -209, -4966, -1935, 2984, 2825, -1317, -4327, -913, 3820, -433, -5298, 668, 3931, -1565, -2422, 717, -2411, -1239, 4699, 118, -6429, 832, 5031, -2761, -4622, 2031, 2335, -855, 174, -550, -1953, 189, 1292, -305, -456, -53, 640, 867, -1865, -2185, 3485, 3803, -3449, -2807, 3465, 639, -2083, 1306, 756, -1504, 2943, 2879, -4061, -2778, 4452, 2864, -2233, -1293, 954, 1902, 1087, -2454, -1044, 4483, 2993, -3147, -1767, 1878, 402, 1238, 1758, -2136, -872, 4433, 1324, -4346, -719, 3732, 1682, -509, -842, -1184, 1099, 1944, -550, -702, 1362, 178, -279, 234, -1946, -372, 4583, 933, -5103, 77, 4118, -1530, -2796]
854b796N235j657k335L235j855l765M067L683m283k060K845P28j848j087Q53L076
870B036k64m234P1L563j157j379K388j684j406M319q36p015L175P782m045n445
886d131M034J462l040J504R62l171J759L789l746l601L264L126n43k606k081K458
902e61L005k401k891K434J698k12M27k789l631N983M733p245l501P152R81n229
918b047J171J763j569K140J689n483j711N952J371m013j096K312J698p71l376
933a970l57M483Q54l526L93O34j966K306J957m089o30O160j824o259K347M486
949B999j997j271N82m85Q37Q10k385l37L216k67j739J56j531J67M236j141n211
966c361K903N052m611l737M036J693j972P28r61k116K391K453k627j983J694K215
$$ y = [-2796, 2439, 782, -1553, 1682, -173, -3938, 129, 3812, -471, -2531, 314, 1042, -806, -1893, -1040, 2036, 1772, -2462, -2391, 1172, 15, -1364, 1024, -660, -2066, 2253, 1417, -5598, -2423, 5359, 1314, -4131, -97, 1365, -1675, -171, 791, -2380, -621, 3168, -578, -4179, -915, 2211, 1668, -938, -3019, -561, 2444, 43, -2848, -414, 1284, 1072, 1499, -1290, -4921, 1062, 5795, -1450, -4951, 2201, 3182, -2047, -876, 887, -682, 1458, 3147, -2336, -4047, 1905, 3276, -737, -1833, 479, 2177, 1406, -1970, -2327, 2156, 3010, -516, -123, 511, -1455, 851, 2808, -1281, -1911, 4249, 2425, -3834, -1487, 2999, 1002, -269, 313, -172, 665, 1475, -910, -1247, 1969, 1702, -37, 119, -1412, -1245, 2991, 1850, -3361, -458, 4594, -17, -3754, 282, 1975, 3, 731, -230, -2346, 45, 2498, -129, -2112, -418, 1797]
982A797j09l550k382N069L782n704k782M913J08l339K697M43m131L184M754o239
998a489m311O961L171n505j684K846N51n62o48j017J333J387k82q16j923n04M327
1015A835J390n995q58O701j304n858K617M049k942k64K321l102j306M597l02m063
1031b484J696K856j667j554K26L84J939J09k990L52K608j224j316J143j31K39
1047A86K098j958l388L480K570l571o94K249n46l87J017k440j08M455l86m954
1063b377J115L181j092m94J15j492J414K738l355k782L430K361k274j157J99j44
1079f14J981J87l349N78L747q16k683J18N46R92J648k508k538L501J753l577l55
1096a389K108o20K36J128l083p09M700l43m297J128K770j548q45Q58j188Q69K401
$$ y = [1797, 1688, -1862, -4244, 825, 4607, -1097, -3879, 1034, 1142, -2197, 500, 943, -3188, -4, 4750, -1489, -5800, 1161, 4332, -1173, -2857, -11, 540, -22, -670, -1687, -354, 1033, 751, -65, -1988, -2492, 1835, 3225, -2770, -3628, 3073, 1769, -4089, -1472, 2577, -365, -629, 1692, -1410, -2716, 1881, 1579, -2484, -788, 2068, 401, -1153, -927, -543, 1396, 1505, -1485, -1133, 1475, 251, -1065, 78, -53, 186, 2284, 326, -3062, 418, 2988, -583, -1277, 972, 426, 39, 1056, -1384, -1492, 2963, 2577, -2377, -1262, 1919, 827, 333, 448, -1044, 370, 3108, -247, -3029, 401, 2762, 488, -669, -470, -614, 1367, 1554, -1795, -1217, 2530, 1714, -969, -851, -305, 687, 2335, -173, -2711, 790, 2543, -1034, -1389, 719, 99, 335, 1463, -1620, -2329, 2371, 2028, -2269, -1141, 1629, 81, -764, 94, -1094, -225, 2176]
1113B176k493k147K472J339j388n32j18K38J888j302k726J717K855k080j094J271
1129G6r39J45K352k177k869M567J754m908p46L920m24j529R09q22r52K955m73
1146H39l224R31K851m03j230r99lK545K34l310r6L519m27k302J083p61qK956q24
1165A371m218J604M152k234k555J810Q12l23R20j789j886L557J429l536n84K300
1181H30j77k52J06j624P16L029j428l239J585K103r12p07m98m97K563M65l603
1198a540J03L520j010j710J165p86p97L184m35m302K167L681k789k707K439J028
1214A211j375Q24q06j121J908J129k248q16J384N97M64j353j922K259K727l331
1230d69k055L301O01k196Q74Rj526J834J659l579r88L876R1k752M18Q38kQ49q42
$$ y = [2176, -317, -2464, 8, 1347, -41, -573, -691, -453, 1435, 133, -2593, -876, 1979, -101, -1195, 76, -863, -718, 1634, -543, -3412, 1155, 2909, -1999, -2745, 1175, 751, -778, 131, -691, -1643, 1312, 839, -2385, -1454, 1397, 994, -236, -1235, -1238, 1307, 1541, -1769, -1865, 1654, 1227, -1075, 8, -753, -761, 2195, 1371, -2847, -1243, 2909, 675, -1880, -70, 742, 419, 1339, -450, -2336, 1221, 2650, -886, -1470, 830, 653, 401, 507, -1117, -401, 2628, 1200, -2039, -454, 1649, 737, 30, -468, -965, 1598, 2063, -1540, -1437, 2083, 1073, -637, 528, -258, -1055, 2129, 1694, -2608, -441, 3240, 451, -2256, 183, 1211, -164, 660, -146, -1267, 641, 1770, -478, -1294, 90, 687, 1151, -202, -2124, 135, 2862, -469, -2524, 777, 1378, -818, 56, 65, -1461, 373, 2032, -1547, -2535, 1341, 1432, -1320, -902, -64, -66, 783, -59]
1249e9k171K215J875k578p80J698m57M4R29j518j082L073j4l069Q38J729o25j62
1267a14r0r50J128J616k015j583K566K60j414O41j33j357K317P33l450K95L659
1284B109j158k588J679P97j099Q25k78j720J559J656j745j278J194O13J09p4j828
1301a227J002K407j534k697K374J375k066N76J40j686J609K334l167j523L476
1316A393N39k882M48J405r29O49L43k055K80K480o53j972O39R63q1K99j548n15
1334a197K701L1k533L71J340n52M41J55k279Q38L316k177l253K890K201k509p36
1351i52J361j248N80J922k558j260K881J302k528r61R81R11Q38j612j781K314
1367A90J636k313r21J451l60L26J301k398j548L963P59l959k52L048k78j137L02
$$ y = [-59, -2230, -15, 1860, -718, -1498, 200, -257, -213, 716, -802, -1884, 1189, 1175, -1894, -1056, 673, 48, -114, -204, -1154, -26, 1590, -425, -2008, 558, 818, -596, 45, -88, -1445, 872, 1605, -1845, -1550, 2109, 951, -1637, 42, 839, -260, 565, 287, -1433, 126, 1782, 37, -1241, -47, 566, 675, 601, -1227, -225, 2182, 648, -2049, 325, 1700, -366, 210, 350, -1336, 273, 2607, -560, -2083, 1393, 1932, -950, -502, 903, -26, 623, 966, -1089, -809, 1671, 1018, -954, -315, 648, 567, 866, -682, -1197, 1504, 1535, -998, -627, 713, 161, 602, 757, -1522, -684, 2632, 455, -2798, 92, 2293, -216, -952, 409, -839, -259, 1663, -895, -2155, 726, 2028, -500, -1461, -480, 431, 1269, -343, -2124, 190, 1826, -487, -1408, 43, -317, 9, 1310, -1088, -2636, 1327, 2086, -1873, -2125, 923, 645, -492, -190]
1384a90j031N32K055q19k474J213J561n67k41p87o36K365R53l701m53L721j38
1401A363k568O12P56k71J041l93k326J256K548j490j501M28O36R00k49k104K58
1418a104L081q06k708J211J592j560L70J170k419K02L384j514l272K158K517j916
1434C86j336J030M5Q71j9j494j04J193K17l77m77r87J195K226k397k409L128J737
1452B428l128m23K330r68q81J831j057j782K629J225l280n22K650%j292j77k60
1469f77J127O67j314p58J159J03m32M64r04m55K127J00l129R39K939j873j734
1486a651J867P4j237J353kj908J060J855j614j228J357K41j92k26q61K47K022
1503A157q02j885J086Q86p77L81J64j579J210J740k419j284K795O69k295J51J039
$$ y = [-190, -1221, -689, 1366, 547, -1927, -714, 847, 280, 39, -748, -1384, 981, 1934, -1767, -2220, 1501, 1363, -1205, -593, 163, -108, 933, 540, -1786, -530, 2018, 528, -973, -545, 91, 991, 742, -1362, -1104, 1977, 1171, -1537, -326, 1266, -294, 76, 1246, -1173, -971, 2413, 899, -2373, -215, 2302, 386, -950, 80, 125, 996, 977, -517, -621, 572, 789, 412, -65, -1052, 143, 2369, -28, -2437, 691, 2428, -700, -1123, 1207, 239, -642, 1189, 132, -1650, 979, 2204, -1076, -1598, 1052, 1052, -240, -417, -677, 450, 1117, -197, -955, 204, 307, -125, 339, -565, -1020, 1107, 1207, -1922, -983, 1956, 83, -1651, 216, 290, -947, 406, 404, -1504, -444, 1411, -203, -1431, -74, 167, -25, -251, -1112, -865, 1157, 355, -1530, -444, 442, -335, 46, 210, -1369, -159, 1581, -838, -2122, 673, 1342, -953, -802, 237]
1520B37p36Q68K63j673M57J641q46j129P99j04L24Q98j359j335K531O75k823L64
1538i48K214j009q07J012p43m92J986j08k243M68J832o52p72m6K63J158l11j760
1556i58N42J973j279q09J468q66p74K212m35l312J634L618k348k716K422J205
1572A577j583m7N47j048P12J022j410q00R63J097j5j119j377J981J380k435j066
1589a621K596K51k033R41L40j889J728K126l002j509L049N40k349q6J355k01M0
1606B76k96j103Q22J194q08p18N99k35N52M48j732m27K682J39k902N23J748r13
1624a51k91P72j007kJ581r90j540J504R39j192J50j02l84J147K81k059N68K337
1642A561r40j914Q98P62p38R52k83j602J036J686j756j045J370Q49o52k52p12
$$ y = [237, -499, 369, 632, -1041, -584, 1057, 211, -918, -119, -223, 101, 999, -360, -1695, 836, 1511, -1312, -948, 1266, 257, -550, 462, -281, -773, 1213, 1105, -1138, -670, 1162, 510, -262, -308, -45, 1113, 802, -958, -416, 1557, 278, -531, 937, 71, -703, 1509, 1074, -2238, -604, 3014, 666, -2050, 372, 1577, -6, -53, 494, -554, 158, 1180, -230, -1030, -67, 1030, 1015, -104, -1481, 500, 1880, -555, -1621, 975, 1226, -807, 134, 474, -1415, 313, 2439, -563, -2072, 977, 1517, -832, -918, 437, 236, 276, -20, -1123, -301, 893, 85, -633, -34, -269, 283, 731, -1001, -1428, 1254, 1393, -1509, -986, 762, -151, -442, 330, -677, -679, 902, -88, -1628, -124, 815, -377, -227, -329, -713, 434, 715, -1344, -776, 1561, 621, -1293, -395, 367, -371, 581, 298, -1304, -268, 1418, -338, -1383, -13, 836, 184, -68, -780]
1659g80K65J561l96j668Q36J067p75K3k19j027J249J751k174j580K444P33j748
1676d38K53P64p88O49P02k098m42K601m1j725M21L71k6O51r23q47J783J36j279
1695b76j64O15j34M38N88j863o0K347q76k145J291J699j620j71J021j193J59J459
1713A115r40j216J317O95j434j28N30K82M90k46j441P05J320j187n22R82l37j16
1731a31P91j257q95K145Q01k488J3J970p42r03M97l33J20J413n73j953Q63J458
1749G96q03l84K33m34P89N50j869m38K330Q8j564L18J71j72Q92j37j564P73J549
1768A124j091j058P52K05K32O54j211j041J929L13j624J29J565o61l00O48j241
1785f76l8J856m71j653Q23R74p87m21M19q8M84K67j133l10J424Kj119O03L0l87
$$ y = [-780, -515, 1046, 650, -1018, -182, 885, 110, 133, -86, -1113, 136, 1887, -287, -1867, 577, 1310, -438, -185, 579, -209, 440, 1142, -956, -1398, 1203, 1162, -563, -142, 229, 203, 854, -69, -916, 867, 1003, -276, -440, 175, 41, 479, 1067, -796, -856, 1491, 615, -1530, -239, 1460, -160, -331, 690, -503, -344, 1115, 175, -1041, 276, 971, -463, -591, -61, 221, 711, 465, -976, -271, 1049, -138, -660, 322, -15, -131, 660, -597, -1492, 653, 1454, -1034, -1021, 949, 207, -696, -199, -532, -412, 1001, 428, -1525, -662, 796, -7, -391, -158, -592, 197, 747, -1122, -1560, 770, 858, -706, -388, -217, -389, 503, 366, -1198, -425, 1124, 33, -1025, -273, -68, 164, 818, -393, -1434, 495, 808, -816, -687, 878, 217, -83, 565, -676, -714, 1142, 671, -982, -159, 815, 28, -393, 26, -62, 422, 689, -444, -754, 670, 672, -447, 156, 186, -201]
1805b01J163q98j435J757J485k271l25J261k04o16P05m06o35J548P9k062L31J668
1823I44k93n96P8p10O65J153j153j357J552Q57j100k21r7J5R92J23j570l6J728
1842I74m51j324P43l4J80Q59p88j665J100J850j651q90J442p2m95L99p36l39J473
1861E75M19j581j3Q55r9k07l42k52Q65P74j764o28J476M93j235N88R4q09P92P06
1881G07j713J96J825p26j262P75M38m86L48l6j020R35P59j080m85J107m7k81K24
1900A78o93p5J091k50j009O10J192p08m81j78j94Q35O70j210q74J775j29r05K90
1919f5J56l25O89K66j655K62J838o33j270P11N83o75M54k78p06J059Q96j462m09
1938e64P04J66r6J09p53K72J224q26j131R60P15r27k2O27p42K68R99j238n69J383
$$ y = [-201, 962, 64, -1371, 386, 1871, -400, -725, 536, 332, -284, 421, 15, -620, 928, 1007, -1055, -724, 944, 651, 55, 133, -577, 88, 1241, 88, -1269, 283, 1140, 40, -181, -278, -263, 729, 852, -718, -754, 974, 523, -801, -58, -92, 88, 947, 159, -1506, -406, 1444, -207, -1097, 345, 273, -222, 177, -559, -898, 575, 994, -587, -600, 255, 156, -51, -393, -645, 220, 994, -770, -1398, 78, 571, -664, -76, 18, -791, 1, 707, -1006, -810, 1015, 289, -973, -198, 240, -246, 102, 66, -954, -19, 740, -340, -825, 282, 235, -46, 178, -515, -590, 501, 251, -758, -148, 1044, 336, -145, -323, -517, 318, 988, -222, -1096, 679, 550, -355, -65, 91, -234, 455, 721, -934, -672, 1166, 533, -737, -26, 557, -118, 336, 58, -648, 411, 1307, -155, -564, 140, 306, 210, 319, -434, -162, 1062, 236, -895, 65, 780, -147, -169, 458, -284, -16, 983, -255, -824, 559]
1958E59K0j033M25K95j90L26j86q91N91P87r27n85J037J66p01Q87p08o26J161
1977D07L44j350J09J114n62m68O00o03J05J034r28p89R67N82j007J02M02m90L39
1996i2O10j179k40J694j61j500K67Q23l64K06j31p55O76R16q11n91K70N69j22
2015H5j9n88j42J664n23j545Q38R15q75j69M74o33L03J312j059j273J152R19q76
2034d0n36O34L0K24J19r29j15J289k24o74k8L34J46M31p39n63R02O90j172l44
2054e65J022q0l39L30n97j91J305k42j314L02J128l29m90J23l41L40Q26j035p68
2073i15J170P64j285M5K48NN49o7j105P3J437n43q93L31J65L6L40m56q02J338
2093D35L81q30o45P73M5j60L34p33j5J189m66j102L14R11l74k17R8m78N91O42
$$ y = [559, 579, -454, -29, 266, 76, 402, 216, -675, -84, 703, -224, -809, 228, 394, -307, 580, -128, -754, 407, 751, -599, -490, 624, 62, -406, 194, -409, -304, 730, -198, -987, -20, 562, -445, -343, 59, -431, -92, 518, -661, -901, 793, 632, -868, -601, 222, -142, 64, -67, -822, -146, 770, -41, -632, -362, 207, 85, 66, -522, -664, 1000, 477, -1068, -230, 685, -190, -359, 115, -518, -215, 1097, 38, -1235, -83, 836, -40, -576, 58, 88, 312, 431, -498, -613, 676, 452, -222, -250, 84, 230, 661, -78, -641, 261, 951, -221, -565, 457, 377, 38, 368, -229, -420, 885, 643, -671, -369, 759, 430, -60, 63, -278, 62, 888, -147, -915, 255, 1019, -266, -221, 27, 32, 581, 514, -591, -518, 919, 376, -517, -186, -21, 15, 355, -101, -903, 435, 816, -14, -659, 114, 159, -1, 333, -400, -415, 774, 308, -794, -480, 431, 57, -160, -62, -540, 51, 693]
2113F93r44o93R15M97q09J19J65jL50k35p74K93J078o21o19M11LJ11L79m39o71
2134g92R98P07j394k08J255m48l13K05j48m30R50J16j162L84P09k36n25J46m4
2153b30L42J47o75r6R16j69n87M25p5l57Q12J58j269L64J361r35p90R50j7m85
2173b10M19k7n24P18K88r18J10P41m30j13R7l58J75O15m97o13Q61M87j051J02
2193a28L58m31M63L10r03j39J191l67p08L45R5q6L13j06q90Q67O13r41l51P85
2213B90M5m45J31j24l54Q56K92j355R7J104l36m98L88m29K38M14n46o75J021J71
2233B85n81O8J11k21O33Q7j097L34J050m21p64M27J09k85L12j43o48O97O26n45
2253C4p76Q00J12k96R1k00j05P92j25p59K77N17m93J2K11m63N07L15o09n54J074
$$ y = [693, -251, -944, -29, 468, -341, -222, -57, -58, 292, 57, -717, -424, 654, 33, -586, -175, -172, -61, 318, -121, -792, 206, 913, -481, -689, 566, 118, -195, 10, -138, -568, 382, 498, -664, -280, 429, 193, -332, -186, -230, 112, 259, -416, -512, 404, 235, -352, 73, -2, -359, 453, 611, -658, -294, 1067, 132, -658, 292, 275, -210, 209, 182, -342, 376, 664, -254, -144, 597, 167, 54, 151, -207, -32, 583, 86, -527, 334, 821, -230, -128, 230, -201, 262, 572, -331, -470, 721, 354, -354, -9, 86, 0, 313, 207, -683, 184, 797, -144, -495, 290, 335, -110, 21, -103, -457, 399, 691, -664, -567, 537, 201, -297, 91, -338, -100, 314, -232, -907, 114, 285, -296, -228, -117, -338, 295, 382, -715, -381, 669, 248, -516, -89, 20, -265, 47, -96, -744, -47, 579, 34, -742, 58, 170, -126, -35, -235, -340, 452, 327, -432, -155, 362, -131, -119, 92, -371, 136, 451, -158, -712, 362]
2274C62K00q84J86Mp2L89K90r91jJ044p8r16M40K23j49O5m4m96N24N92r37J5M23
2297A89J33k60N8k82O0P25m51o97O38L88m51p3K58n20L59N60p26n09R69J21o33
2318a44J33K58k41K53J06q17J15J010n18n54L41K59j74K73m79k34P23K19p86k14
2338d71O50Qm04J87j53M2O57m27p53N58P52o19j14pj11J45N79p75k73O17K81n39
2360a70m6L67j22K50j36o16K11O13j57p30M98N6j7R3k59k28N98l2o53J98N50j51
2382A17l94M67m89N9O33l66p94P23M14n06o5J84j56J18N92p65j57P45p0k73o3
2403d6J09J77n3r8n69M75N10o46k52M70K22k52N3k61j69O28K99q86O1Q23n68k03
2425a76K40k43Q7P48m53p51O55K65m07o9K28j53M05k7o09J57P63l39n42J1K33
$$ y = [362, 562, -322, -136, -132, -204, 185, 475, -516, -517, 527, 449, -467, -27, 196, 47, 112, 68, -428, 96, 688, -249, -234, 189, 322, 62, 120, -162, -102, 623, 172, -525, 113, 501, 50, -23, 235, -285, 74, 634, -92, -601, 368, 489, -144, -11, 247, 6, 259, 365, -452, -337, 673, 155, -399, -58, 201, 27, 300, -179, -413, 310, 529, -257, -471, 179, 187, -217, -30, -183, -141, 516, 89, -664, -106, 646, 27, -87, -94, -205, -60, 519, -256, -529, 88, 369, -170, -216, 151, 29, 279, 143, -473, -262, 351, 194, -536, -38, 18, 1, 94, -165, -393, 205, 173, -480, -282, 268, 117, -277, 190, -299, -240, 393, 27, -767, -44, 370, -136, -201, -17, -173, -55, 537, -228, -385, 360, 290, 17, -46, 63, 240, 187, 89, -480, -5, 505, -141, -393, 77, 299, 47, 100, -161, -330, 298, 597, -289, -228, 595, 27, -176, 64, -179, -92, 656, 203, -548, 107, 372, -35, -104, 124, -29, 376, 349, -260, -103, 660, 321, -221, -210, 23]
2446B3P4J22k7o75M66P84q78l91O68q3m06L07j42o0M99P0p40K37M32j64l63K21
2468b6k62J07P38m15n43N80K32n96L8P0K16J57k13n92K31O52l50m21M33K20l52
2489i6K22l15j72M92J61p95J6O99j82k87K36j49J6L28m2n65N8P32l49j89M2n2
2511a91J70J83n33q2N84J74n49N8K73k56N61j90p77M52O09m45n82O20O9k2J65
2532B91k75n11O48L86q14MN60k09k32K00j18k08P19j10o77M37L20m73L7K05l15
2553a35K35N28n59l68O31N4n82L27J40n14L13J82n56M6P07n25k92O51m3l15J78
2574A03J90n04N10p1n45N1L56j02o3N7l81K81M34k46l83N16J02m08l0J11j5J41
2596A04L48q27J12O19j03o32K86L30m21M18j37m55J06Q23p80j97N86k43j09K35
$$ y = [23, 97, 219, 192, -483, -17, 767, -111, -502, 166, 83, -323, -16, -158, -218, 281, 351, -389, -152, 280, 116, -247, -26, -288, -181, 557, 142, -401, 179, 411, -185, -147, -77, 139, 296, 83, -509, -278, 374, 24, -397, 36, 256, -96, 126, -189, -361, 131, 292, -503, -487, 212, 30, -257, -21, -170, -154, 174, 132, -433, -375, 357, 8, -181, -139, -191, -21, 162, -371, -453, 131, 305, -244, -186, 87, -169, 392, 202, -575, -123, 486, 41, -541, 79, 148, 126, 291, 16, -495, 153, 539, -275, -271, 289, 80, -152, 48, -70, -278, 441, 331, -346, 91, 411, -62, -25, 180, -135, 100, 628, 69, -299, 332, 386, -196, 131, 271, -243, 70, 252, -304, -258, 449, -76, -368, 283, 240, -75, 103, 293, -211, 299, 228, -317, -266, 90, -12, -75, -18, -399, -118, 316, 70, -313, 203, 305, -103, -133, -22, -37, 104, 452, -375, -263, 356, 253, -379, -93, 237, -184, 234, 97, -358, -252, 571, -209, -406, 180, -63, -172, 63]
2616F3l74J07N72k40m86P9N84k57r5P9l16J61M64l77m39N56K11n39j0K56n49L83
2638a67N91o46L4L42L9n70K03K82l52L80j04l97M66K23m92j31M96j85L5n0j98
2659b01k53P42k16m49L89M31l29l21K64j12r2N43l07n12P01R9m72J76R0l17K97
2680A51N9n75K75O38m98l90L56K30k01K17k90l35O22J90o37l07P81k05O6p4k91
2701b18O7M61J0o70K59N85l91k44J48k82J65L72j81n32P91K00o07jJ85n5J47R4
2723C03p84K82N76l06m01L53N0p1o3Km64N85J93n08J0M55k32k61L27j51r8O44
2745D41k85n60J75N00k97pK13m79L99J32l28n07R09J29o68R7K0o3L64Mn61K51
2767a21M27l89j75L28J49j80J54k55l73O68J33o81ON93m28j34L80j43k11N64j39
$$ y = [63, -311, -204, 368, 128, -358, -279, 305, 48, -47, 32, -284, -123, 341, -36, -475, 81, 292, -247, -257, -1, -550, -167, 424, -222, -188, 154, 193, -377, -174, 108, -244, 136, 32, -365, 101, 324, -168, -299, 197, 12, 47, -3, -201, -454, 288, 72, -377, 12, 443, 114, -207, 57, -55, -147, 396, 89, -423, 278, 377, -95, 81, 171, -146, 151, 210, -365, -90, 548, 50, -340, 16, 246, 45, 262, -28, -363, 259, 449, -188, -495, 286, 81, 147, 73, -218, -151, 310, 320, -350, -91, 494, 103, -141, 7, -275, -110, 262, 81, -451, 340, 540, -67, -68, 117, 62, 209, 303, -481, -199, 377, 71, -330, 23, 73, 2, -61, -59, -523, 62, 255, -253, -243, 212, -20, -281, 46, -105, -203, 441, 156, -404, -229, 271, -26, -33, 180, -299, 100, 232, -96, -603, 306, 435, -233, -136, -116, -179, 185, 189, -372, -121, 306, -83, -258, 70, 219, 39, 193, -62, -435, 233, 366, -315, -309, 284, -144, -278, 102, -41, -252, 312, 173]
2788A73m68L72J88l11n6M07j92o4L54o99K02N32l95k26J89J43j80K48n4m86M63
2809A40L27l82l98O85j58m16M28j26k51K57J32m68M9N57l03k3L7k07K76m3j50
2830c7k08L07K7j03k5o7J92j8Q0j14j65L20j19k61K07K61n08K58j25r0N35k18
2852A29k24P9L02k12n02O01l49j01K74n9l04L35K64m12J03L85m25j6K11L2n29
2873d18P78l97j48K39o0p8K87j09k30k8M27m47j96L46O6rj08M2l68L29M78n43
2895a47l47O71l2p8o6K9r6K0K85p17N68L87m52j48J90j52L87J02n19k09N64q0
2917A60l92K78J40k87K61m7l83L7M13j22k70L41L3j96MQ3l60N51Ol87P1mK16j58
2941a2K0p7P5K46K1m49L03J20k49l1K18l26NL50k54j94L65K78m33M8J56j70J01
$$ y = [173, -295, 77, 265, -46, -102, 305, 113, 49, 403, -296, -94, 438, 43, -183, 6, 149, -31, 217, 163, -323, 140, 467, 85, -313, 372, 214, -202, 226, 100, -151, 106, 238, -230, -181, 376, 73, 50, 87, -120, 156, 113, -37, -245, 62, 89, -14, -39, -106, 86, 68, 148, 34, -131, 189, 70, -191, 16, 277, -231, 27, -98, -188, 347, 129, -95, -16, 286, 74, -428, 173, -176, -277, -3, -62, -366, -31, 233, -179, -76, 309, -116, -132, 79, 111, -418, 360, -37, -185, 54, -6, -84, 203, 94, -136, -164, 263, -184, -380, -34, 32, 23, -85, -43, -411, -82, 396, -147, -494, 177, 145, 67, 1, 30, -66, -46, 239, -478, 90, 477, 25, -123, 67, -85, 302, 404, -115, -324, 240, 160, -232, 46, 186, -101, 160, 113, -270, -233, 180, 58, -212, 129, 162, -34, -30, 53, -307, 244, 250, -137, -66, -70, 146, -12, 8, -69, 6, 252, 273, -176, 127, 247, -2, -33, 185, -141, -136, 214, -40, -234, 131, 409, -24, 24, 180, 10, 111]
2964A11Q3l73J68K73m26k12M98r3j16Q1K7m74Q36k17n44J26N09k38k18K37k10
2985a72J06R6m6k09L11N2k33O5P5k27J41J22m11l3N92j42k74n2L88l19N2K34m35
3008c19M42J43l03j03J79j05P5j19%J17K03k68j46J07K32j14k88K73K7j64N94
3029D63n79k04M97J9r8m0J28j85K58j57l09J57J06R6k74J43K20l08J88r2l13M59
3051A75J17l50J27J71j62n6j04K6j03L81j54m06L12L89k63k71P8J84j02K59k02
3072D6l49M29j00j98K38J8j61J25M0l19J12M05k05k88J42J56j80K32j79k27K59
3093dJ67l27J37J65L2j40J37k02k96L89J12k43K64m3j36m2o9j00o7M51r9k12K32
3116A06Q9k78J68jk58J29Q1k86N6L87j76l27M31j55K3O9j03k32L19L10m93J12
$$ y = [111, 194, -179, -11, 262, -164, -376, 122, 29, -87, -6, 21, -453, 383, 166, -378, -252, 257, 19, -199, 38, -172, -66, 30, -16, -225, 86, 138, -95, -30, 45, -182, -41, 81, -330, -363, 229, 87, -187, -239, 149, -170, -118, 116, -319, 123, 266, -37, -140, 39, -66, 9, -110, -110, 7, 210, -58, -204, -97, 135, 21, -267, 6, 33, -131, 463, -116, -320, 177, 196, 98, 58, 186, 1, 259, 102, -207, -50, 56, 152, -122, 21, 241, -67, 121, 29, -284, 175, 292, -58, 69, 240, 78, 22, -82, -56, -159, 222, 68, -338, -26, 363, 100, -171, -93, 91, -11, 248, 46, -303, 126, 26, -172, 66, 84, -77, 48, 88, -231, -119, 286, 81, -207, -65, 91, -89, 143, -36, -263, -4, 163, -164, -27, 138, 170, 30, 167, -35, -331, 58, 170, -73, 191, 148, 12, -30, -99, -199, -266, 185, 86, -126, 106, 195, -83, 85, 84, -174, -45, 36, -250, -194, 193, 17, -310, 121, -34, -11, 58, -45, -277, 42, 352, -141, -29]
3138b9K12r9j87K47o2k24K34n7k76K76K07m51J32J26k84R6K73j78l5LK88m34J06
3161a16P2P8N2l9j4J03m5j71j32Q0M13k69J63r7j66L05J7l42J0K91j54j1K05j75
3185E8j08L9p1j14K34J35p2j90K43k02J98j19k25J27K27n4j89J36L3r5q9K98k87
3208h7J68N2l43j22M95j50N6P2l06R6J31%j97J13J58j71q3Q9m7J58o3j08j93K85
3232CO7k41J79K9j30K1L50o04M70N3j86m7k0M8m3J31j01j9O6O1j04j77M00j86
3256B0j7Q8k0n27L46K74l24J07k7J71j36J33k09J82k19N1j27L47j63j2J40J4k45
3279a53K46K38n44oL77j70k34L17J11k41K34j42j96J78K13l05j1J69R3k33k29
3300b88M24q4K20k47J25j81J43j17m0K75k03j24K06j06l23M89J04k62j66L97k35
$$ y = [-29, 183, 84, -103, 144, 82, -142, 92, 35, -241, 35, 242, -209, -77, 49, -235, -139, 134, -44, -79, -76, 212, -222, -116, -44, 34, 86, 47, 33, 136, 91, -80, -212, -132, 281, 12, 175, 78, -88, 217, 234, -108, -98, 193, 39, 28, 233, 58, -50, -11, -82, -196, 38, 173, 101, -89, 154, -48, 150, 31, -194, -67, 160, 106, -83, 53, 86, -9, -98, 200, -87, 81, 133, -210, -332, 163, 13, 69, 141, -165, -69, 62, 62, -135, -22, 136, -35, -118, -29, -76, 82, 19, -89, -282, 3, 70, -171, 8, 37, -93, -72, 278, -326, 144, 197, 11, -36, -56, -8, -51, 80, -21, -40, 26, 87, -17, -194, 206, 20, 3, 91, 71, -456, -110, 164, -160, -53, -80, 91, -45, 88, -121, 61, -158, -107, -234, 113, -50, -62, 78, 92, -153, 93, 331, -213, -219, 158, -12, -246, 71, 182, -59, 175, 33, -163, 15, 228, -77, -88, 81, 174, -59, -288, 136, 52, 272, 25, 150, -31, 112, -5, -45, 230, 27, -97, 109, 3, -320, 169, 273, 11, -155, 242, 7]
3321GN2j3k10J94O5p5j23J96J45p8r7j85J7P8K48l14j44J87l6Q4O7O1j27J54q9
3346F4k62K96j05j97J95R5r3N5j33l7K4K40j65l09L17j3J02j21lL6l8K43l48j3
3370a70J49K65k57n8K41k70l7J89k45R7L35j32j55j18r8J65K88l05J4J12L5m5
3392@j1O2j63L6L13l19J02K12j66%r6K47k58R0n0J4o3J35j8r5K45k19o3L7N4r3
3418f7J7J78j65j35M06k40m3O8K0j89K73j70p8L0J53J05j55J23k98J10J6p7K79
3441A61m6J17l15oJ15J8j40J02j0J03o4k1j62K80q5j97J57p5K82j01j70j53L99
3464A89k3k55J71l4P7j58J10j03j92J69J14j29Okj06J91k8k7q1J61l1l3J6j37
3488a35l4K7P3l7L7J14j51k9K69nk39K85m06M52p3m2l51K46m1K8j49J49n9J37
$$ y = [7, 59, 46, -164, 30, 95, 20, -103, 93, 238, 160, 63, -122, -105, -27, 221, -93, -237, -50, -86, -2, 65, 126, -1, 153, 64, -198, 98, -7, -204, -9, 86, -7, 48, -85, -122, -98, 142, -23, -332, -15, -28, 74, -47, -50, -14, -52, 191, -157, -170, -21, 244, -13, -71, 170, -100, -137, 52, -193, -96, 239, 107, -48, -166, -264, -99, 189, -116, -102, 10, 45, 0, -11, 51, -112, -76, 237, -82, 20, 232, 66, 66, -30, 217, -41, 49, -1, 13, -50, 85, 67, -28, 217, -2, -65, -28, 26, -67, -50, 128, -37, -172, 234, -6, -49, 19, 39, -150, 123, -47, -125, -95, 58, 163, 8, 131, -167, -57, -41, -118, 161, 115, 232, -83, -89, 26, 44, -96, 6, -4, 99, 35, 14, -148, 132, 47, -150, 7, -68, 214, 113, -57, -210, 189, 166, -89, 82, 48, 125, -33, 77, -26, -218, -49, 65, -64, -58, -60, -166, 25, -3, -30, -111, 50, 19, -14, 2, -135, -169, -142, -69, -106, -69, 45, -106, -135, 134, 129, -110, 175, -231, 221, 148, 106, -245, 1, -40, -12, -161, -12, -71, 66]
3512F6J0j11j54K56j9j40J18j7PQ2N8l22K04n7J80l23J70M4l1m7M2l5K06n7k65
3537a35J96J8m6r6k5P1n6L33l27O1J47j54r6Q0N9o2J29j49j65K1K59J7j01J39
3561A18l6j49J84l6m4J10m9k17K12R7q6k29K12j17J15K3Qpk37K78m4j88K89l09
3585a02r6J25j37O2K09p1mJ55p3k28N4J55q9n1K9N5Nj85L14r8j41P8j01RL35l07
3611i8O8M4K15j53J7j00MM4j17j38J95J65o1n5j8q9q4L09m40J11K24O7k17J74
3635F7k68J29L37j27n6j73J16L7j52L8Q3J03j28R8j89R0O2p5J41Pj04o5p2m1o9
3660b11L12K80l72m6J61mk89K85n7Q2J70l84q5K43O9l61K81N8n9j26O3j98L9L35
3684A86j16j14Q1R9k49J90j06Q5o9J15Q1k37pJ60J1k1J40j56O8K2l78J6J86J28
$$ y = [66, 76, -35, -189, 67, 48, -92, 26, 9, 16, 98, 156, -166, 38, -19, 161, -162, 8, 52, 21, -26, 16, -19, 187, 130, -135, 61, 79, 33, -63, -88, -17, -73, 260, -67, -6, 141, -13, -109, -29, 30, -32, 97, -52, -217, -196, 63, 80, -21, 118, 82, -67, 117, 81, 37, 147, 98, -119, 93, 190, 104, -125, 87, -30, 85, 108, 116, 109, -128, 150, 106, -82, 207, -102, -198, -73, -210, -148, 61, -10, -14, 141, 68, -160, -106, 49, -40, -91, -62, -7, -2, -187, 127, 29, -112, -34, -135, -126, 209, -98, -30, 14, 229, 76, 93, -7, -3, 41, -76, -214, -19, 146, 85, 30, 12, -77, -161, 148, -292, -181, 43, 110, -107, 67, -201, -72, 265, 138, 82, -91, 25, 62, -90, -52, 31, 134, 6, 104, -85, 5, 67, -8, 133, 140, 36, -29, -101, -142, -211, 101, 381, 9, -37, 124, 120, -169, 116, 59, 141, 311, -73, -158, 85, 154, -207, 74, 132, 73, -53, 10, -188, -149, 186, 70, -44, 37, 136, -113, 77, -29, 56, -13, 102, 183, -54, -61, 99, 110, 89, 229, 73, 141, 163, -215, -199, -13, 115]
3708A15o9J6j43m9K71j12q5K36k05q3k4J82j23J8n8J16p9O4K16k58j19PR3j4o5
3733a52J08J93j31p7L8J04P1k63K01j37j48L25j65n2M8j71J93l3j9j8K24j25k12
3756a98Q5R7J57j80J49lj04K0K5M6m3Q2k65n6K04m3l40L60PJ01l04PJ78J86R3
3781B61k47m0K12k26n7K65j61M8j38J23k46K35J37l80Q1L34k72j25O1J21j21K38
3803A03k16m4K52k6m22M25M5j39M5L9j2nP3j15J9R1q3j53J38J44k34km4L30O3
3828B72k27r4J44o9l7oP4O4m5m29L66j8q7O6Q8M1oj5k06J81q1kk8n5J56r6Q2n3
3856b0j8J07p2j73R1K4k2L1L2j13N1J32j90J73O8r7k15K59k4r2J59K4k91J38J58
3881A20j75J2R3l00OP4K57mj1l2Kq8L2l0K9J5j40L00o9j41r6K00m6%J40n9j39
$$ y = [115, 46, 62, -81, -130, 141, 29, -56, 180, -25, -108, -132, 50, -73, -55, -113, 3, -76, -12, 204, -54, -173, -166, -73, -87, -152, -44, 149, 18, -59, -21, 83, 154, -109, 92, -45, -193, 132, -33, -85, -37, -208, -15, -48, -67, -85, 139, 14, -198, -113, -16, 141, -39, 110, 107, 3, 23, 48, 94, 51, 133, -132, -188, 16, -27, -367, -7, 0, 101, -203, -196, -18, 168, 261, 14, -26, 186, -40, -97, 168, 7, 55, -83, 40, -206, 29, 166, -214, -133, 201, -71, -196, -135, -14, -135, 103, -113, -157, 95, 69, -353, 72, 117, -22, 23, 62, 50, 45, 118, 3, 22, 113, 30, -123, 15, 159, -75, -77, -121, 209, 272, 45, -49, 95, 26, -11, -17, 57, 121, 76, -353, 13, -5, -92, -26, 62, 103, 97, 82, -124, 57, -24, -26, -54, -109, 47, -49, 33, -20, -38, 69, -3, -176, -85, -61, -83, -52, -20, -133, -82, 50, -140, 33, 101, 4, -211, 48, 24, -68, 91, 115, -176, -38, 120, -55, -43, 50, -250, -244, -170, 87, 83, 72, 40, 42, -46, -14, -44, -15, 0, -140, 160, 91, -50, -146, 54, 8, 8, 148, 89, -50]
3908e0M5k1j08P0P5j09K20P0j78k0k5o7Q8L3j3j6L15l26j59m1K21l3r6J13K24
3933B12j88q3M4O8j65J93J0l5P2Ql5k8k96K59O5M1j86kL59l82J21J9q0J50j05
3958C6k7J22o7m7k48J70J30j88J82j17J20j89K14l32L7K32j17J17N1Q1k08j07
3980a55J47j41J7K6J94p1j40J94j30J21K5p4n9J64q5p8J32j83j11L90m1l0k19
4003a07J14k23P7K1J47l1N3Q1k11j6j5K20k3o1k6j2J64j98J91o9j53J71k21R7
4027c0j96L26jj86K02M5l77L07p2l30L37J6j39Q7r4mO4k0J91p8j58R8l5J35k29
4052a41L45j70j09J29j37K03j64k2nN1K0R3n5J1j38J70k30J55Q4l8j15K56l0j84
4076b1J16j41J16j63o2k9J13J47J05k42P7j02j0J01p7K18j06j43q7J73P9l0%O1
$$ y = [-50, -5, -26, -134, -64, 11, -98, 122, 192, 14, -6, -31, -98, -10, 23, 10, -6, 309, -17, -176, -217, 4, -29, -125, -12, 212, 24, -59, -15, 53, -112, 81, 91, 56, 128, 136, 101, 73, -223, 36, 101, 142, -44, -46, 313, -69, 52, 71, -9, 141, 36, 9, 131, 64, 17, -231, -61, 69, -119, 63, -54, 66, -123, 91, -241, -204, 28, -89, 28, 79, 160, -48, -155, -8, -149, -132, -106, 88, 17, -123, 71, -59, 62, 87, 13, -46, 118, 33, -45, 87, -96, -207, 183, 142, 112, -107, 7, -216, -139, -118, 29, -2, 51, 132, -79, -95, -110, 110, 87, 26, 0, -12, 152, -46, 145, 76, -77, 94, -127, -30, -226, 100, 99, -87, 115, 160, -217, 90, 18, -312, 25, 41, -98, -11, -105, -109, -45, -65, 126, 48, -110, -12, -47, 88, -141, 204, 34, -75, 54, -83, 120, -44, -66, -71, -20, 0, 93, 38, 49, -89, 81, -149, 6, 90, 52, -63, 193, 163, -21, 95, -46, 70, -93, -155, -184, -71, 76, 181, -61, 16, -86, -96, 5, -72, 146, 40, -103, -190, -17, 62, 32, 32, 93]
4100I3j42m5L2L9j81K51j95J4Q1n0k0K00l5p0Jp0J05j74M3J01j4k4k0k3N2Q3l2
4127@L7k44J78J09k49L3J17p8l0J26n3P7P6j89r6J47J37Op6L2q6Q6r3j5J37k08
4153a19qJK42l6j87R8QM9M0j8l4j9j41L66j76k17O5m9J28k7j19Q9K47k18J95l25
4179a65K15j5k8l1P7nJ17j57O1P8k47J20P2j50J13m7j17K88l2k29J12n5JN2P2
4204A00j39N8j49K66o5j05Q4j44J04k08K98l48J58r3J91J52j42l7n3R0L7N0j11
4227fj07J57j81J13J8J9P6j05J33L4j05l9j06J33q3k0J2JJ17j26K1j03J22j84
4251b09J35K30j9j26P4j57J1o1J19k1K76r8j18Q8o5j54J14j74P5q6J63R9n3L6
4275G9r2O1q8O9l1J24j43O6K8r1Q2rj48J55j76J2P5l2O4j68K27j39J20m0j46M9
$$ y = [93, -49, -94, -62, -23, -204, 47, -148, -134, -53, -103, -123, 77, 42, -28, -27, -97, 8, -166, -123, -22, -36, -60, -80, -103, -51, 32, 0, 37, -207, -29, 80, -169, -136, -19, -97, -127, -1, -54, 23, 99, -90, -186, -39, 98, 104, 28, 60, -26, 60, -33, -48, 89, -119, -127, -126, 116, 80, -107, -9, -1, 48, 88, 70, 36, 17, -124, 242, 66, -151, -86, -135, -7, -34, -153, -64, 183, -35, 160, -165, 50, 35, 7, -24, 53, 48, 165, 8, 69, 147, -100, 20, 92, -58, 55, 8, -109, 179, 147, -82, 30, -25, -24, 28, 100, -39, 19, -130, 136, 71, -34, 50, -94, 10, -198, 100, -248, -90, -183, 8, 160, 18, -19, -72, 18, 55, 105, -6, -113, 44, -137, -24, -6, 13, 89, -16, 117, 151, 46, 7, -99, 34, -49, -69, -57, -56, 61, -65, -44, -147, -25, -209, -74, 156, 137, 11, 85, -72, -61, -122, -3, -24, 252, 154, 36, 124, 59, -95, 19, -155, -80, -166, -3, 96, 43, 79, -13, 48, -40, 29, -2, 122, -21, 45, 73, -18, 64, 55, -93, 62, -114, -102, -27, -59, 5, -163, 64, -75, 45, 5, -141, -92]
4301i2N0k7J24j43J88k39R7J88j71J49j18J35k24L0J41Rn4j85J40N4j33l8M7J67
4325I5n1o1P5J79k21R3j40n1J95k30PK6j2J45o9J7K4j07L12l03R3r9R4j10K00
4350A01j2j99J32j55M9J69j2k3j34QM9NJ84j05J48j41k3R4l3k1j14J43j76J30
4374F4n7L7Q1o0Q8n8j9nr1M8k06K95l10L01j72K8R6n4p6J02L0k09J10M2J31j09
4400B7L5J1k04J8K14k02J12p2J72j01j36K15J9j01j10J37j70R8j20OJ57J96l07
4423a06J98J42m08J30M3rJ34k75J60L2p5j07q9J85j3Q5J6o7q2M4J57o2k34L24
4447A23m5J6l62L25r7J53j34P6o0j28K26k66K79q7k61L69j05j02l4J31m5K2J61
4470A55j41j4QK0Q8j03R0l25L34j30J87j56K24k24k8O8J4l07L47j95J45j19J31
$$ y = [-92, -42, -69, 55, -88, 100, -139, -42, 146, -25, 124, 6, 141, -83, -53, 88, 97, 43, -142, -2, 52, -81, -119, -72, 95, 44, -17, 58, 237, 16, 109, -31, -82, 113, -117, -110, -84, -96, 49, -20, -3, 21, -86, 226, -77, 16, -83, 11, -99, 101, 89, -110, 22, -133, -84, 85, 73, 50, -84, -76, -27, -22, 162, 57, 205, 64, 41, 135, 102, 81, -33, 110, -66, 64, 7, 44, 125, 65, 153, 95, 76, 71, -20, 28, -178, 117, -193, 108, -64, -36, 60, 6, -70, 32, 62, -147, -37, 5, 136, 27, 62, 73, -131, -113, 101, -101, 11, -61, 111, 10, -126, 89, 108, 7, -103, 34, -136, -38, -158, -152, 5, 201, -106, 92, 234, -174, -44, -1, -10, 124, -151, 9, 41, -34, -141, -230, -45, -58, 27, 43, -24, -106, -62, 95, 33, -201, 123, 78, 94, -268, 57, -40, 113, -21, 55, -5, -133, 93, -173, 106, 19, -242, 127, 22, -80, -114, 17, -28, -6, 155, 14, 0, 8, 28, 116, 13, 103, -222, 112, -18, 169, 13, 237, 13, -15, 53, 67, -240, 107, -88, 57, -62, 69]
4493F9j83J28J14k72J15j12j03J66k7J70j1j93K8p9J68l1j0k73M80k77m0O8J97
4516I2k04L49l04Lm8O8L3n0N3jM7n5n4O4L7rk55K24rj23K62m0m3N0M5j03QLN2
4545I2j93OL8j04J56J35j31j1J02j28J75p3j58N5J05j23Q7j6K36l97L48k65p6
4568a40J91j22On5L94l64Q3r5J52l9j4J3Q3r9j12R3J2j37J49J19Nj83J75k20J
4593a04K10R5j34j50Q5J79r3n2n7M7j48J29K4m1l9P9L3j9LP6p0m1J3R0k2j64P2
4620AR0m1O7j43J18l00J45J65l08L24j92J85j93N2K6kJ46j94mL3nml1K11J1j81
4646b4o9N6L11j57kj31ON8Mj30m2K25k14Q5J7N5J14j58P5r7L8M4j57O0p7J3l2
4673a29K0N3m7l3J57k1J78j54K0p6J66j88j0K6K0P0j26jK52j68j24M7K64k61K45
$$ y = [69, -114, 14, 128, -144, -29, -141, -244, -78, -105, 65, 54, -139, -111, -190, -22, -53, -63, -336, 144, -133, -173, -105, 92, -112, 237, -67, -64, -112, -44, -11, -61, -8, -9, 38, -17, -71, -7, 30, 21, -234, -10, -19, -142, 120, 80, 37, 87, 132, 29, 37, 40, 92, -101, -95, -57, -161, -5, 130, -1, -12, 90, -38, 137, 64, -94, -39, 66, -57, 30, 14, 250, -147, 201, -64, -140, 51, -71, -65, -120, 274, -90, -7, -102, 50, 11, -3, 10, 93, -6, -118, -25, -13, -150, -1, 118, 123, -60, 115, -105, -104, 106, 201, 67, -83, 2, 181, 88, 36, -21, 26, -122, 7, 31, -10, -49, 30, 63, 44, 47, 123, 53, 12, 25, 115, 93, -71, 1, 91, 50, 117, -26, 92, -208, -63, 102, -206, 118, -74, 111, -82, -30, -4, -6, 140, -54, -58, -25, -30, -34, -65, 146, 157, -24, -93, -37, 274, 117, 115, -16, -10, 48, 52, -78, -120, 105, -109, -24, -7, 48, 162, 4, 79, -18, 20, 64, -93, -33, -110, -97, -129, -109, -56, -103, -136, 21, 0, 178, 24, 44, -32, 134, -54, -64, -38, -18, 52, -74, -75, 177, 9, -115, -68, 196, -65, 180]
4698A80k80M3J12k5j87n2K83j06K1p6J11n2J18J8L7j24P6j71l8Mo7J70j2P3LK08
4724B67l87N9j37J43l5J57j20K31k15N2M0j03J6jn8J01Q1j90J8K6o4J67MjJ00
4749A51j55J67j27k3O2j60N9J54j36k07L04j02L9J47j32J17j14J16j18m0J45j18
4771B9q0J02p7rl5p8P1O0N4J34j03j76J43n4n2L5M7k6k8m3N4J82k27M7qJ39p7
4798B4L7Q8k50Q0kj5O8j79K39k13j38J89M7K7M6j44K09j25r3J6k3J66l37K98j68
4823a53K06O7k21N8l7J52n9J77m09L18j36k4m1K8J82j75p3N1K24j62m7R0j39j
4847a24L24j33q7q8J84r3K70m45J81q1J71r3M3k72L02p9P4J2q9O4o7J45j27L3
4871B5m9N4r9K0J02jj94L90k23q7j18J73k05J62J44k09J98j6r4J05m9q5j2N4j25
$$ y = [180, -100, -57, 55, 30, -157, -209, 74, -32, -11, -87, 24, -28, 90, 108, 145, 21, 97, -74, -112, -108, -175, -5, -17, 56, 59, 267, -120, -61, -198, -55, -90, 67, -53, 178, -37, 15, 55, -48, -32, -33, -91, 10, 91, -99, -81, -55, -119, 48, 52, 51, 151, -4, 163, 36, 13, 75, -85, -26, 128, -8, -215, 89, -13, 26, 173, 41, 158, 44, 160, 42, 2, 147, 29, -51, 51, -26, -35, -70, -148, -77, -17, 37, 171, 68, -108, 35, -19, -71, -36, 11, -15, -43, -86, -32, 150, -77, -30, -38, 101, 24, 61, 149, -101, -21, -23, -38, 30, -149, 90, -123, -261, -72, -25, 2, 48, -96, 113, -12, -105, -89, -112, 54, -283, 15, -153, 53, 120, -101, -43, -80, 72, 13, 190, -219, 99, -37, -61, -102, -74, 108, -67, -140, -89, 135, -27, -74, 16, -123, -124, 200, 67, -20, -108, 76, -17, 253, -192, -11, -92, 79, -14, 29, -243, 59, -20, 54, 66, -23, 41, -26, 119, -8, 25, -24, 30, -69, -49, 53, 52, -142, 248, 25, -62, -180, -7, -212, -50, 94, -115, 83, 67, -27, 78, 29, -56, -68, -14, -139]
4896a39K36j24K93j57L2l7j33r2K11j07r5P4k7n8P2M0N3J22Jj05j21q9L16k33
4920f7J60j34j36K29K2k01N3m9J24lJ26k08P2R0o2j47L32k00j22P8k4J95r8j6
4944A4Km9j13J04q9L10j27j81N8J72k5j22qj09J42Q8N9j69o1J44K10k47j55Q3
4968f9k02J58L3K8Q4J68j29k3K5O0j76M2j23J83m3kP6pp0J05k2j28J5j18L06j05
4994F6Q1j36K0o3R3Ln8M0L2J13j48r7oJ82l92N5Q8M8j5qL02j65j36J05K0n1R6
5021F9j30lJ23P7K5k46K02j52N4Q1J02j86J07j33J2J98j56p9j12K24j15qJ20j46
5045g2J11p9pl2m0O6J46j79J2J47j17J6p4J13L6k75J56J63j74L8Q2k5j34J27O3
5070F8j80K49j82K8K46l46J71j09J36j96L65j44j45M1mj69J36O7J2j04J70r1p7
$$ y = [-139, 97, -27, 266, 109, 141, 104, -29, -121, 90, -17, -112, -38, -65, -123, -51, -11, 42, 164, 165, 60, -61, -150, 166, -67, 93, -41, -177, 52, 74, -127, -74, -123, 1, -2, 124, -84, -12, 78, 16, -131, 201, 1, -121, -43, -67, 128, 30, 14, 16, -33, -146, -42, -131, 179, 52, -129, -71, 101, 76, -46, -54, -163, -21, 67, 126, -43, -104, 40, 250, 3, -152, -69, -271, -113, -80, -52, 32, 200, 71, 48, 73, 133, -43, -1, -124, 59, 16, 14, 90, 83, 13, 118, 96, -32, -17, -135, 171, 66, 147, 11, 31, -32, 61, 64, 6, 46, 78, 191, 43, -54, -60, 122, -270, -215, -127, -79, -94, -102, 200, 35, -101, 4, 24, -27, 69, -61, -64, 59, 136, 161, -85, 117, -35, 19, 100, 202, 16, 123, -10, 2, 200, 44, -35, -147, 77, -38, -46, 74, -72, 39, -40, -47, -79, -119, -53, 93, -86, -74, 73, -44, -28, -102, 11, 47, -228, -72, 91, -83, -45, 37, 12, -122, 5, 68, -112, 137, -45, -17, 229, -117, 54, -55, 81, -115, 250, 106, -39, 2, -2, -171, -35, 32, 44, -60, 110, 19, -58]
5093e8J40j29l3J1J71j39j2j44M13k07p9J42jJ42j50p1K0K1k18Q0K04n2L1k02
5117a20M4Q4j28l2Q5k09M63j32Q2k34J90p5k25K84j75J4O5J4j0J30k21M6KK45
5141A87k20J83J0l22J66N5l5J00o3j47l2J20j02O1QL8j65J83J5J00k38N0J6n9
5165i1Q6K9m2K30k22o7R5j31mJ55o7j19M6L52k14j92Q3j05J76j20O6J25M4j94
5189h1O0j13K11o9j29K8J04j96P6j24M05j51m1m6L8JQ5L1r1k23k6K27l6J09j25
5214g6n5J47j62K01k2n1J88j53j72l4L08j83j15J57J92k53L1j10mR4Om1J23nl1
5239b0M6l6j95J99nR0k45J76n7p0K39j36j41L27k23p5O2K61j25Lj99j2J53l29
5263c12J82J18J95j48Q2q5o3J59k28J69k06oJ44P9L8j69Q8k51j7L03o6j80J11
$$ y = [-58, 82, -47, -80, -69, 102, -37, -49, -193, 220, 13, -66, 76, 75, 217, 67, -4, 16, 37, -181, -101, 103, 51, 82, -120, -76, 8, -120, -152, -67, -276, 187, 55, 137, -97, 93, 18, -207, 77, -98, -84, -19, -5, -15, 115, -106, -60, -58, 187, -33, 150, 160, -162, 4, 59, 24, 124, 61, -86, -118, 2, -100, -39, -31, 7, -158, 25, 40, 140, -98, -48, -32, -91, -5, 24, -18, 212, -10, -77, 18, -113, -117, 38, -29, -148, -102, 250, 36, -156, -73, -178, -2, -122, -56, 69, 113, -81, -21, -134, 77, 8, -121, -93, 11, -185, -109, -233, 172, 21, -20, -66, -28, -27, 58, 89, -2, -225, -251, -24, -60, 49, -76, -131, 16, -146, 55, 33, -18, 170, 17, -155, -189, 119, -64, -179, -22, 170, -83, -52, -162, -166, -72, -66, -107, 16, 11, -20, 26, -10, -205, -6, -11, 79, -166, 10, -47, -117, 122, -14, -155, 172, -51, -126, -64, 197, 72, 75, -124, -136, 17, -312, -130, -12, 183, 35, 117, 32, -31, 128, -100, 69, -137, -143, 1, 80, 118, -51, 37, -214, -231, 72, 6, -174, -63]
5286f3K02k11Q8j4RJ55j69r3p6Q0K2J66l3j82l7Q2J69J2l04J72m3O2R4J1p5Q1
5312A05k35J23k87L67j23j49J68J1J08p6QP2r3Qk2k9J79k17M3L1j05M1R8j87O3
5337i8Q1j9M6n6O1j41P3Q4j33J45l7K3j12J06M0j12j1J47k32J12m9n2K07O7k94
5362a54J00K40k15j06J75j55j00K13J93j68j9k7Q2J22k05J61j63J48j28J58j34
5383A8L9j38J49o0o0P6j54J50q5O3j44O6R9L2q6L27l16k7K18j75K6J5P5p8m2L6
5409B4lj24J14j68K2J48j45J70p1J75k25L0J27j19j9L9m2J40j0j13P9r5Q5j65
5433a46J41Q6k42J54r6P2M5j40J57J29k15p7L8oJ37N1r5o0%l1J47p2L5n7J35o4
5459B6j1K9o9M8q5J52j52J2J0J37L2k62O6q7J96n9J21k92R0J6m2L16Rk28m0o0
$$ y = [-63, 139, -72, 16, 2, 11, 166, -3, -96, -172, -92, -70, 96, 63, -119, -156, -74, 95, 107, -197, -25, -68, -6, 88, 99, 24, 105, -130, -7, -294, 73, -50, -199, -31, -20, 88, 12, 20, 92, -1, 7, -15, -44, 135, -82, -39, -8, -113, -72, 26, -161, -98, -17, -36, 10, -46, 15, -126, -53, 31, -102, 43, 6, 29, -83, 23, 63, -49, -60, 87, -145, -33, -82, -134, 73, 140, -154, -54, 186, -29, -135, 40, -115, -215, -2, 191, 23, 4, -23, 59, 181, -24, 137, -26, 122, -6, 152, 18, 57, -81, 68, 8, -52, 24, -130, 20, -65, -2, -146, -80, 19, 51, -35, 292, -24, -51, 167, -8, 18, 33, 108, 30, -12, 24, 21, -103, 11, -157, -135, 13, -132, 38, -33, 142, -83, -53, 74, -45, -64, -25, -67, 73, 63, -50, 29, -66, 19, -146, -5, 81, -161, -7, -103, -31, 14, -126, 31, 160, -55, -132, -94, -100, 37, 88, -7, -67, -67, -98, 49, -23, 12, -45, 90, 26, 15, 44, -25, 23, -62, 90, -62, -50, -40, 97, 129, -133, -67, -154, 42, -17, 104, -188, -98, -82, -124, 192, 201, -27, -67, -127]
5485a27L4L3K3n2N1Q4R7j69n6OQ5j22j44L60j12k15L17k36l6L31r7j32P8q6j10
5510a95J33J80m4l59K65n9qO3K5K34k57P0j52J79L9k42rJ74L0J2j80Q5J02j81
5534i5l2Mm1M51j40k16J66j5n9k05J97n2k0J65M9j01j63J50j34k1K89q6n6q2R4
5559D7J18j25j11K73j30j45P9J49k37J17m9M0j13K50m18M82j41R8q7m3K5j1J7
5582H5j52Q8p2j04NK62%j70j04K98j08Rk7N7j45J57j7q0pnJ13r6K02j25R1k25
5608g0m2J02n7K93k67J70k80K26pJ39p3j73q1L01k75M8P2N3l9j06n4Q9O4j28L17
5633B22k61K84k78J33j73k3L0Q2l1J28k60K52n6j01P5k00L03k06K15l4M1n6r7
5656a1J2K0j25J33j06l7N2Q3K2o8J63l38L18o6K5q8p2m2r9J90J03j52O3Q4j00
$$ y = [-127, -93, -60, -37, -89, -38, 46, 143, -26, -82, -76, 9, -113, -257, 103, -9, -224, 93, -143, -179, 152, 55, -77, 1, -85, -195, -62, 118, 74, -285, -20, -79, -87, -24, 1, 235, -22, 48, -104, 75, 114, -128, -137, 37, 67, 79, -101, -16, 86, -95, -127, -123, -164, 287, 147, -69, 97, 82, 23, -182, 15, -37, -57, 108, 157, 56, -107, 43, -91, -112, 177, 91, 35, -47, 47, 165, 40, -71, 202, 72, -73, 6, 155, -82, 35, -14, 26, -87, 163, -255, 227, 86, 184, 97, 54, 79, 68, 85, -67, 21, -51, -155, -150, 112, 112, -58, -162, 136, 28, 37, 10, 67, -78, 79, 62, -18, -25, -30, 83, -13, 189, 64, 155, -70, -112, -10, -67, 226, -41, 129, -151, 75, 68, 207, 134, -39, -120, 181, -94, -46, 26, 79, 40, -66, -120, -31, 33, -95, 222, -39, 245, -33, 100, -73, -96, -66, 16, -15, 113, -147, 105, 49, -52, 23, -177, 126, -80, 135, 101, 142, 86, -11, 1, 21, -104, 29, -77, -114, -62, 21, 43, -25, 138, -200, 118, 52, 77, -11, -83, -125, -224, -34, 69, -83, -20, 64, -36]
5681c6J6K8R0J54l22N7l7j2p5R4j97ML16j3m4l4MM7J8j08q8k8K01j47J70k3j15
5708h0J81k56J59j67J08Q1l1K12l86J89N1J09m21L83j88K2J27j07K39j03j92j27
5730a97J0J34j8L5m5m7K56n6k7J47k25J53p6Rq8O9m2K2k68J61k3j72L79mr6K42
5756B33k25n7R3J0M1J6q4J16j33J77k33o4J99J38j14j58J76k62K11L3m6j24j32
5779a89R9J45jp1o8J07j1rL6k04K19M0j6j7j14l2J7O6j21K45j39j05J01K9J27
5804A34j79j1l3J33M5J44k88o8J96l60K63o8K4p5J38o3L5n0J08k5M0J54o6nj16
5829Gj89Q4J3J88m6J46j87J09j30N4j45j1L0J22j82O1K15k2J41l64M7M9J58k11
5853f3n9kJ79k6n2O7j13j24J13j6P5J53j15qj47K29K1r3J39k0j80K0l1K04n5k05
$$ y = [-36, -20, 8, 98, 252, -70, -13, -50, -62, -137, -43, -240, -236, 80, 67, 23, -11, -7, 40, 58, -50, -138, -166, 35, -112, 58, 35, -80, 101, -155, 4, -163, -55, 26, -5, 207, -179, 10, 61, 170, -251, 132, -56, -34, 93, -14, 225, 122, -70, -197, -187, -53, -71, -36, -81, -128, 128, 72, 45, 192, -33, 120, 44, 53, -35, 34, -8, 14, -254, -93, -116, -288, 91, 87, -9, 233, 8, -49, 44, 54, 95, 111, 27, 143, 10, 187, -46, -110, 89, 227, 113, -45, 131, -131, 80, 113, 67, -57, -189, -90, 55, 54, -17, -85, 22, 11, 2, 38, -166, 53, 93, 77, 60, -54, -86, -69, -3, -124, 121, -18, -123, -22, 7, 134, -45, -56, -89, 44, 89, 233, -55, -123, 73, -287, -24, -92, -68, -143, -5, -68, -33, -83, 25, 0, 40, 194, 128, 123, 7, -182, -98, -85, 103, 57, 203, 16, 125, -5, 49, -96, -107, -77, 45, -137, -76, 139, 117, 258, -106, -59, -10, 148, -63, -122, -124, 55, 29, -23, 44, -69, -193, -80, -96, -21, 132, 17, 9, -138, 91, 112, 19, 158, 138, -42, -22, -53, 151, 96, -109]
$$ [...]
8191a06
##END NTUPLES=NMR FID
##END=
