##TITLE=1H_EL-19-2
 CDCl3
 8 sc, 
 25.11.2024
##JCAMPDX= 6.0         $$ Bruker NMR JCAMP-DX V2.0
##DATA TYPE= NMR FID
##DATA CLASS= NTUPLES
##ORIGIN= UXNMR, Bruker Analytische Messtechnik GmbH
##OWNER= root
$$ XWIN-NMR		Version 3.5
$$ Mon Nov 25 14:04:06 2024 Russian Standard Time (UT+4h)  she@DPX200
##.OBSERVE FREQUENCY= 200.1315
##.OBSERVE NUCLEUS= ^1H
##.DELAY= (6, 6)
##.ACQUISITION MODE= SIMULTANEOUS
##.ACQUISITION SCHEME= undefined
##.AVERAGES= 8
##.DIGITISER RES= 18
##SPECTROMETER/DATA SYSTEM= spect
##.PULSE SEQUENCE= zg30
##.SOLVENT NAME= CDCl3
##.SHIFT REFERENCE= (INTERNAL, CDCl3, 0, 15.7039)
##AUDIT TRAIL= $$ (NUMBER, WHEN, WHO, WHERE, WHAT)
$$ ##TITLE= Audit trail, XWIN-NMR		Version 3.5
$$ ##JCAMPDX= 5.01
$$ ##ORIGIN= Bruker BioSpin GmbH
$$ ##OWNER= she
$$ F:/spectra/data/she/nmr/H-F/1/audita.txt
$$ ##AUDIT TRAIL=  $$ (NUMBER, WHEN, WHO, WHERE, WHAT)
(   1,<2024-11-25 14:03:04.46 +0400>,<she>,<DPX200>,
      <created by zg, POWCHK disabled, PULCHK disabled
       configuration hash MD5:
       00 E9 B6 7A A2 85 ED C7 34 08 36 98 17 FE 4E 26
       data hash MD5: 16K
       6A D9 D3 F4 B5 34 78 64 F8 81 0A 21 F7 3E FF 86>)
$$ ##END=
$$ 
$$ hash MD5
$$ F6 F4 17 31 16 C7 E5 67 15 B2 52 8E DB 8A 70 B4
##$RELAX= 
##$RELAX= 
##$RELAX= 
##$RELAX= 
##$RELAX= 
##$RELAX= 
$$ Bruker specific parameters
$$ --------------------------
##$DU= <F:/spectra>
##$EXPNO= 1
##$NAME= <H-F>
##$PROCNO= 1
##$TYPE= <nmr>
##$USER= <she>
##$AMP= (0..31)
100 100 100 100 100 100 100 100 100 100 100 100 100 100 100 100 100 100 
100 100 100 100 100 100 100 100 100 100 100 100 100 100 
##$AQSEQ= 0
##$AQ_mod= 1
##$AUNM= <au_zg>
##$AUTOPOS= <>
##$BF1= 200.13
##$BF2= 200.13
##$BF3= 200.13
##$BF4= 200.13
##$BF5= 200.13
##$BF6= 200.13
##$BF7= 200.13
##$BF8= 200.13
##$BYTORDA= 1
##$CFDGTYP= 0
##$CFRGTYP= 5
##$CHEMSTR= <none>
##$CNST= (0..31)
1 1 145 1 1 1 1 1 1 1 1 1 1 1 1 1 1 1 1 1 1 1 1 1 1 1 1 1 1 1 1 1 
##$CPDPRG= <>
##$CPDPRG1= <>
##$CPDPRG2= <>
##$CPDPRG3= <>
##$CPDPRG4= <mlev>
##$CPDPRG5= <mlev>
##$CPDPRG6= <mlev>
##$CPDPRG7= <mlev>
##$CPDPRG8= <mlev>
##$CPDPRGB= <>
##$CPDPRGT= <>
##$D= (0..31)
0 1.2 0 0 0 0 0 0 0 0.06 0 0.03 0 0 0 0 0.0002 0 0 0 0 0 0 0 0 0 0 0 0 
0 0 0 
##$DATE= 1732528983
##$DBL= (0..7)
120 120 120 120 120 120 120 120 
##$DBP= (0..7)
150 150 150 150 150 150 150 150 
##$DBP07= 0
##$DBPNAM0= <>
##$DBPNAM1= <>
##$DBPNAM2= <>
##$DBPNAM3= <>
##$DBPNAM4= <>
##$DBPNAM5= <>
##$DBPNAM6= <>
##$DBPNAM7= <>
##$DBPOAL= (0..7)
0.5 0.5 0.5 0.5 0.5 0.5 0.5 0.5 
##$DBPOFFS= (0..7)
0 0 0 0 0 0 0 0 
##$DE= 6
##$DECBNUC= <off>
##$DECIM= 24
##$DECNUC= <off>
##$DECSTAT= 4
##$DIGMOD= 1
##$DIGTYP= 9
##$DL= (0..7)
0 120 120 120 120 120 120 120 
##$DP= (0..7)
150 150 150 150 150 150 150 150 
##$DP07= 0
##$DPNAME0= <>
##$DPNAME1= <>
##$DPNAME2= <>
##$DPNAME3= <>
##$DPNAME4= <>
##$DPNAME5= <>
##$DPNAME6= <>
##$DPNAME7= <>
##$DPOAL= (0..7)
0.5 0.5 0.5 0.5 0.5 0.5 0.5 0.5 
##$DPOFFS= (0..7)
0 0 0 0 0 0 0 0 
##$DQDMODE= 0
##$DR= 18
##$DS= 0
##$DSLIST= <SSSSSSSSSSSSSSS>
$$ [...]
##$SUBNAM2= <"">
##$SUBNAM3= <"">
##$SUBNAM4= <"">
##$SUBNAM5= <"">
##$SUBNAM6= <"">
##$SUBNAM7= <"">
##$SUBNAM8= <"">
##$SUBNAM9= <"">
##$SW= 24.0689530833862
##$SWIBOX= (0..15)
0 0 2 0 0 0 0 0 0 0 0 0 0 0 0 0 
##$SW_h= 4816.95568400771
##$TD= 16384
##$TD0= 1
##$TE= 0
##$TE2= 300
##$TE3= 300
##$TEG= 300
##$TL= (0..7)
0 120 120 120 120 120 120 120 
##$TP= (0..7)
150 150 150 150 150 150 150 150 
##$TP07= 0
##$TPNAME0= <>
##$TPNAME1= <>
##$TPNAME2= <>
##$TPNAME3= <>
##$TPNAME4= <>
##$TPNAME5= <>
##$TPNAME6= <>
##$TPNAME7= <>
##$TPOAL= (0..7)
0.5 0.5 0.5 0.5 0.5 0.5 0.5 0.5 
##$TPOFFS= (0..7)
0 0 0 0 0 0 0 0 
##$TUNHIN= 0
##$TUNHOUT= 0
##$TUNXOUT= 0
##$USERA1= <user>
##$USERA2= <user>
##$USERA3= <user>
##$USERA4= <user>
##$USERA5= <user>
##$V9= 5
##$VALIST= <valist>
##$VCLIST= <CCCCCCCCCCCCCCC>
##$VD= 0
##$VDLIST= <DDDDDDDDDDDDDDD>
##$VPLIST= <PPPPPPPPPPPPPPP>
##$VTLIST= <TTTTTTTTTTTTTTT>
##$WBST= 1024
##$WBSW= 4
##$XGAIN= (0..3)
0 0 0 0 
##$XL= 0
##$YL= 0
##$YMAX_a= 177235
##$YMIN_a= -143208
##$ZGOPTNS= <>
##$ZL1= 120
##$ZL2= 120
##$ZL3= 120
##$ZL4= 120
##$ABSF1= 10
##$ABSF2= 0
##$ABSG= 5
##$ABSL= 3
##$ALPHA= 0
##$AQORDER= 0
##$ASSFAC= 0
##$ASSFACI= 0
##$ASSFACX= 0
##$ASSWID= 0
##$AUNMP= <proc_1d>
##$AZFE= 0.1
##$AZFW= 0.1
##$BCFW= 1
##$BC_mod= 2
##$BYTORDP= 1
##$COROFFS= 0
##$CY= 11.3945322036743
##$DATMOD= 1
##$DC= 2
##$DFILT= <>
##$DTYPP= 0
##$F1P= 15.6554695791079
##$F2P= 12.8336369535428
##$FCOR= 0.5
##$FTSIZE= 0
##$FT_mod= 4
##$GAMMA= 1
##$GB= 0.15
##$INTBC= 1
##$INTSCL= 1
##$ISEN= 128
##$LB= 0.24
##$LEV0= 0
##$LPBIN= 0
##$MAXI= 10000
##$MC2= 0
##$MEAN= 0
##$ME_mod= 0
##$MI= 1.114404
##$NCOEF= 0
##$NC_proc= 0
##$NLEV= 6
##$NOISF1= 3.799351
##$NOISF2= 2.8
##$NSP= 1
##$NTH_PI= 0
##$NZP= 0
##$OFFSET= 15.70392
##$PC= 1
##$PHC0= -26696.77
##$PHC1= 1.987439
##$PH_mod= 1
##$PKNL= yes
##$PPARMOD= 0
##$PSCAL= 0
##$PSIGN= 0
##$REVERSE= no
##$SF= 200.130013532006
##$SI= 16384
##$SIGF1= 3
##$SIGF2= 2
##$SINO= 400
##$SIOLD= 16384
##$SREGLST= <1H.CDCl3>
##$SSB= 0
##$STSI= 0
##$STSR= 0
##$SW_p= 3612.71676300578
##$SYMM= 0
##$S_DEV= 0
##$TDeff= 0
##$TDoff= 0
##$TI= <>
##$TILT= no
##$TM1= 0
##$TM2= 0
##$TOPLEV= 0
##$USERP1= <user>
##$USERP2= <user>
##$USERP3= <user>
##$USERP4= <user>
##$USERP5= <user>
##$WDW= 1
##$XDIM= 8192
##$YMAX_p= 0
##$YMIN_p= 0
$$ End of Bruker specific parameters
$$ ---------------------------------
##NTUPLES= NMR FID
##VAR_NAME=  TIME,          FID/REAL,        FID/IMAG
##SYMBOL=    X,             R,               I
##VAR_TYPE=  INDEPENDENT,   DEPENDENT,       DEPENDENT
##VAR_FORM=  AFFN,          ASDF,            ASDF
##VAR_DIM=   8192,          8192,            8192
##UNITS=     SECONDS,       ARBITRARY UNITS, ARBITRARY UNITS
##FACTOR=    0.0002076,     1,               1
##FIRST=     0,             0,               0
##LAST=      1.7004516,     0,               0
##MIN=       0,             -143208,         0
##MAX=       1.7004516,     177235,          0
$$ Real data points
##PAGE= N=1
##DATA TABLE= (X++(R..R)), XYDATA
0 0 0 0 0 0 0 0 0 0 -8 8 -8 8 -8 16 -16 22 -24 32 -36 41 -48 57 -68 78 -89 103 -118 134 -151 173 -195 219
32 219 -244 274 -306 342 -380 424 -469 521 -576 639 -707 783 -866 961 -1067 1185 -1324 1480
50 1480 -1664 1884 -2147 2476 -2894 3450 -4224 5390 -7349 11426 -36781 139821 149394 -129140
64 -129140 -74527 108533 40127 -107063 -7614 92021 3056 -78067 3563 53415 232 -14473
76 -14473 35945 1235 -58435 -642 66635 -5858 -59236 9855 33850 -30298 -13463 42558
88 42558 1238 -39640 10964 28243 -20603 -19831 21890 15161 -10006 -1433 12762 3735 -6541
101 -6541 4547 20781 8396 -10362 2649 8133 -20306 -9056 38970 17470 -38502 -10037
113 -10037 42885 12794 -34245 -17582 11891 6526 -9155 -8174 13462 25242 -1430 -25928 -6637
126 -6637 16747 9775 -2736 -7680 -3249 12125 7874 -12407 4162 28326 -3254 -29745 2791
139 2791 16271 -10869 -3507 16280 -10318 -24620 9857 21312 -5432 -14187 -5181 -4923 -2913
152 -2913 6172 4916 -5519 -9665 -2296 3715 -678 6037 18459 -5046 -35086 -3799 32941 -1731
166 -1731 -29409 7779 19584 -12906 -5078 17689 -7820 -22954 4583 5148 -16393 -122 17609
179 17609 -4571 -17001 5353 14066 -6870 -17109 -628 11121 -1136 -8637 4260 5233 -6552
192 -6552 4376 14890 -6873 -14839 6771 3519 -10520 9712 15425 -17228 -14246 20089 8035
205 8035 -16001 4630 13230 -15614 -14976 15799 14237 -9711 -10041 5220 7760 -261 1671 9665
219 9665 396 -13686 -1754 13552 -395 -5375 13690 7173 -14723 471 18969 -1350 -13804
232 -13804 3408 5182 -6659 424 8919 3729 45 -1628 -3433 1869 2717 -2818 1772 2992 -6630
247 -6630 -268 12962 1865 -7594 6257 4789 -11825 -1896 13614 -334 -10626 2940 7469
260 7469 -3841 -4211 5475 5532 -5757 -9618 3786 7935 -9705 -9840 12797 5940 -16518 -933
274 -933 16501 -5840 -14399 9679 5859 -16169 -4015 11846 -1514 -6206 6518 2164 -8949
287 -8949 -2820 5219 179 -5932 -4810 865 1744 -3017 579 6407 -3352 -11018 939 4765 -5540
302 -5540 -1726 4506 -6106 -5835 8436 3301 -6391 1284 1638 -7540 -146 6348 -3587 -2853 5067
317 5067 -2559 -5027 7333 4671 -7355 -1300 4729 -3494 -3936 4372 2549 -3297 -1103 3458 3334
332 3334 -1826 -2951 4622 3560 -7950 -2626 10692 892 -8109 6849 8552 -8130 -1881 11274
346 11274 -2538 -8817 8368 5824 -9462 480 11728 -530 -6268 4218 4393 -3362 -2329 3094
360 3094 3239 -884 -2437 3573 5030 -2948 -1436 7047 208 -7813 2961 6900 -4661 -1953 7306
375 7306 -673 -5192 4905 3623 -4359 25 1838 -2844 -102 1943 -2252 859 3979 -4307 -3520
390 -3520 6412 1072 -7269 194 3550 -3547 -2100 3182 -696 -1465 1580 -1211 -2389 718 153 -1550
406 -1550 -1880 -2638 684 2999 -3554 -3900 5256 546 -9268 699 7118 -6714 -6480 7975 837 -9839
422 -9839 2404 7514 -6418 -5820 5451 629 -6461 -199 3290 -1342 -3032 -13 2349 -8 -3710
437 -3710 -75 4120 -2737 -5304 4272 3421 -5877 -390 6173 -2477 -3933 4787 545 -5197 2082
452 2082 3296 -3730 -506 4064 -843 -925 2605 -981 -334 3757 -1164 -3001 4535 2167 -4592 1868
468 1868 6111 -2286 -2830 4948 2089 -3518 301 3755 1356 -2206 -832 4430 3291 -4529 -1438
483 -1438 7859 696 -7510 4055 7731 -6569 -3503 9572 430 -8328 5211 7626 -7151 -3935
497 -3935 8288 1099 -7069 1351 5449 -1573 -3422 1878 3169 -1554 -3087 2145 2826 -4038 -2018
512 -2018 5797 -253 -6948 2945 6067 -6052 -4084 7021 -186 -7942 2290 4802 -5029 -2582
526 -2582 4300 -1305 -3748 1338 259 -2335 126 -349 -1757 472 -201 -2240 60 149 -2335 -93
542 -93 709 -2389 -147 1211 -2738 -1839 2269 -1093 -2630 1964 -244 -3406 1552 1759 -4304 -660
558 -660 3961 -2419 -3320 2902 495 -3043 1115 685 -2642 1127 1864 -2827 -501 2978 -1249 -1973
574 -1973 2167 804 -1167 1162 0 -1424 2033 1461 -1857 761 2217 -1186 -325 2036 100 -4
590 -4 1490 -666 299 2513 -726 -1308 3439 271 -3818 3850 5210 -4466 -2027 6717 -356 -5484
606 -5484 4160 4778 -4565 -1168 6028 89 -3917 2599 3640 -2301 -2486 3212 3558 -2701 -3032 4694
622 4694 3867 -5581 -2069 7350 -544 -7179 4316 6232 -7357 -3148 9342 -643 -8744 4150
636 4150 6839 -6616 -4479 6992 1871 -6606 -721 4279 -986 -3885 1052 3120 -2344 -3782 2893
651 2893 2984 -5487 -3332 5884 -406 -7694 2291 6071 -5541 -4644 6016 212 -7300 1177 4439
666 4439 -4166 -3478 3848 1591 -3935 -2009 1659 1559 -1942 -3457 1041 2619 -2614 -2087 2992 -166
682 -166 -4117 1647 2750 -3843 -1528 4019 -1341 -4056 1808 2904 -2392 -1866 1214 1500 431 -1157
698 -1157 -935 1542 105 -1893 1971 2277 -3314 -341 5121 -1158 -3995 3931 3064 -5105 -617 5744
714 5744 -327 -3113 2916 1859 -2516 771 3042 -835 -2081 905 2729 862 -1848 -29 3357
729 3357 335 -2596 1606 3114 -2344 -443 4125 -1073 -2724 4226 1744 -5029 1292 5651 -2589
744 -2589 -3703 3842 1925 -2661 984 1644 -2294 -103 3115 -556 -2185 700 1272 -901 -1487 629
760 629 1834 -717 -2561 1426 2679 -2711 -1537 3594 -1432 -4802 3358 3752 -5329 -2447 5842 -715
776 -715 -5525 1835 2227 -4120 -869 3357 -1395 -3297 1603 1869 -2086 -1714 537 896 -2173 -2557 2201
793 2201 2631 -3225 -3028 2932 293 -3346 1730 2105 -4856 -1806 4871 -521 -4507 1651 2472 -3034
809 -3034 -1431 2839 597 -1979 -1018 -154 888 483 -1397 503 1529 -1959 -558 3555 -7 -3777
825 -3777 1416 2896 -2420 -1255 3228 268 -1797 1470 1184 -1191 31 1261 158 -354 242 1065
841 1065 1340 -1010 -948 3589 1693 -3846 -146 4912 -778 -3060 3528 2389 -3645 740 4469 -1840
857 -1840 -2543 3343 1536 -2827 236 3347 -203 -1846 555 1851 122 -1184 412 2416 -998
872 -998 -2117 2117 1497 -3175 405 4150 -1730 -3283 3323 1430 -3821 830 3073 -3041 -2352 3835
888 3835 1019 -3265 733 1611 -2480 -1284 1819 505 -1331 -1167 -212 741 59 -484 300 -860 -2445
905 -2445 609 1977 -2135 -1476 2481 -975 -3612 2285 2694 -4045 -1818 3127 -1012 -2691 2166 863
921 863 -3300 -355 2508 -881 -1744 836 453 -1005 -789 308 439 -590 -1480 905 1712 -1907 -1352
938 -1352 2300 -187 -2926 1617 2263 -3051 -1431 3404 277 -2038 1310 1084 -1703 -162 1416 224
954 224 35 -343 -481 973 985 -517 1172 1560 -2373 -930 3576 538 -2522 1939 2504 -2411 -576
971 -576 3567 483 -1916 969 1557 -784 -161 1468 1090 -469 -1279 1046 2410 -909 -1131 2636 689
988 689 -3737 1047 4654 -1900 -3173 3690 1534 -4177 720 4248 -1715 -3253 2364 1713 -2394 -196
1004 -196 2516 -45 -2012 227 1930 -135 -2212 54 2392 -1395 -2323 2649 1495 -3810 -607
1019 -607 3954 -1724 -3746 2238 1795 -3547 -307 2792 -1533 -2590 1386 645 -1408 -164 -34 -1109
1035 -1109 -348 -34 160 335 -1059 -1418 599 454 -1490 -71 680 -2110 -1118 1715 -154 -1365 722
1052 722 -387 -1819 948 1246 -1403 -577 915 -1314 -378 1901 -230 -1705 714 15 -1587 893
1068 893 1209 -1457 -636 970 -606 -240 1555 -25 -1108 822 400 -419 1008 257 -542 587 463
1085 463 -723 883 1287 -857 77 1351 -760 -533 1950 262 -1415 1502 1304 -1592 270 2021
1101 2021 -662 -464 1721 -98 -1152 1639 845 -1112 688 1204 -769 -39 1179 -12 -105 463 -470
1118 -470 75 1048 -10 50 615 -690 -911 1560 47 -1540 961 693 -2210 -241 2450 -852 -1974
1135 -1974 1712 328 -2364 720 1859 -1477 -1080 1274 -318 -1169 687 516 -686 -459 -345 -51
1151 -51 237 -691 -576 752 -489 -1533 767 814 -2047 -372 1560 -1054 -1761 1482 313 -2072 267
1168 267 864 -1669 -405 1074 -1065 -825 731 -420 -945 1073 -179 -1104 399 253 -1266 133
1184 133 812 -740 -419 572 -292 -602 545 -245 -138 533 -586 -515 1179 -17 -910 1045 771 -1731
1202 -1731 566 2144 -1029 -1296 2112 405 -2226 1024 2072 -1351 -580 1847 73 -709 966 941
1218 941 -164 -116 267 585 559 -500 245 1584 -359 -1210 1651 1297 -1650 -71 2000 -631 -1255 1974
1236 1974 568 -1905 673 1394 -1131 -303 1204 -47 -593 409 64 -80 597 -45 -347 789 -46
1253 -46 -1020 945 543 -1201 52 1040 -1060 -749 1178 -34 -1037 410 -40 -747 302 182 -918
1270 -918 322 98 -1119 206 760 -1567 -410 1304 -847 -1766 1305 579 -2062 117 1357 -1418
1286 -1418 -1155 1113 -255 -1371 373 391 -990 -164 105 -288 -246 -329 -386 769 -28 -1169 466 837
1304 837 -1404 -343 1439 -702 -1576 1383 345 -1761 513 1381 -1174 -692 1417 -365 -1196 968
1320 968 621 -713 310 363 -507 230 663 -440 -18 387 -165 303 671 -373 61 1015 -454 -493 1406
1339 1406 149 -849 1107 804 -1259 451 1798 -1157 -834 2134 534 -1427 1043 1407 -1165 -96
1355 -96 1370 -56 -389 643 425 -136 -78 80 482 604 -564 141 1373 -400 -1047 1201 639 -1551
1373 -1551 93 1576 -811 -822 1520 78 -1708 574 963 -1265 -188 784 -292 -338 216 -429 -146
1390 -146 409 -742 -425 655 -552 -957 867 100 -1682 187 1072 -1475 -825 1157 -315 -1474 441
1407 441 280 -626 -298 158 -460 -4 -174 -298 407 -149 -1068 223 978 -1491 -763 1627 -246 -1932
1425 -1932 859 1033 -1825 -377 1575 -536 -1470 923 728 -1207 -266 842 -68 -635 -137 313 560
1442 560 -415 -668 1130 271 -1348 730 1480 -1317 -725 1942 186 -1878 1231 1640 -1569 -398 1768
1459 1768 -178 -1057 1332 686 -852 108 1043 125 -303 183 220 378 30 -42 980 284 -765 604
1477 604 1442 -769 -535 1488 -142 -1321 1370 1129 -1473 -36 1762 -457 -822 1269 615 -856
1493 -856 267 834 -357 82 512 -241 101 78 -174 229 339 -800 53 521 -688 -769 1318 81 -1168
1512 -1168 504 795 -1014 -174 873 -753 -1011 839 183 -921 52 116 -521 -57 -225 -596 337 -92
1530 -92 -1017 96 503 -1273 -710 1188 -372 -1317 700 582 -1564 -266 1098 -672 -1019 465 286
1547 286 -884 44 280 -295 -349 -391 216 473 -704 -616 1177 78 -1746 491 1496 -1177 -909 1704
1565 1704 -12 -1776 847 1662 -1440 -775 1589 -126 -1294 673 1121 -330 -362 423 827 -149 -405
1582 -405 491 972 -636 -324 1477 410 -1426 657 1883 -1031 -808 1990 319 -1860 676 1714
1598 1714 -888 -618 1351 198 -824 293 796 4 -65 166 390 480 -468 -113 1098 15 -803 729
1616 729 827 -1283 -187 1335 -324 -964 822 326 -1189 197 835 -598 -211 438 -247 -296 310 -316
1634 -316 -107 592 -482 -424 738 -174 -1030 601 416 -1111 -71 713 -786 -839 731 61 -930 268
1652 268 164 -519 -183 111 -228 100 -10 -490 155 159 -760 -101 691 -480 -840 693 -83 -1185 521
1671 521 567 -982 -73 1082 -525 -909 837 -42 -1041 195 390 -430 -207 97 -535 -57 343 -299 103
1690 103 295 -324 -50 741 -272 -406 543 -112 -905 532 568 -1099 101 1015 -495 -619 1143 24
1708 24 -1027 582 743 -794 14 806 -103 -153 458 318 20 369 305 168 378 -268 172 760 -82 -595
1728 -595 831 473 -862 363 1088 -781 -319 1121 75 -859 625 717 -673 18 719 -418 -267
1745 -267 330 -152 -323 612 -102 -295 582 31 -395 341 254 -634 425 313 -725 -169 581 -377 -658 398
1765 398 46 -413 413 -30 -665 234 342 -677 2 542 -629 -211 646 -598 -745 562 143 -977
1783 -977 252 585 -912 -430 456 -306 -551 513 -183 -405 114 -183 -208 -147 -208 -509 268 83 -609 205
1803 205 424 -916 -296 732 -297 -388 768 285 -989 253 615 -658 -218 691 -268 -328 518 -168
1821 -168 -196 524 229 -485 175 415 -155 295 351 -360 51 656 -274 -100 648 -26 -199 503 74 -316 522
1842 522 229 -372 384 536 -453 -228 724 -130 -354 628 273 -630 478 529 -530 123 607 -166 -262 420
1862 420 -43 -21 410 -156 56 93 -98 -123 431 179 -461 548 638 -410 -18 805 -126 -552 698 162
1882 162 -872 422 542 -516 -24 442 -365 -304 288 122 -363 104 -14 -491 171 15 -395 246 -20
1901 -20 -405 72 210 -428 -211 359 -363 -561 275 11 -542 129 -164 -502 -64 212 -831 37 514 -389
1921 -389 -612 502 166 -542 104 255 -415 5 386 -375 -316 366 -127 -144 -7 -156 -98 329 -51 -272 483
1942 483 268 -528 452 348 -362 9 625 -208 -316 746 198 -683 455 518 -521 92 552 -278 -225 413
1962 413 -162 -156 307 -109 -106 474 136 -280 364 498 -189 83 666 -307 -224 501 8 68 267 164 -350 393
1984 393 166 -282 353 440 -437 169 324 -404 -194 603 -4 -496 362 39 -607 13 713 -154 -301 549
2004 549 55 -366 71 -64 -47 82 140 -184 109 -105 -444 369 130 -680 -41 277 -650 -264 519 -144 -607
2025 -607 470 391 -739 -109 468 -512 -377 456 38 -701 202 -39 -281 -245 -165 -210 -59 -92 -347 152 40
2046 40 -528 -185 451 -350 -242 490 -25 -617 386 255 -559 19 501 -300 -378 319 -63 -275 244 98
2066 98 -300 87 19 -286 387 277 -205 211 339 -68 -117 454 3 -158 259 80 -48 368 165 -407 115
2087 115 323 -66 197 575 -187 -36 634 -32 -207 463 111 -359 283 386 -165 66 536 -207 -326 660
2107 660 228 -281 320 48 -322 109 410 -11 36 253 -116 60 343 14 -396 245 -128 -94 274 100 -272
2128 -272 306 261 -212 124 405 -505 -281 393 -103 -372 275 236 -589 172 345 -356 -313 387 -192 -123 -56 -86
2150 -86 -162 80 -277 1 240 -171 -370 194 -134 -597 108 124 -378 -330 396 -183 -759 260 262 -470 6 250
2172 250 -358 -253 426 -92 -134 70 105 -180 46 127 -41 441 -59 -185 355 239 -505 123 268 -34 -57
2193 -57 388 120 -323 413 124 -336 288 216 -65 66 231 -13 -214 354 -234 -51 422 94 -265 236 406
2214 406 -138 -1 436 -45 -95 297 -65 -158 172 138 40 121 163 -131 132 233 -151 219 361 -205 72 446
2236 446 -268 -244 276 -25 -407 353 436 -221 -111 367 -166 -255 401 -156 -234 55 176 -361 59 5 -175 333
2258 333 205 -153 48 317 -199 -117 265 -156 -163 91 -39 -245 170 199 -343 106 -46 -372 -72 236 -151
2279 -151 -407 387 29 -511 92 220 -205 -35 178 -272 -1 76 -198 -105 161 -38 -342 -36 -67 -10 223
2300 223 187 -278 121 227 -400 -251 442 -154 -364 339 80 -395 310 445 -227 121 238 -111 -268 189
2320 189 99 -65 258 -31 -192 311 10 -173 230 172 -231 -25 181 -156 -35 330 82 -379 464 183 -131
2341 -131 230 77 -175 132 339 2 -191 294 111 -127 394 31 -255 136 124 -68 70 380 -192 81
2361 81 349 107 -5 204 285 -189 223 26 -218 114 134 -96 236 244 -217 44 386 -415 -162 343 -51 -456
2383 -456 263 -13 -396 68 311 -358 13 306 -216 -153 187 103 -50 143 28 -30 -24 90 -188 -5 93 -313
2405 -313 33 202 -282 -176 284 -252 -328 319 -53 -394 -131 105 -252 -174 121 58 -428 120 -113 -165 164
2426 164 15 -493 -31 257 -182 71 284 -188 -11 161 -84 -87 70 27 17 265 155 -259 92 136 -283 66
2448 66 338 -238 -162 514 3 -135 165 385 -311 194 267 -155 61 249 16 63 389 110 -248 260 163 -64
2470 -64 93 103 -164 -72 177 -395 168 255 40 -87 306 124 -97 0 116 -146 105 201 -360 -106 322 -118
2492 -118 -87 259 -109 -13 323 177 -264 152 230 -132 -71 38 -135 -149 89 8 -186 -60 -58 -88 -48 144 -160
2515 -160 35 67 -312 33 19 -309 -17 100 -212 -336 197 102 -236 -84 267 -375 -67 192 -262 -224 5
2536 5 143 -297 -12 -184 -201 39 19 -156 118 50 -204 -207 270 -35 -94 301 -188 -209 189 225 -300 102 339
2559 339 -39 67 225 -116 -39 250 -215 -189 256 48 -210 282 265 -3 59 182 9 -132 324 144 -143
2580 -143 111 30 -310 172 38 -49 250 145 -219 247 318 -118 112 375 21 -35 277 -55 -125 98 291 -290
2602 -290 -135 339 22 -142 183 164 -176 243 -92 -141 104 165 -30 70 157 -40 216 -22 -129 -154 259 -34
2624 -34 -201 140 196 -196 111 256 -262 -18 147 -379 -168 227 -146 -161 62 -67 -201 110 171 -162 64
2645 64 102 -223 -151 168 -101 -287 66 -46 -289 106 63 -242 -29 -31 -194 -129 98 -189 -88 125 -113 -150 189
2668 189 131 -221 48 -40 -404 10 21 -43 -229 64 104 -121 267 62 -248 171 49 -392 -4 147 -19 -61
2690 -61 192 -47 -187 32 -126 -123 296 97 8 245 21 -94 -13 166 -12 186 51 -115 -76 112 235 -318
2712 -318 114 283 -337 116 201 -109 114 -14 -34 -223 35 400 -75 202 -31 -229 242 -95 -6 152 57
2733 57 -96 -73 331 -286 -101 261 226 -201 276 128 -265 147 221 -32 -129 338 -107 -171 162 1 -140 74
2755 74 -60 -152 34 84 -289 27 65 -392 -264 -51 -208 -58 44 -149 -191 178 -15 -230 207 142 -247 -109
2777 -109 279 79 -116 321 -172 -245 151 226 -328 -130 80 -52 -59 356 -84 -91 22 -153 -23 50 -88 -86 131
2800 131 179 -134 -59 28 -109 -20 266 -67 -138 404 55 -305 87 -49 -17 -25 233 -160 114 184 -70 -124 158
2823 158 -169 51 266 -73 -244 -48 291 -28 -187 19 -231 122 298 70 10 316 313 -226 185 75 -20
2844 -20 59 223 19 52 152 -67 -126 93 -200 -181 157 144 -54 114 -5 -215 57 -53 -262 -144 135 -38
2866 -38 -255 -145 -303 -87 121 153 -147 234 9 -250 93 99 66 1 63 25 -29 118 75 -121 291 134 -224
2889 -224 -119 283 -368 -165 -31 -87 -112 78 -144 -100 -67 58 -185 49 49 -190 120 238 -28 -328 22 -88
2911 -88 -133 51 112 -228 -5 126 -116 -186 238 -208 -163 352 -97 -267 23 145 -230 93 102 -199 -164 139 25
2934 25 15 112 -146 -104 -2 -29 -159 266 19 -6 -126 19 -163 107 169 -88 31 110 -73 -302 264 113 -18
2957 -18 95 87 -13 -98 299 -212 -16 244 -207 -149 51 29 -264 59 64 60 142 126 -82 -71 -92 -76 -123 211 29
2982 29 -185 274 84 -60 94 172 -48 77 -61 -237 -296 266 105 -238 -41 19 -136 -60 14 -163 -81 47
3004 47 -305 80 225 -126 -86 -16 -58 -88 -120 118 -158 -112 83 40 -63 -133 -132 -21 71 -125 -126 86 -77 -375 118
3029 118 308 -140 -133 271 36 -106 -20 -140 1 206 97 45 20 -12 -178 19 32 -327 -167 14 -150 -73 213
3052 213 -109 -44 257 145 -169 -175 194 -219 -46 4 -93 -50 69 67 -109 261 280 175 156 93 -49 -42 223 -38
3076 -38 74 -21 -84 -141 70 -32 -205 249 37 -81 -87 78 -107 191 223 -71 -65 -78 27 -38 13 -153 -90 229
3100 229 19 -107 -191 222 -90 -239 -59 -93 -17 -31 26 -101 71 99 -102 26 -49 -75 -84 -24 -32 -135 144 -89
3124 -89 37 54 61 78 63 150 -243 95 -17 -31 -9 110 -27 78 24 -126 -146 72 18 -255 -215 68 87 8 16 -49
3150 -49 -70 125 -85 -171 96 8 -198 44 -36 -165 -145 -89 -177 -165 166 -116 -33 47 -60 -270 67 84 -287 -251
3174 -251 61 -151 51 149 -56 -106 65 92 -149 42 164 -55 11 46 -163 292 -128 -13 127 309 146 -101
3196 -101 204 133 30 199 67 -23 -209 37 -58 -168 224 1 69 85 48 -18 93 129 -175 -26 -126 -174 67
3219 67 85 -130 43 38 -17 -123 -9 20 -90 114 -44 -244 -111 -12 -220 -235 152 19 -131 129 -22 -115 -73
3242 -73 13 -12 6 -182 55 -79 -26 -265 -158 399 45 -78 10 -24 -242 51 -63 40 -11 127 -112 2 42
3265 42 -78 -145 104 -27 -78 -73 -159 -69 -154 -9 -277 104 -43 -186 -32 201 -105 -113 -153 129 76 117 1 14 -87
3290 -87 -43 -131 30 65 87 36 87 -6 100 58 -80 24 75 98 -71 -95 191 -95 -84 35 -116 -10 17 -38 -182
3315 -182 -45 281 -64 -73 39 -108 -74 -35 -170 -33 120 52 42 32 130 -142 -49 202 -85 -182 -42 -38 -74 140
3339 140 -43 -192 224 -41 71 71 -86 -229 -128 79 202 -36 158 -114 -141 68 100 -171 199 50 44 71
3361 71 42 162 -31 205 232 -100 68 -84 26 38 -54 -147 139 -15 -60 95 -136 8 -123 71 85 -141 -102
3384 -102 52 26 -132 58 75 174 -29 68 -179 -163 -79 -184 -80 -17 -18 208 29 -111 155 -111 -120 -90 25 27 -124
3409 -124 63 100 -156 86 8 120 -5 66 -74 6 204 48 77 217 -9 96 -67 131 -175 129 115 -48
3431 -48 155 -54 -124 160 51 30 -116 154 127 -164 79 58 -60 -57 157 -106 122 196 150 -106 23 -130 220
3454 220 162 155 219 37 152 48 97 11 131 -215 110 -30 73 24 77 -92 3 15 -48 6 -20 -19 -15 77 -158 74
3480 74 7 -118 248 152 -19 131 -12 81 101 153 13 14 -261 126 -50 -170 -117 -87 251 60 128 83 102 -7
3504 -7 35 -14 -31 20 -65 -250 26 8 134 -56 135 32 106 179 190 219 -89 201 -3 72 212 90 -5 -21 85
3529 85 -105 -105 -6 140 -104 -6 172 -43 -72 -7 -25 71 83 21 242 -66 2 -122 -146 -100 -103 -187 0 161 -90 -11
3555 -11 -68 -81 171 -40 131 35 116 9 82 14 -174 98 123 -49 -49 166 12 53 80 -92 -131 -160 111 43 166
3580 166 218 10 11 26 -95 -175 75 56 -162 -64 82 10 162 107 57 29 215 -50 -46 -74 -16 -88 11 164 -101 6
3606 6 -49 0 -22 -82 -88 -8 105 48 -186 -63 33 -56 27 -11 -168 47 116 13 15 88 -26 -28 204 -15 -172 76 180
3633 180 -60 -176 56 -42 -11 101 53 187 156 -4 -38 77 181 -348 -18 107 102 50 78 -36 -155 30 -60
3656 -60 -132 175 -77 -26 32 -38 -45 -61 -5 -147 -8 97 -261 -132 8 64 -138 41 129 257 -111 121 13 -139
3680 -139 -82 30 236 -7 -26 -103 -33 108 -136 -70 13 182 40 142 -49 -139 152 14 -13 -18 38 13 144 163
3704 163 -109 -55 -45 -29 -195 141 -8 -177 179 -246 113 75 61 -128 42 75 73 -143 -86 115 90 -91 -36 20
3728 20 -60 57 22 78 -16 -96 44 -173 -56 -56 -242 57 158 -2 33 -309 49 -19 32 24 69 188 -52 -46 144
3753 144 -32 19 32 63 -236 -125 -134 123 109 -128 159 185 51 6 -77 -191 -196 -44 39 -63 -103 252 -161 98
3777 98 216 -52 -48 26 -124 59 -54 -142 -189 -166 -10 52 73 60 -127 -5 -88 103 22 -17 -13 33 15 -21 -115 -6
3803 -6 -93 51 94 175 199 -17 128 -28 176 112 80 23 -61 36 15 249 -27 11 -39 69 76 -54 -18 81 -97 -6
3829 -6 -73 111 -48 49 -41 -51 120 -168 -45 54 -69 -5 117 0 -154 -45 -125 -198 -21 -114 -83 -24 3 -41 -144
3854 -144 303 30 3 70 57 79 176 100 -33 43 -185 101 168 -62 -164 -43 202 -32 -101 147 86 -109 196
3877 196 -98 48 29 -78 13 165 39 -28 147 -22 -415 -98 18 -246 79 -20 -7 207 35 -126 -201 -119
3899 -119 88 73 -180 -33 -52 -156 100 19 -187 29 70 -138 100 191 176 -117 10 -169 -167 -16 -157 11 -49
3922 -49 -73 68 44 16 21 -40 89 55 -2 -42 -77 -8 53 216 49 86 47 32 -68 11 -19 -91 106 -92 -33 138 254
3949 254 -102 80 106 -103 -29 33 -142 -86 -15 76 -13 -93 119 -39 136 3 87 -25 89 45 2 65 38 -11 40
3974 40 -3 95 19 -31 -77 -37 -41 -5 -104 193 49 -48 107 -117 -47 200 48 -221 -183 208 74 215 48 84 43
3999 43 -73 56 51 -12 -52 -69 83 52 -179 -137 -30 -69 32 38 -87 -129 -4 -29 103 29 39 122 68 -65 -19 91
4025 91 91 140 -48 -91 79 2 140 75 -115 78 -175 -66 67 138 95 120 151 181 -185 258 -229 10 73 68 35
4050 35 0 0 24 42 239 -97 -122 -34 -32 -21 3 78 -71 278 31 -6 -227 -123 48 37 63 32 149 -45 -189 -96
4076 -96 15 119 -170 -3 71 45 -40 -8 -52 228 111 -142 -61 96 -23 112 -83 206 58 -100 -90 3 96
4099 96 153 -5 -70 -60 125 -43 -151 -106 -47 116 -30 9 -6 119 90 -13 -98 -70 -142 57 71 66 -41 71 16
4124 16 -47 -161 -86 197 -36 -51 -128 5 -180 -36 -90 83 -75 131 -27 -59 103 24 39 81 77 76 78 100 -75 103
4150 103 -193 16 -103 -123 159 107 -50 -113 117 -40 -49 -215 -184 15 120 -102 7 39 -19 -23 69 37 137 2
4174 2 -21 -173 -100 -164 40 -56 -87 -23 -114 15 -95 90 88 -88 40 -131 -102 -102 -130 -156 -272 -100 42 -55 141 145
4200 145 -194 95 89 39 97 -268 113 134 -73 -12 -34 -157 142 82 82 91 98 -98 5 111 77 87 94 -185 44 -99
4226 -99 -108 4 102 -143 -61 -21 32 -16 24 -7 137 -61 -14 -18 -82 182 16 -251 -53 82 -221 189 30 -51 -31
4251 -31 -175 -156 -156 84 144 33 -45 4 223 119 -86 92 -122 13 -181 49 -32 -138 29 -6 90 -33 -13 -51
4275 -51 -66 -53 -163 21 18 125 20 -31 268 -71 -37 89 -28 60 38 -179 -9 151 21 -22 -229 -71 -135 19
4299 19 5 -53 -127 -65 159 290 78 -18 -108 8 17 -76 -48 111 -84 -207 122 122 50 -182 20 -153 -78 -80 -145 -129
4325 -129 45 -21 44 56 -104 -113 -32 -134 133 54 50 -45 -153 89 -142 62 133 172 102 50 45 -164 -185 -21 -155 -100
4351 -100 18 -56 89 -47 -55 -16 -21 82 -164 12 165 -52 -56 -67 8 -44 -36 -118 -119 -144 58 69 262 -78 -84 140 155
4378 155 -257 143 -46 93 -48 102 76 107 108 136 221 -37 14 -76 -5 -109 22 -6 115 -99 0 -97 -103 -83 107
4403 107 70 -82 -20 -234 -76 89 -84 39 -74 5 -33 -24 170 -92 140 22 -8 -148 -5 -27 92 -56 -99
4426 -99 25 -147 12 -7 135 154 245 -103 75 121 152 -178 -103 47 -115 8 90 25 -7 -141 -67 -10 -152 56
4450 56 -57 -123 233 -11 16 144 -18 -6 27 -46 -87 4 -26 -1 169 90 -47 -86 -104 74 -40 -23 78 53 33
4475 33 -53 80 -24 -80 31 -59 18 163 -5 -158 89 -181 82 261 -26 -50 -141 119 -31 112 -101 -68 1
4498 1 -75 23 160 -9 -5 -69 -33 136 194 108 28 4 138 -114 60 -59 -156 -127 -124 131 -67 -173 -119 72 62 -9
4524 -9 67 33 65 -56 29 162 3 190 18 -211 8 117 55 103 47 78 24 -194 -112 109 -126 117 31 196
4548 196 -25 13 -27 27 -133 87 -25 -125 -28 -87 63 -98 -20 229 16 77 136 134 -29 -121 -53 224 100 -195
4572 -195 149 -59 -122 60 -31 -40 -2 110 8 41 -172 -138 -58 29 -19 118 68 -10 86 -56 29 33 173 183 35 7
4598 7 36 44 -118 -154 -20 77 -96 60 21 52 -181 23 -48 -86 -45 -13 61 134 101 11 92 -177 41 -18 -49 33 59
4625 59 -2 3 133 -19 86 -124 -24 159 82 -168 174 -155 -102 -32 34 244 20 -134 -85 -49 18 95 -29 -40
4649 -40 -96 66 24 -5 31 38 -126 5 79 -86 2 128 -96 30 -189 2 18 178 55 93 71 6 20 -50 -54 32
4675 32 25 -15 -42 -128 -53 -17 -51 -13 87 -22 24 -81 -68 17 24 -30 -45 -57 40 112 -56 174 -83 -31 44 -137 -33
4702 -33 104 -23 88 -32 17 10 110 73 -25 -32 -211 140 -22 140 137 -181 132 33 66 -55 21 164 54 233
4726 233 114 58 108 84 -98 14 -36 -33 94 -139 20 126 -61 72 78 -96 225 -214 -220 93 63 -89 -23 -40
4750 -40 46 -113 -92 12 -10 191 113 22 -63 -200 175 84 -98 -17 37 123 34 -126 -130 43 -217 254 -162 148 -128
4775 -128 7 -126 -90 158 -12 7 118 63 -21 -114 -83 23 82 -27 -75 -64 130 48 -68 -57 -13 -86 22 54 152
4800 152 -85 55 110 -164 67 -21 12 110 130 29 88 130 -123 -59 -243 -46 -34 -103 80 -6 -32 -51 35 20 142
4825 142 62 -14 -52 115 83 -118 36 -55 137 -204 34 -67 -106 -73 202 -44 -29 -103 -87 40 121 -13 -63 151
4849 151 -12 -214 -2 -2 91 -214 -10 -76 -125 -15 16 196 5 155 -27 -58 -139 -11 -73 70 -73 -2 -85 -108
4873 -108 111 126 -185 315 20 -33 68 -227 -246 141 141 114 66 24 97 -127 54 21 125 -56 205 69 -147
4896 -147 231 -177 -23 -41 34 -167 48 107 -219 67 -110 -18 -167 93 -126 -119 -157 -14 170 207 32 -307 -77
4919 -77 14 24 -85 36 4 55 -74 -113 61 -52 11 35 94 -98 55 -262 84 68 -76 -64 122 79 -73 174
4943 174 50 16 4 -102 92 -118 36 82 70 -13 108 -37 -173 26 73 -42 -74 56 -64 -45 157 79 43
4966 43 -159 38 128 110 151 -75 -192 -17 -15 59 136 29 132 -21 59 84 -64 -77 30 67 53 -2 -106 -78 -54
4991 -54 -70 -59 -202 58 190 -29 19 117 -97 120 123 281 100 -92 -3 103 152 -53 -21 -14 -183 41 69 -43
5015 -43 79 47 71 -154 -20 -25 -71 -62 -224 -36 112 115 -72 30 16 107 -17 -78 134 52 20 37 194 -16 -96 61
5041 61 90 46 92 50 -31 -53 -16 -42 14 -88 157 227 164 233 6 53 49 207 91 55 -100 81 -87 -141 -38 179
5067 179 -160 -7 3 -12 -25 -157 100 -173 -180 -48 -117 -108 10 51 0 291 -212 83 65 178 -118 18 -37 178
5091 178 -10 -225 96 -22 -134 -21 -54 10 -67 -188 -33 150 68 35 201 -80 148 -214 126 -8 -141 168
5113 168 19 -19 -79 -124 67 65 45 -110 -17 87 -158 -107 -23 91 104 -15 -173 -113 213 92 -39 87 -274 -122
5137 -122 83 -37 167 156 73 -104 -84 -81 48 -52 -94 24 -23 142 -5 -158 -109 -3 -202 -111 57 246 197
5160 197 64 -201 -7 129 -38 -19 47 -42 102 -104 -115 145 207 -6 61 -8 134 -40 205 101 -170 -4
5182 -4 67 -199 20 236 -37 -33 -133 -15 20 80 -35 -36 -220 -132 -35 86 79 30 -112 95 33 -54 -161 121 130 140
5208 140 21 -147 96 39 61 55 43 -33 -82 -3 132 46 -125 -19 105 16 136 -126 -138 -29 24 26 38 29 -62 -7
5234 -7 209 -134 -86 60 -86 -237 63 -81 115 -196 -55 16 -57 -115 88 -47 -164 -10 99 -73 -68 156 -109
5257 -109 188 -83 -145 -195 13 -5 -54 37 57 91 -76 -42 16 -82 -18 -103 123 -10 158 193 3 139 6 7 49
5282 49 293 105 -81 -54 15 5 -110 44 33 -81 -10 -138 -102 17 89 3 99 43 -94 -155 -5 -100 -155 -181 -78
5307 -78 -185 11 -51 -100 -84 -47 -65 -36 -61 102 63 -16 -78 -133 76 -156 -16 91 49 -62 98 138 6 -199 39
5332 39 20 117 -89 -20 -87 -11 -71 -218 -21 -3 -56 -159 84 -38 -76 26 90 61 77 -1 -100 171 -135 -81 -89 -29
5358 -29 -87 14 -80 -209 72 66 -42 -29 -57 -3 143 -77 32 -97 -111 -190 48 -43 -80 136 111 211 120 -107 29
5383 29 45 150 -54 -99 37 187 -69 169 -216 57 127 -96 -66 -37 77 101 -10 -157 -30 -55 -51 -126 -129 85
5407 85 -94 107 55 -24 57 50 64 -48 29 100 -44 -7 -23 202 -57 103 22 -72 -121 -128 -108 67 -119 4 3 -106
5433 -106 166 -118 105 21 43 -47 89 -11 70 -166 -4 51 -69 66 -66 28 100 -27 -129 79 210 -36
5455 -36 -131 161 -60 -159 63 -107 -213 -47 -81 -276 94 80 87 61 -157 -64 68 98 234 131 -41 178 -26
5478 -26 -10 -131 20 -4 67 102 17 -104 -8 -143 -36 146 72 -214 19 -85 -172 2 -50 -5 -117 204 -191 -37
5502 -37 -102 88 -127 141 76 2 -97 45 -116 60 59 -1 -12 113 -134 90 21 -68 -169 162 81 -14 -5 -269 -54
5527 -54 178 125 -22 84 -122 -84 -98 1 -161 -166 -23 -142 37 -4 36 -120 -23 99 -12 -5 -112 16 -76 60
5551 60 82 5 67 -30 50 -53 -72 -75 1 68 -36 -171 -40 242 -105 24 -22 -90 124 -126 -55 51 187 -102 -42
5576 -42 92 55 -14 -28 -99 19 -108 -47 6 79 -87 -87 -161 3 -46 117 70 -38 -102 28 -48 156 148 -62 104 -65
5602 -65 103 -7 -41 -33 -175 -55 4 179 -63 129 125 -80 22 68 -34 235 227 0 37 126 -18 -132 -97 13
5626 13 25 55 -68 126 108 2 64 74 52 -34 -5 8 -89 -111 142 -24 -109 -29 -10 -47 51 62 -52 75 -47 -120
5652 -120 41 -41 -64 -83 -152 -174 33 -92 99 -28 33 222 109 -18 73 21 151 -101 -56 -20 88 -160 -100 -101
5676 -101 108 16 -130 55 102 30 -153 68 111 49 -22 -113 114 43 -91 13 -106 45 69 52 91 -52 -215 97
5700 97 -68 163 12 -8 59 308 -122 -156 224 -132 37 45 44 -84 26 53 -10 37 84 -66 174 100 -77 31
5724 31 -24 125 60 58 -44 -110 71 17 5 -166 77 108 81 20 -77 -141 110 120 58 39 18 -262 177 75 -203 -2
5750 -2 29 -11 -84 -3 -13 204 -130 -8 -165 49 15 -27 -227 116 20 -12 134 -97 -37 -240 -224 -214 69 -15 47
5775 47 20 94 -75 35 86 23 52 73 -25 93 3 115 18 270 -48 81 -160 140 86 -281 13 -17 67 41 73
5800 73 1 173 7 16 86 109 -31 16 195 -27 100 -83 -10 150 104 114 -41 290 -62 27 32 207 -125 -10
5824 -10 119 41 150 101 -100 120 121 202 22 66 176 -30 -95 64 88 5 47 131 55 75 46 -56 -102 135 -70
5849 -70 78 -75 -18 60 -91 -82 35 122 41 98 8 -71 41 -53 -120 51 -220 115 -151 -138 87 -63 -127 -86 39
5874 39 -61 -14 -93 -114 96 -58 -48 -150 -11 -304 56 -70 -90 75 66 -57 -124 -66 44 21 -58 60 -140 -28
5898 -28 91 -229 -322 111 53 79 89 -51 -92 -79 -6 102 119 7 -5 -124 63 157 -5 15 43 -37 -193 -26 72
5923 72 36 -33 -200 -34 124 128 -89 225 -181 -93 152 185 112 39 213 -81 42 175 76 -202 -85 -32 124 -49
5947 -49 52 8 -107 29 -100 59 115 59 -24 97 121 38 13 154 17 48 39 4 17 30 1 -33 179 94 10 -18
5973 -18 135 -208 -120 110 -63 114 33 -49 148 -184 111 -81 -22 80 -118 -64 23 -8 -6 -95 20 -110 -120 82
5997 82 -288 185 -148 -20 6 81 -180 -96 250 184 167 -95 27 -73 24 16 -213 32 -179 -88 -77 -132 -84 13 -106
6022 -106 -81 -167 142 -61 -80 224 57 20 -47 54 -100 56 141 30 -220 154 27 -80 115 47 -99 -205
6044 -205 -14 -113 3 -57 -85 -90 -148 -4 202 34 147 195 43 52 42 27 -255 -23 59 78 -130 141 92 -37 77
6069 77 -29 -109 -153 45 63 -62 126 -103 -48 36 101 -95 177 135 -17 231 26 -72 142 -86 -181 -114 86 73
6093 73 -237 -91 -33 -25 33 70 -34 -55 41 196 -118 -36 94 18 37 37 -61 -93 161 63 -62 17 31 21 126 129 39
6120 39 17 -104 -39 -120 26 -48 -128 139 -169 104 -201 -38 58 98 -20 71 6 138 -56 -28 61 141 -142 82
6144 82 63 -102 2 53 120 -60 -168 -97 -88 -43 -31 -62 104 17 -30 -33 250 -18 -55 4 109 16 83 -57 -256 142
6170 142 7 -72 24 172 62 79 -70 -65 -10 -228 -124 120 86 7 209 -178 30 54 188 5 -30 49 67 25
6194 25 94 68 -10 -32 -56 64 -26 71 -33 -130 67 -27 111 127 82 -19 9 68 -49 -69 28 -77 -53 57 -129 56
6220 56 -139 -76 -13 44 135 75 44 -11 112 107 43 92 105 20 104 -88 139 -200 29 26 52 -31 -194 -175 78 74 -26
6247 -26 -63 -83 5 16 38 210 151 37 -73 78 64 -101 254 126 16 -71 83 23 -191 29 -194 -65 122
6270 122 -51 -197 -17 62 13 133 -43 56 -47 66 -60 -89 -156 15 -115 120 -68 -82 56 264 74 234
6292 234 87 64 -88 -119 109 296 238 -149 161 9 92 31 -47 -135 25 71 166 -93 67 94 106 -49 -30 167
6316 167 -29 98 -63 -207 12 126 -22 5 104 106 28 207 -20 -34 -36 25 -60 -65 29 -77 -84 155 -138 11 -16
6341 -16 -204 -81 -36 0 -29 47 -42 -136 68 9 255 52 62 60 -82 -155 -52 151 16 5 171 4 198 -44
6365 -44 74 187 -56 -23 4 78 -21 196 4 -87 79 -304 -106 -129 64 -120 -69 63 21 71 199 4 53 -140
6389 -140 246 -28 -42 -30 8 40 43 -70 -43 -79 14 -107 2 249 -78 -6 15 -5 75 109 -66 -17 224 -62 108
6414 108 33 143 -39 106 221 -132 126 115 -19 113 78 151 96 37 -128 -79 -50 -92 55 -105 189 -16 -124
6437 -124 6 22 14 119 62 -27 -46 76 -213 -45 -9 127 -105 -92 -102 -168 -65 -24 -144 -26 8 108 -256 51
6461 51 9 -216 42 30 -265 24 64 -153 193 119 -189 27 32 105 -74 118 -7 253 -59 -29 -57 -175 54
6484 54 -195 -6 -119 96 42 -18 -136 -44 -87 45 -49 145 88 -76 36 206 -64 -76 -174 -101 153 19 -84
6507 -84 -259 79 -58 -56 68 72 151 56 -10 -120 -35 -39 7 -68 69 -34 -9 115 141 12 -82 121 54 44 -142 20
6533 20 5 82 -9 78 111 222 -111 126 84 -83 37 154 79 11 115 95 57 130 201 76 32 60 43 -85 -71 -158
6559 -158 65 -88 -95 -16 -33 -101 -1 55 -42 83 175 -132 -1 90 -6 67 50 51 53 1 -15 142 -20 -113 -113 7 125
6586 125 79 67 -68 182 -132 -153 54 101 32 229 -8 30 134 86 114 -103 -88 42 6 109 185 -103 6 138
6610 138 166 -57 -94 -144 107 253 -41 113 59 -34 -137 -113 50 48 45 -73 -79 161 98 49 190 10 -45 -7 -40 -74
6636 -74 40 63 -16 -31 -34 -173 -86 87 -25 33 87 45 -19 119 -101 -82 7 -308 46 64 -27 28 126 118 -154 17
6662 17 22 -33 -174 68 12 107 61 -17 -102 -2 -302 172 -33 126 -26 -78 -123 -150 -79 -56 99 -20 18 -98 159
6687 159 123 40 -66 147 48 130 -72 -188 69 -120 -85 63 -38 -170 -268 -6 171 -1 -140 97 13 0 -24
6710 -24 -120 -14 -23 -125 24 82 -3 32 37 -118 -116 63 -93 22 111 -131 -40 257 -46 5 27 36 -25 -28 117 120 27 59
6738 59 83 196 -31 -53 24 -85 69 63 -79 -11 43 -18 37 -95 -180 103 102 -34 27 -21 -55 113 42 99 227 72
6764 72 131 -95 41 -67 -114 92 94 -36 38 -93 -120 151 154 -163 -219 -122 50 -78 -67 -57 87 128 -192 173 218
6789 218 17 -110 67 117 -90 -4 189 -105 -43 88 3 85 -89 -90 -74 -46 10 32 67 67 -7 71 150 -106 64 226
6815 226 -75 -209 80 151 -134 -208 58 -11 -25 -8 -87 -42 -16 -31 -25 148 -89 -167 94 137 -94 33 50 4 -16
6840 -16 49 -68 -12 254 -87 -104 -58 -56 138 51 54 -72 -91 65 7 11 122 -88 5 162 -30 5 1 70 -63 24 16
6867 16 -118 69 162 74 113 -129 1 -130 6 -96 -247 128 31 -100 -48 -119 -238 -46 31 61 10 71 11 -68
6891 -68 -73 -174 -147 -12 231 0 108 -21 39 19 -33 78 -159 -258 -25 93 67 -19 85 -41 56 105 -4 87
6915 87 51 31 -229 -181 -365 94 210 83 -59 36 143 -80 63 -62 98 156 42 -65 -39 127 -200 -32
6937 -32 17 27 -8 -60 172 47 177 -57 -151 -39 144 -7 -110 -96 34 -209 5 -135 -27 47 88 -19 290
6960 290 7 -17 -35 68 -223 147 118 56 140 62 176 24 94 17 -17 1 -163 -13 -101 -31 -229 -42 222 -177
6984 -177 -50 58 5 -142 -25 216 163 -130 -136 90 1 95 -52 -77 88 65 3 -5 86 63 156 67 -221 -50 -71
7009 -71 -103 -88 -55 153 -77 27 -16 -107 21 40 131 -88 -47 -91 -43 44 -69 -2 -22 149 11 -104 -11 89 155
7034 155 247 2 25 -34 -157 183 186 81 37 77 124 -7 0 -79 259 33 124 85 63 111 74 -8 -171 52 -47 203
7060 203 7 -148 -167 211 -69 65 46 -39 95 87 64 -6 -13 -239 -157 64 112 -89 64 109 -144 -157 87 178 146
7085 146 233 -431 -72 -153 62 -120 64 -80 20 -18 21 -138 62 25 -12 111 196 -3 -81 201 53 19 107
7108 107 159 -173 -29 99 87 -107 -110 -113 8 33 -37 -220 -46 -65 26 -124 10 34 -69 -116 -60 23 -155 -150 -139 -81
7134 -81 -91 -25 -47 122 50 -15 74 -65 -122 -198 54 32 41 -26 -26 97 -166 -77 -9 -32 50 -70 175 8 57 241 92
7161 92 8 -93 165 -165 64 50 -5 50 8 -83 97 169 -22 -191 122 -62 164 -34 -122 54 27 89 51 -130
7185 -130 -316 79 -185 34 13 140 -67 106 33 58 -27 148 -40 241 -107 -77 27 14 -114 -27 278 -35
7207 -35 17 -170 208 -71 208 -103 45 174 -54 -123 -205 45 -54 -33 -133 -127 -89 53 52 -57 -53 -44 117 183 -80
7232 -80 -63 -123 58 -141 68 206 -66 -33 20 -64 78 -5 153 -78 -41 225 -94 -156 260 43 17 165 -11
7255 -11 -219 204 55 -26 205 122 165 -55 23 36 118 -38 23 107 166 64 122 31 69 64 134 261 -59 104 57 46
7281 46 47 65 8 67 -169 219 43 -177 -60 55 67 99 -122 -38 -114 -34 -20 251 98 72 5 139 6 -115 -136
7306 -136 206 -51 72 -22 40 45 18 131 20 -77 55 6 29 -206 -18 5 -150 -30 154 34 -12 125 -41
7329 -41 14 7 79 26 42 -181 -112 149 86 -151 -53 -144 -199 -168 106 246 -202 -63 44 -69 -5 75 -1 39 82 -47
7355 -47 66 -153 -297 -66 -11 -164 101 37 -64 -38 119 -29 -9 22 138 5 1 147 97 -133 18 130 104
7378 104 74 7 -27 27 -9 -90 -157 -56 179 -120 -6 127 104 -140 141 168 180 83 119 62 -47 -81 -121 91 92 85
7404 85 -152 136 132 -61 119 134 -17 -9 -6 -111 136 17 101 -188 41 -39 -165 12 -147 -12 164 -181 98
7427 98 -58 -87 -147 -23 57 -74 76 172 -37 -50 32 -21 162 51 54 -130 -28 24 -25 -37 97 -123 10 -77 -225
7452 -225 -266 -56 -16 -31 244 39 90 -60 131 -92 -107 187 -17 63 96 57 76 -50 78 -52 -45 63 -237 -64
7476 -64 -7 137 -101 -155 -9 -81 -60 -141 -111 -147 24 -24 -29 -23 176 -60 -120 -204 -22 209 143 -59 -30 -34 -35 81 -56
7503 -56 -67 -225 -75 -120 -2 46 -225 6 -106 72 -291 14 -97 -117 -12 -2 168 -57 60 -244 -9 -9 -28
7526 -28 27 -45 -92 -177 -79 76 -102 110 2 -133 -56 4 98 140 349 -41 160 136 40 -121 193 -81 -147 -35
7550 -35 76 -23 -40 -268 39 147 -118 -71 57 144 -53 -6 107 -175 -134 86 2 -158 82 -73 -128 -20 46
7573 46 -4 -45 -15 38 35 -105 160 -234 -16 -87 -96 29 129 -43 37 -176 24 -234 -7 39 -94 127 107 -114
7597 -114 30 101 -64 -94 176 228 -125 119 103 -172 -74 -9 67 120 -76 -235 -53 83 -16 -96 134 26 -171
7620 -171 -51 93 -41 115 60 -73 -34 -47 -66 -239 -14 22 -69 91 105 -6 132 -33 -130 -104 21 23 -186 54
7644 54 66 -106 -31 -7 59 49 -140 -4 100 67 -85 162 -192 40 -51 51 110 93 3 40 -88 -20 38 132 -125
7669 -125 54 53 15 188 -199 186 163 118 -202 195 -118 -6 159 29 -48 83 95 -56 -44 -61 -133 -59 -130 -23
7693 -23 -96 114 -49 -26 -48 -10 -40 53 75 80 -125 -21 -35 -125 92 -11 31 -73 -35 -156 -183 124 74 -34 11 6
7719 6 105 95 13 -108 -1 17 -57 120 33 -222 -150 9 196 -191 31 -18 151 115 206 -93 86 -118 -166 -7
7743 -7 -136 -56 108 149 13 19 14 73 -17 13 -6 -6 -133 -62 -105 -30 238 31 -145 3 -28 138 -115 -166 233 98
7769 98 65 47 8 37 -117 -55 74 52 -18 23 157 -63 -91 79 3 -48 110 133 -150 26 -184 -92 15 25 -139
7794 -139 -28 -156 63 -43 -24 -67 -116 -38 5 -75 -64 76 109 41 30 85 112 -32 -132 -26 207 -140 -209 111
7818 111 1 -41 -102 83 -184 19 -30 -156 -2 103 147 102 -46 24 47 16 -122 52 -48 269 4 144 186
7841 186 -181 -212 -55 114 -156 -1 -1 -70 245 54 59 -187 -148 -77 168 -50 -32 -130 112 73 -53 6 -4 114
7865 114 -104 -23 -13 -91 -131 -83 77 -83 -105 -9 -116 168 -30 -38 140 -28 -187 91 -129 -9 151 62 66 70 21
7890 21 23 176 -31 -88 32 5 -100 -6 -77 -161 -158 11 -160 -66 154 -126 -75 124 -8 -295 181 -51 -72 -314
7914 -314 86 78 183 -96 -77 -120 -114 118 -5 -98 34 -74 -102 80 7 2 -115 97 -73 191 -117 -77 -92 -33 77
7939 77 41 166 -4 104 198 -37 -51 145 -85 -112 -7 74 253 -25 8 174 122 46 12 -165 242 75 35 -186
7963 -186 -78 91 -249 -168 -15 111 -54 -138 -57 -102 -76 75 35 25 31 -102 97 1 -49 138 -174 80 -189 59
7987 59 -126 23 -141 0 124 -169 -22 128 34 64 -112 -54 -34 112 -24 -97 -167 -125 -68 24 55 -5 -27 -110 166
8012 166 -111 -70 174 -123 11 113 -107 65 -108 51 -100 -42 -117 231 -137 21 80 -14 -147 -49 -76 206
8034 206 62 18 196 -78 -210 -34 -62 78 -227 -37 136 30 51 -105 60 134 -8 -77 -48 -26 -68 -186 -45
8057 -45 202 52 258 -75 -49 -37 -88 25 -120 -112 -36 -100 26 -55 -71 -121 51 -107 -146 38 -7 68 -186 -193 -279 7
8083 7 -55 -65 29 -30 -177 -85 -26 -63 121 -191 157 -142 -49 41 89 -18 -191 -13 -132 -49 1 -3 -148 176 4
8108 4 94 110 157 42 -119 -66 200 -1 238 239 127 -4 -29 -129 167 -7 9 32 70 281 -110 23 -48 -147 -122
8133 -122 201 68 5 -41 222 -8 -126 57 -32 -53 110 -175 -40 34 142 -47 78 30 -50 -49 -27 -106 2 -19
8157 -19 -30 -144 73 31 -84 223 -13 62 143 -171 -87 191 13 48 238 199 -114 -11 196 90 -55 222 -212
8180 -212 -42 -58 -83 151 -52 226 -5 -53 127 51 -66
8191f6
$$ Imaginary data points
##PAGE= N=2
##DATA TABLE= (X++(I..I)), XYDATA
0 0 0 0 0 0 0 0 0 -8 8 -8 8 -16 16 -24 24 -32 39 -41 48 -58 72 -80 96 -110 126 -144 162 -185 209 -237 266
31 266 -298 335 -375 417 -464 516 -574 637 -704 781 -863 956 -1060 1175 -1303 1449 -1613
48 -1613 1805 -2029 2292 -2611 3003 -3502 4159 -5068 6409 -8595 12749 -23416 102971 177235
62 177235 -143208 -99000 113269 63151 -109777 -15390 99760 9481 -85330 5848 67739
73 67739 4078 -33637 17296 3192 -48857 -2236 64977 -3101 -64077 6881 49039 -18258
85 -18258 -20050 39513 9039 -41541 6985 35963 -14260 -21111 25645 20500 -13195 -5646 13017
98 13017 3723 -7309 1949 14113 1201 -18060 -6320 7256 -12095 -8602 30272 13322 -40888
111 -40888 -16121 39079 8211 -43169 -18352 21476 12134 -8037 -4217 12369 16469 -9021 -28553
124 -28553 -4339 21558 8501 -9658 -8956 -1240 9134 6077 -12494 -3862 17729 -7565 -34069
137 -34069 -567 21514 -8543 -12178 11613 -5748 -22686 9829 22593 -9874 -20342 -1936
149 -1936 3252 1528 6896 4255 -6079 -7578 1840 8280 2995 1613 7912 -7622 -29393 -792
163 -792 35206 2325 -31527 4839 25089 -11068 -13321 14501 -3576 -22910 6149 15233 -9155
176 -9155 -524 19080 -1188 -16612 6357 16084 -5760 -14648 4459 16194 2383 -7614 4579
189 4579 9366 -3502 662 11457 -5733 -15798 7234 11032 -7685 4380 14376 -13537 -14804
202 -14804 20294 12749 -17817 -1583 14850 -10232 -12983 18062 16740 -11716 -11080 8788 10818
215 10818 -940 -2061 4928 -1046 -12041 -598 14971 2386 -8434 7382 6426 -15208 -4163
228 -4163 16398 -2256 -18076 1719 8945 -5111 -1270 8584 1152 -5239 -3724 -3516 778 3046
242 3046 -2587 -978 3010 -4245 -1892 10247 824 -11808 713 4552 -10899 -4388 12346 -390
256 -390 -13509 731 8205 -4703 -6867 3252 3151 -7327 -9242 3303 7910 -7274 -9546 10928
270 10928 7866 -15329 -4313 16405 -3349 -16819 7050 9443 -13734 -4955 14953 1501 -9281
283 -9281 3880 3180 -9069 -2934 6784 510 -5899 -2795 3705 4018 -1054 -426 4410 -2379 -9371
298 -9371 2187 8739 -2700 -2645 5941 -1234 -4232 8696 5687 -7150 -769 4438 -4028 -243 8361
313 8361 -705 -3971 5638 1223 -4341 6269 5797 -7338 -2771 6681 -664 -3520 5458 4212 -3027
328 -3027 -563 4063 2934 -1807 -2627 3439 3882 -5502 -2373 10644 3170 -8817 3293 9266 -7306
343 -7306 -5440 9920 -124 -10349 5771 7994 -8733 -2361 11281 -385 -9401 2051 4873
356 4873 -4340 -3433 3286 2596 -2142 -2814 1897 3763 -3413 -3972 4530 331 -8416 762 7214 -4603
372 -4603 -5453 5928 4 -7218 2235 3495 -6044 -2757 2261 -2562 -1815 2359 -1768 -1240 2855 -3544
388 -3544 -4906 4645 1538 -8094 -1144 4832 -2522 -3170 3115 -69 -2934 525 -691 -2776 627
403 627 757 -1935 -988 -562 783 3050 -1946 -4148 4253 2327 -8020 -222 8521 -3634 -6698 7922
419 7922 3920 -8871 1193 9221 -4440 -6508 6602 3492 -5718 220 5455 -113 -2400 1389
433 1389 3202 605 -2218 288 4201 -484 -4155 4281 5343 -4575 -1215 6932 -347 -4691 4585
448 4585 3221 -4637 1504 5347 -2157 -1040 4877 243 -1739 2395 449 -1030 3120 15 -3212
463 -3212 3455 3208 -4268 229 5923 -1997 -4211 3983 2446 -4273 -483 3631 473 -2881 -740
478 -740 2878 1970 -4533 -2715 6033 888 -8031 1319 7564 -5596 -6035 7781 1742 -9862 2234
493 2234 7542 -7003 -6242 7649 1717 -8324 -309 5818 -2195 -5076 1249 2440 -2314 -3838 861
508 861 2054 -3641 -3182 4406 418 -7119 905 6257 -5092 -6042 6354 1318 -8565 885 5891
523 5891 -4503 -4181 4562 67 -4723 1386 1684 -2315 -397 932 -1208 303 827 -1345 0 1460
539 1460 -1335 111 1781 -1096 -509 2041 -998 -1546 2949 670 -2390 1928 1692 -2474 1402 3183
555 3183 -2621 -927 4569 -464 -3051 3320 2572 -2712 890 2667 -1497 524 2853 -1420 -518 3775
571 3775 318 -2045 2550 2017 -1239 821 1143 -949 1550 2201 -1637 77 2508 -615 -886 2147
587 2147 795 -768 1246 -91 -782 2237 -421 -2147 2276 1119 -3596 1547 4644 -4219 -3609 5781
603 5781 700 -6429 2245 5183 -4632 -3157 5224 465 -5444 1035 3332 -3000 -3389 2468 2668 -3244
619 -3244 -3580 3252 3062 -5595 -3670 5969 265 -8073 1851 6116 -6640 -5336 8203 836 -10006
634 -10006 1714 7667 -6163 -6567 6602 2507 -7523 -1594 4724 -512 -4186 770 2816 -2042
648 -2042 -3996 2356 3327 -4755 -3663 5632 1435 -7070 1109 6981 -4114 -5807 5608 2429 -6951
663 -6951 598 6058 -2651 -3675 4439 2470 -3859 -1428 2871 2011 -1728 -2198 1948 3305 -1325 -2176
679 -2176 3205 1362 -3446 1174 4117 -2277 -1616 4461 471 -3866 2496 4163 -1834 -1872 2401 1981
695 1981 188 -552 -245 1949 1162 -1238 1523 2767 -2024 -1151 4795 -18 -4609 2757 3955 -4456
711 -4456 -1442 6015 183 -4488 1803 2920 -2901 -634 2934 -808 -2457 1107 2589 57 -2226
726 -2226 -586 2436 42 -3353 520 2813 -2012 -1980 3122 -403 -3642 2562 1998 -5285 -380 5352
742 5352 -2378 -5262 3005 2526 -3655 -1082 1733 -2130 -1164 2526 -683 -3249 -35 1079 -1099 -1543
758 -1543 121 1357 -974 -2831 537 2215 -2446 -2917 2714 -175 -4561 2189 4159 -4837 -3435
773 -3435 5647 575 -6244 850 3557 -3138 -1744 3912 -524 -3361 1398 2404 -1951 -1817 1177
788 1177 1297 -1220 -1569 2346 3107 -2484 -2964 3521 2109 -3174 956 3225 -2978 -1820 5408 780
804 780 -4658 1375 4059 -2217 -1685 3501 1465 -1795 -480 1073 1554 858 -781 431 2020 -607
820 -607 -875 3198 495 -3764 1143 4014 -1467 -1614 3332 1255 -2231 1029 1634 -1314 -517 1676
836 1676 121 -456 837 837 859 -909 -1213 2343 1706 -3658 -979 4537 -169 -4030 2392 2611 -3881
853 -3881 -714 4191 -1373 -3889 2501 1857 -3558 -561 3147 -784 -2808 125 1456 -445 -1906
868 -1906 -330 1365 -1105 -2609 1044 1571 -2970 -800 3331 -1501 -4269 2107 2017 -4114 -793 3145
884 3145 -2307 -3191 3468 1388 -3761 -366 1937 -1955 -1497 1753 590 -1983 -1074 345 591 92
900 92 -779 -249 -320 -1691 711 2257 -1490 -1864 2356 143 -3076 1783 3005 -3174 -2237 3764 647
917 647 -3078 1799 1879 -2782 -426 3335 -238 -1631 1345 986 -944 -360 965 1092 251 -540 1184
934 1184 1999 -1141 -1518 2560 931 -2349 1356 2890 -2122 -1492 3578 1186 -2529 980 1901 -1399
950 -1399 -266 2106 685 -384 148 42 719 1218 -704 188 1348 -1335 -1062 3257 1260 -3029 785
967 785 2619 -2147 -1423 3310 698 -2940 226 1589 -871 -699 1077 662 -1216 -1188 561 1803 -1168
984 -1168 -2370 1609 886 -3511 -115 4327 -1637 -4207 2466 2107 -4159 -595 3912 -1707 -4015 2040
1000 2040 2041 -2749 -1236 2195 -459 -2494 -51 1552 -401 -2257 -91 2053 -1036 -2778 1690 1730
1016 1730 -3465 -1275 3559 -1068 -4019 1797 2573 -3430 -1308 3224 -887 -2730 1410 1441 -1455 -394
1032 -394 740 -443 -98 575 284 97 -634 -941 683 972 -1096 -214 1184 -978 -744 2314 635
1049 635 -1373 646 600 -1263 903 1847 -1102 -676 1550 146 -543 2176 449 -1605 788 853 -800
1066 -800 815 1733 -859 -516 1795 32 -359 1521 239 -1022 760 842 -247 494 605 -747 430
1083 430 889 -461 547 1372 -589 -611 1522 -164 -1007 1357 485 -1606 836 1362 -1729 -474 1947
1100 1947 -568 -1251 1253 -11 -1492 738 958 -1526 -212 783 -1017 -625 968 -58 -770 72
1116 72 -505 -390 682 -318 -813 444 -683 -1224 619 301 -1832 20 885 -1916 -938 2234 -433
1133 -433 -2435 893 941 -2225 -9 1916 -1511 -1855 1297 88 -1442 381 647 -1297 -581 73 17
1150 17 343 -432 -811 392 23 -1199 693 1138 -1661 -763 1887 -458 -1530 1576 825 -1843 359
1167 359 1667 -1055 -699 1435 -325 -694 1241 360 -565 767 750 -746 350 823 -800 81 1469
1184 1469 -333 -300 782 334 -325 853 423 -206 693 213 -371 1090 834 -885 708 1038 -1327 -37
1202 -37 2373 -645 -1514 1968 955 -2094 796 2239 -1151 -1198 1675 484 -1186 633 989 -835
1218 -835 -702 464 522 314 -679 -227 942 -256 -1667 1154 1334 -1767 -724 1727 -541 -1687 1475
1235 1475 906 -2119 -285 1680 -1199 -1307 1124 -158 -1234 100 -286 -467 159 -291 -725 224 76
1252 76 -1135 381 645 -1266 -638 1121 -496 -1196 969 28 -1271 -131 524 -801 -212 327 -789
1269 -789 -70 379 -1021 -129 758 -1169 -847 1385 -229 -1733 1197 1236 -1787 -3 1705 -751 -980
1286 -980 1322 610 -1262 573 896 -562 -35 453 -2 -56 121 -61 576 383 -760 553 1230 -874
1304 -874 -406 1772 173 -1327 1075 1276 -1564 449 2094 -752 -1009 1760 492 -912 942 1089
1320 1089 -675 36 896 -205 -213 952 -156 -123 642 19 289 443 -287 -10 840 -75 -567 1195 301
1339 301 -1076 635 922 -1405 -139 1829 -849 -1376 1530 580 -1725 267 1463 -1234 -860 1239
1355 1239 -22 -1000 282 337 -716 -243 27 87 218 -626 -358 739 -497 -1458 622 964 -1708 -488
1373 -488 1570 -726 -1545 1340 427 -1850 32 1154 -1083 -691 645 -264 -653 232 -196 -301 248
1390 248 -433 -492 434 -125 -846 609 430 -1358 27 1335 -918 -1165 1315 284 -1281 151 705
1407 705 -754 -178 559 -96 -25 162 -58 437 24 -826 54 1431 -811 -939 1720 493 -1856 561
1425 561 1976 -977 -768 1886 183 -1429 1024 1149 -736 -339 1142 339 -296 24 555 348 -103
1442 -103 -363 1044 603 -1126 413 1551 -721 -1168 2012 547 -1957 712 1994 -1226 -1002 1923
1458 1923 272 -1204 690 1123 -873 -332 880 -64 -440 499 308 242 -135 -370 451 370 -928 -48
1476 -48 1041 -464 -922 1008 230 -1653 695 1179 -1667 -674 1537 -262 -1456 852 513 -1216 -197
1493 -197 783 -706 -691 236 -236 -116 140 -543 -284 332 -735 -304 723 -345 -962 718 224 -1517
1511 -1517 109 817 -1023 -887 976 -148 -1003 677 661 -1025 7 552 -273 -117 1 -268 400 265
1529 265 -820 -155 799 -624 -637 1445 7 -1174 502 1086 -1101 -237 1596 -355 -887 989 674
1546 674 -813 -75 693 13 -51 -107 278 449 -461 -426 1283 482 -1359 326 1620 -783 -1159 1674 458
1565 458 -1821 675 1868 -985 -988 1795 568 -1332 475 1052 -232 -391 490 737 -353 -444 140 956
1583 956 -114 -734 1255 660 -1474 67 1726 -706 -1286 1837 848 -1907 182 1837 -818 -1276
1599 -1276 1311 326 -1186 129 788 -214 -464 65 230 -71 -561 -413 527 -155 -1125 225 779 -1033
1617 -1033 -924 1237 -131 -1328 684 505 -1150 -292 746 -740 -716 416 -149 -448 -53 -91 -320 307
1635 307 -309 -486 399 29 -1159 175 838 -923 -645 790 -337 -836 652 186 -753 150 424 -456
1653 -456 -187 549 -164 -72 270 -314 -57 406 -254 -112 1094 -126 -743 631 397 -870 464 996 -738
1672 -738 -484 1124 -165 -936 1035 633 -1008 -47 945 -212 -70 601 -169 14 383 50 109 340 -29
1691 -29 -78 503 -138 -391 832 190 -612 635 729 -570 -18 1249 -119 -891 894 444 -867 269
1709 269 1022 -717 -226 745 -172 -478 513 255 -379 148 -77 -12 163 -442 -179 333 109 -889 353 735
1729 735 -830 -289 864 -529 -960 873 79 -1181 117 608 -967 -314 638 -330 -743 300 -148
1746 -148 -524 231 -9 -634 130 63 -649 112 100 -683 -176 581 -774 -485 518 -284 -653 517 15 -698
1766 -698 352 236 -703 -46 358 -556 -36 292 -414 -269 790 -194 -806 605 300 -776 -92 789 -600
1785 -600 -390 532 -161 -467 324 147 -401 183 298 -12 248 177 -261 400 218 -287 448 701 -409 -186
1805 -186 951 62 -490 848 639 -485 420 848 -493 -308 903 58 -259 293 238 -460 230 370 -330
1824 -330 333 505 -607 101 718 -238 -110 432 -250 -531 587 241 -335 313 326 -442 168 396 -677
1843 -677 94 764 -385 -519 705 58 -576 520 421 -714 -90 696 -436 -299 586 -18 -461 210 22
1862 22 -375 88 152 -489 253 36 -529 403 200 -458 103 403 -668 -534 745 -146 -747 426 67 -736
1882 -736 -105 583 -546 -400 482 -172 -417 214 44 -400 87 186 -433 -36 181 -301 -162 190 -290 31
1902 31 476 -311 -344 587 59 -503 489 114 -446 65 530 -461 110 612 -585 -178 482 -58 -378 526
1922 526 485 -588 203 530 -307 -97 483 6 -169 312 389 -370 262 371 -161 337 -43 -307 306 291 -205
1943 -205 214 463 -348 -39 685 -187 -410 749 434 -591 368 709 -479 -91 598 -60 -488 430 116
1962 116 -337 307 177 -290 256 166 -316 170 455 -586 -91 469 -138 -460 227 261 -403 89 62 -511 -22
1983 -22 321 -290 -180 259 -342 -384 408 -384 -522 614 36 -622 236 210 -730 12 405 -130 -669 386
2003 386 -53 -692 -99 -3 -305 -30 20 -68 -25 -169 -181 172 351 -538 -242 580 -478 -387 519 85 -672 94
2025 94 629 -638 -208 539 -319 -558 449 588 -258 216 211 49 31 193 115 229 488 -183 101 427 -171
2046 -171 -97 486 -147 -292 597 218 -403 341 351 -433 66 680 -51 -216 462 246 -319 359 316 -178 208
2067 208 464 -372 196 379 -147 115 366 -86 0 269 -114 -137 230 206 -114 44 281 -181 83 376 -453
2088 -453 -51 362 -124 -131 293 -74 -198 0 224 -422 268 261 -340 -225 420 -9 -417 185 -270 -319 224 289
2110 289 -336 -16 386 -467 -126 82 -357 -106 124 -134 -226 215 -106 -307 69 82 -219 97 -1 -381 -179
2131 -179 432 -272 -407 343 -35 -699 87 538 -499 -166 241 -135 -336 240 -45 -188 10 -34 -200 38
2151 38 103 -158 56 -23 -243 215 205 -236 -133 431 -216 -108 728 23 -362 529 463 -347 -155 401 -168 -337
2173 -337 454 208 -279 247 73 -54 -27 129 -162 239 232 -271 221 580 -14 -116 607 -105 -247 317 231
2194 231 -154 240 337 -132 -79 87 -104 37 379 -77 -259 257 -7 -221 477 169 -273 174 438 -303 -6
2215 -6 474 -96 -432 314 77 -449 210 -8 -278 -61 97 -29 44 -20 -311 -198 328 -100 -349 259 -69
2236 -69 -358 271 -234 -351 105 232 -460 -288 447 -280 -459 282 -52 -362 101 159 -240 97 49 -255 -102
2257 -102 17 -190 -352 322 -262 -197 137 -132 -171 170 -29 -254 -5 217 -377 -32 259 -290 -226 181 -131
2278 -131 -335 183 84 -365 97 432 -375 -12 424 1 -73 372 69 -233 47 17 -241 88 210 0 131
2299 131 283 -125 27 451 -154 -60 151 272 -252 261 98 -401 176 683 -152 -92 594 -214 -142 252 168
2320 168 -202 143 112 31 158 190 -75 153 335 -262 -23 286 -201 -34 244 -6 -286 47 12 -320 48
2341 48 146 -104 -156 125 -204 -294 268 -177 -348 95 56 -266 -70 59 -435 -256 288 -166 -146 171 131 -309
2363 -309 67 -26 -115 -157 37 -212 -39 281 -335 -94 57 -391 -46 169 -43 -375 68 -52 -325 163 228
2384 228 -264 -25 98 -388 -218 274 78 -271 240 152 -367 198 210 -260 33 27 -66 -28 -22 -77 38 202 176
2407 176 -225 165 20 -348 190 48 -307 -47 313 -84 -319 400 42 -140 318 24 -165 173 192 -268
2427 -268 121 454 159 56 268 -85 -31 426 93 -17 213 112 -212 345 236 8 82 385 24 259 378
2448 378 -103 -331 266 117 -132 192 182 -221 37 227 -239 -118 155 118 -277 103 -68 -229 -101 169 -187
2469 -187 105 61 -287 -111 144 -127 -217 384 -122 -405 119 -99 -270 215 52 -210 -13 155 -200 -233 188
2490 188 -395 -290 88 100 -318 -34 279 -177 45 125 -178 -124 -120 -42 -182 -60 89 -145 -181 -203 -169 95 152
2513 152 -270 88 129 -157 -134 317 -46 -95 292 116 -260 141 214 -228 98 168 -311 -99 122 -69 -222 256
2535 256 180 -244 -143 -123 -106 -91 201 -210 111 125 -304 83 308 3 144 308 92 22 384 120 -155 133
2557 133 567 -119 -84 257 -163 -138 236 98 -282 -14 111 -76 144 336 -72 -87 173 7 -132 243 10
2578 10 -116 224 267 78 8 59 -270 95 85 -240 42 36 -145 -212 328 -75 -178 332 101 -337 22 -5 -277
2601 -277 -211 211 -29 -269 52 54 -302 206 13 -127 -31 129 -303 -99 338 -239 -184 151 -77 138 286 33
2623 33 -373 -66 44 -372 143 180 -27 -112 246 -202 -237 -34 18 -184 64 43 -183 184 94 -29 -153 321
2645 321 28 -7 260 -50 -151 29 -46 -77 80 -54 -174 217 71 -204 -25 91 -170 -192 226 244 -145 111
2667 111 202 -290 231 161 -138 155 337 102 9 50 185 -93 181 109 128 25 195 -167 121 327 47 48 351
2690 351 -41 49 236 218 -70 54 -58 -250 14 220 -52 -125 99 -135 -208 349 2 -143 439 33 -167
2711 -167 -27 133 -211 66 85 -299 -387 72 -62 -183 86 -4 -169 -61 70 -125 113 59 -128 -131 48 -173
2733 -173 86 68 -79 -200 170 -222 -305 18 152 -247 -337 249 -9 -94 107 -52 -208 3 -42 -145 -116 39
2755 39 -11 -62 200 -202 -172 23 20 -55 136 -50 -207 111 -40 -270 21 0 -225 -59 261 -195 -166 121 -133
2778 -133 -180 56 79 55 124 182 -33 -88 161 107 -66 172 57 -164 246 -37 -193 75 -6 -304 134 172 36
2801 36 160 112 80 -19 249 -85 -183 203 19 -333 405 154 -201 -31 341 -24 -130 97 16 -117 256 91
2823 91 -128 71 100 -206 134 162 -155 -191 -138 -88 -206 70 141 -227 141 101 -64 99 239 -16 103 224 -119
2846 -119 2 9 -62 -212 210 62 -153 45 -18 -168 -15 59 -24 -12 105 -32 -186 202 64 -250 104 80 -201
2869 -201 4 -103 -214 -281 124 -62 -143 26 -88 18 176 202 -217 212 289 -120 -112 319 -34 -236 102 -138
2891 -138 -300 198 26 -183 -101 174 -37 35 162 -100 92 -57 -61 67 250 -85 -66 16 -123 -227 158 124
2913 124 -112 3 191 -118 -94 151 49 32 182 86 -167 197 194 -129 -42 200 62 46 -87 -304 -184 70
2935 70 -55 -44 236 9 51 23 50 184 42 220 -73 -31 82 62 -162 113 121 -67 -73 49 -68 142 -66 -9
2959 -9 -45 140 62 -188 249 -11 -216 161 8 -18 152 43 -143 8 139 53 -123 87 -49 22 116 -57 -43
2982 -43 -55 139 -263 59 0 -368 -389 17 -10 -208 137 -39 -264 107 99 -244 52 89 -41 -92 -18 35 -56 79
3006 79 -159 -148 33 95 22 82 24 -88 66 166 -113 19 27 91 -122 36 -95 -132 176 118 -227 -15 69 65 -145
3031 -145 208 10 -176 20 138 -124 208 -44 21 -51 260 -65 -45 171 26 144 64 43 -193 191 -127 11
3053 11 189 131 33 -8 7 69 306 234 5 -182 70 -80 -91 81 211 -82 103 97 0 120 242 -161 185 265
3077 265 -55 -153 186 86 -124 31 48 -142 198 217 2 -62 -59 167 -15 68 179 -152 -95 90 -237 -79 201
3100 201 -144 -139 -103 43 -165 162 84 122 50 206 -262 33 79 -91 -38 60 -76 -94 67 -155 -222 34 101 -124
3124 -124 64 -83 89 -71 37 -115 -71 221 -188 -82 -103 -107 -70 165 206 -165 21 22 -18 -231 78 -132 -15
3147 -15 249 35 -83 -17 -97 29 17 120 66 65 81 -68 322 128 -88 27 313 -236 -108 125 84 -229 187
3170 187 188 -7 -54 120 38 -183 91 238 -41 97 -26 -90 85 22 139 98 37 39 -87 70 -76 -302 184
3193 184 -81 -11 125 138 -138 100 127 -144 -223 -44 -164 -172 289 165 -23 -58 32 -92 103 19 133 -23 -25 -116
3217 -116 -36 -47 -51 -252 -78 134 -122 172 -1 86 39 232 34 -96 -11 169 46 18 155 -110 -90 -66 -77 202
3241 202 99 -127 -33 155 93 -250 248 101 -176 65 113 -118 -44 -27 -139 -113 177 -101 50 158 -85 -1
3263 -1 -6 -56 -151 24 -291 -115 -80 36 -131 -76 52 -97 -21 -5 -64 4 -113 67 28 156 123 95 73 81 -145 75
3289 75 20 -78 171 -85 39 -210 -82 -44 -169 -20 3 -15 0 186 -64 -33 137 153 -21 -103 110 -73 -40 170
3313 170 -153 8 202 -94 -65 129 -13 -35 -172 44 45 105 140 -162 103 19 -136 -39 114 197 -101 11 -35
3336 -35 -87 74 91 241 19 141 -138 -32 127 -101 144 -12 -36 -85 67 -31 -163 -4 89 -139 198 -41
3358 -41 -41 -68 -136 -162 -19 140 -98 -73 74 -110 4 120 -54 -251 5 132 137 29 104 114 -10 -33 8 29 143
3383 143 165 -20 112 71 -115 133 253 -144 -128 -76 55 -4 58 190 23 66 18 -73 14 245 -124 -282 114
3406 114 -37 -110 68 -4 -171 -34 117 27 5 127 -58 -94 78 -115 171 86 -30 94 54 -26 -185 67 216
3429 216 19 -218 -23 -211 10 193 170 -4 94 -58 -48 -21 122 -46 -63 103 44 103 216 -27 -257 112
3451 112 -28 -75 61 -44 -60 -15 41 -91 -116 124 -84 4 80 -3 -34 -25 -79 29 -51 -152 4 -64 39 -142 -98
3476 -98 -27 -171 28 -61 -307 -64 18 228 -19 -100 135 174 -5 136 -79 -314 -73 82 -213 -23 19 -181
3498 -181 -59 87 -216 -229 11 -352 -75 51 11 -183 -14 27 -60 -173 141 4 -2 105 34 115 45 44 -56 65
3522 65 25 -120 161 90 25 180 132 49 -46 127 -79 140 -91 -6 -58 -36 108 -104 17 202 -13 70 -91 -1
3546 -1 -160 55 -78 -33 29 192 52 93 102 2 194 -50 -300 -117 72 -7 -58 110 -168 -13 85 30 -58 211
3570 211 -74 -79 118 103 2 46 -2 105 -218 26 22 -138 121 60 107 -40 -87 -146 91 -75 28 -55 170 -79
3594 -79 -85 30 124 -40 7 -11 -130 59 305 36 -4 39 156 -13 32 -66 -28 -132 35 -163 108 6 -127 -141
3618 -141 -90 70 61 84 -87 -132 68 -101 39 186 -57 3 60 -86 -123 -122 74 -163 24 -21 35 -83 -30 18 -65
3643 -65 -43 88 -72 -39 136 -12 -108 242 57 68 107 76 -151 122 -181 -155 176 156 -125 -180 35 -95 -106 93
3667 93 -213 -166 -114 117 -169 139 -4 127 12 16 -74 -22 243 27 -57 -4 64 -57 111 98 -84 -117 144 26
3691 26 165 136 180 -39 -70 48 -39 74 -69 -94 61 51 -213 -119 102 13 -142 -31 50 -83 56 -90 36
3714 36 44 101 107 -38 55 63 -12 -5 -71 -156 -57 53 -66 82 -103 -139 2 110 -82 29 -18 -146 110 245 -155 163
3740 163 142 279 -85 -220 51 117 -58 99 10 -24 -109 197 -131 24 -296 -133 71 -106 82 -137 130 -132
3762 -132 -8 102 -161 -81 50 -159 -57 -12 -151 -144 75 134 28 -67 101 -147 -171 41 -155 -75 -172 38 -98
3785 -98 148 -97 77 104 110 84 96 34 85 13 -31 79 -57 102 -58 108 -40 151 -30 74 163 111 -10 -116
3809 -116 15 -102 -8 -12 69 17 -114 -338 -56 -90 120 25 -103 21 -97 229 -79 -218 -73 200 12 41 179
3832 179 199 148 152 16 -248 130 -50 6 96 84 87 33 -88 -84 133 -4 32 -61 229 62 38 9 53 -9 12 143
3858 143 -49 -135 -53 -3 -144 -33 12 51 175 53 64 16 7 -30 -41 -88 -231 133 155 114 -85 259 -69 -53 -31
3883 -31 51 111 -53 -82 43 -1 -174 262 -222 11 0 84 133 -8 123 26 -4 90 98 136 23 3 -57 163 -94
3908 -94 -95 56 59 127 166 187 109 169 -111 -14 233 -90 19 86 64 -193 -206 97 59 39 -154 62 21 67 14 -97
3934 -97 -26 -70 -77 -23 113 -63 -40 -157 -62 80 13 -108 -272 150 -48 102 -24 -86 50 -41 73 25 -97 -28
3958 -28 -71 -169 -145 -14 -28 24 40 -125 93 107 63 143 -45 -20 -148 -152 98 -15 170 -36 33 49 384 87 24
3983 24 -29 -91 81 -161 -123 151 -1 -75 -91 48 -45 46 125 -101 -377 -4 16 -124 109 96 -135 -201 47 -105
4007 -105 -62 159 75 75 28 10 108 58 114 29 -34 -64 16 46 -4 45 -102 -29 179 -18 80 -1 24 -11 41 -21 103 101
4035 101 -195 -129 22 32 -105 -174 -61 23 -50 12 -38 -217 11 -28 -61 103 106 -30 49 85 -131 -196 101 13 21 -45
4061 -45 37 -22 174 -7 -26 -56 -115 -14 42 -42 69 -113 7 -42 148 23 -126 -125 -37 4 87 142 -185 17 -92
4086 -92 -44 -154 -84 35 103 -135 -131 -198 11 87 74 117 -26 -233 -104 90 -217 -65 177 -34 -1 41 52 -48
4110 -48 -185 28 -32 -95 -15 139 8 -17 24 34 -183 9 -111 -137 133 152 38 69 -18 -36 -26 19 60 54 8 -12
4136 -12 102 97 -65 -121 -21 99 -82 37 -42 -17 10 102 -93 -126 -183 85 -1 -168 70 72 127 -97 -91 160 -23
4161 -23 -127 -37 40 -1 61 33 -104 -187 -99 -22 35 -56 8 -28 -176 51 -8 -247 -52 -45 127 147 119 -35 14 122
4187 122 140 83 -63 -61 -67 -11 -190 -86 -33 13 -129 -23 -14 139 -2 94 -48 91 41 -217 72 -3 329 -77 231
4212 231 26 -182 14 -208 8 -100 109 -129 -5 -68 3 -79 269 11 -183 5 -23 76 -96 -94 -265 99
4234 99 68 112 -122 38 116 12 -96 -141 33 28 130 -162 -71 -63 -6 129 114 -151 -25 -110 -160 89 -19 196 -151
4259 -151 184 -99 -140 85 82 127 -70 14 28 -1 -55 -3 -46 -49 -134 -41 87 -246 12 -90 143 -58 63 156 -174
4284 -174 147 -91 58 -33 210 -20 -187 -52 41 -54 -86 58 -139 -170 154 -335 12 -85 93 97 -14 -112 -68
4307 -68 14 3 -59 -62 -4 -69 -73 183 127 48 259 63 -12 -52 34 -81 -97 -62 91 -142 -136 -21 -87 54 -109 -123 -119 32
4335 32 119 49 58 86 -109 -163 -121 14 172 -2 -21 -62 194 -200 99 -64 155 4 -56 22 -124 -65 -5 -74 58
4360 58 230 -87 51 35 252 -85 -122 -56 -117 238 135 34 -28 4 3 -11 -250 -107 -109 -3 53 37 177 155 6
4385 6 54 -202 -131 -158 58 1 -221 84 106 -96 -10 186 -5 -55 -86 -41 29 -34 -64 4 86 171 14 -127 -98 207
4411 207 46 -223 23 14 -253 -149 86 18 -177 98 -12 64 -39 5 18 68 -194 -78 14 -8 68 31 33 -117
4435 -117 -101 -67 -129 -13 -33 137 -79 10 124 -9 -125 42 36 6 -53 -53 -58 164 71 182 83 -25 -178 -48 -22
4460 -22 87 -105 168 11 -27 -91 47 -84 -213 159 -21 173 -23 120 63 113 37 134 -105 53 -88 41
4482 41 -8 -85 -31 120 76 -12 5 -22 -25 73 73 20 99 -160 132 -28 -82 -67 -92 122 121 58 118 -68 -133 20 -229 -182
4510 -182 -24 172 -38 29 16 -15 8 98 18 157 -76 -111 -81 -11 -61 0 153 -60 5 -173 130 44 186 27
4534 27 103 -43 -45 -124 2 -103 238 56 49 81 71 69 -34 -137 24 139 -72 -124 -22 -98 37 -201 -45 11 -253
4559 -253 37 -58 -26 50 96 67 -86 -42 -12 -133 -20 -241 -58 -100 -93 -41 -92 -178 -16 151 58 75 -53 -63 -118 -85
4585 -85 23 -11 -80 5 221 39 0 138 -81 13 -5 -167 -45 101 63 135 125 97 176 116 -151 21 -48 -165 225
4610 225 105 -97 44 81 26 -96 -199 172 43 -239 -80 -71 39 -117 124 -36 -69 -9 -55 -29 -108 136 111
4633 111 150 -201 -15 43 14 -85 128 -104 6 -20 126 -22 46 -101 -9 -59 -35 153 20 -121 -133 -128 -200 -11
4657 -11 -85 18 -126 151 -3 194 -117 33 -26 -5 85 -130 -25 -82 153 219 -11 -22 -105 5 -101 -60 -66 -44
4681 -44 55 -99 -124 -16 88 -80 91 86 -17 59 -33 20 -106 7 76 -43 -99 11 -146 208 29 121 17 -23
4705 -23 -120 215 -92 -75 46 -17 149 -100 -107 60 164 -31 -127 72 -40 44 36 -85 157 149 -21 25 -2 -40 -185
4730 -185 6 -123 -207 69 -72 109 71 -60 207 82 -33 101 115 91 -115 -131 -128 84 -29 -81 -58 -70 -141 -19
4754 -19 -63 -172 -47 84 -68 -160 -29 -104 -30 32 -209 68 -104 -5 -31 93 -13 90 167 53 64 76 8 177
4778 177 40 11 87 95 -101 -19 291 -43 28 -78 46 -124 -64 112 1 -17 97 60 -62 89 106 99 -65 19
4802 19 22 60 -15 -137 76 -101 202 42 113 55 120 31 -69 178 -118 19 96 64 -215 113 -54 -40 -12 -180
4826 -180 -12 48 -43 -77 -45 0 43 -15 1 -25 -83 20 92 105 -113 59 -29 133 -91 134 -73 -86 -26 -36 12 -5
4852 -5 -45 -96 -230 222 -35 -21 63 116 49 -61 43 -151 79 45 -253 -220 4 159 88 -125 -24 -317 -39 223
4876 223 59 -10 47 97 167 49 -49 -27 85 89 7 -1 -181 -30 -59 105 -59 87 79 -26 -103 -96 2 26 -72 70 -257
4903 -257 -153 47 -93 -147 -17 -124 52 110 51 -83 58 -159 -55 95 86 -104 10 101 13 -40 15 92 -134
4926 -134 91 -36 -208 50 50 -62 173 186 46 -180 45 -94 -33 107 66 -3 -16 121 189 -84 71 79 200
4949 200 50 -93 105 -75 -35 83 -124 -5 -96 -94 -31 -63 -205 -85 -31 86 57 -68 6 116 96 -134 225
4972 225 285 180 -152 24 -203 238 79 -53 13 92 -57 -254 -89 -68 50 62 41 -146 39 -81 -15 10 -22
4995 -22 -32 -89 64 -28 105 138 -47 65 110 105 -218 -172 48 25 84 29 -73 59 -27 27 -138 -112 -118 -47 -161 -169 -71
5022 -71 135 120 5 -32 -27 52 95 -88 -127 28 62 -77 -75 26 82 -85 -154 -198 -78 165 -211 -109 68 133 125 123
5048 123 198 -20 14 -53 28 37 39 -43 -122 -121 119 23 35 31 80 -50 -146 67 86 42 88 150 -65 -45 215 -127 -82 213
5076 213 -33 -53 109 35 23 114 182 151 -77 19 -98 -288 117 208 -172 124 -192 22 -35 -121 -76 106 92 -55
5100 -55 92 -2 -187 -3 14 -51 -4 155 -69 97 135 -60 -42 58 -35 79 -14 -24 2 61 -97 176 74 -79
5124 -79 -8 -122 -60 -74 -202 9 32 -21 -169 84 -63 -42 42 36 -189 74 3 -58 -129 90 75 -117 -97 -30 -17 22
5150 22 26 -22 -24 73 -82 -2 35 -103 -141 -121 137 80 96 41 215 -16 59 60 -49 -29 -85 -51 42 153 -62 -10 -98 130
5178 130 81 -110 -40 -75 -126 89 50 103 12 -98 -40 25 -209 -19 -129 5 12 9 -26 50 154 -113 -2 60 -15 25
5204 25 -70 -73 106 99 5 -25 199 -111 -267 -14 -147 -49 -139 -131 67 -77 55 -41 -39 -18 41 65 -43 155 -97 -119
5230 -119 -19 13 -109 -45 117 -24 114 -18 -45 6 -53 -79 -158 -152 149 -58 56 -177 179 -7 -133 -172 155
5253 155 -53 37 141 -190 3 173 -62 -119 110 -52 -89 -109 91 138 9 36 28 28 231 76 -106 -120 13 109
5277 109 -102 -73 8 -58 6 -37 66 -38 -7 -180 -160 27 87 162 -1 -20 330 30 -6 -139 -52 -216 102 148
5301 148 197 -21 -35 -31 38 -102 -15 16 -132 6 -223 -58 -267 -98 54 61 -95 69 -72 -22 -43 23 88 -23
5325 -23 -37 -281 -187 133 94 23 -23 132 72 -115 11 120 117 -57 216 193 -4 242 44 165 -103 29 -93
5348 -93 -2 -106 106 149 -12 -30 -103 143 -116 -81 120 -86 -16 -47 4 58 135 -119 22 -32 -31 -138 55 188 -2
5373 -2 -50 -23 67 -125 87 -48 -73 -161 -10 40 -35 -40 -297 -158 227 199 136 55 119 105 -94 -53 5 -31 109 55 134
5400 134 -6 -76 -66 30 162 15 -13 -105 6 -51 127 102 12 7 76 188 -198 -161 44 38 -108 -207 58 215 24
5425 24 -11 39 180 -68 168 33 2 98 56 49 148 179 -41 32 248 -81 -21 104 6 -17 -64 -40 -44 50 -49 77 -108
5452 -108 216 52 53 -202 169 41 -20 -74 -17 -15 91 39 -60 10 -145 89 34 92 -21 115 64 65 -173 207 8
5477 8 -79 -101 1 -18 -258 -43 2 21 -32 -198 14 -11 127 31 -20 -4 160 317 -6 4 -69 90 50 -101 -208
5502 -208 261 29 128 -132 -185 180 116 -119 -35 64 -108 160 -8 -52 -120 -169 -34 -127 198 -1 85 120 -8 -37
5526 -37 147 -5 -10 -78 126 -42 33 17 -48 49 -263 144 21 -141 188 -225 96 114 78 104 -8 63 43 89 -35
5551 -35 -161 59 -46 -170 35 -61 -13 103 -23 66 -163 3 -61 96 87 -68 -160 54 -128 143 54 -67 -33
5574 -33 159 -156 -173 -4 189 -18 9 -85 -36 -118 -5 129 -133 51 -44 -25 -74 75 129 -136 102 125 -130 -11
5598 -11 -40 -73 129 82 -149 -112 124 44 -50 11 107 85 100 6 -184 123 215 15 -163 -25 -62 -24 19 -52 -86 -71
5624 -71 36 -166 0 -163 -247 -83 -157 -71 181 252 -46 18 -59 1 -38 161 -68 -55 147 -63 12 180 -141 -33
5648 -33 -117 -70 34 187 -262 102 -45 47 30 -78 -33 108 -62 206 96 42 50 -52 -63 -89 134 37 -49 62
5672 62 13 46 149 101 -13 -59 162 -240 -129 19 -27 -231 -84 -113 -97 -8 81 -81 -115 84 -159 0 -80 138
5696 138 -65 -164 -87 -92 -19 110 -100 67 87 -66 22 116 -2 7 121 -24 -28 -80 32 -56 124 186 -130 -70 -9 17
5722 17 185 -94 -134 -123 5 -34 -102 -229 -6 -38 -136 252 -44 -180 144 -10 98 69 62 23 34 -10 -116 43
5746 43 174 103 109 113 -197 102 -128 -54 -34 -45 25 -51 -94 33 8 7 122 -36 14 233 200 6 49 -40 -98 115 87
5773 87 82 -21 150 -43 119 200 -257 -44 -46 -66 33 -189 252 96 34 71 105 79 107 112 -110 52 -74 45 -40
5798 -40 -125 45 -68 62 -49 -66 145 -1 -46 -50 -28 -115 -79 -69 -13 -54 48 -63 -153 82 66 172 8 -59 -47
5823 -47 15 63 -266 -1 46 -278 44 -65 -17 10 267 140 -66 -25 57 18 198 92 83 21 -70 83 34 -20 -74
5848 -74 -16 219 -188 -63 118 134 252 100 53 -54 83 -176 -151 64 114 -66 119 -60 -130 85 -77 -109 37
5871 37 -76 288 -49 15 -63 82 2 -65 -26 -74 -71 25 -60 145 9 -9 -16 58 117 42 135 -54 17 -112 -56 0 25
5898 25 -44 -8 33 134 -27 -150 -93 -49 -21 -38 -34 -6 -121 -62 -329 -13 -9 -170 -43 267 38 -179 66 -181 -9
5923 -9 48 -75 -108 149 -1 -33 70 -118 29 80 38 -80 -135 49 -12 60 99 -6 50 -149 100 -166 89 44
5947 44 66 -60 29 59 -159 151 22 -30 179 173 -91 139 157 117 -36 63 -68 -121 221 -46 -133 78 -121 83
5971 83 62 181 -45 -148 -53 17 45 -287 -131 61 50 11 57 -28 234 -48 67 116 7 -41 -10 -2 79 -38 82
5996 82 -68 5 -47 23 49 51 -153 35 4 30 -92 -71 -50 101 121 44 -166 -81 -236 -30 26 79 96 -116 60 -117
6022 -117 -51 52 82 7 48 179 52 111 42 -232 -90 55 -22 18 31 113 -265 69 76 65 189 137 113 -26 21
6047 21 177 -15 35 38 -205 -181 -19 35 65 128 -56 -18 42 -65 120 84 -43 76 36 22 -66 -26 78 -199 -62
6072 -62 137 -47 -33 -21 69 -71 32 -106 -179 -132 -37 -144 -101 47 -14 65 189 -9 38 49 -44 -92 -90 -8 89 23
6098 23 -159 -40 93 136 -113 38 112 -11 20 -52 16 -34 -64 19 6 -12 136 -140 38 67 -179 202 43 91
6122 91 -46 66 -101 -2 100 69 86 -16 156 -137 68 66 124 39 87 166 188 -103 85 -181 15 -83 -138 -89 148
6147 148 45 -53 -198 -112 18 185 -37 166 117 170 -32 -96 38 -79 -80 29 -25 -15 -40 -34 56 -20 68 -79 -84 27
6173 27 207 34 339 115 2 60 -145 236 32 -80 -225 -14 59 -91 24 84 -205 -123 -36 209 -185 96
6195 96 -17 204 9 -104 -80 80 116 -168 -180 -159 15 -155 33 -151 -89 -94 23 100 81 76 -53 -56 30 -90 -100
6220 -100 15 8 10 -141 31 -133 36 52 -161 71 109 28 -25 2 -12 161 168 38 5 17 -23 -56 175 -133 233
6245 233 -83 50 -144 95 97 -94 157 -2 149 -23 -120 56 -28 138 2 11 -78 41 6 170 64 -67 -110
6268 -110 116 57 44 -42 113 -93 -44 137 34 -89 0 98 -17 58 -150 32 74 -33 17 161 -9 -101 -21 48
6292 48 -196 164 46 89 73 88 -158 -32 -130 51 59 83 -41 -82 -3 -127 56 -102 65 25 -300 41 98 -198
6316 -198 -34 -18 -9 -3 -38 -122 225 27 6 -188 -54 -89 -125 -113 -145 -3 -8 50 -150 -192 232 -72 -4 -60 109 -34
6342 -34 -139 -33 -73 -2 -83 -39 220 102 84 -70 -28 -88 -190 -49 -125 -154 90 83 -121 146 -110 -161 -156 133 -34
6367 -34 89 -5 125 -181 76 39 70 32 221 87 -45 80 71 -196 111 -76 203 92 106 82 5 -32 -104 136
6391 136 48 -157 18 -106 -91 -55 47 -100 -59 54 50 103 34 -96 -213 15 115 48 -232 -164 23 62 64 125 -14
6416 -14 -72 -20 -10 -32 139 -70 16 157 -27 32 230 8 -149 -3 73 -204 -86 0 -4 -21 -3 -10 -3 49 75 -84
6442 -84 -73 29 -51 70 -114 86 -144 31 -238 7 49 37 20 112 59 6 146 66 -49 58 230 -8 18 158
6466 158 62 -56 -20 261 -113 -134 111 -119 124 165 -122 -5 -8 64 -166 4 20 -25 -23 185 -36 -7 -57 -51 27
6491 27 -82 -89 -16 -63 -104 202 43 -105 -38 -135 -35 102 -8 35 118 90 123 235 -100 -211 -7 -40 -62 127 -106
6516 -106 86 107 -17 61 168 -80 -183 51 -168 30 148 35 -67 163 150 54 -6 81 -140 -48 54 -152
6538 -152 -128 -89 146 74 -43 -44 44 56 8 142 -34 -55 31 14 84 -89 -159 -36 122 -260 139 61 60 -15 -86 -173
6564 -173 51 -40 40 96 15 81 -69 -32 46 -262 97 139 -106 -50 60 133 -22 47 91 -19 180 235 31 59 -118
6589 -118 -128 10 49 -62 86 110 -89 -40 -94 -50 -87 -60 -186 -221 -61 -15 -90 98 -6 -65 38 80 155 231 117
6614 117 -22 -21 8 106 -25 114 292 -94 -331 82 -32 100 122 66 -147 -18 -178 -135 83 -38 -57 22 -191
6637 -191 -73 59 -130 -261 246 11 -2 -69 -97 103 -148 89 130 32 -124 52 -9 58 -66 -145 -21 -53 -10
6660 -10 128 62 -25 100 160 -29 -131 231 123 -10 19 35 21 -138 -65 76 -79 65 59 -190 -37 83 130 -100
6684 -100 -11 -97 195 -123 14 70 -36 326 19 166 119 84 -176 7 32 -197 146 -145 -192 -121 105 -77 -13
6707 -13 119 65 -51 148 179 -139 -35 166 47 -139 162 -128 31 55 -217 -71 -165 17 41 170 -23 147
6729 147 -68 46 64 -34 47 104 -83 -63 -28 -21 -170 -5 -19 -46 -116 -89 -47 -83 55 -25 91 144 17 -41 135 -36
6755 -36 141 72 163 1 -170 -73 29 169 -77 -29 -182 -100 14 86 -151 -32 201 104 -218 -24 12 -79 -111 30
6779 30 87 -92 131 -118 200 -12 -7 37 -69 42 -103 220 78 114 125 97 53 -117 54 35 134 79 65 -284
6803 -284 64 104 -50 -62 16 -39 38 152 154 1 73 32 -27 -100 40 112 -165 45 15 160 -61 -95 45 44 -86
6828 -86 -140 61 -7 -16 -74 57 5 -127 119 133 -26 -12 -77 244 -15 95 -26 -36 97 33 85 177 -220 -64 95
6853 95 78 -73 -172 154 -128 -138 -51 -19 -42 40 159 -58 -53 100 -3 -51 -70 41 14 -61 -12 278 139 -57 9
6878 9 -11 198 92 8 -28 -31 -41 27 -75 -9 31 44 -140 -225 120 -48 -95 14 -23 -100 -109 21 39 -33 -150 66 -160
6905 -160 77 -116 -186 -44 -211 97 9 -75 -186 -46 -18 -51 -67 -213 -59 26 30 -4 -151 22 95 76 -70 -44
6929 -44 154 -100 -36 29 -90 -95 -95 -69 94 -114 0 79 -135 7 -11 -16 -21 75 84 -69 -79 3 -22 27 -85 -165 98
6956 98 56 69 29 -51 -72 130 -79 -225 -78 -27 -129 128 64 147 -116 -20 0 -289 28 235 -68 -72 17 -165 -76
6981 -76 -94 -98 79 85 26 210 -175 17 -149 -5 -91 -88 26 44 121 -10 -98 -10 -119 -92 136 -222 -55 -48 -2 -14
7007 -14 198 11 -42 -13 -3 -38 94 -22 -85 76 35 -81 144 -122 276 19 132 -8 -64 -45 120 -51 38
7030 38 88 -193 -16 158 -60 41 60 -129 -217 -18 127 -178 15 101 -33 31 36 -126 84 -3 134 -119 23
7053 23 49 -91 142 40 -96 226 -163 56 -69 164 101 -137 -141 -48 -142 -35 123 76 -14 34 58 -12 275 -188
7077 -188 -88 157 -31 -35 0 -110 84 28 -235 60 -24 88 -50 -116 38 -68 165 130 -47 -107 206 -37 -40
7100 -40 51 168 38 -11 -58 72 -81 -29 -64 118 264 -78 39 -13 127 -128 178 44 -206 -43 160 -56
7122 -56 -161 8 132 -137 180 176 -247 121 -164 62 -150 27 44 112 92 -194 -133 -78 30 -119 46 7 -34
7145 -34 -7 -16 -45 54 -62 -22 -57 239 -125 -19 25 -34 -9 -2 51 -85 98 9 -66 -202 17 -141 -123 149 -166 -152
7171 -152 149 -171 -73 -112 193 -176 -217 -90 -64 -52 -47 9 -167 -110 -138 60 119 32 -251 120 -20 -88 -3 144 -19
7196 -19 -213 159 -42 -11 143 -87 100 103 29 57 46 165 -8 -174 -61 48 -251 155 33 -14 -61 160 -75
7219 -75 -87 -63 -15 -133 26 -14 -39 238 -25 -204 -21 199 -106 29 144 -135 -203 68 2 -34 -103 -61 -160 -87
7243 -87 -147 111 36 179 192 -40 174 1 -97 89 -91 25 -81 255 96 120 103 37 266 79 -19 52 9 -83
7267 -83 25 -1 284 -87 -38 -67 -201 -25 7 4 -49 -126 113 57 -129 -216 196 361 59 -24 -55 -62 -133 102 24 -75
7293 -75 -53 118 114 28 23 -17 -22 32 112 76 -45 -58 -122 -19 -38 2 -287 105 -7 -173 -161 -29 -115 30 32 -142 34
7320 34 -149 -94 5 -62 6 -86 -127 101 130 129 38 -172 108 98 80 -8 -92 -48 -184 -60 21 -42 9 31 -14 76 2 -14
7348 -14 -5 34 -78 -69 -58 -172 -24 -122 43 -120 -20 187 34 -39 26 2 -27 67 8 93 27 -135 -79 -156 -74 225
7374 225 94 -71 -4 -80 34 116 -51 114 110 -79 -21 -35 111 -73 208 -50 4 51 56 57 -80 -81 -112 80 188
7399 188 -204 136 194 6 72 294 156 17 226 47 64 118 34 -125 -83 98 -377 15 367 -36 55 132 168
7422 168 -69 92 13 145 127 163 -142 107 -147 -41 3 182 -93 35 56 -104 61 125 16 -162 -24 10
7444 10 -124 184 -82 -75 -206 -89 28 10 -104 190 -183 10 -20 -142 -83 -46 -2 -47 -54 23 74 -72 250 -170
7468 -170 150 58 -134 -101 -108 -81 101 101 77 178 223 -121 27 -25 -38 -87 26 91 4 26 -161 -211 73 213 -117
7493 -117 -88 -37 -68 -22 -22 -80 -377 69 31 64 19 10 -185 93 -46 -72 32 79 151 -52 169 41 -80 21 -60
7518 -60 25 14 58 -62 -206 65 125 155 43 35 80 -21 84 -120 -162 172 -54 -22 -79 48 -90 21 -154 -117
7542 -117 -43 56 -15 -190 -64 -150 65 79 -72 68 182 -80 -128 -91 -72 52 1 87 -61 -269 224 -186 -143 198
7566 198 15 4 181 -208 47 49 -86 -113 -51 156 -126 116 197 103 -239 7 -149 53 -69 -13 -62 -27 -7 -162
7590 -162 -156 -46 -6 -167 316 -327 -238 131 -22 -145 219 -148 45 -121 31 34 -76 179 -181 -19 -29 79
7612 79 -14 187 -243 -30 13 304 21 -288 191 -61 112 -34 45 31 -14 60 40 205 94 -87 129 47 -40
7635 -40 30 -54 -209 39 100 -10 -42 -32 -60 -35 -86 133 -3 -31 -67 -167 -78 -19 6 -123 48 107 -105 11 213
7660 213 4 -25 -30 -230 187 174 73 28 29 41 10 64 -147 8 -82 -67 -170 -146 -74 -270 -153 -2 12 -74 9 200
7686 200 -99 -5 239 59 44 33 114 -32 160 92 -88 -111 120 -181 28 -215 3 19 59 -114 -91 47 -27
7709 -27 200 73 19 -118 -109 -179 76 -189 -11 68 -212 -64 102 -24 29 -60 -7 127 -28 82 -70 36 -98
7732 -98 -184 -108 120 134 229 -122 -74 46 87 -57 119 36 23 65 -86 -18 -211 112 -9 99 -125 33 -20 41
7756 41 8 -70 142 -92 -1 155 -107 251 -90 -129 -53 43 -57 -4 -52 73 151 101 -223 -79 -266 -17 -75 -262
7780 -262 118 45 6 -55 124 111 -54 -77 109 18 29 -94 1 -100 -8 -50 -146 -74 101 -174 103 43 42 -71 120
7805 120 -4 -155 -13 -137 -74 94 36 1 -5 4 -100 128 -147 -11 216 133 -18 -39 -185 -262 20 70 -159 -3
7829 -3 142 64 76 21 -165 87 42 -37 118 -68 26 -52 -132 34 76 30 -12 -68 -42 129 205 -102 -39 37 82 77 13
7856 13 -7 -38 27 70 -188 11 -72 -172 -24 -45 141 -14 51 216 185 116 -172 83 -25 -205 38 -13 -5 11 147
7881 147 166 -62 -83 -107 80 -24 -55 -17 -245 277 -72 75 154 170 39 140 -48 -69 -7 74 -65 -21 39 -95
7905 -95 -207 91 43 -117 -249 103 18 98 121 -110 55 41 83 38 -53 -65 55 -62 106 -263 134 28 2 61
7929 61 -119 -6 -67 -155 24 157 122 5 -42 -76 145 -80 -20 45 201 -165 95 -225 39 4 20 147 -42
7952 -42 16 -3 -139 46 75 -126 -75 -190 72 206 52 -118 65 70 -24 126 141 163 -90 -64 127 112 -101 -95 -72
7977 -72 220 -27 -162 9 49 -49 -231 -21 253 61 29 227 -99 212 158 -8 -48 24 -13 -98 167 -210 -65
8000 -65 184 76 -53 57 90 -78 -34 13 -112 199 -11 11 14 -23 81 31 11 -44 -56 100 105 -88 125 -49 -32
8025 -32 -195 -36 86 -63 43 -35 -112 -8 -8 81 -68 -97 139 -97 200 -62 -247 209 235 -33 95 20 23 -8
8049 -8 -62 4 145 218 1 124 61 -135 -151 187 27 28 -135 207 -120 -96 5 124 -130 -43 -181 46 54 -185
8073 -185 -134 -17 -46 -12 28 55 -35 -229 -53 -7 -134 88 -76 -12 108 9 32 186 49 11 -15 8 -122 46
8097 46 -88 114 -128 -16 -31 -49 -112 -37 98 140 -101 -4 -42 106 -37 -82 -135 49 -118 -278 -99 -442 102
8120 102 -194 -188 179 -73 -97 -3 -26 155 -59 -206 40 -1 16 -85 182 246 19 -120 -46 -7 -27 68 60 153 78
8145 78 -135 81 149 -137 -33 -61 -184 79 44 -164 -70 96 188 -63 74 -271 193 160 -82 -119 92 -72 -163
8168 -163 -30 59 125 144 136 111 -90 -150 71 -20 -64 98 -24 68 34 -21 -66 -19 97 -10 -47 -199 35
8191C5
##END NTUPLES=NMR FID
##END=
