##TITLE=1H_EL-1
 CDCl3
 8 sc, 
 26.12.2023
##JCAMPDX= 6.0         $$ Bruker NMR JCAMP-DX V2.0
##DATA TYPE= NMR FID
##DATA CLASS= NTUPLES
##ORIGIN= UXNMR, Bruker Analytische Messtechnik GmbH
##OWNER= root
$$ XWIN-NMR		Version 3.5
$$ Tue Dec 26 15:55:21 2023 Russian Standard Time (UT+4h)  she@DPX200
##.OBSERVE FREQUENCY= 200.1313
##.OBSERVE NUCLEUS= ^1H
##.DELAY= (6, 6)
##.ACQUISITION MODE= SIMULTANEOUS
##.ACQUISITION SCHEME= undefined
##.AVERAGES= 8
##.DIGITISER RES= 18
##SPECTROMETER/DATA SYSTEM= spect
##.PULSE SEQUENCE= zg30
##.SOLVENT NAME= CDCl3
##.SHIFT REFERENCE= (INTERNAL, CDCl3, 0, 15.7039)
##AUDIT TRAIL= $$ (NUMBER, WHEN, WHO, WHERE, WHAT)
$$ ##TITLE= Audit trail, XWIN-NMR		Version 3.5
$$ ##JCAMPDX= 5.01
$$ ##ORIGIN= Bruker BioSpin GmbH
$$ ##OWNER= she
$$ F:/spectra/data/she/nmr/H-F/1/audita.txt
$$ ##AUDIT TRAIL=  $$ (NUMBER, WHEN, WHO, WHERE, WHAT)
(   1,<2023-12-26 15:54:16.39 +0400>,<she>,<DPX200>,
      <created by zg, POWCHK disabled, PULCHK disabled
       configuration hash MD5:
       00 E9 B6 7A A2 85 ED C7 34 08 36 98 17 FE 4E 26
       data hash MD5: 16K
       3A 54 1C 99 3A 5E 7B 6A FC 50 BA 95 53 71 0E 7A>)
$$ ##END=
$$ 
$$ hash MD5
$$ AF 70 46 58 3D 86 64 46 4C CE 3B CB 38 2D 5E CD
##$RELAX= 
##$RELAX= 
##$RELAX= 
##$RELAX= 
##$RELAX= 
##$RELAX= 
$$ Bruker specific parameters
$$ --------------------------
##$DU= <F:/spectra>
##$EXPNO= 1
##$NAME= <H-F>
##$PROCNO= 1
##$TYPE= <nmr>
##$USER= <she>
##$AMP= (0..31)
100 100 100 100 100 100 100 100 100 100 100 100 100 100 100 100 100 100 
100 100 100 100 100 100 100 100 100 100 100 100 100 100 
##$AQSEQ= 0
##$AQ_mod= 1
##$AUNM= <au_zg>
##$AUTOPOS= <>
##$BF1= 200.13
##$BF2= 200.13
##$BF3= 200.13
##$BF4= 200.13
##$BF5= 200.13
##$BF6= 200.13
##$BF7= 200.13
##$BF8= 200.13
##$BYTORDA= 1
##$CFDGTYP= 0
##$CFRGTYP= 5
##$CHEMSTR= <none>
##$CNST= (0..31)
1 1 145 1 1 1 1 1 1 1 1 1 1 1 1 1 1 1 1 1 1 1 1 1 1 1 1 1 1 1 1 1 
##$CPDPRG= <>
##$CPDPRG1= <>
##$CPDPRG2= <>
##$CPDPRG3= <>
##$CPDPRG4= <mlev>
##$CPDPRG5= <mlev>
##$CPDPRG6= <mlev>
##$CPDPRG7= <mlev>
##$CPDPRG8= <mlev>
##$CPDPRGB= <>
##$CPDPRGT= <>
##$D= (0..31)
0 1.2 0 0 0 0 0 0 0 0.06 0 0.03 0 0 0 0 0.0002 0 0 0 0 0 0 0 0 0 0 0 0 
0 0 0 
##$DATE= 1703591655
##$DBL= (0..7)
120 120 120 120 120 120 120 120 
##$DBP= (0..7)
150 150 150 150 150 150 150 150 
##$DBP07= 0
##$DBPNAM0= <>
##$DBPNAM1= <>
##$DBPNAM2= <>
##$DBPNAM3= <>
##$DBPNAM4= <>
##$DBPNAM5= <>
##$DBPNAM6= <>
##$DBPNAM7= <>
##$DBPOAL= (0..7)
0.5 0.5 0.5 0.5 0.5 0.5 0.5 0.5 
##$DBPOFFS= (0..7)
0 0 0 0 0 0 0 0 
##$DE= 6
##$DECBNUC= <off>
##$DECIM= 32
##$DECNUC= <off>
##$DECSTAT= 4
##$DIGMOD= 1
##$DIGTYP= 9
##$DL= (0..7)
0 120 120 120 120 120 120 120 
##$DP= (0..7)
150 150 150 150 150 150 150 150 
##$DP07= 0
##$DPNAME0= <>
##$DPNAME1= <>
##$DPNAME2= <>
##$DPNAME3= <>
##$DPNAME4= <>
##$DPNAME5= <>
##$DPNAME6= <>
##$DPNAME7= <>
##$DPOAL= (0..7)
0.5 0.5 0.5 0.5 0.5 0.5 0.5 0.5 
##$DPOFFS= (0..7)
0 0 0 0 0 0 0 0 
##$DQDMODE= 0
##$DR= 18
##$DS= 0
##$DSLIST= <SSSSSSSSSSSSSSS>
$$ [...]
##$SUBNAM2= <"">
##$SUBNAM3= <"">
##$SUBNAM4= <"">
##$SUBNAM5= <"">
##$SUBNAM6= <"">
##$SUBNAM7= <"">
##$SUBNAM8= <"">
##$SUBNAM9= <"">
##$SW= 18.0517328524113
##$SWIBOX= (0..15)
0 0 2 0 0 0 0 0 0 0 0 0 0 0 0 0 
##$SW_h= 3612.71676300578
##$TD= 16384
##$TD0= 1
##$TE= 0
##$TE2= 300
##$TE3= 300
##$TEG= 300
##$TL= (0..7)
0 120 120 120 120 120 120 120 
##$TP= (0..7)
150 150 150 150 150 150 150 150 
##$TP07= 0
##$TPNAME0= <>
##$TPNAME1= <>
##$TPNAME2= <>
##$TPNAME3= <>
##$TPNAME4= <>
##$TPNAME5= <>
##$TPNAME6= <>
##$TPNAME7= <>
##$TPOAL= (0..7)
0.5 0.5 0.5 0.5 0.5 0.5 0.5 0.5 
##$TPOFFS= (0..7)
0 0 0 0 0 0 0 0 
##$TUNHIN= 0
##$TUNHOUT= 0
##$TUNXOUT= 0
##$USERA1= <user>
##$USERA2= <user>
##$USERA3= <user>
##$USERA4= <user>
##$USERA5= <user>
##$V9= 5
##$VALIST= <valist>
##$VCLIST= <CCCCCCCCCCCCCCC>
##$VD= 0
##$VDLIST= <DDDDDDDDDDDDDDD>
##$VPLIST= <PPPPPPPPPPPPPPP>
##$VTLIST= <TTTTTTTTTTTTTTT>
##$WBST= 1024
##$WBSW= 4
##$XGAIN= (0..3)
0 0 0 0 
##$XL= 0
##$YL= 0
##$YMAX_a= 159213
##$YMIN_a= -196427
##$ZGOPTNS= <>
##$ZL1= 120
##$ZL2= 120
##$ZL3= 120
##$ZL4= 120
##$ABSF1= 10
##$ABSF2= 0
##$ABSG= 5
##$ABSL= 3
##$ALPHA= 0
##$AQORDER= 0
##$ASSFAC= 0
##$ASSFACI= 0
##$ASSFACX= 0
##$ASSWID= 0
##$AUNMP= <proc_1d>
##$AZFE= 0.1
##$AZFW= 0.1
##$BCFW= 1
##$BC_mod= 2
##$BYTORDP= 1
##$COROFFS= 0
##$CY= 11.3945322036743
##$DATMOD= 1
##$DC= 2
##$DFILT= <>
##$DTYPP= 0
##$F1P= 15.7292609196834
##$F2P= 12.9074282941183
##$FCOR= 0.5
##$FTSIZE= 0
##$FT_mod= 4
##$GAMMA= 1
##$GB= 0.15
##$INTBC= 1
##$INTSCL= 1
##$ISEN= 128
##$LB= 0.24
##$LEV0= 0
##$LPBIN= 0
##$MAXI= 10000
##$MC2= 0
##$MEAN= 0
##$ME_mod= 0
##$MI= 1.114404
##$NCOEF= 0
##$NC_proc= 0
##$NLEV= 6
##$NOISF1= 3.799351
##$NOISF2= 2.8
##$NSP= 1
##$NTH_PI= 0
##$NZP= 0
##$OFFSET= 15.70392
##$PC= 1
##$PHC0= -24595.6
##$PHC1= 14.85273
##$PH_mod= 1
##$PKNL= yes
##$PPARMOD= 0
##$PSCAL= 0
##$PSIGN= 0
##$REVERSE= no
##$SF= 200.130013532006
##$SI= 16384
##$SIGF1= 3
##$SIGF2= 2
##$SINO= 400
##$SIOLD= 16384
##$SREGLST= <1H.CDCl3>
##$SSB= 0
##$STSI= 0
##$STSR= 0
##$SW_p= 3612.71676300578
##$SYMM= 0
##$S_DEV= 0
##$TDeff= 0
##$TDoff= 0
##$TI= <>
##$TILT= no
##$TM1= 0
##$TM2= 0
##$TOPLEV= 0
##$USERP1= <user>
##$USERP2= <user>
##$USERP3= <user>
##$USERP4= <user>
##$USERP5= <user>
##$WDW= 1
##$XDIM= 8192
##$YMAX_p= 0
##$YMIN_p= 0
$$ End of Bruker specific parameters
$$ ---------------------------------
##NTUPLES= NMR FID
##VAR_NAME=  TIME,          FID/REAL,        FID/IMAG
##SYMBOL=    X,             R,               I
##VAR_TYPE=  INDEPENDENT,   DEPENDENT,       DEPENDENT
##VAR_FORM=  AFFN,          ASDF,            ASDF
##VAR_DIM=   8192,          8192,            8192
##UNITS=     SECONDS,       ARBITRARY UNITS, ARBITRARY UNITS
##FACTOR=    0.0002768,     1,               1
##FIRST=     0,             0,               0
##LAST=      2.2672688,     0,               0
##MIN=       0,             -196427,         0
##MAX=       2.2672688,     159213,          0
$$ Real data points
##PAGE= N=1
##DATA TABLE= (X++(R..R)), XYDATA
0 0 0 0 0 0 0 0 0 0 0 0 0 0 0 0 0 0 0 -8 8 -8 8 -8 8 -11 16 -16 16 -24 24 -26 32 -34 40 -43 50 -57 63 -69 78
39 78 -87 97 -106 117 -130 141 -157 174 -190 210 -231 255 -281 309 -343 380 -422 472 -530 600
59 600 -683 789 -922 1098 -1341 1694 -2252 3233 -5275 11115 -58987 -196427 80995 91374
73 91374 -139870 -11583 133519 -33454 -58602 78502 14718 -63189 30907 20473 -63649
84 -63649 13108 57961 -24828 -6469 28068 -41347 -31057 25649 -9764 -11262 29794 1117
96 1117 -15997 21316 14313 -18387 -296 15999 -15943 -8078 40305 7410 -42137 -3996 7873
109 7873 -34343 -15001 28271 17319 -5698 -3731 13878 14301 -8086 -18158 -5605 6275 -118
122 -118 -6136 21263 24116 -22923 -16778 11106 -17997 -10376 27999 -3118 -17001 22952 12910
135 12910 -14367 1285 731 -17367 -5700 6833 -1387 9757 17463 -15784 -13459 22386 -1818
148 -1818 -14430 24564 2505 -23729 18504 6935 -29389 5736 6379 -32562 -815 27180 -4947
161 -4947 -4387 18829 -5482 -17786 13042 8391 -12534 10652 10567 -14198 8909 10837 -21861 -1513
175 -1513 3595 -28307 2336 27432 -10404 -4421 23889 -4456 -16544 12989 7394 -15233 1868
188 1868 11787 -10485 -277 19289 -8998 -16962 11155 -333 -11534 11454 7740 -7193 840
201 840 393 -6215 -905 2455 -3369 -7353 4080 8574 -6441 615 10434 -10847 -6591 16510 -574
216 -574 -6718 15866 3257 -18592 543 10370 -15115 -13053 14621 -1038 -15474 17711 13040
229 13040 -18315 6096 13796 -17092 1473 19041 -7923 -3658 11842 -6296 -7980 6382 -3941
242 -3941 -11484 3575 4794 -8008 2980 11691 -6118 -5119 7979 -3785 -2515 8712 -3113
255 -3113 -2615 5836 -4161 -2470 2519 -4649 977 2112 -5373 4600 6436 -6928 -2584 3659 -4792
270 -4792 -4387 4564 1436 -4982 4156 5568 -6922 1871 9392 -7389 -1007 10515 -5328 -137
284 -137 10239 -8996 -5423 9491 -8387 -10470 8862 735 -9512 3277 6963 -4180 -1326
297 -1326 7884 -1133 -4710 8565 2102 -6254 5333 1784 -6945 636 -770 -3856 893 -2061 -1383
312 -1383 1726 -2212 1866 2353 -4780 2361 4816 -4209 1013 4937 -1891 -192 1699 -2054 -388
327 -388 3008 -1141 -4713 4632 4859 -9381 -104 9923 -8744 -5435 10325 -4680 -5848 10153
341 10153 -2422 -6037 9180 1255 -6915 4993 5150 -4845 -687 4844 -2957 -4588 4118 -2211
355 -2211 -7231 4228 264 -7638 3246 3221 -4514 2587 2429 -1082 2721 478 982 2246 -2555 2187
371 2187 2409 -5578 1081 3787 -5822 -1854 4824 -2942 -4011 3857 1376 -5154 2582 5846 -6210
386 -6210 -189 10211 -5731 -4556 11761 -3431 -7677 10582 -1245 -9930 8674 1352 -10643
399 -10643 4101 5320 -8423 -1695 7101 -3601 -5454 6439 582 -6219 6586 2547 -7181 6123
413 6123 4793 -8689 3124 5197 -7140 570 3828 -4204 -401 1565 -2638 -1096 778 106 -1119
428 -1119 184 2489 258 -64 2624 496 436 1288 -438 2030 44 -3413 2699 108 -5669 2276
444 2276 985 -5219 847 820 -2852 929 -569 -670 1928 -833 350 2587 -202 422 1002 -394
460 -394 517 -302 -1203 -471 -276 -76 -2126 -1225 2317 -2051 -1836 4230 -2578 -1530 7130 -3601 -3263
477 -3263 10120 -1742 -6345 9392 929 -8656 5857 4410 -9917 319 8446 -7771 -5828
490 -5828 10503 -2950 -10681 10093 2454 -14128 8207 7913 -14025 4446 12062 -10839 -496
503 -496 13068 -7189 -6606 10539 -1010 -9800 6103 3978 -11243 1465 8157 -9958 -2965 11663
517 11663 -6151 -6402 11799 -549 -7588 8077 2992 -6515 4295 5043 -4691 -1601 5098 -2179
531 -2179 -6513 3445 1932 -7592 1739 5240 -6927 404 7873 -4960 -3631 6622 -412 -5198
545 -5198 4114 4480 -4847 -454 6450 -4128 -5145 7894 -1470 -9811 7182 2959 -9885 4636
559 4636 4939 -9166 1075 6055 -5123 -799 6963 -2377 -3579 6672 1313 -5817 4672 4208
573 4208 -8015 2474 6191 -8198 -279 6152 -8669 -2933 7714 -4529 -2396 6613 -2114 -2483
587 -2483 5353 -513 -3269 4250 1786 -4857 2942 5121 -5254 -930 4454 -7468 -3618 7802
601 7802 -4890 -5527 8579 -1773 -6099 6930 1237 -5475 2922 2429 -3458 1745 4749 -1356 -2487
616 -2487 2801 -328 -3584 3382 1034 -5064 2315 1541 -5467 1860 3290 -5262 -853 3515 -814
631 -814 -383 2676 1712 -2948 -1515 4472 -1188 -2826 5808 174 -6395 4128 2733 -6458 -255 1780
647 1780 -5445 -1407 4324 -402 -2378 3995 955 -5440 3327 5239 -6304 1203 6954 -6080 -902
662 -902 8678 -5449 -5706 5696 -2854 -5446 5388 1680 -4805 1342 2154 -3834 419 5267 -2439
677 -2439 -2325 6309 -660 -2726 6038 -1000 -5705 4000 -499 -4203 5888 957 -5645 1221 596
692 596 -4132 135 1370 -1607 -1233 2056 1610 59 2000 -46 -3127 1367 695 -1105 4002 831
708 831 -3821 2041 -475 -4557 1853 -148 -4412 1590 1416 -1372 2411 918 -2263 -426 1987 1128
724 1128 370 3071 1789 -2625 425 2169 -3323 -612 1666 -3708 -618 3218 -752 -1296 -9 -1175
740 -1175 -1589 -931 2480 2211 -1981 2013 2648 -3545 415 3591 -4199 -1075 3711 -1081 -1182 3096
756 3096 -40 -4593 -528 1448 -3558 -52 5697 -2763 -2578 6777 -1630 -4700 6532 -335 -6036
771 -6036 5877 3224 -4641 3166 2759 -6189 -1907 3418 -2604 -2755 4126 -348 -4812 3726 2083
786 2083 -5836 2287 3496 -5039 2606 6077 -3114 21 3559 -4024 -2164 2571 -874 -1705 1057
801 1057 851 -1760 -1208 1502 -1352 -2479 1463 476 171 2641 773 314 497 -1546 780 1418 -1457
818 -1457 1593 1119 -2346 1300 251 -2648 561 -864 -2559 1421 1180 -511 1226 36 -962 -217
834 -217 521 877 -224 1128 1774 -1431 783 1278 -3089 -667 818 -2750 445 1539 -1574 874
850 874 -58 -2340 1185 -214 -1575 2520 926 -884 2157 1350 -1147 -409 448 -625 -1454 1421 918
867 918 -2518 864 964 -4000 1163 2201 -4231 1620 3767 -3230 1065 3920 -2358 -572 2381 -1466
883 -1466 -748 2458 770 -1820 445 1498 -3126 -1769 2656 -2017 -2287 2700 -727 -1152 2374 -561
899 -561 -1095 1813 -813 549 2068 -732 1205 1071 -1834 707 -334 -1859 310 172 -1171 -182
915 -182 368 -80 -1073 -140 1081 -1310 908 2610 -1744 1235 3532 -2833 -54 3391 -2491 -694
931 -694 3117 -1950 -1527 1915 -1066 -2043 591 52 -1678 306 2136 -931 -591 3440 -911 -2479
947 -2479 3542 124 -2625 2967 518 -2334 1592 612 -2587 -441 114 -449 -1118 -387 1774 -1153
963 -1153 -1076 2309 -499 -1657 2385 991 -925 1436 1376 -203 -540 681 310 -2115 568 1317 -2838
980 -2838 193 2287 -3739 -384 2971 -2791 -449 3344 -1964 -780 3498 -57 -1430 1714 1147
995 1147 -1908 87 2124 -1920 -1615 2770 -1789 -2920 2854 -1256 -3022 3202 -490 -2315 3379
1010 3379 520 -2239 2334 905 -1106 1017 1102 -506 -364 1054 8 -1919 503 436 -2036 331
1026 331 357 -2267 862 566 -1946 1665 75 -1441 2254 104 -1417 2346 396 -1610 1125 360
1042 360 -848 -289 322 -184 -1441 130 531 -2164 -42 1500 -1815 -50 1774 -1013 370 1463
1058 1463 -684 677 729 -95 746 -648 108 809 -1550 112 751 -2519 -4 1222 -2343 -215 1516
1075 1516 -998 -535 1289 123 -679 761 1587 -620 -859 2391 -1003 -1618 2748 -1111 -2453 2872
1091 2872 -1010 -3483 2550 -273 -2989 1944 1152 -2048 940 1909 -1262 -649 2570 353 -2426 2732
1107 2732 1442 -3709 1462 1939 -3900 774 2274 -3464 -299 1871 -2231 -292 1283 -1089 -277
1122 -277 1053 427 -110 430 1288 -544 -294 1774 -693 -884 1484 -964 -674 801 -1401 -394 761
1139 761 -1594 -156 708 -1220 707 790 -484 948 102 -342 853 83 183 403 -542 707 -38 -1061
1157 -1061 454 -677 -1020 765 -636 -471 632 -574 358 734 -481 736 656 -348 1422 -74
1173 -74 -609 1713 -746 -1390 1764 -977 -1697 1466 -495 -1735 452 149 -1195 -366 1556 -450 -1246
1190 -1246 2149 914 -2721 2361 1314 -3312 1555 1991 -3523 743 2498 -3285 -617 2291 -1969
1205 -1969 -1508 2123 32 -2425 1060 1667 -2099 235 3215 -1877 -469 3642 -1821 -1490 3327 -978
1221 -978 -2453 2333 -445 -2322 986 325 -1471 -388 773 -237 -1130 1205 551 -1740 1588 1287
1237 1287 -2003 1120 1402 -1765 437 1001 -816 -263 130 -268 -384 -874 790 -426 -1264 1371 110
1254 110 -1618 1565 571 -1250 1502 710 -1035 891 859 -575 76 302 -105 -812 12 287 -1479 -38
1272 -38 1018 -1998 176 1700 -1809 100 2050 -1497 264 2344 -1031 -35 1655 -625 -646 856
1288 856 -354 -1051 157 238 -1485 -410 1348 -1289 -861 2196 -1250 -1113 2728 -624 -1273 2679 -352
1305 -352 -1340 2025 175 -1214 898 164 -996 -20 706 -1025 -1100 910 -129 -1794 1430 598 -2303
1322 -2303 1676 971 -1559 1115 1523 -1311 828 922 -427 6 239 -261 -647 -629 634 -298 -1259 997
1340 997 -432 -1424 795 -180 -548 902 297 -395 641 541 530 -374 -63 889 -1079 -106 1511 -1670
1358 -1670 -888 1571 -2070 -1154 1759 -1128 -1075 1563 83 -716 887 935 -741 -425 1581 41 -1246
1375 -1246 1644 510 -1961 1137 135 -1947 878 192 -1980 961 429 -1228 739 272 -591 286
1391 286 294 569 406 62 795 20 -137 615 -540 -122 408 -1128 126 257 -1114 295 -399 -1252 862
1410 862 -37 -536 1371 36 -488 1275 -14 -681 1081 13 -486 365 419 -103 -352 145 -195 -1199
1428 -1199 454 480 -1365 879 916 -1400 827 1295 -1038 691 1014 -645 450 648 -208 343 -292
1445 -292 -508 -249 -683 62 -64 -878 31 -270 -221 236 -306 62 661 -329 759 666 -738 1263 279 -1435
1465 -1435 1047 184 -1299 807 212 -1144 160 -106 -715 -119 -207 134 -330 -58 861 -162 -179 1022
1483 1022 -597 44 1109 -823 132 548 -1134 425 200 -891 119 -145 -859 326 64 -415 203
1500 203 -124 1 362 56 559 133 -209 521 -82 -66 480 -525 -99 262 -899 52 174 -1455 745
1519 745 304 -1557 806 530 -1053 644 735 -450 167 537 -46 -325 462 640 -827 90 1323 -1170
1537 -1170 -849 1161 -1407 -941 1201 -900 -318 1086 -478 -282 711 -121 132 572 -13 546 -22 -122
1555 -122 353 -525 63 -363 -704 138 -278 -765 470 -357 -699 973 -146 56 909 -271 302 1009 -171
1574 -171 259 666 -647 271 101 -596 275 -131 -416 12 -428 -392 -242 -311 543 -24 -377 1129 75 -190
1594 -190 1045 -277 -65 1122 -569 4 444 -599 -32 310 -1018 -33 -266 -707 43 -353 -333 462
1612 462 12 44 139 55 428 -14 129 1120 -641 19 1127 -1004 -514 1172 -1520 -350 1215 -1003
1630 -1003 -770 815 -171 -458 602 200 4 146 971 -95 -279 1154 7 -1084 1055 85 -1514
1647 -1514 1134 23 -1585 465 64 -914 92 -84 -526 328 59 118 -186 17 690 -187 -5 865
1665 865 -390 -144 664 -698 -278 322 -785 -321 -41 -361 113 -326 -28 564 -472 259 1134 -549
1683 -549 235 1227 -622 207 918 -561 -180 339 -320 -259 -21 51 -296 -249 464 -398 -727 889 -83 -760
1703 -760 1129 422 -543 846 164 -873 727 -2 -430 222 -457 -170 -51 -74 -144 -478 200 35 -623
1722 -623 390 592 -557 517 562 -1004 605 659 -663 574 195 -674 413 -42 -708 189 -245 -459
1740 -459 -87 -286 14 -445 -177 785 -278 84 1060 -279 203 973 -592 207 566 -416 167 448 -658
1759 -658 -86 -11 -671 284 -263 -623 133 -484 12 463 -393 363 676 -256 614 220 -404 462 -69 -26 -92
1780 -92 -501 170 -211 -1164 543 61 -998 393 57 -646 808 180 -460 673 621 -245 358 397 128
1799 128 -180 279 355 -791 -342 569 -1060 -125 624 -749 -56 849 -865 -4 738 -276 94 484 -183
1818 -183 220 27 100 636 -441 352 -192 -552 368 -64 -858 179 -278 -415 208 -594 -38 677 -171 531
1838 531 444 -274 731 386 -486 578 165 -464 308 -105 -693 371 -338 -517 -67 -19 74 -201 51 487
1858 487 -369 213 920 -422 61 928 -524 -200 821 -612 -269 531 -621 -487 -7 -710 -46 -312
1876 -312 -173 14 -82 -58 382 19 680 324 -286 699 -146 -205 731 -181 1 574 -766 -274 230 -802
1896 -802 -58 126 -366 260 228 -339 386 232 93 209 142 362 152 -138 508 -46 -401 382 -362 -686 442
1917 442 -252 -431 569 -617 -198 336 -186 81 221 -79 471 320 358 391 126 258 376 -241 333 -6
1937 -6 -383 184 101 -890 90 -368 -113 340 -252 -212 679 -364 165 885 -246 204 642 -63 -21 221 -110
1958 -110 118 -326 42 140 -533 181 -393 -728 454 52 -727 783 -74 -363 831 126 -298 723 -195
1977 -195 47 322 -329 -193 -30 -312 0 -141 -301 75 -166 -27 358 -215 318 575 -536 438 194 -230
1997 -230 689 140 -176 426 -293 -226 65 -653 -229 286 -696 -120 263 -430 -25 96 119 201 -144 425 310
2018 310 -300 573 285 -783 482 51 -840 328 23 -622 16 -215 -440 150 -293 202 252 -359 274
2037 274 208 3 360 195 -310 388 -62 -74 393 -629 -102 109 -575 -108 366 -313 408 -276 -476 418
2057 418 1 171 634 -195 54 726 -59 -80 48 78 -69 -244 -189 -119 -200 -40 -136 -629 -127 58 -744 350
2079 350 170 -956 394 142 -360 314 509 -54 472 -32 322 273 -414 194 -62 -477 295 -249 -257 21
2099 21 -340 -165 305 -521 -201 740 -529 266 469 -509 504 346 -439 175 -132 -345 133 -327 -54 117
2119 117 -548 28 -140 -173 281 -403 -78 434 -292 164 717 -248 526 501 -441 109 385 -456 322 -9 -528
2140 -528 165 -361 -68 139 -597 -27 154 -385 133 299 -143 381 27 -101 294 -189 63 407 -667 146
2160 146 263 -574 374 -167 -558 338 -148 -387 611 -117 -204 188 -64 170 194 121 124 -99 -122 323 -312 43
2182 43 467 -736 -280 214 -891 -78 226 -501 -191 352 -454 86 51 53 371 75 247 339 -297 251 -136
2203 -136 -467 252 -316 -301 262 -353 -311 191 -238 -226 324 -202 -272 431 -120 346 177 -96 519 -192 -343
2224 -343 199 -436 1 107 -435 49 152 -565 246 4 -350 566 146 -13 253 -187 68 388 -47 -25
2244 -25 238 -258 179 11 -254 149 -181 -433 275 -396 -248 183 -219 -32 28 0 323 1 -15 439 -180
2265 -180 10 531 -140 -130 397 -477 -190 425 -708 -48 -169 -464 -15 137 -298 -21 -70 175 287 -148
2285 -148 646 168 -235 683 3 -515 670 56 -497 235 -318 -418 327 -4 -474 198 -50 -116 37 -32
2305 -32 334 -241 315 360 -204 317 271 -655 315 82 -544 69 268 -414 -94 20 -258 95 -289 84 161
2326 161 -152 267 452 -234 361 131 -292 422 296 -484 437 -257 2 -103 -231 10 -318 -290 312 -206
2346 -206 -388 563 -176 -355 469 -373 -209 598 -364 -220 386 -219 106 -139 -281 -96 -125 -159 -120 -586 27
2367 27 73 -390 -15 25 -414 370 461 -70 545 297 -305 344 -135 -174 158 -93 27 36 -216 -196 -262 -249 190
2390 190 -199 -242 414 -381 -108 473 -531 256 493 -202 415 145 -63 53 -71 -114 140 108 -22 145 -320
2411 -320 113 -89 -97 206 154 -198 277 269 -148 522 32 -12 338 -266 -191 181 -114 187 -132 -258 446 -300
2433 -300 -374 321 -238 -272 413 -169 -127 246 127 74 325 -172 402 20 -84 239 -210 100 130 -339 -128 156
2455 156 -424 -28 -79 -233 261 124 -248 234 283 -125 152 -226 61 150 176 332 -105 -149 179 -375 -231 231
2477 231 -397 -50 430 -611 164 377 -330 -68 314 -72 282 30 -182 208 31 153 -60 -129 -342 -266
2497 -266 -420 -21 -116 -67 258 -332 -232 435 -55 -5 500 -29 -24 301 -176 55 231 -116 447 -149 -163 99
2519 99 -412 108 72 -404 -280 -43 -82 -87 26 -84 508 128 -147 375 -47 -129 316 71 -222 115 -493 -37
2541 -37 18 -562 95 -412 -183 54 -166 -89 295 -127 180 269 -43 234 110 -224 187 -148 15 306 -218
2562 -218 -260 376 -338 112 -48 -494 -57 185 -285 87 97 -101 156 -26 276 249 -153 252 41 -121 208
2583 208 -174 -238 237 -292 -174 343 -537 24 216 -145 126 216 -364 259 252 -195 -63 245 -172 -5 -135
2604 -135 176 -91 69 90 -154 -401 278 -239 -240 -15 61 -324 677 35 136 378 22 78 89 -178 90 286
2626 286 -41 84 -183 75 193 -454 -172 227 -698 228 -96 -633 195 95 -231 94 85 -5 150 -177 -34
2647 -34 246 -99 78 -99 -453 42 -32 -31 -11 -311 -197 -3 -265 -22 317 91 90 368 -23 153 -162 135
2669 135 207 -7 -66 21 -170 -22 200 -393 290 -153 -404 31 163 -107 133 24 287 -59 103 119 199 -144
2691 -144 104 201 -483 289 -190 -454 188 -135 -438 523 -296 -269 239 -110 19 -34 165 327 335 -38 331 -125
2713 -125 133 468 -310 103 349 -303 -230 215 -518 -11 168 -237 -114 173 -370 220 210 254 210 131 365 -218
2735 -218 -63 446 -200 -246 493 -280 -261 313 -159 -277 150 -260 29 229 -191 6 -20 75 50 -284 -13 127
2757 127 -136 34 288 -324 -70 128 -429 -19 53 -85 -5 -187 -7 -41 -306 253 226 -378 298 173 -478
2778 -478 170 23 -266 430 197 -353 361 -191 -280 -12 -111 -157 -141 -105 212 -126 15 333 -213 237 544 -6
2800 -6 292 514 -512 93 275 -397 278 396 -105 -151 -4 -360 -340 -98 97 -92 -174 560 -271 -132 503
2821 503 8 -263 243 4 -297 325 144 -284 183 -133 -113 68 27 -155 -312 12 -8 -108 101 246 -247
2842 -247 479 441 -224 104 298 -250 54 -19 -72 77 -78 -69 43 -527 -145 -136 -116 386 10 -426 275 8 8
2865 8 225 76 -92 275 315 54 21 -21 -80 -97 -48 201 -71 -1 62 -301 -188 193 -285 -177 314 -93 183
2888 183 15 19 109 123 -214 -163 129 79 -41 -194 186 -151 -435 23 168 -367 205 -199 -365 354 147 -131
2910 -131 84 156 -341 175 144 -53 -32 -94 41 173 -167 192 -337 -87 191 -243 49 183 -104 282 229 -9
2932 -9 72 57 -161 165 30 -98 364 -136 67 -156 -306 290 -186 -144 117 289 -119 192 139 -245 130 216
2954 216 -110 48 -117 -148 234 -58 -44 13 -264 254 -187 -171 -103 -202 -101 20 -393 103 151 -62 101 -43
2976 -43 195 65 137 137 189 -74 34 -110 -279 88 -324 -307 122 -27 -273 154 -36 -73 38 34 -118 77 28
2999 28 122 -21 176 253 -329 -18 408 -95 -110 246 -323 -217 16 -381 184 -277 -424 194 -24 -316 11
3020 11 140 -255 224 -143 -20 124 -245 -236 172 -249 305 344 -116 6 17 -227 55 -139 -271 181 -307 175
3042 175 43 -268 150 2 -16 78 -266 -14 345 -339 -68 78 -144 72 -149 -116 -105 117 -148 86 81 51
3064 51 267 2 -50 -21 -172 19 169 -223 52 5 -335 -188 -236 -410 69 -186 -96 165 -93 -38 -166 -261 59
3087 59 69 -107 -29 192 -11 368 -203 191 285 -303 92 -143 -175 124 -95 -153 -93 -159 151 52 -190 72 55
3110 55 102 160 67 -202 -98 153 -310 18 -263 -121 177 -140 -54 76 -384 -92 150 -179 30 11 19 -64 161
3133 161 330 234 -42 154 -31 -51 194 295 -464 92 -97 -79 -59 45 -246 200 -25 -17 76 62 5 179 -148
3156 -148 41 392 55 244 -327 -142 157 -462 -146 88 -159 -71 -181 148 73 120 99 -11 55 12 308 -100
3178 -100 -260 -13 193 118 -69 -137 334 176 -384 257 -89 -101 -25 -165 35 -44 -73 22 127 -2 -19 171 -145
3201 -145 97 -65 102 -56 -138 -133 51 48 -33 6 -312 106 -87 -176 -196 59 -20 -145 121 165 203 -55 102 -12
3225 -12 -103 404 191 -340 302 40 -283 387 -368 -91 -82 -49 -161 -134 -36 -40 -50 111 171 -143 -48 319 90 -80
3249 -80 206 50 129 -141 -254 -315 117 -168 182 -139 46 115 -112 105 45 -11 -79 104 -160 322 351 -80 242
3272 242 12 -74 28 -314 107 -86 52 -397 271 -247 82 -116 41 119 -6 105 11 -137 184 181 -123 202
3294 202 118 -225 36 -350 -26 205 -72 187 60 55 44 -68 71 28 -64 -30 123 21 170 463 -130 -153 25
3317 25 -235 119 244 -80 135 -140 -325 -201 -9 -82 -115 -337 -240 280 -74 136 215 -145 243 163 -306 -17
3339 -17 79 154 -143 127 -82 -184 188 33 -23 -357 11 -122 -111 -19 -90 -217 348 5 19 193 25 390 137
3362 137 0 -102 137 -129 29 53 14 -158 -244 -145 322 -194 54 123 -31 -3 87 144 27 177 -31 110 9
3385 9 119 47 -188 -11 62 -299 -33 -91 -190 184 162 -246 8 -27 -260 263 44 139 236 -11 49 6 133 -78
3409 -78 -31 -156 144 -132 -79 199 -271 -68 339 126 -223 233 89 35 367 205 365 -3 -119 93 -152
3430 -152 69 104 -217 120 -89 -133 137 -82 -39 1 36 -178 -21 -8 -51 -80 151 34 -73 131 161 132 -155
3453 -155 -10 -52 -150 148 -152 -135 124 -168 -3 427 -259 139 154 -89 -136 14 4 43 -12 254 206 -149 235
3476 235 17 -366 186 29 -56 391 -180 -280 -19 -27 -176 176 -85 102 57 -30 104 -214 110 251 -257 49
3498 49 -16 306 40 274 -98 63 -159 -40 213 15 15 43 36 -41 20 142 33 250 -111 -50 147 -18 250
3521 250 -85 -161 140 145 -140 -224 -254 -126 179 -210 -88 149 -79 297 66 60 212 -181 -36 124 -167 -318
3543 -318 -23 -71 324 -72 14 206 126 -217 98 76 392 106 -48 33 -58 18 -28 6 -161 193 60 -73 -55
3566 -55 -146 -128 83 68 305 140 -207 119 127 -29 408 -186 -65 93 -129 62 178 -6 270 207 -365 112
3588 112 -74 161 220 204 -277 32 -108 -102 -52 -225 20 -3 141 224 174 -404 140 -65 -252 -42 -56 38 -145
3611 -145 86 95 80 -62 -115 -52 -124 13 -27 -32 -14 -212 -136 -8 -259 51 99 242 36 139 -65 73 65 -113 26
3636 26 2 -74 -34 -22 -88 337 -5 28 -47 -332 7 -81 -214 122 146 -39 104 98 217 -89 -258 4 221 -134
3660 -134 156 74 -49 -66 -4 -125 199 16 182 176 85 208 38 -67 -12 62 -311 28 -117 56 -55 -171 106
3683 106 88 -31 199 130 -386 33 93 179 241 -80 -57 -50 -196 15 69 0 -33 -85 0 82 -5 -89 -152 78 -318 43
3709 43 -100 36 444 112 321 73 65 101 152 -364 92 165 90 105 -168 -237 -45 -76 -189 72 -185 -23 3 88
3733 88 246 -156 -69 37 -68 129 -106 100 254 8 -250 -80 78 -178 52 -237 -277 51 -203 -47 -143
3754 -143 -136 236 -107 -130 -43 24 117 236 -80 -11 24 -77 -37 -132 -321 -19 -35 -181 108 -153 -153 214 116 28 72
3779 72 55 -44 107 -142 214 418 -31 -1 -28 -123 -2 -257 -109 -124 -223 10 -12 10 85 -19 -152 107 187 -100
3803 -100 128 -338 195 251 -241 -259 -7 152 -198 -13 -21 154 17 -159 7 -162 -153 -78 -69 226 243 3 -17 204
3827 204 -98 40 149 -108 -83 150 40 272 142 -62 1 -150 39 -85 -339 222 -4 -71 -71 99 203 255
3849 255 -88 -46 212 -104 -57 -104 16 -69 -151 -39 306 -94 -159 27 149 -77 160 62 -109 104 75 15 298
3872 298 268 -38 4 -190 -105 -179 104 4 87 147 126 -351 274 154 -111 88 30 -136 -35 -196 -66 121 38
3895 38 -136 91 -104 202 -31 9 73 -355 -212 289 -112 155 -45 -5 -22 -94 -143 -95 155 -221 155 -147 65
3918 65 146 -54 217 259 -214 372 -38 -263 -60 32 -287 18 125 -382 37 -114 -138 -79 84 -40 121 135
3940 135 -14 81 -150 99 -311 -57 -115 27 -64 33 -119 -5 67 -42 212 -94 -135 164 97 -83 60 -312
3962 -312 -179 -91 -50 -52 44 -128 159 -21 -161 -37 -7 39 218 10 -7 184 82 66 -135 20 58 -17 61 174
3986 174 -137 95 20 -266 -41 29 69 -3 222 -34 -255 30 -49 257 126 53 -22 163 161 -19 -20 107 268 40
4010 40 29 -98 31 72 -53 72 178 19 -251 -217 -105 -43 -473 -118 110 0 -168 258 59 -135 26 -41
4032 -41 93 142 -104 -88 -53 -226 19 46 -116 -61 134 -190 66 -204 30 254 -30 36 113 377 9 60 121
4055 121 -125 -162 -63 -47 -205 68 30 -305 -49 -108 -1 38 -84 -29 35 166 117 39 28 135 15 -263 38 198
4079 198 -155 107 -88 -274 112 -152 -53 211 -289 104 212 176 64 86 76 128 130 -138 121 103 -81 16 75
4102 75 -43 167 -173 -25 -30 94 78 165 17 11 -128 -205 31 -15 84 254 -128 37 78 -68 16 18 67 176 -172
4127 -172 -100 -44 58 7 158 -71 151 -72 -199 66 277 -10 -6 -83 -120 126 65 -92 -25 -244 65 -21 -72 189
4151 189 258 -27 -152 -93 -91 85 -116 166 69 -160 -99 -175 -197 119 73 -121 121 -99 54 321 134 7 -51
4174 -51 77 -52 173 -39 99 -58 197 34 -241 162 63 11 -83 -63 -228 40 -170 9 -178 77 43 -65
4196 -65 -269 -301 178 -102 149 81 181 -55 25 -57 114 -62 -170 297 -176 -206 186 -244 -76 105 -96 -12
4218 -12 87 -31 -25 -250 41 170 -95 -22 -64 -63 134 106 -166 121 51 107 -73 7 -21 -26 117 98 125 74 110 9
4244 9 -76 -35 187 55 148 345 -34 273 59 86 -46 -94 -210 -129 245 -121 -201 28 -4 79 0 36 3 -108 325
4269 325 -178 -109 115 -63 115 236 47 25 84 -174 22 -194 -315 49 42 -137 -164 -289 -107 -38 31 -152 -29
4292 -29 -10 176 -123 160 184 -142 -122 -19 -357 30 -148 -322 -153 -426 -55 -15 -98 96 -191 -209 28 8 -131
4315 -131 -36 -83 -100 -138 19 -84 -145 -221 -55 14 -134 -96 73 -121 -24 -88 -224 115 -88 -57 40 132 -142 -62 -24
4340 -24 -166 376 34 -96 83 73 12 34 -119 -70 60 -71 256 63 -47 77 -205 94 52 -107 92 62
4362 62 -18 24 -57 -30 266 243 -251 32 -70 39 1 -85 262 38 -116 7 -30 -199 219 -58 132 25 -7
4385 -7 183 111 -52 64 -27 -291 -4 -165 -155 -51 -244 -75 131 231 211 5 -39 68 -150 -3 63 -95 -299
4408 -299 -92 -195 -132 -38 140 -38 62 -40 119 180 -61 45 -26 -208 -28 182 -72 -50 143 53 416 49
4430 49 -74 -187 -221 221 184 -258 -65 -162 153 360 -30 -135 148 -54 -156 -189 -66 13 -92 416 53 -289
4452 -289 14 -94 -288 38 245 35 78 191 2 80 50 -105 -30 10 -158 -42 -73 -109 -32 -13 250 117 33
4475 33 -258 -34 91 113 -64 -133 -60 -216 133 -308 58 -41 227 -94 -103 -2 0 116 31 -98 -122 -210 207 -14
4499 -14 88 281 -76 -213 19 19 70 -103 -113 -68 47 179 -66 242 118 109 67 -141 23 9 -185 -20 -52 -311
4523 -311 -74 -92 -198 -95 19 -50 45 -137 371 -229 129 319 -147 273 63 8 80 -59 -55 -80 235 -90 -56
4546 -56 113 152 -67 -55 -209 -227 -112 75 22 85 -29 -250 21 -61 -57 -270 -81 -250 -28 -101 -206 -14 -74 -36
4570 -36 67 131 -213 -67 40 -2 263 186 79 29 352 90 1 -66 112 61 -4 234 157 -121 146 82 -303 -112
4594 -112 -271 -61 -184 5 105 114 197 13 -1 24 -5 -9 258 -18 -134 82 -33 63 208 151 -80 8 -57 180
4618 180 127 -57 -37 -66 -114 -34 -56 -16 159 -60 -36 198 -8 -204 -75 76 110 -279 -47 -71 -82 148 -215 -35
4642 -35 -60 -70 99 -47 -88 7 -108 -135 -114 -198 -12 -47 33 28 -65 16 -50 -100 163 4 -219 47 -22 -136 131 53
4668 53 -106 297 67 160 34 60 26 102 -19 92 -11 3 91 -346 7 -78 171 -69 -127 12 -98 -61 -287
4691 -287 -9 -5 3 23 -264 -98 21 81 39 217 7 75 224 206 57 -406 117 -7 -17 129 185 -115 -2 -244
4715 -244 48 65 -53 248 377 -49 -34 132 -37 62 253 -375 256 -24 69 14 -121 208 -135 -186 93 -125
4737 -125 -20 -173 -203 -30 43 165 175 -56 176 17 -65 -101 28 -244 -148 -26 173 -51 273 -28 -217 -104
4759 -104 -6 -6 169 -1 -31 -235 -22 52 -302 26 -100 117 194 -18 -150 -103 -214 -105 -16 -154 -194 173 -132
4782 -132 -66 216 -127 150 -29 70 -212 59 -91 12 -120 133 24 -214 -32 -194 -77 337 15 -105 4
4803 4 22 -131 34 165 276 15 94 -226 183 57 -228 24 107 85 -178 -181 -82 105 43 72 35 -132 -65 20 -279
4828 -279 -77 99 -308 29 -120 235 -176 10 -110 102 79 184 -129 -225 -160 138 -18 237 -18 275 23
4849 23 -17 101 177 -35 -50 -172 -112 468 -142 35 39 -23 42 5 -112 66 103 -187 27 -73 -16 -178 -264 -149
4873 -149 266 -58 145 139 -164 -32 -18 -73 68 26 177 -42 63 125 -171 175 135 46 -69 122 116 -31 17 -126
4897 -126 -29 63 246 43 -197 -84 12 -210 23 4 -3 -327 -14 14 120 29 95 176 50 -203 -26 -119 57 -63
4921 -63 171 -78 56 73 -19 76 -67 -258 125 -210 -41 86 -40 1 58 -100 231 363 69 -42 -331 254
4943 254 -60 -52 317 -65 -103 319 -82 -173 42 -126 22 177 8 -56 35 -29 -23 -98 -214 182 20 177 143 -276
4967 -276 5 -286 28 -74 127 145 161 -30 -110 -42 276 -92 -78 -144 135 48 74 -108 -149 -129 155 108 -122 120
4991 120 -113 125 -53 -24 -183 382 145 -99 -70 128 142 -74 39 -176 57 -18 112 -41 68 166 -104 -42
5013 -42 227 -55 15 19 17 -54 37 32 -131 12 16 3 -148 -237 136 -159 162 -31 200 -78 -113 -113 52 219 15 18
5039 18 -5 193 -120 119 -39 -111 -171 -163 74 -51 303 -12 52 318 49 -174 -84 118 -2 -190 195 -36 -89
5062 -89 -24 266 -160 7 -243 -113 70 81 -118 -187 115 165 121 71 203 246 -127 184 156 -268 227 -66 -191
5085 -191 100 114 -148 -53 -7 44 193 166 82 163 162 88 33 66 100 -103 -47 -9 34 240 15 33 -205 186 -142 114
5111 114 48 15 48 -34 -47 103 73 125 -39 -150 111 11 175 62 -47 -81 122 228 -70 52 13 -113 92
5134 92 -186 -10 56 132 -51 87 -141 169 -285 64 -60 -63 58 -66 -99 -145 -64 -47 -242 -216 -186 -146 -201 -35
5158 -35 130 144 84 130 -248 -48 -65 -98 239 -62 71 115 42 -86 42 -44 -123 108 -97 -86 -213 -37 92 178
5182 178 -140 -106 -92 -320 -125 95 235 130 -166 -144 159 -35 51 179 119 -50 110 -191 16 87 -41 47
5204 47 -62 153 25 -52 139 228 -139 -62 133 207 -86 -109 -107 206 -33 -191 26 -49 43 105 142 -82 -86 252 28
5229 28 -25 -244 69 2 -182 204 -80 -40 -259 94 151 -40 138 43 140 69 336 -138 -210 54 -46 138 173
5252 173 139 -94 -39 -110 29 154 8 -34 -25 -103 -22 15 -84 14 232 169 47 -127 -243 95 -18 82 -35 258
5276 258 152 -153 59 175 -127 -78 237 -157 -11 -228 -181 1 120 44 51 11 107 97 -49 -213 236 -181 -153
5299 -153 289 -77 -86 35 -80 -85 -244 -300 75 -24 265 -107 171 180 39 -146 -129 408 259 338 -131 92 103 -118
5323 -118 -235 -267 186 232 -188 -183 -141 -242 -280 27 -148 -77 130 208 124 27 -100 144 177 -110 119 32 205 109
5347 109 63 -146 110 -139 34 90 -373 234 174 -70 59 -20 33 85 184 -36 160 -195 74 99 274 -206 0
5370 0 6 -130 -216 -183 -8 19 161 -260 -19 47 -40 237 -32 59 0 -102 -66 -78 81 210 17 -155 -251 181 -107
5395 -107 66 56 -12 -34 26 146 131 58 83 33 300 -31 56 190 -196 36 -183 66 131 -78 133 166 -189 -69
5419 -69 108 254 70 -17 -72 28 35 32 10 -43 23 -65 -5 213 62 -73 -75 155 50 -29 253 -61 -51 -28 29 84
5445 84 48 -122 -109 17 78 -63 -264 -92 37 65 -53 79 44 256 -135 45 -92 -345 -111 -138 117 43 153
5468 153 41 247 15 74 -27 186 -137 -67 32 -31 193 -396 186 54 52 175 -127 -151 30 -88 -5 -20 -65
5491 -65 83 107 103 26 28 -180 -105 137 91 -34 105 47 -29 7 -141 89 -103 116 39 -148 -166 -53 -167 -125 120
5516 120 -87 285 94 147 145 -37 -127 -218 171 65 51 -123 -232 175 283 143 -30 -166 -211 -33 -19 -36 -191
5539 -191 -59 70 -141 43 218 46 -107 133 38 -12 146 73 150 -178 69 -126 5 221 -134 2 -105
5560 -105 -92 -134 64 -212 49 -106 17 158 273 215 233 -1 -66 -51 -136 58 -42 -94 100 -327 -184 -135 -123
5583 -123 -185 -12 120 155 -93 -165 21 -87 -9 -125 251 -186 135 -149 -174 -8 -24 -375 -68 76 -24 40
5605 40 -4 -280 248 200 -132 192 182 152 182 94 18 -218 -144 25 72 -69 -181 -57 94 -55 -195 190 -3
5628 -3 -75 2 79 15 6 161 263 276 -214 -139 68 -170 -18 -185 169 -89 -38 39 -135 52 -101 -242 -197 3
5652 3 29 -2 -89 80 -46 86 -72 182 -91 99 -34 -135 -109 197 176 169 -36 -22 16 -173 34 8 -99 112
5676 112 47 67 -39 -60 166 90 118 -67 29 78 -12 95 196 143 110 -100 -118 227 -41 134 73 259 128 244
5700 244 39 122 -200 164 152 -272 -4 270 -120 157 -42 -122 61 -126 159 112 25 -7 -14 109 -59 -106 -132
5723 -132 -26 24 -43 -101 -100 -21 44 -36 -223 -67 -116 -30 126 -94 -103 270 113 -168 -53 -40 -111 -18 241 289 -8
5748 -8 -47 108 -65 -22 266 25 -38 153 14 -77 57 -33 -68 142 77 143 -100 18 39 86 -159 85 26 19 -48
5773 -48 -65 135 -21 -150 -101 165 56 62 66 -147 42 -102 -77 47 293 215 15 4 -128 192 -177 -218 22 -142
5797 -142 -94 -33 -113 -126 109 3 -43 -94 231 -22 81 -171 79 -65 63 29 -19 -24 77 149 79 -55 -182 -93
5821 -93 -256 -238 2 6 51 -137 14 119 55 178 -171 -65 63 -64 -97 240 -113 39 -225 -265 199 -29 -250
5844 -250 38 -113 89 -55 162 354 164 3 -348 196 3 25 118 -48 3 -61 34 202 26 206 -147 -66
5866 -66 -176 185 -116 -75 -31 -62 93 218 -56 -37 -6 181 77 76 -277 252 34 104 -22 -170 223 -112 -55
5889 -55 -61 18 -133 276 92 -194 -244 -128 -139 -31 -53 -129 -134 -73 12 -75 -9 -22 -120 235 -98 -122 -235 -118 180 62
5915 62 285 -82 92 -96 -154 -119 26 163 11 -87 -22 37 -321 -107 262 -115 317 -58 -318 96 -120 173
5937 173 109 22 56 -31 65 -2 128 -22 34 21 1 -71 171 163 -89 197 283 83 -4 -2 -36 36 132 371 -124 34
5963 34 202 -45 13 86 -62 -134 200 51 149 24 86 -127 -87 123 -287 -189 221 -207 261 -40 -169 -31 -202
5986 -202 -173 -64 -25 104 227 -53 224 53 126 115 -48 -75 -138 145 -66 -419 -162 -83 -102 -93 -24 70 -89 -128
6010 -128 -91 -32 11 -173 -100 327 83 -160 0 -83 213 56 -35 45 -113 -206 280 164 68 -128 -251 100 -44
6033 -44 173 245 214 49 117 -83 -267 209 20 -12 -143 -153 -204 -157 -123 13 66 38 -11 87 -138 -94 60 -225 -172
6058 -172 -4 -228 -60 -127 -89 65 -142 96 -37 67 -80 -185 -271 -69 44 -100 -64 -225 -59 -140 238 -85
6080 -85 -140 -72 -325 102 -11 174 96 -162 -64 -253 38 -68 111 88 76 -73 -54 -174 114 273 -130 -95 88
6103 88 -29 221 -219 33 9 -31 83 -55 -94 -285 17 -24 -77 -125 -69 -1 83 -46 -197 -25 -90 25 -1 -103
6127 -103 -301 238 22 246 35 -21 -107 -179 11 -35 -135 -17 -122 207 -175 -210 75 99 1 -158 -171 -107 88
6150 88 -124 -36 181 5 -7 -15 184 71 -42 198 149 -94 8 170 2 -153 90 -73 -109 139 -173 -46
6172 -46 -13 -114 -69 -206 86 177 -5 149 -18 18 193 -13 -58 108 -27 130 116 -90 -118 -148 151 -144 178
6195 178 -60 -76 -52 113 -63 -343 167 -145 -104 -87 -64 159 49 -56 64 -90 -130 51 -63 158 291 -167
6217 -167 -39 42 234 141 -41 -154 234 220 -205 154 -66 -102 193 -36 -20 131 57 75 -2 -105 -136 -142 -155 81
6241 81 -123 199 -35 100 137 -58 -51 60 -67 -6 33 -270 -222 -32 -242 -36 92 -98 -27 80 6 17 -120
6264 -120 -101 -187 -154 138 13 -101 -72 -49 -54 -210 -18 269 82 32 178 372 -2 305 170 107 27 36 89 153 -24
6289 -24 87 -189 -203 3 71 108 149 -56 -135 160 -114 114 -41 -102 221 65 -239 60 65 -18 104 -84 329
6312 329 -72 -158 333 97 200 101 5 -193 34 144 -144 -228 -61 -2 -33 -6 300 -90 164 -51 -333 -121
6334 -121 -3 -140 -177 -40 -156 -115 49 133 174 -59 9 195 -122 54 -92 -32 -90 -15 30 -5 39 179 -81 18
6358 18 251 109 -61 -49 78 415 -236 -108 283 -14 78 -85 -58 39 182 79 -96 48 58 -132 -176 166
6380 166 -157 3 69 -115 -83 -209 -39 -113 133 11 105 -9 -147 18 36 49 15 152 61 -106 -85 -109 157
6403 157 211 -151 -51 41 -76 -131 -185 -28 48 -159 133 -58 145 249 -119 -121 28 27 -225 -241 -296 29 -174 303
6427 303 -154 -214 -22 16 9 -68 -49 -72 -120 -1 238 144 -318 -75 226 100 99 239 5 -63 -87 -276 -63 92
6451 92 15 53 -97 134 13 -27 5 26 173 -118 148 -113 69 -134 -136 -167 -192 -172 -71 71 -114 133 -36 19
6475 19 62 -5 68 90 135 204 169 81 -189 -53 -150 150 -87 -21 138 -64 -8 89 -60 -108 13 121 -97 187 132
6500 132 -143 49 -290 152 122 6 -183 -6 105 -107 -177 -155 -8 72 52 86 87 -117 83 42 -140 247 333
6523 333 -229 381 258 -54 -10 -210 -93 176 -87 -86 36 -136 199 -163 -130 -312 16 23 -83 147 -11 326
6545 326 -118 -34 171 86 72 -280 -21 -339 42 -85 97 125 -98 -103 156 -15 -98 54 -142 -16 -48 -18 164
6568 164 -66 -19 -56 -123 117 23 22 134 20 112 -21 -90 -26 -54 -138 154 48 73 23 171 218 217 175 16 125 94
6594 94 48 7 30 -238 -92 62 63 -165 -61 -18 143 51 6 15 96 135 -19 32 -15 -169 -19 98 20 -61 -49 13
6620 13 94 98 109 -149 18 -122 -162 -1 -93 52 21 -293 -225 43 -101 162 27 37 194 45 35 -26 -34 132 -83
6645 -83 28 -86 114 -131 245 114 45 -4 -329 -127 250 138 -210 136 151 -19 72 -296 96 202 -44 138
6667 138 -25 55 -76 97 -68 91 263 -44 242 190 -145 144 56 301 28 -14 -125 -36 -211 -142 104 167
6689 167 -143 117 -65 -135 -174 10 283 -254 -228 -167 63 -5 39 -226 -91 -112 165 -115 60 115 36 -83 371
6712 371 -82 73 66 -57 168 -214 -27 2 -12 -109 -145 -124 88 -195 -94 -116 8 -55 16 43 86 65 -115 159
6736 159 -13 91 -82 0 -60 -176 -5 -88 -83 -220 -66 -64 -135 -19 -77 -289 46 -56 -378 105 -49 -134 -55 -64
6760 -64 17 -10 -265 -95 -119 -215 -274 23 59 -162 2 -205 45 15 -69 -4 78 71 -11 51 219 10 88 103 -66 -148
6786 -148 160 150 -16 231 134 -47 -98 126 94 -150 155 322 -237 -98 79 114 85 141 -275 -99 -61 -66 -190
6809 -190 -196 142 79 163 45 -26 -115 -170 13 158 -6 114 -62 -29 53 239 56 84 136 3 68 -232 -170 43
6833 43 -44 -339 105 -272 21 109 19 -38 -53 -215 -90 62 -60 -306 -64 -38 -11 43 -62 -61 -231 -10 146 -159
6857 -159 154 162 54 172 134 164 -65 39 -125 -115 107 86 71 39 -76 14 -78 -49 -160 77 -5 -173 -103 -116 -198
6882 -198 159 132 -195 -195 -248 127 216 136 20 1 -222 -74 -19 6 163 141 -48 49 -77 -121 180 85 -221 67
6906 67 56 -154 -34 323 63 -65 -112 95 6 -113 219 -75 -200 -233 132 95 -113 -42 -124 31 -48 -109 -112 31
6930 31 -73 -11 235 -146 -161 -97 185 305 -17 245 -113 -12 253 -155 -5 -13 104 43 -305 88 153 -186 -99
6953 -99 147 17 137 -43 147 -45 -154 -190 -17 184 -60 115 305 20 -88 52 -86 -115 -402 -86 154
6974 154 57 -2 -268 177 164 -104 42 56 -113 165 -2 6 60 19 145 11 -117 -135 -114 -15 -181 70 103 -3
6998 -3 373 0 -92 195 -236 60 143 39 -142 309 134 -19 209 22 249 -18 356 -108 -27 -252 -112 -173
7020 -173 -160 0 -96 19 78 69 81 159 31 -115 -39 -33 218 -23 104 55 287 208 -49 56 101 72 77 -60 45
7045 45 117 262 48 -250 -87 -89 -40 -16 141 -43 -45 -4 -2 -79 33 -83 208 -14 -8 -58 155 -38 -238 110 -26
7070 -26 29 -64 173 115 142 -122 44 170 -108 209 -120 -114 -53 102 -28 231 7 -80 -66 74 252 -2 -66 -41
7094 -41 58 117 86 -32 -62 353 105 140 98 -166 -129 14 145 237 89 9 -134 59 33 -87 -110 -31 -30 61 72 144
7120 144 -273 -135 -64 11 -33 -61 -176 -96 -195 -299 -160 193 -184 114 -151 245 39 58 -148 -19 -47 -53 131
7143 131 48 -323 -55 -20 -185 113 -34 51 258 -74 155 38 2 183 -80 -45 42 161 143 32 40 -44 -121 -43
7167 -43 23 -28 -9 100 -119 -134 11 56 84 80 -64 -34 -290 -92 -139 222 -273 120 78 -59 -12 -25 -172 -14 115
7192 115 -16 80 -24 277 222 7 224 189 -39 117 -140 -33 72 -8 230 119 -51 348 31 -138 -41 149
7214 149 -352 161 70 -393 -203 195 109 -9 -65 -88 100 7 -22 128 -275 66 224 -119 -127 66 105 200 -44
7237 -44 16 201 46 116 -79 -248 2 -24 178 -114 -49 -5 -77 -9 -83 152 24 161 -4 -414 42 -260 12
7260 12 -294 41 49 -228 -138 -205 -149 -48 -24 -107 154 9 -161 -145 18 -223 -3 -125 159 -39 150 -218 22
7283 22 -7 242 136 -436 -43 -242 222 -271 -103 -137 279 223 111 135 -90 84 151 28 -189 2 282 58
7305 58 190 167 167 -238 -86 64 127 -51 -225 -189 151 -20 106 -240 -6 115 -110 53 -75 120 -104 187
7327 187 140 11 -102 -173 -8 35 272 202 -377 70 -112 -186 -216 89 13 -61 -39 361 -174 -240 -25 -16 -147 -42
7351 -42 67 178 215 10 56 131 -113 -125 151 57 -175 170 76 -105 248 354 134 36 -293 -267 -43 25 -135
7374 -135 -98 -110 25 196 -329 221 81 101 -154 -169 -243 -9 94 39 117 -10 187 18 176 120 -82 65 158
7397 158 188 -69 47 90 10 21 -158 -150 66 21 -3 134 -141 283 145 99 173 -121 -2 -82 39 178 244 -219
7421 -219 -178 66 -58 151 -75 26 3 28 -150 -17 -109 63 64 -52 -237 232 189 28 -155 35 -182 139
7443 139 -273 -175 68 -9 -23 98 2 -228 90 -147 -211 21 17 122 -2 80 -91 -25 168 4 163 57 -102
7466 -102 -88 305 -132 -37 67 -93 -51 -317 -140 194 56 32 -178 102 15 30 -216 -58 229 219 -139 -28
7488 -28 44 34 208 103 -131 251 40 -36 -48 55 -116 9 -41 151 -174 -41 61 -287 34 261 25 -167
7510 -167 310 -210 2 -283 -92 -72 -89 -91 211 -3 -151 -131 135 61 -25 2 -132 78 162 -89 -100 -82 -132 112
7534 112 36 10 -92 -66 -9 61 -186 -4 -138 -97 -103 0 60 -157 64 25 -61 13 -172 3 -52 11 27 49 -109
7559 -109 -27 79 -217 58 -26 -79 -128 -142 32 -255 -47 79 -120 -135 157 180 -264 243 -16 20 27 -5 279 64
7583 64 -99 -118 -140 308 -58 -82 -184 -39 24 -12 -189 -348 66 177 -103 -100 18 49 -95 -148 102 -150 -313
7606 -313 -68 79 -43 102 275 24 -35 57 -43 48 -110 260 154 -65 -197 -6 -20 222 71 335 43
7627 43 -179 154 -316 -446 -74 -64 192 143 204 -207 63 -123 -261 113 208 -141 21 54 143 -60 -21 22 0
7650 0 250 -68 78 -94 159 -35 -109 117 2 208 98 -96 182 -67 7 -190 -81 -137 -142 -11 40 147 -236
7673 -236 -155 -112 271 -93 11 -92 -119 26 -43 181 185 -98 -192 111 256 260 116 74 13 90 -190 67 -60 21
7697 21 1 6 97 -111 154 235 -271 160 114 -83 13 -57 -8 -98 -110 307 -273 -122 111 64 1 -31 440 59 -225
7722 -225 212 283 -258 -51 -19 -59 38 -62 68 -25 249 19 -81 -107 19 -78 -104 265 30 -3 -106 -160 -24
7745 -24 159 -126 24 -169 102 103 -263 62 -56 -275 -4 -48 -56 -16 -33 57 23 -199 71 27 -10 -203 14 200
7769 200 98 215 -256 -80 -54 -46 2 -132 146 76 1 62 -83 -202 233 35 189 275 78 -195 -76 -29 357
7792 357 -120 -41 4 433 -18 5 -15 -100 -334 -109 254 -309 83 90 6 -280 -19 179 -156 -19 30 50 -283
7815 -283 134 26 4 160 11 60 -128 31 -87 110 -73 303 -25 221 -165 58 -184 -45 182 108 -6
7836 -6 -72 -296 7 160 -108 -59 -1 -69 -10 26 -69 -51 78 -356 -1 73 223 -200 -100 -151 23 19 -140 181 -158
7861 -158 64 98 -9 -316 197 -125 -4 -44 40 52 144 122 -139 44 2 87 -9 -6 -164 -210 -73 -108 52 -6 -77
7886 -77 187 -54 -123 -60 -79 -85 -95 16 52 275 -224 113 -46 -202 143 144 -270 28 -192 -13 129 262 -318
7909 -318 277 195 34 200 -61 46 -66 -31 -58 44 -75 -98 111 12 34 74 46 -185 -93 -73 -73 238 -161 -132
7933 -132 -53 173 -96 135 4 -17 95 -180 85 45 93 82 -96 -3 -197 64 -70 319 -99 -175 161 -58
7955 -58 27 -51 -19 3 -67 -99 -112 -85 54 -51 -130 -36 22 167 185 72 -217 26 -19 43 46 -186 168 -204 -145 -192
7981 -192 14 -222 66 -61 -190 71 -14 161 116 -116 42 105 185 99 -109 221 -48 30 77 114 -15 -158 28
8004 28 -179 -129 -135 278 282 91 10 121 133 103 207 157 32 -92 -110 -89 46 73 107 -43 59 -126 257 -108 -108
8029 -108 -73 392 166 267 171 -114 226 68 68 39 77 7 114 119 -139 40 90 -140 -78 -136 -168 -24 17 125 116
8054 116 287 17 -7 167 80 116 187 -133 -97 87 62 -5 -86 -192 -77 -40 14 59 317 11 154 -10 20 321
8078 321 160 7 -132 -91 -14 12 160 -60 -3 125 173 -54 -144 60 49 140 4 -300 78 -163 200 -226 180
8101 180 -199 -96 56 103 -20 -98 -45 174 21 -59 206 75 145 139 139 102 365 114 -113 -30 55 -66 35 -256
8125 -256 -74 90 82 -79 -120 -362 137 -43 102 -184 -5 -74 182 47 -12 -209 20 -23 -36 -64 195 58 -298
8148 -298 554 -61 -269 249 267 -16 -201 -97 -59 -322 45 51 102 64 158 -111 -66 -8 114 -132 44 136 -8
8171 -8 -38 -194 101 28 -74 43 155 -272 181 108 57 -78 96 19 -46 -33 -204 -4 51 73
8191G3
$$ Imaginary data points
##PAGE= N=2
##DATA TABLE= (X++(I..I)), XYDATA
0 0 0 0 0 0 0 0 0 0 0 0 0 -1 8 -8 8 -8 16 -16 16 -24 28 -32 40 -48 56 -64 73 -88 101 -115 132 -150 171 -193
34 -193 219 -247 277 -311 348 -389 430 -478 531 -588 651 -719 794 -876 967 -1063 1172 -1291
52 -1291 1422 -1569 1734 -1919 2130 -2371 2651 -2980 3375 -3857 4462 -5247 6310 -7840 10229
67 10229 -14533 24655 -101934 22328 159213 -128561 -38864 140641 -5655 -100535 65476
78 65476 32788 -71764 8785 48738 -48567 4553 68027 -18172 -37300 26224 -26520 -34414
90 -34414 35017 12140 -19545 24024 4964 -24796 9651 14685 -21890 -7369 18399 -4493
102 -4493 -9599 31529 8478 -44749 -8336 25492 -14561 -6177 37485 18568 -16347 -12191 4312
115 4312 3165 -17596 -22643 -2393 11392 5681 -2535 12786 17296 -22952 -23013 19230 2393 -7846
129 -7846 29566 7415 -22526 14211 12677 -24740 -11123 2039 -14456 -5277 13112 3767 2465
142 2465 10882 -11967 -15655 22542 10640 -16683 17250 11647 -25813 8600 15564 -28067 -2064
155 -2064 17611 -21272 -2780 32548 -2579 -17204 10555 -3148 -21096 8726 14358 -12578
167 -12578 2249 13838 -12832 -871 13905 -17791 -7630 15070 -12662 1390 32757 -5840
179 -5840 -17034 16723 -3762 -24676 6464 9349 -16357 -3656 14361 -4961 -5049 17272 -2562
192 -2562 -17766 13440 11962 -9314 9417 11313 -10342 -3943 1935 -6847 -2781 1514 -3572 -5824
206 -5824 2566 8239 -5280 -4989 9188 -5239 -7601 17202 6007 -10775 9845 5029 -19228
219 -19228 -2728 13642 -9055 -12929 14953 6970 -16006 9208 14771 -20975 -5475 16338 -13425
232 -13425 -6229 20856 -4485 -10786 11882 -1320 -9921 8044 2850 -8161 5304 9935 -4850
245 -4850 -1069 9766 -5994 -10987 5766 -1052 -7508 6262 -1157 -6694 5768 -551 -3587 5819
259 5819 301 814 6292 -1968 2358 6665 -7221 -5931 3624 -3468 -5855 2996 1458 -6375 56
274 56 4845 -6028 -2356 9523 -3477 -4350 11617 -452 -4550 9944 -4537 -9183 10209 -1685
288 -1685 -10855 9047 4921 -10294 1150 7465 -4711 -5119 5642 -323 -7160 5151 4236 -7287
302 -7287 2481 5377 -5771 844 4576 -1940 2318 1846 -1305 2680 -1559 -1772 1667 -5580 -1905
317 -1905 3748 -5202 -3026 4188 -2375 -2595 2322 -191 392 4044 1539 -2246 3773 5922 -6960
332 -6960 -3127 9949 -5403 -9692 9125 -739 -9891 7514 781 -9494 6670 4162 -8034
345 -8034 3413 7321 -3938 -1365 6085 -262 -4243 3965 1654 -6400 2960 3764 -7396 698 4687
360 4687 -5819 -992 2726 -3237 0 603 -1232 1690 -1246 158 3984 -3152 172 6575 -2877
375 -2877 -2397 6338 -686 -4766 3048 1783 -5909 -795 4634 -5438 -4611 8153 -2697 -8412 10238
390 10238 1627 -9866 9060 5016 -9930 6781 6851 -9515 2143 8624 -7374 -4293 7292
403 7292 -2139 -7956 4078 2267 -7768 2408 4572 -8005 1911 7293 -7699 125 8720 -4722
417 -4722 -1600 6507 -2168 -1648 3199 -1838 -2258 1047 -926 -2157 -1222 941 -424 -2348 1172 485
433 485 -1240 1371 365 1206 2165 -1778 2387 3406 -3722 1705 4100 -3945 253 2790 -3380 -569
449 -569 512 -2491 263 -650 -1814 1708 -536 -1022 1083 -66 681 865 -466 907 1257 723 -76
466 -76 -707 2094 -856 -3492 2425 -1451 -4574 4516 -1846 -6694 6773 558 -8658 6873 4976
481 4976 -8905 3929 8144 -7082 -906 10572 -3468 -7075 9614 1480 -12264 5777 6363
494 6363 -14272 1928 10680 -12647 -1987 14055 -8417 -6269 13662 -2897 -8948 10392 3567
507 3567 -9966 4443 7758 -8745 -1926 9811 -6565 -6882 10819 -2598 -10897 9029 2280
520 2280 -11070 4682 5137 -7762 1686 6639 -4017 -2269 5812 820 -5258 3466 5118 -5326
534 -5326 -144 6703 -5248 -3262 6904 -4423 -7085 5589 762 -6345 2498 5061 -3876 -1952
548 -1952 6773 -472 -5699 7097 3263 -8875 5188 6851 -9564 379 6796 -9113 -2836 7259
562 7259 -4540 -4551 5761 -1178 -5467 4634 3504 -5579 2600 6470 -5817 -110 8671 -5592
576 -5592 -3883 8109 -4794 -5204 9061 -1305 -6074 5548 -695 -5573 3595 320 -4885 2876
590 2876 3064 -3787 1593 6158 -3302 -2726 6058 -2746 -3879 8924 -352 -7348 6695 1336 -8824
605 -8824 3597 2687 -8042 344 3562 -3821 -207 4438 -1159 -3217 2719 2490 -2374 3119 3726
620 3726 -4147 1014 3632 -4725 -443 4153 -5028 -3009 3943 -701 -2374 1353 725 -2900 -1810
635 -1810 4429 1256 -2870 4640 2912 -6003 2706 5067 -6207 -1383 4387 -2996 -1896 4879 187
650 187 -4331 1172 533 -5830 708 5733 -5015 -2231 7718 -3390 -3920 8607 -1893 -7385 6791
665 6791 1497 -5658 5229 3685 -6099 -894 2762 -3693 -1680 4278 -2055 -4759 4465 919 -4885
680 -4885 3993 1457 -5941 4115 4150 -3546 4579 3636 -5913 195 3074 -3373 -923 2180 -1837 -2175
696 -2175 1136 350 -1871 -468 -241 -2514 1152 2838 -400 2832 1789 -4039 1263 2173 -3918 1022
712 1022 2336 -3694 711 2725 -2385 172 143 -3706 -1295 1645 755 -698 1493 1345 -2211 -69
728 -69 3481 -1348 -450 3761 -990 -459 4236 -378 -2686 -75 -1267 -1328 -380 1594 1514 -2803 -927
745 -927 1992 -3460 -1186 4477 -1920 -1791 5412 1280 -1608 2855 256 -4342 -788 2505 -1758 -1223
761 -1223 4195 -2048 -5429 4337 178 -7054 4191 2683 -6527 4217 5931 -4925 595 4290
775 4290 -4649 -1749 5407 11 -3146 3591 1027 -5552 1186 3069 -5971 -895 4870 -4401 -509
790 -509 6422 -3291 -2795 3989 -2322 -2032 4591 1569 -1674 1805 1375 -1221 -1407 1270 -661 -3152
806 -3152 627 1313 -1440 830 -191 -2187 -232 -1119 104 2087 -154 1139 2548 -1575 782 1741
822 1741 -2333 47 1246 -2231 897 1380 -1778 -319 -530 -2001 -799 462 981 -54 278 1878
838 1878 -416 -59 2341 -1608 -638 2470 -941 105 2726 -1484 -738 261 -2799 306 563 -2079
854 -2079 1158 1151 -2166 642 1155 -1597 -341 1163 254 -196 1724 2265 -1709 -119 1985 -3203 -329
871 -329 2996 -3577 -864 3895 -3033 -1864 3325 -2483 -2175 2789 -111 -1149 2820 1810 -1677 178
887 178 2053 -1107 -1727 2906 -26 -2580 2068 599 -2997 882 -775 -2479 1244 -469 -226 1530
903 1530 -375 -177 1297 -1047 330 1431 -772 789 1522 -759 81 168 -424 -1277 -902 503 -1226
920 -1226 -719 2084 -1470 -1228 2985 -2017 -1665 3915 -601 -1564 4017 127 -2076 2549 181 -2016
936 -2016 746 705 -1317 -217 1396 -1293 -2309 1674 -413 -3623 2470 1593 -3071 2129 2143 -2603
952 -2603 1222 1795 -1755 57 1398 -124 -257 -265 781 -858 -2238 1019 -466 -2777 906 1007 -1828
969 -1828 689 1131 -543 -203 784 1040 -670 841 2509 -1832 -673 3060 -2413 -2200 3297 -1878
985 -1878 -2506 3138 -1304 -2806 2546 -45 -2628 1396 1618 -1651 478 2660 -433 -1368 2799 206
1001 206 -2707 2530 779 -3430 1975 563 -3864 1601 946 -3603 785 1530 -1943 337 1288 -281
1017 -281 33 1128 761 -1034 942 1524 -1287 -25 1499 -1607 -34 973 -2237 -17 557 -2269
1033 -2269 1048 525 -2159 1341 1268 -1608 965 1668 -654 304 953 465 -428 80 1001 -1548 -796 1703
1051 1703 -1212 -1676 1407 -1024 -1153 1122 -859 -387 903 -518 669 269 75 1413 -432 -32
1067 -32 1860 -1323 -384 2037 -1801 -1195 1898 -1263 -1716 708 175 -1140 -178 1067 -305 -1113 2097
1084 2097 428 -1829 2711 671 -2649 2598 1435 -3437 2010 1331 -3532 620 1805 -2737 -804
1099 -804 1604 -1399 -1561 1829 638 -2604 1766 2506 -2876 726 3502 -2757 -171 3637 -2041 -1444
1115 -1444 2633 -1477 -1462 1581 -1072 -1457 812 -227 -819 -303 851 -501 -592 1804 -52 -869 1762
1132 1762 482 -806 1663 -273 -924 1194 -1301 -993 1056 -1202 -512 638 -1187 -134 267 -1027
1148 -1027 392 552 47 735 182 404 890 -653 744 441 -1076 626 51 -997 446 -503 -908
1165 -908 466 -864 -259 228 -1217 471 645 -774 1579 501 -1085 2024 432 -1521 1461 800
1181 800 -1689 508 596 -1408 -660 935 -395 -1877 839 912 -2636 902 2426 -2968 405 3371
1197 3371 -2390 -175 3589 -1853 -1128 3308 -918 -2223 1776 359 -2573 -246 1858 -2005 -1263
1212 -1263 2837 -1458 -2109 3405 -379 -2709 3435 572 -2514 2690 1437 -2127 1220 1479 -1196
1227 -1196 -380 942 -248 -1385 164 680 -2084 115 1476 -1913 146 2082 -1328 -208 2071
1242 2071 -543 -337 948 152 -149 -267 102 317 -1317 483 572 -2207 264 1119 -1810 294 1485
1259 1485 -1615 341 1267 -600 -84 490 107 289 375 771 -506 -266 1217 -1208 -951 1930 -1413
1276 -1413 -1325 1756 -994 -1357 1958 -770 -1213 1576 -150 -758 1265 567 -229 474 758 -455 -304
1293 -304 1112 -765 -1647 1389 -498 -2091 1805 -67 -2484 1480 578 -2095 1382 1184 -1205 823
1309 823 1365 -701 272 915 -284 -807 652 381 -1507 28 1087 -2309 84 1177 -2053 -250
1325 -250 1841 -1373 -158 1340 -698 63 754 236 169 -157 1045 375 -853 417 460 -1411 537
1342 537 391 -1557 256 196 -797 -172 133 226 -286 -85 983 -391 -654 2323 -688 -1381 2098 -501
1360 -501 -1787 1566 -338 -2114 1026 134 -1478 126 681 -875 -647 895 443 -1031 1045 864
1376 864 -1502 971 1369 -1640 421 1377 -1908 92 1138 -1176 -234 203 -1006 -121 301 -112 -132
1393 -132 -105 163 27 -382 972 426 -202 1042 -179 122 958 -825 -204 359 -1189 259 576 -1505
1411 -1505 432 158 -1465 483 156 -793 920 549 -363 530 437 70 -6 256 593 -589 160 1031 -1349
1430 -1349 -223 1094 -1265 -504 1193 -1305 -421 1130 -782 213 1031 -364 298 360 -18 709 145
1447 145 138 265 -358 57 131 -965 114 -137 -560 116 -559 14 685 -643 103 823 -947 665 1341
1466 1341 -1047 642 1202 -662 -3 387 -456 -97 -194 -137 -253 -445 383 -702 -1003 629 -490 -560 1210
1485 1210 -150 -185 1248 -406 -67 1068 -749 -59 902 -616 -6 478 -679 -162 -259 -872 -63 -697
1503 -697 396 425 -342 549 227 -636 443 37 -69 980 -523 323 888 -923 167 934 -1440 -333
1521 -333 728 -1192 -138 1183 -775 -590 636 -70 -207 645 692 -235 -73 1295 -114 -1028 1599
1538 1599 -419 -1125 1031 -393 -1480 823 -318 -1186 376 -364 -517 310 232 -70 102 37 462 59
1556 59 120 451 -294 310 440 -504 364 15 -1010 234 -274 -1065 514 -484 -537 831 -349 -59 987
1575 987 -340 428 765 -353 550 499 -200 180 -7 -285 192 -460 -154 59 -750 259 -233 -1161 344
1594 344 -33 -901 866 -249 -153 1142 -174 -147 699 -147 -198 366 -620 250 293 -531 126 -137 -436 67
1614 67 -112 89 139 -201 606 -132 -319 1363 -360 -458 1162 -269 -961 1441 -139 -1038 836 -234
1632 -234 -1150 199 20 -642 -214 449 76 -763 627 623 -1084 636 1003 -1020 857 1030 -1054 349
1650 349 674 -1187 1 416 -686 -341 -251 -256 -211 -302 251 -431 -493 852 41 -98 1061 51 -214 963
1670 963 51 -439 515 -327 43 -235 -330 -32 -505 -600 833 -746 -373 1274 -340 -403 1220 -86 -267
1689 -267 942 302 -157 109 -3 -72 -483 -9 226 -1024 450 -32 -1258 583 397 -1175 537 810
1707 810 -881 660 658 -432 419 337 49 487 159 107 -223 -75 70 -663 21 639 -860 -281 627 -1141
1727 -1141 -71 1038 -745 310 1000 -929 595 550 -318 399 426 -254 8 196 -206 -224 -443 137 -603
1746 -603 -536 455 -296 -601 764 -590 3 787 -117 24 815 -48 539 765 -452 119 326 -476 61
1765 61 -500 -492 140 -598 -326 42 -206 -93 381 -175 403 179 31 310 -135 306 544 -725 449 460 -934
1786 -934 12 334 -1154 246 359 -898 231 454 -421 -160 377 -43 111 336 544 -83 -85 884 -295
1805 -295 -340 1215 -604 -408 845 -597 -534 524 -715 -500 666 -225 -95 195 -92 402 294 144
1823 144 379 -437 482 527 -328 420 177 -562 83 -516 -618 152 -394 -296 129 -352 104 387 -694 321
1843 321 193 -577 554 525 -403 489 270 -196 -12 -73 -353 -469 -496 380 -313 -275 762 -325 -575 758
1863 758 -180 -378 994 -163 -314 864 -107 -295 452 3 125 174 -366 -72 -364 -289 -40 -788 -302 109
1883 109 -331 310 -151 -426 469 128 -299 694 -149 -201 864 -213 -55 384 -546 109 463 -607 -226
1902 -226 16 -412 103 -371 -267 240 -282 228 238 -325 558 258 -253 776 226 -587 357 -289 -491 414
1922 414 -332 -492 346 -382 -213 68 -143 350 185 -25 405 -207 185 379 -315 90 300 -306 448 -10
1942 -10 -472 302 -342 -745 303 -496 -404 555 -164 -314 353 -188 -125 430 100 278 240 399 -2 -350 129
1963 129 387 -652 280 378 -950 -113 103 -975 268 168 -523 553 248 -156 675 89 -1 451 -218
1982 -218 267 279 -138 60 -531 -222 276 -388 -419 323 -492 -30 249 -576 285 368 -520 596 200 -201 672
2003 672 64 -336 571 158 -231 148 -244 -393 76 -300 -209 -210 -18 439 -271 38 506 -475 437 364 -522
2024 -522 515 886 -250 253 201 -424 235 -8 -309 -24 -6 -234 301 -596 81 84 -188 377 -104 -52 581
2045 581 -62 -181 502 -155 193 474 -340 -179 22 -477 392 -229 -620 293 -66 -429 223 -186 76 237
2065 237 48 65 88 87 218 -23 -156 340 -445 8 378 -529 -157 379 -1005 -86 313 -499 -33 212 -444
2086 -444 305 220 186 368 -239 275 305 -236 569 -18 -484 321 -197 -592 -18 -314 -308 384 -464 -338 523 -264
2108 -264 333 327 -413 339 365 7 472 369 -58 229 -103 27 217 -490 31 1 -376 283 -384 -453 377 -318
2130 -318 -412 478 -188 60 753 17 -43 220 -201 122 83 -392 352 16 -441 40 -814 -327 220 -472 251
2151 251 106 -564 315 -235 27 395 -10 204 371 -293 214 358 -687 17 290 -715 436 65 -627
2170 -627 -181 -98 -377 -130 130 4 61 -35 439 25 -110 828 -121 -424 787 -271 -467 472 -438 -415 227
2191 227 -356 -176 296 -67 -32 99 125 208 -247 100 245 -309 46 492 -416 630 310 -485 246 -133 -523
2212 -523 232 -122 -489 320 -542 87 91 -74 -65 255 -162 191 181 -65 180 -282 58 301 -188 28 365 -446
2234 -446 88 -28 -466 86 -26 -416 279 12 -86 407 -227 172 434 -388 99 291 -480 315 103 -261
2254 -261 189 117 -102 -80 -383 -250 -44 -192 132 -291 -194 536 -120 30 628 -189 -119 818 -166 -367 525
2275 525 -154 -52 309 -328 -349 -62 54 -146 -292 303 170 -707 300 165 -647 433 234 -326 473 279
2295 279 -392 176 118 -335 66 42 -356 -183 -75 -136 4 -436 296 -230 -200 588 -85 -80 865 -278 62 622
2317 622 113 -70 211 -291 176 72 -168 341 -276 -313 31 -535 -104 393 -460 297 209 -165 53 305 36
2338 36 358 -40 122 41 -518 269 10 -488 -48 34 -611 215 -270 -518 460 -243 -411 531 123 16 305
2359 305 198 137 38 -21 -43 -287 93 149 -164 107 610 -704 -23 335 -615 340 301 -425 176 240 -307 412
2381 412 -62 78 114 99 172 100 -33 88 -52 -345 207 -223 -485 388 -427 -265 424 -16 -152 507 -327
2402 -327 159 383 -26 254 69 -100 247 -293 -6 218 -184 -159 99 -411 104 12 -414 233 202 -147 256
2423 256 240 90 243 205 69 189 -141 300 21 -574 303 -27 -595 108 -35 -431 64 -169 -19 21 -21
2444 -21 74 13 108 172 125 98 461 -51 -306 318 -199 -97 434 -433 241 -30 -481 -183 -16 -308 -118 131
2466 131 185 233 166 96 61 -237 158 -24 -299 61 -332 -381 275 -254 -200 251 -385 -163 66 -104 67 159 -262
2489 -262 340 32 325 406 17 -135 784 -206 249 235 -274 347 -140 -327 -21 -101 -459 10 -344 -405 233
2510 233 -80 -100 118 9 170 132 61 310 132 -129 113 39 -195 86 -67 145 187 -252 -34 24 -138 91
2532 91 -56 -127 465 -125 -98 411 140 93 288 -189 164 -131 -569 17 -167 -221 13 -352 -115 103 -276 135
2554 135 103 -131 347 180 36 422 5 -57 247 69 -287 198 -283 -87 57 -331 -79 -55 -308 -36 -157
2575 -157 -173 499 -161 -188 436 -204 -9 194 14 243 -169 68 450 91 -208 169 -111 -182 -124 -391 -158
2596 -158 179 -385 -94 92 -133 1 -194 19 -46 -62 55 205 -148 92 -12 -567 149 25 -507 114 109
2617 109 -543 -60 -24 -92 15 -23 -21 18 -190 253 -39 -331 184 -162 341 387 -45 -103 261 -101 -345 117 -247
2640 -247 -204 83 -229 -162 260 -137 146 258 232 202 95 107 184 -506 261 -3 -193 28 60 -292 215 -214
2662 -214 -7 330 -36 -96 201 -165 258 67 -91 376 -127 -238 314 -162 -203 266 -122 -261 -41 -70 -281
2683 -281 -69 -214 107 -31 28 139 -269 76 280 -238 201 512 -229 365 240 -577 161 166 -283 179 -66
2704 -66 -482 -115 154 -84 160 -140 -70 -239 -78 133 -380 -17 403 -67 -90 557 -210 5 173 -383 -99
2725 -99 109 -107 -247 372 -387 -89 27 -55 49 -301 223 3 -385 344 277 -287 185 138 -226 -91 -155 -296
2747 -296 27 -86 -60 -181 -202 274 24 -134 549 -105 -331 253 -160 -203 534 31 43 125 -149 178 -79 121
2769 121 112 -33 -29 143 -190 -169 142 -270 229 294 -503 221 234 -292 38 342 17 290 -2 -434 -142 -40
2791 -40 -15 -233 -129 -275 -243 -94 349 -35 -115 343 -149 -82 579 -96 -3 339 29 -23 3 -74 134 -167 -10
2814 -10 -220 -211 102 251 -286 496 -175 -391 127 263 -165 227 452 -37 396 -47 -67 -1 35 43 124 -269 67
2837 67 -550 -282 199 -249 -137 679 -363 -11 350 -258 -33 393 -74 92 239 69 264 -131 -109 135
2857 135 -39 -63 194 -350 -97 13 -666 -17 20 -535 86 54 -379 229 126 -73 179 67 107 -128 -61 397
2879 397 -86 -239 285 -391 -166 385 -141 -117 139 -183 -133 244 275 -184 206 5 51 -178 98 232 -149
2900 -149 107 242 -302 168 -29 -406 120 42 -385 -172 470 -150 27 41 169 165 -284 341 43 -112 26
2921 26 -54 -213 168 -171 -54 101 -271 -12 83 -313 -205 339 -106 -106 292 128 98 50 143 399 151 176 293
2944 293 -109 199 315 -135 -10 -163 -142 150 -7 32 175 -119 -69 177 55 276 226 -333 81 95 -252 362
2966 362 -165 -162 486 49 -272 -67 -187 -24 82 -275 -56 -58 -35 -97 22 20 332 -385 38 252 -299 145 146
2989 146 -445 342 287 -268 -111 -31 -299 36 -140 -57 335 -191 60 19 82 540 -96 -18 403 23 -179 133
3011 133 -339 -219 -8 -212 -40 -91 -328 -162 25 -155 -218 80 -60 -144 315 121 82 -334 296 296 -19 181
3033 181 30 -136 142 -133 -205 141 -249 -23 -92 -141 194 98 -65 96 272 -192 46 -337 -46 424 245
3054 245 -95 85 -71 28 -64 -51 -46 -68 -146 -108 -29 -50 97 -70 -54 420 -84 -82 336 -64 488 237 -66 -73 79
3079 79 -94 188 -67 -37 -41 -275 53 8 -185 -4 199 -292 307 75 11 49 -193 158 376 -404 183 36
3101 36 93 5 -112 -196 -31 -114 -323 122 -97 -98 -21 -204 332 -87 81 262 32 -294 338 -139 -285 286 44
3124 44 -256 -77 -131 -55 119 -62 -46 225 -189 425 -149 -43 245 -193 4 -96 9 65 285 -49 182 80
3146 80 -38 203 -72 -480 25 26 -267 122 -192 -236 143 -74 -97 -161 41 -221 -40 -51 242 7 -168 25
3168 25 -88 -102 29 -99 111 -91 -232 -4 49 131 -187 -74 91 70 -105 172 101 -110 4 471 -204 143
3190 143 137 -151 -83 -51 -200 14 -328 80 -44 -127 45 -118 -19 102 -77 -116 416 136 -55 240 14 -234
3212 -234 356 -68 -85 66 -71 7 -262 43 7 134 -48 -32 -42 279 276 -280 170 233 -422 128 216 -191 159
3235 159 -287 -100 -23 -165 277 -137 -185 118 23 -46 97 -94 -39 271 21 -126 253 -85 -1 60 -135 -190 -64
3258 -64 78 34 120 -68 0 -51 23 146 -377 443 41 -175 471 134 17 219 22 -152 109 -33 -20 108
3280 108 105 91 -5 -274 100 -36 -254 259 26 -241 258 -161 -161 100 -188 -45 157 -10 -282 298 -10 57
3302 57 232 -212 193 150 92 41 -188 -62 -60 -255 68 -106 -94 261 89 -116 213 228 -36 -11 76 353 -203
3325 -203 270 154 -116 -385 364 178 -162 118 -259 -185 99 -111 -38 227 -62 266 11 -123 -223 -219 -61
3346 -61 48 -134 12 -93 -224 -31 -44 -346 102 316 15 168 138 -216 106 394 154 -27 17 2 168 120
3368 120 60 -247 -304 115 -74 -244 181 -80 -259 44 -421 -241 123 -62 298 194 -46 72 42 -61 265
3389 265 83 219 10 -110 -114 -111 -279 -34 84 -202 56 -19 -167 303 -17 70 23 61 -139 122 143 31 -15
3412 -15 -195 273 -9 -222 -234 -86 78 103 -241 -103 142 -56 58 88 -217 -87 -64 67 275 27 262 -119
3434 -119 -145 444 5 -227 -129 176 101 -118 -83 -120 75 -264 35 31 -193 19 -6 62 290 -145 -178 170 333
3457 333 -335 118 -154 -244 464 -313 -148 -11 -158 149 -309 -125 208 -132 21 151 58 50 23 -282 138 16
3479 16 -108 -2 128 20 112 40 -331 -23 62 -326 -156 -121 143 47 -113 69 147 -243 46 50 -12 305 -13
3502 -13 -6 27 136 67 -104 -35 -194 -240 62 111 -360 -79 132 118 69 236 -102 135 127 -203 416 208 -29 287
3526 287 54 -3 21 43 60 355 -42 -157 98 -297 43 -89 -250 194 -53 11 324 38 -150 -85 -135 -242
3548 -242 48 -377 49 -236 26 -16 -260 -23 -3 27 -144 32 -154 17 49 -53 40 238 -253 69 201 176
3570 176 150 -169 -67 208 -162 10 44 -97 26 -209 -52 94 -271 -124 336 -308 -34 176 -3 -82 67
3591 67 4 -50 194 -107 15 20 -251 94 -101 -107 123 -217 171 109 -370 -95 51 -223 -76 -15 -66 4 -135 -7
3615 -7 -19 -66 -17 -174 -330 -261 67 -12 -43 -112 -127 96 44 40 56 65 24 115 -79 -91 99 -66 -53 -196 -85 184 -382
3642 -382 -17 -19 10 -148 -46 -327 -71 7 37 189 176 -72 207 95 19 176 2 -24 5 -30 -92 86 -145 4
3666 4 98 -74 -109 -203 145 172 -58 157 257 -129 -160 218 29 191 33 -139 239 20 -22 142 -81 66 -5
3689 -5 -183 136 -95 -62 241 -18 -11 162 -201 66 32 61 224 -70 -215 213 142 -162 17 -112 14 -87 -69
3712 -69 -127 150 27 -9 218 -350 303 98 -126 241 118 -31 -66 315 -21 261 -374 53 112 -74 -45 -62
3734 -62 -236 189 136 13 254 -299 -26 -6 -60 -37 30 -249 72 -126 70 -157 -42 -59 53 46 -145 33 -162
3757 -162 11 150 -329 15 58 -154 83 -40 -253 293 148 126 -85 -21 26 56 -205 -94 130 -138 -265 -238
3779 -238 -233 219 -6 4 218 70 52 232 -72 -36 175 -85 -66 -396 38 -47 -222 -183 115 -53 57 359 55
3802 55 36 255 -136 130 267 -110 -131 -274 34 31 129 -114 145 -3 -42 131 -127 -3 70 -94 51 -180 -73
3825 -73 -79 -86 80 327 -96 291 38 -156 -2 53 -126 74 -119 -144 -3 11 -13 85 -66 175 254 -124 264 213
3849 213 -14 247 147 -256 -30 -96 142 -54 7 174 164 -130 117 -52 -47 22 85 -46 12 170 53 4 -230
3872 -230 -186 41 -18 106 176 147 63 106 156 230 -181 246 56 -85 -134 -115 -91 -164 207 -248 -32 -103 -60 -86 -218
3897 -218 101 127 34 124 50 48 -74 -125 -239 113 -134 -288 -47 190 -90 2 -46 -60 54 -282 151 44 -193
3920 -193 250 -96 -56 154 116 140 190 -141 363 30 -122 122 -151 -272 -12 52 234 12 -30 0 31 -110 -27
3943 -27 -73 124 -41 10 148 40 -172 -210 109 49 -299 70 217 94 106 -86 -130 87 -15 14 -106 141 120
3966 120 84 -125 141 155 131 252 -262 -137 -59 64 124 -192 -23 226 -65 32 42 -244 -43 54 15 114 69 -242
3990 -242 215 -216 -56 -33 38 21 -85 -13 -426 -265 -96 -144 -341 -344 -11 -197 40 -47 -115 -111 196 -292 114 47
4014 47 -271 69 338 -408 -167 76 26 69 -107 36 -142 -85 -15 -96 199 124 43 2 118 -66 185 -71 55
4037 55 42 136 104 -182 102 -136 53 -206 -15 8 -58 142 101 -163 14 66 -58 59 107 -22 14 316 -125
4060 -125 -43 -67 -390 -51 -3 147 120 -33 189 -55 -77 -16 -51 86 -1 37 32 11 -29 -11 214 -80 -228 -134 90
4085 90 307 -51 -81 88 -254 -56 -22 -168 248 -31 -178 8 84 -170 -28 257 -91 -113 69 -82 218 178
4107 178 94 -244 -199 -126 64 -275 -120 50 -188 -2 -128 280 162 33 79 125 0 -226 -26 -196 59 -60
4129 -60 -15 180 -32 92 96 -418 -66 224 -140 -45 -104 56 369 233 -66 138 -57 -132 129 179 352 69 20
4152 20 -5 -116 -87 -140 -144 -175 102 27 -220 194 41 254 -145 214 -83 225 24 -158 171 -337 270 -147 -73
4175 -73 -88 -142 -326 7 -253 -21 202 26 -36 -129 93 80 125 68 165 107 168 -38 46 105 137 -180 -41 -21 13
4200 13 -96 -12 -79 -94 2 -129 89 -239 -27 170 149 113 44 49 199 -54 72 115 262 128 119 85 86 -19 -169
4225 -169 192 103 -39 134 188 32 -94 -265 46 -176 32 2 243 -44 76 14 -223 -27 107 -235 310
4246 310 147 -25 173 -263 -61 129 -12 189 43 -194 53 -5 104 185 90 246 100 -431 96 167 -112
4267 -112 42 85 -214 287 377 -159 -145 -66 -5 29 -67 225 37 -118 9 -104 -37 111 252 57 197 -65 15
4290 15 -121 -262 188 -321 -82 -133 9 -125 261 107 103 369 -18 -107 153 -33 -126 -170 -55 -63 57 45 102 185
4314 185 -92 -45 -319 -43 -56 -25 95 35 49 -69 -46 -124 303 -40 -12 335 -102 179 -211 -19 42 -129 -154
4337 -154 -58 124 -98 221 -3 131 -37 115 84 -68 -11 74 107 35 195 -53 88 103 -12 -36 129 -4 -72
4360 -72 8 -57 41 130 -195 -102 211 -28 80 -34 -100 157 224 41 -74 -215 8 64 -230 2 -137 93 -202
4383 -202 -11 -5 -82 -110 -166 194 -20 98 -64 -3 104 -195 -126 59 118 8 152 -198 -10 80 41 187 218 -90
4407 -90 132 224 181 45 -133 43 67 -110 -123 128 -261 71 -111 -56 -36 264 -88 204 -80 -138 12 -73 6
4430 6 3 -32 67 233 -3 -140 140 -181 168 -203 -68 39 -217 -114 36 -145 148 67 66 3 -22 -27 200 -73
4454 -73 135 77 123 326 -7 -82 -65 -103 -140 -47 -198 -57 81 182 71 19 94 -58 -118 -163 23 -113 27 225
4478 225 -131 -224 -98 -27 -220 -20 -187 -47 -197 286 64 -118 -36 -274 -102 -17 119 -56 -350 -84 34
4499 34 -86 0 -19 -51 109 -254 -152 -245 -180 81 54 -90 -8 -123 -79 36 -115 -46 109 -167 113 -15 -55 166
4523 166 39 40 125 58 21 -104 -122 -150 -322 -169 279 -173 -168 -108 -304 -32 145 105 1 -4 -54 45 -150 -40 49
4548 49 -165 -106 -21 -102 -71 51 -49 -107 -34 -122 174 118 193 72 -5 -146 -76 -178 43 212 -278 147 132 -107
4572 -107 -107 -141 5 231 14 191 186 31 -104 -102 -78 277 45 -77 4 100 5 0 30 55 156 23 130 193 122 -128
4598 -128 -126 61 -1 20 -281 -140 13 -139 -104 -55 2 -174 -52 85 214 381 143 -17 41 102 3 110 234
4621 234 40 6 -10 -332 -190 173 -241 39 9 24 -22 -137 -52 190 -52 263 178 3 30 -159 -150 146 -95
4644 -95 -239 204 -57 94 46 250 -7 -165 -102 52 6 -20 53 66 41 133 54 -11 -213 -54 153 -70 -82 217
4668 217 115 38 318 19 4 -179 19 271 -69 97 41 110 -124 -10 110 -57 53 277 -120 140 -210
4689 -210 -181 285 -234 -30 47 -129 -62 47 79 18 -51 51 78 284 17 -58 -51 68 121 -83 231 -207 -70 59
4713 59 -68 -234 98 129 -116 129 32 -122 -147 -60 185 282 102 -98 -127 12 132 222 -58 199 -191 -174 -234
4736 -234 -100 -25 215 -177 -61 -47 -1 267 -57 -229 361 -181 137 -162 47 -199 217 -47 -319 30 17
4757 17 84 115 -25 -78 -2 -103 69 -38 12 -107 93 227 31 41 28 -22 -45 -49 131 148 19 13 -5 190 45
4782 45 31 203 30 228 221 80 112 -3 -71 219 -194 71 -41 -34 286 99 -96 13 180 -111 -216 101 -354
4805 -354 2 -208 -21 -236 -164 155 -84 -184 172 -29 -37 80 40 83 140 129 -89 47 -159 -45 -232 -155 -179
4828 -179 -116 194 -58 1 -109 -2 -12 220 79 110 -170 119 -138 158 -10 -51 141 175 -6 -139 -292 20
4850 20 -36 -46 -146 187 257 156 128 -32 309 -146 73 234 14 47 206 48 -84 -61 10 21 -28 -131 -18
4873 -18 -131 180 123 -231 134 -149 -285 30 -70 187 32 169 18 -5 45 161 133 -27 -29 21 -135 78 -253
4896 -253 235 -240 -47 46 204 5 -61 118 -92 -142 1 91 -50 -230 29 -245 -284 -81 334 36 -274 143
4918 143 -15 -47 204 143 -110 118 -206 298 9 -104 -20 -123 137 -77 36 -238 -30 -105 81 66 -326 46
4940 46 -164 22 16 33 142 168 203 152 -10 -81 49 65 -110 -154 -3 -290 -21 -154 -126 -68 -22 -11 182 -70 -143
4965 -143 -161 124 187 67 94 43 12 2 21 -100 172 -143 132 49 227 129 136 94 -72 -63 -60 -98 -70 58 123 44 -52
4992 -52 0 227 -283 186 25 230 60 281 -71 159 -289 -250 -10 -6 197 88 -147 51 217 -121 37 43
5014 43 187 299 -107 -60 -131 40 -42 171 38 57 97 27 68 -94 -67 -11 -412 -13 2 -64 41 -101 8 100
5038 100 35 25 -11 223 -218 -39 -65 171 124 90 -60 -76 -269 -34 -13 -13 -7 -47 32 109 176 43 81 30 -100 -134
5064 -134 -64 -209 -7 96 93 -71 -139 146 -5 -45 -105 -207 84 -30 324 -12 -74 159 -64 133 -273 148
5086 148 50 -25 -206 75 -54 -146 -51 -78 -71 -15 -40 -182 -120 -138 -102 -81 -91 -117 59 -51 -186 24 -40 -96 -14 11
5112 11 -275 115 -41 105 -121 -282 106 -179 -97 -71 46 -91 109 14 0 5 -14 -21 71 3 33 30 -27 -126 191 241
5138 241 78 -201 215 86 -36 16 11 -88 -108 -157 -107 41 -40 21 65 27 46 -15 -110 53 191 277 51 -77 -264
5163 -264 -246 155 24 308 43 -201 243 108 325 242 -127 58 -10 75 -109 155 -29 -266 140 -56 38 128
5185 128 186 166 -270 -11 -260 -2 281 94 -185 222 108 -344 -74 -190 -290 -101 -51 131 -34 -110 -159 28
5207 28 36 207 14 9 293 125 152 163 20 170 114 48 -61 -16 -10 158 -296 68 -47 15 48 189 107 -43 367
5232 367 -138 18 -140 13 -62 -20 16 -29 -65 91 -17 -54 26 -142 -257 22 -24 -153 -53 -38 -69 81 59 -86
5256 -86 89 -99 -148 -126 -47 -196 -188 69 258 -118 -48 -46 -222 32 -2 -177 84 100 -133 169 -48 -118 60 98
5280 98 -345 60 130 -218 -39 -30 -66 93 -15 -115 56 40 36 50 -181 128 92 122 37 148 -155 -119 -93 -386 -4
5305 -4 -4 155 -242 -206 -76 -4 111 1 -358 -87 25 100 -112 99 -88 -39 -312 -23 -29 35 41 89 -146 -187 289
5330 289 -173 54 65 -165 123 -28 -203 -195 -266 110 6 53 213 -244 143 79 86 -78 -46 -148 -249 29 4
5353 4 -141 -14 232 179 46 174 73 -181 -147 -2 62 180 -102 -103 -37 -140 261 50 56 -83 -76 -108 100 269
5377 269 88 -153 -79 54 -181 -6 -15 -77 27 172 -40 176 -1 90 -102 -2 -56 -223 36 54 -170 -30
5399 -30 -99 104 166 -224 -34 -57 68 -160 181 -222 101 183 93 -57 -54 -30 102 350 93 83 2 114 205 -82
5423 -82 -142 17 -65 -18 -82 104 122 -47 -294 166 -97 89 109 -139 -44 197 16 69 55 -57 35 48 91 -222
5447 -222 -174 -131 -135 -27 -263 -92 71 186 5 261 -71 91 -39 162 11 13 135 24 71 242 -70 -32 -54
5470 -54 63 143 -48 8 8 278 109 210 -246 49 106 109 230 -271 -25 1 -78 71 447 214 236 -84 -232 108
5494 108 45 -47 -115 -114 39 71 -103 -121 146 -38 -99 22 -1 -21 24 78 99 119 -250 37 -12 182 186 -197 -138 213
5520 213 -109 32 -34 -77 -129 -76 102 -4 106 -147 165 -82 -77 137 -33 66 -56 -88 -108 21 -69 -121 17 11
5544 11 56 18 188 -26 150 91 -151 27 65 204 23 41 -1 69 -175 -198 -70 -18 -5 -68 -293 -245 46 -18 151
5569 151 95 190 -59 284 -74 -53 -141 38 45 10 -80 -201 202 170 72 0 2 -87 33 107 227 -45 72 132 -305
5594 -305 108 -144 -36 58 53 -47 -48 47 96 135 5 -21 310 -143 172 -128 181 2 13 68 -22 -116 -5 104
5618 104 -41 -166 -264 -197 110 -165 -75 103 -69 -200 87 -70 -20 17 193 46 -44 -73 178 -15 -23 22 64 346
5642 346 62 89 160 -42 -101 32 20 -105 -1 39 -120 82 -149 134 159 -89 301 90 -89 -16 -140 60
5664 60 -16 -106 -108 12 -244 -362 1 -127 198 19 157 177 226 129 -88 175 69 117 -14 -111 6 -143 -30
5687 -30 -8 33 19 -144 -75 41 119 -138 -198 -151 236 -213 106 121 162 101 141 39 26 257 -218 -95 -178 -125 -172
5712 -172 -71 -78 -306 -86 -211 -96 -18 -17 119 69 -181 -57 -63 -75 -83 95 35 137 -50 -104 -113 -123 -17 -106 -95 79
5738 79 -145 -91 -71 -99 1 52 -139 -20 84 -7 -195 -40 173 -76 -234 -185 189 2 71 95 -46 25 4 -123
5762 -123 46 -253 79 -32 -36 269 -79 -134 1 140 -240 241 254 -141 35 124 62 255 -219 34 189 5
5784 5 -2 -202 13 -176 13 164 -140 72 40 88 -236 -50 118 248 -77 -92 -82 153 -6 -30 194 -51 130
5807 130 -179 -64 -205 39 -56 25 -68 -280 111 167 -256 234 168 145 78 -78 209 26 -69 23 -475 -216 -210 180
5831 180 44 -111 -42 115 199 111 26 25 -239 -2 63 -83 33 -112 -359 179 -61 -131 196 34 114 -129 45
5854 45 122 -52 -133 -64 63 85 11 -248 -203 114 -48 -189 -118 17 -216 -152 21 75 103 22 73 -62 -174 136
5878 136 21 -19 25 145 -153 -123 -10 49 261 -12 46 -6 12 -73 -83 170 49 -81 16 42 76 107 -57 133
5902 133 125 -224 -110 250 -192 -183 -52 -173 -202 267 3 -12 64 39 -106 -3 -11 -216 181 1 310 4 24 64
5926 64 17 42 -132 -133 134 219 20 50 -151 -48 -66 -11 117 277 -241 -24 -58 157 160 -35 53 17 -77 -119 226
5951 226 276 137 -23 -136 -202 83 -116 80 240 -128 -251 10 -61 -187 100 82 -16 -24 178 71 -15 -105 13
5974 13 -55 36 -7 199 -81 -243 -55 64 73 174 166 -185 -21 68 -11 58 48 -9 41 -143 -169 0 -141 111 -1
5999 -1 115 -41 -7 1 -170 145 -19 39 -178 57 88 111 -183 -29 111 88 158 119 132 109 -95 -118 -137 101 86
6024 86 -31 -110 21 321 -162 106 -88 -4 -176 -241 96 -134 -136 -174 222 -392 -58 -183 109 -58 99 208
6046 208 -260 40 -46 67 68 51 15 -46 -157 7 43 -82 31 50 -3 1 134 -72 -89 99 14 -261 202 -86
6070 -86 53 164 -78 219 94 94 -21 103 141 191 35 -137 -75 58 -215 73 335 187 148 -66 -146 -81 11
6093 11 -27 -146 66 20 -70 -9 51 71 -185 111 77 210 62 92 -57 -144 144 42 43 -143 27 12 -85 -179 33
6118 33 8 37 -163 -7 275 -33 152 -143 33 256 -200 35 -113 -107 -83 119 197 -97 93 239 9 -45 -65
6141 -65 -165 113 160 -66 111 12 -133 -231 -76 9 -6 39 106 5 -5 121 -64 96 103 86 -362 -105 95 42
6165 42 -253 22 240 -23 123 -3 261 -227 -91 -113 99 -195 -28 223 165 -74 -12 40 27 -280 179 -17
6187 -17 87 -190 24 51 -177 -113 -57 15 -39 127 81 -4 -47 -69 -109 -47 96 131 235 -137 165 -34 -117 -29 -112
6212 -112 -164 156 -54 -1 57 -183 60 166 -173 22 -160 71 69 9 51 103 26 -132 -140 13 -58 -175 -54 -10
6236 -10 222 105 -93 66 -73 163 30 -66 -39 -11 20 -7 105 34 -80 128 -26 73 104 -116 -45 116 28 139
6260 139 69 -210 31 -121 32 -29 -81 -105 129 5 5 -290 -187 -50 -121 60 -170 -291 -137 0 -252 -79
6282 -79 -25 109 -63 130 -1 -62 -116 -314 -177 -17 11 -47 75 -28 271 -19 93 68 32 59 55 -271 -199 165
6306 165 215 40 50 -6 162 -76 -2 -124 -278 49 -45 149 75 -30 9 126 208 410 -51 -108 -102 -141 120 -83
6330 -83 21 -182 -35 188 34 -131 131 97 -57 121 290 -64 143 -170 -32 -338 113 -7 172 -8 -142
6351 -142 115 -65 -82 -194 38 -255 -107 265 -35 78 -129 -396 1 108 66 -53 6 -33 63 202 -160 -126
6373 -126 -171 24 -131 -103 60 54 137 61 10 70 -22 96 228 65 -16 7 -222 -149 -18 -137 5 47 151 -60
6397 -60 133 145 264 -36 151 -264 -233 -65 -84 48 5 170 61 -145 57 -6 -89 32 -81 -27 195 139 0
6420 0 -83 -108 -26 143 211 -93 334 75 -90 44 250 -71 -211 -231 -14 -118 44 113 -17 -49 -79 42 7 -162
6444 -162 -183 12 147 -144 35 24 62 -244 147 -119 -88 -93 18 -27 4 78 96 26 17 -140 113 65 209 -80 147
6469 147 -58 47 -15 -69 215 20 -81 147 -111 -145 -110 145 -135 169 -225 -196 68 -176 34 -92 -36 -108
6491 -108 187 -106 73 -5 172 -242 -216 157 -213 189 -144 187 126 -60 -126 193 166 137 95 -69 41 149
6513 149 172 267 348 77 -93 65 -88 84 -112 -137 65 -40 -92 96 67 2 -46 138 197 -260 -13 119 5
6536 5 -235 -226 -171 -137 104 23 -55 -42 165 47 -30 180 132 147 29 -103 -223 -129 259 168 -164 25 209 -246 215
6561 215 6 -263 -90 265 -143 48 43 -216 93 5 141 56 -89 160 24 62 88 -4 -119 54 8 22 90
6584 90 43 -348 100 74 -113 -110 86 133 -139 -79 -306 65 78 -192 -213 -80 -60 -17 86 -159 -117 6 13 6 -63 -64
6610 -64 -68 101 -102 13 -16 162 110 -148 78 -46 -84 -87 77 102 -115 -224 38 -28 -114 -30 142 48 -91 121
6634 121 -67 -23 62 118 40 97 -92 -147 22 32 43 59 -199 76 111 16 143 267 -30 -147 141 38 25 -220
6658 -220 100 12 -28 -28 -476 256 -171 141 -102 41 -155 83 -61 -86 44 -142 -224 58 -37 69 -216 -254 -101
6681 -101 -132 -19 43 -17 65 -2 -24 56 91 -131 -76 -172 125 148 357 161 -19 103 -185 -66 58 -30 101 -47
6705 -47 -151 44 -6 -167 -158 -33 130 -29 44 -81 -219 -81 -13 -197 28 142 -18 170 256 -93 41 339
6727 339 48 -155 53 -274 -42 31 70 -65 -17 -110 -211 -133 63 63 -23 -84 -1 144 127 186 3 144 -23 -108
6751 -108 73 157 -8 -230 139 8 -166 202 -61 -27 -94 -127 126 -1 -37 54 -59 -71 -65 62 -176 75 -31
6774 -31 106 241 88 -156 -15 -44 69 -91 -30 21 37 -9 47 -123 179 101 -4 -263 -18 -124 102 -40 -74
6797 -74 -297 -67 84 -70 -26 -161 -210 -102 -84 126 71 96 1 -40 90 185 310 -110 62 17 -50 -254 1 -279
6821 -279 113 44 191 -102 373 -127 -157 -67 290 -43 -52 -84 42 195 292 107 -175 233 -218 -206 -149 68 17
6844 17 -141 283 -53 143 217 -27 10 144 -87 142 126 -70 -61 87 261 111 148 -200 -2 -126 -89 -121 126
6867 126 -81 189 116 -105 -42 -28 78 13 -24 -253 96 211 204 68 -239 166 132 336 -166 314 104 76 11
6890 11 -91 -2 47 149 121 -195 -214 39 13 -98 -21 77 80 -21 -127 -80 255 -2 -303 215 -210 -52 -317 94
6914 94 -157 56 122 -280 -62 -16 188 188 -16 -188 306 -95 -45 -160 -66 -140 -44 81 -149 -107 -101 13 173 229
6938 229 -300 -41 129 139 -160 -114 -124 -139 90 163 -133 70 41 -276 16 48 153 126 100 -6 -204 47 -65
6961 -65 -34 179 5 92 -69 44 5 -115 143 235 -130 -157 0 -77 -81 0 38 -152 261 -224 199 162 185 33
6985 33 -65 166 -76 143 -287 326 -50 -21 -30 -197 158 83 -41 -176 -52 204 -199 -106 13 43 134 -100 -79
7008 -79 -31 300 -74 307 -62 -32 27 -18 -246 31 -226 -24 5 102 249 117 9 10 7 -196 75 -112 -170 45
7032 45 -155 -137 48 -66 -230 -98 -118 115 -119 -191 83 -72 78 -30 46 -18 113 30 111 -52 -17 6 -105
7055 -105 -129 -120 -113 45 -195 224 72 38 -291 -16 125 15 -39 -141 207 -134 -128 -96 50 -138 -63 201 282 -223
7079 -223 -75 -219 0 79 37 -124 -233 -108 -223 180 -21 -121 -66 123 -68 -168 -31 23 -176 -20 -88 260
7101 260 135 -131 -142 3 -25 -162 -181 -258 -97 -120 -38 -40 -210 -50 -138 -200 -103 -28 -247 -322 -167 -40 -77 -95 133
7126 133 -81 361 0 14 462 -182 123 -111 90 203 -70 -55 11 -190 -59 218 176 48 -128 -204 105 24
7148 24 2 -42 158 57 184 -31 -82 92 79 -85 -54 -110 -122 -11 6 154 92 -227 105 -223 48 -189 -155 79
7172 79 -382 137 -148 29 -45 39 -37 100 13 -30 -333 -10 -57 87 -65 165 -39 229 187 -126 44 76 -59
7195 -59 -50 0 -23 29 182 -98 -27 -280 -71 238 -255 -121 88 162 -155 10 -44 206 -158 59 -181 -2 -209
7218 -209 359 -228 153 -25 -85 -197 -174 87 25 241 33 -30 -198 -97 -59 145 241 -187 -92 -175 23 2 -67
7241 -67 91 14 -204 -111 -31 13 -164 -118 -17 -196 -26 56 -92 174 -35 21 -74 193 -198 228 78 154 26
7264 26 139 131 87 -24 10 -12 11 25 -192 -43 163 -237 -236 3 113 21 35 -132 -113 -85 -23 -137 -16 20 -140
7289 -140 6 -50 222 -81 12 24 191 -193 -178 -150 -124 56 29 173 11 -105 -13 208 -17 109 41 102 65 -65
7313 -65 -96 -62 -117 -31 14 65 -29 199 -33 -23 182 -204 -32 123 117 109 52 28 -49 159 45 -95 -36 -135 15 -169
7339 -169 -170 218 -181 -28 -7 -72 67 -89 -105 -19 98 70 -181 131 102 -13 27 65 -220 299 20 181 55
7362 55 -135 -29 -101 266 -74 52 -102 58 94 -119 97 -38 -16 26 88 168 86 67 -138 199 -59 59 121
7385 121 -61 206 155 29 85 -289 113 109 -307 -103 -218 5 -113 110 -55 214 189 -66 -24 -211 -13 120
7407 120 -151 95 78 -17 -75 107 -33 70 305 -185 135 85 10 34 56 -272 -214 -19 113 -135 19 -218 -128
7430 -128 -65 -96 151 75 -13 -67 86 114 131 167 -53 205 -181 -40 213 -171 132 53 228 -23 166 87 62 42
7454 42 -169 61 55 -75 -125 -47 -146 60 -4 -42 -328 54 25 -159 -76 -119 -3 9 124 -9 85 -148 -236 96 194
7479 194 64 274 224 166 -302 75 -85 -209 -30 -284 78 57 66 -147 -69 -10 -199 146 -238 -110 139 -171
7501 -171 -273 -184 4 3 -153 -144 -47 -169 -164 160 -47 51 97 -146 98 -212 -110 -231 -154 -85 -277 40 -164 -73
7525 -73 29 -95 16 171 -197 -44 92 -80 190 252 -98 274 4 3 -116 -36 -201 182 -110 -340 53 -113
7547 -113 -25 -84 169 19 -71 -49 237 -243 -337 23 -201 92 -101 208 135 94 -56 223 79 -30 -108 114 -186
7570 -186 -75 38 -144 -109 -292 -249 29 9 115 129 100 215 1 -15 76 97 63 121 138 -243 34 77 80 37 52
7595 52 -37 -93 -259 -44 44 0 -76 -220 162 118 -182 67 13 -11 74 278 66 76 106 19 -33 -158 -162 -4 151
7620 151 161 14 -232 134 27 91 -260 -141 -35 321 141 -72 213 -36 18 11 80 265 50 -11 -226 71
7642 71 179 49 -79 5 -279 -54 -241 98 107 -111 166 14 191 -53 -79 -235 -78 -176 -71 -136 72 -5 30
7665 30 -134 -26 -266 7 -64 -209 -40 -80 170 -182 4 -128 99 60 -87 -123 40 83 148 -45 62 -151
7687 -151 86 -106 29 -3 -215 -98 173 105 -189 -165 213 -83 52 79 -118 50 106 9 314 28 5 -18 -190
7710 -190 -214 -61 -59 96 36 320 174 -94 29 99 113 2 19 221 91 -173 43 40 12 8 -34 50 -95 320 23
7735 23 -196 -139 -29 -60 136 16 57 42 -88 -193 -285 19 -78 -66 -86 71 -115 120 -199 170 173 -129 -219 134
7759 134 -304 -53 97 -145 117 64 102 34 55 79 60 58 -51 258 79 118 -98 63 -155 -195 47 -217 -119 -2
7783 -2 64 -67 -265 2 39 -283 270 -46 5 -118 -88 183 -37 73 37 -112 268 -97 18 -53 -63 66 17
7806 17 204 119 -107 -142 -216 -108 -71 -108 103 15 -196 28 159 30 -104 -86 151 -74 -344 -84 223 -96 -30
7829 -30 -12 -76 -74 -129 121 -140 52 -3 -163 -186 87 -245 -163 -228 -9 -92 -55 -58 -139 -189 -39 -164 42 -107 -136 -132
7855 -132 -2 -96 -239 -31 98 50 80 96 -13 141 -25 -27 -166 -159 53 -51 -89 117 60 104 -15 70 235 -47
7879 -47 -86 -110 38 155 279 111 -1 -60 361 232 138 -13 -31 -59 -53 -132 152 108 -28 25 -167 16 -254 -9
7903 -9 -16 136 -186 202 5 -239 -3 -200 -110 19 38 99 145 54 153 102 -215 -89 23 -65 140 90 -67 68
7927 68 3 -1 -93 126 -160 149 -106 281 -52 -114 232 -199 -276 126 -117 -261 7 118 -42 -198 20 114 -69
7950 -69 -76 -155 -114 -90 45 70 210 13 69 -323 -267 212 158 98 74 132 -92 -78 -123 -31 115 104 -173 173 -51 -80
7976 -80 -104 -111 -27 24 -210 -24 121 69 -44 133 -357 -135 -42 -116 94 -143 117 51 44 11 81 -46 -62 98 -289
8001 -289 9 45 -5 -45 -187 79 -199 -165 -92 -75 134 -9 153 130 -72 -16 220 -79 16 -79 3 205 242 141
8025 141 157 -130 -62 145 -144 -156 174 29 -328 -82 -146 -140 -33 15 -53 -143 -98 21 -282 -152 49 128 85 -70
8049 -70 -127 69 28 -98 31 20 -18 -87 2 -157 -69 330 9 24 140 -60 59 -138 -70 74 -192 -203 -192 23
8073 23 59 -28 -322 -306 -117 -153 142 -84 -168 -109 35 192 102 169 -193 -76 102 -256 31 -194 -44 -131 -127 25
8097 25 112 267 -17 125 -205 9 -48 5 87 72 141 -62 6 2 164 -225 -377 -43 -8 155 76 -132 70 47
8121 47 -108 -108 -6 -50 -95 -52 -205 -175 -70 -136 -69 -53 -32 209 58 -11 227 42 72 -213 150 -10 -13 80 -49
8146 -49 180 -108 -55 60 8 100 -191 279 -40 -93 -40 -56 138 -218 -27 72 115 -64 -473 12 163 66 159 10
8170 10 93 0 -189 -96 272 -58 81 148 -13 363 88 36 -3 11 -114 -282 -106 -129 179 185 -7
8191g
##END NTUPLES=NMR FID
##END=
