##TITLE=1H_DNG-CO-Pr
 CDCl3, 8 sc, 
 5.6.2019
##JCAMPDX= 6.0         $$ Bruker NMR JCAMP-DX V2.0
##DATA TYPE= NMR FID
##DATA CLASS= NTUPLES
##ORIGIN= UXNMR, Bruker Analytische Messtechnik GmbH
##OWNER= root
$$ XWIN-NMR		Version 3.5
$$ Wed Jun  5 16:16:18 2019 Russian Standard Time (UT+4h)  she@DPX200
##.OBSERVE FREQUENCY= 200.13155
##.OBSERVE NUCLEUS= ^1H
##.DELAY= (6, 6)
##.ACQUISITION MODE= SIMULTANEOUS
##.ACQUISITION SCHEME= undefined
##.AVERAGES= 8
##.DIGITISER RES= 18
##SPECTROMETER/DATA SYSTEM= spect
##.PULSE SEQUENCE= zg30
##.SOLVENT NAME= CDCl3
##.SHIFT REFERENCE= (INTERNAL, CDCl3, 0, 15.7039)
##AUDIT TRAIL= $$ (NUMBER, WHEN, WHO, WHERE, WHAT)
$$ ##TITLE= Audit trail, XWIN-NMR		Version 3.5
$$ ##JCAMPDX= 5.01
$$ ##ORIGIN= Bruker BioSpin GmbH
$$ ##OWNER= she
$$ F:/spectra/data/she/nmr/H-F/1/audita.txt
$$ ##AUDIT TRAIL=  $$ (NUMBER, WHEN, WHO, WHERE, WHAT)
(   1,<2019-06-05 16:14:31.51 +0400>,<she>,<DPX200>,
      <created by zg, POWCHK disabled, PULCHK disabled
       configuration hash MD5:
       00 E9 B6 7A A2 85 ED C7 34 08 36 98 17 FE 4E 26
       data hash MD5: 16K
       A0 08 9D D7 AE 04 F1 1D 50 D3 E3 4A 77 C4 19 53>)
$$ ##END=
$$ 
$$ hash MD5
$$ 58 2E DE CE B4 08 D1 43 BF E7 D3 80 4B C7 22 D2
##$RELAX= 
##$RELAX= 
##$RELAX= 
##$RELAX= 
##$RELAX= 
##$RELAX= 
$$ Bruker specific parameters
$$ --------------------------
##$DU= <F:/spectra>
##$EXPNO= 1
##$NAME= <H-F>
##$PROCNO= 1
##$TYPE= <nmr>
##$USER= <she>
##$AMP= (0..31)
100 100 100 100 100 100 100 100 100 100 100 100 100 100 100 100 100 100 
100 100 100 100 100 100 100 100 100 100 100 100 100 100 
##$AQSEQ= 0
##$AQ_mod= 1
##$AUNM= <au_zg>
##$AUTOPOS= <>
##$BF1= 200.13
##$BF2= 200.13
##$BF3= 200.13
##$BF4= 200.13
##$BF5= 200.13
##$BF6= 200.13
##$BF7= 200.13
##$BF8= 200.13
##$BYTORDA= 1
##$CFDGTYP= 0
##$CFRGTYP= 5
##$CHEMSTR= <none>
##$CNST= (0..31)
1 1 145 1 1 1 1 1 1 1 1 1 1 1 1 1 1 1 1 1 1 1 1 1 1 1 1 1 1 1 1 1 
##$CPDPRG= <>
##$CPDPRG1= <>
##$CPDPRG2= <>
##$CPDPRG3= <>
##$CPDPRG4= <mlev>
##$CPDPRG5= <mlev>
##$CPDPRG6= <mlev>
##$CPDPRG7= <mlev>
##$CPDPRG8= <mlev>
##$CPDPRGB= <>
##$CPDPRGT= <>
##$D= (0..31)
0 1.2 0 0 0 0 0 0 0 0 0 0.03 0 0 0 0 0 0 0 0 0 0 0 0 0 0 0 0 0 0 0 0 
##$DATE= 1559736871
##$DBL= (0..7)
120 120 120 120 120 120 120 120 
##$DBP= (0..7)
150 150 150 150 150 150 150 150 
##$DBP07= 0
##$DBPNAM0= <>
##$DBPNAM1= <>
##$DBPNAM2= <>
##$DBPNAM3= <>
##$DBPNAM4= <>
##$DBPNAM5= <>
##$DBPNAM6= <>
##$DBPNAM7= <>
##$DBPOAL= (0..7)
0.5 0.5 0.5 0.5 0.5 0.5 0.5 0.5 
##$DBPOFFS= (0..7)
0 0 0 0 0 0 0 0 
##$DE= 6
##$DECBNUC= <off>
##$DECIM= 24
##$DECNUC= <off>
##$DECSTAT= 4
##$DIGMOD= 1
##$DIGTYP= 9
##$DL= (0..7)
0 120 120 120 120 120 120 120 
##$DP= (0..7)
150 150 150 150 150 150 150 150 
##$DP07= 0
##$DPNAME0= <>
##$DPNAME1= <>
##$DPNAME2= <>
##$DPNAME3= <>
##$DPNAME4= <>
##$DPNAME5= <>
##$DPNAME6= <>
##$DPNAME7= <>
##$DPOAL= (0..7)
0.5 0.5 0.5 0.5 0.5 0.5 0.5 0.5 
##$DPOFFS= (0..7)
0 0 0 0 0 0 0 0 
##$DQDMODE= 0
##$DR= 18
##$DS= 0
##$DSLIST= <SSSSSSSSSSSSSSS>
##$DSPFIRM= 0
$$ [...]
##$SUBNAM2= <"">
##$SUBNAM3= <"">
##$SUBNAM4= <"">
##$SUBNAM5= <"">
##$SUBNAM6= <"">
##$SUBNAM7= <"">
##$SUBNAM8= <"">
##$SUBNAM9= <"">
##$SW= 24.9336996594482
##$SWIBOX= (0..15)
0 0 2 0 0 0 0 0 0 0 0 0 0 0 0 0 
##$SW_h= 4990.01996007984
##$TD= 16384
##$TD0= 1
##$TE= 0
##$TE2= 300
##$TE3= 300
##$TEG= 300
##$TL= (0..7)
0 120 120 120 120 120 120 120 
##$TP= (0..7)
150 150 150 150 150 150 150 150 
##$TP07= 0
##$TPNAME0= <>
##$TPNAME1= <>
##$TPNAME2= <>
##$TPNAME3= <>
##$TPNAME4= <>
##$TPNAME5= <>
##$TPNAME6= <>
##$TPNAME7= <>
##$TPOAL= (0..7)
0.5 0.5 0.5 0.5 0.5 0.5 0.5 0.5 
##$TPOFFS= (0..7)
0 0 0 0 0 0 0 0 
##$TUNHIN= 0
##$TUNHOUT= 0
##$TUNXOUT= 0
##$USERA1= <user>
##$USERA2= <user>
##$USERA3= <user>
##$USERA4= <user>
##$USERA5= <user>
##$V9= 5
##$VALIST= <valist>
##$VCLIST= <CCCCCCCCCCCCCCC>
##$VD= 0
##$VDLIST= <DDDDDDDDDDDDDDD>
##$VPLIST= <PPPPPPPPPPPPPPP>
##$VTLIST= <TTTTTTTTTTTTTTT>
##$WBST= 1024
##$WBSW= 4
##$XGAIN= (0..3)
0 0 0 0 
##$XL= 0
##$YL= 0
##$YMAX_a= 251739
##$YMIN_a= -394194
##$ZGOPTNS= <>
##$ZL1= 120
##$ZL2= 120
##$ZL3= 120
##$ZL4= 120
##$ABSF1= 10
##$ABSF2= 0
##$ABSG= 5
##$ABSL= 3
##$ALPHA= 0
##$AQORDER= 0
##$ASSFAC= 0
##$ASSFACI= 0
##$ASSFACX= 0
##$ASSWID= 0
##$AUNMP= <proc_1d>
##$AZFE= 0.1
##$AZFW= 0.1
##$BCFW= 1
##$BC_mod= 2
##$BYTORDP= 1
##$COROFFS= 0
##$CY= 11.3945322036743
##$DATMOD= 1
##$DC= 2
##$DFILT= <>
##$DTYPP= 0
##$F1P= 18.9103706918063
##$F2P= -1.10871071338519
##$FCOR= 0.5
##$FTSIZE= 0
##$FT_mod= 4
##$GAMMA= 1
##$GB= 0.15
##$INTBC= 1
##$INTSCL= 1
##$ISEN= 128
##$LB= 0.24
##$LEV0= 0
##$LPBIN= 0
##$MAXI= 10000
##$MC2= 0
##$MEAN= 0
##$ME_mod= 0
##$MI= 1.114404
##$NCOEF= 0
##$NC_proc= 0
##$NLEV= 6
##$NOISF1= 3.799351
##$NOISF2= 2.8
##$NSP= 1
##$NTH_PI= 0
##$NZP= 0
##$OFFSET= 15.70392
##$PC= 1
##$PHC0= -8493.038
##$PHC1= 9.600198
##$PH_mod= 1
##$PKNL= yes
##$PPARMOD= 0
##$PSCAL= 0
##$PSIGN= 0
##$REVERSE= no
##$SF= 200.130013532006
##$SI= 16384
##$SIGF1= 3
##$SIGF2= 2
##$SINO= 400
##$SIOLD= 16384
##$SREGLST= <1H.CDCl3>
##$SSB= 0
##$STSI= 0
##$STSR= 0
##$SW_p= 3612.71676300578
##$SYMM= 0
##$S_DEV= 0
##$TDeff= 0
##$TDoff= 0
##$TI= <>
##$TILT= no
##$TM1= 0
##$TM2= 0
##$TOPLEV= 0
##$USERP1= <user>
##$USERP2= <user>
##$USERP3= <user>
##$USERP4= <user>
##$USERP5= <user>
##$WDW= 1
##$XDIM= 8192
##$YMAX_p= 0
##$YMIN_p= 0
$$ End of Bruker specific parameters
$$ ---------------------------------
##NTUPLES= NMR FID
##VAR_NAME=  TIME,          FID/REAL,        FID/IMAG
##SYMBOL=    X,             R,               I
##VAR_TYPE=  INDEPENDENT,   DEPENDENT,       DEPENDENT
##VAR_FORM=  AFFN,          ASDF,            ASDF
##VAR_DIM=   8192,          8192,            8192
##UNITS=     SECONDS,       ARBITRARY UNITS, ARBITRARY UNITS
##FACTOR=    0.0002004,     1,               1
##FIRST=     0,             0,               0
##LAST=      1.6414764,     0,               0
##MIN=       0,             -394194,         0
##MAX=       1.6414764,     251739,          0
$$ Real data points
##PAGE= N=1
##DATA TABLE= (X++(R..R)), XYDATA
$$ [...]
3525f710M533J0515j1350j965J1962p482p589J3075j691j1051J0348L696j3329
$$ -6710 -2177 8338 -3012 -4977 6985 -497 -8086 4989 3298 -7753 2595 6291 -7038
3538g038N374R529j2663L76J2493q535o842J3412l286j0760J1242K791j2541O647
$$ -7038 -1664 7865 -4798 -4422 8071 -464 -7306 6106 2820 -7940 3302 6093 -6448 199
3552A99P211j2536J158J1604r538m454J3466n038r323J1783K95j2880Q240O796
$$ 199 7410 -5126 -3968 7636 -1902 -6356 7110 2072 -7251 4532 4827 -8053 187 6983
3566F983j2712L351J0515j0532k898J2223o502q549J2333n87j1291R613M822j3239
$$ 6983 -5729 -2378 8137 -2395 -5293 6930 428 -8121 4212 3625 -7666 1947 6769 -6470
3580f470M577R496j2113j126J2562p459o364J2598k681j0680J0748K439j2704
$$ -6470 -1893 7603 -4510 -5636 6926 -533 -6897 5701 3020 -7660 3088 5527 -7177
3593g177O264Q205j2288J170J1708r217m672J1756m155r224J1324J625j2437Q112
$$ -7177 -913 7292 -4996 -3826 7882 -1335 -6007 5749 1594 -7630 3694 5319 -7118 994
3607I94O000j2144K057J0435r411l143J2493o229q367J1382n27j1171Q818N852
$$ 994 6994 -5150 -3093 7342 -2069 -5212 7281 1052 -7315 4067 3540 -7631 1187 7039
3621G039j2001L524Q762j1349j920J1585o489n853J2660j980j0770R182K788j3239
$$ 7039 -4962 -1438 7324 -4025 -5945 5640 -849 -6702 5958 3978 -6792 2390 5178 -8061
3635h061N862R089j0576N70J1078r293n537J1784l777q957J1451K193j1800O368
$$ -8061 -2199 6890 -3686 -3116 7962 -1331 -6868 4916 1139 -7818 3633 5826 -5974 394
3649C94O282j2176J428J0913q765l077J1961n296q939J0727K45j0900Q539O150
$$ 394 6676 -5500 -4072 6841 -1924 -5001 6960 1664 -7275 3452 3697 -7203 1336 7486
3663G486j1884K778Q660j0482k478J1916n554o386J2026j970j0906P801L675j2029
$$ 7486 -4398 -1620 7040 -3442 -5920 5996 442 -5944 6082 4112 -6794 1007 4682 -7347
3677g347N351R393j0310l73J0962q701o438J1808k586r075J0224K590j1400N419
$$ -7347 -1996 7397 -2913 -3286 7676 -1025 -7463 4345 1759 -7316 2908 5498 -5902 -483
3691d83O833j1383Q81J0976q426m045J1721m308r140J0506J317j1047P145N950
$$ -483 6350 -5033 -4152 6824 -1602 -5647 6074 1766 -7374 3132 4449 -6598 547 6497
3705F497j1373K218R415r634k690J1796n324p104J0966q00j0813P969M617j1578
$$ 6497 -4876 -2658 6757 -2877 -5567 6229 905 -6199 4767 3967 -6846 1123 5740 -5838
3719e838M004R095j0077j571J1393o628o914J1113j878r782Q956L706j0967M842
$$ -5838 -1834 7261 -2816 -4387 7006 378 -6536 4577 2699 -7083 1873 5579 -5388 -546
3733e46P563j0537j53J0290q265n071J1914k828q919R785J829j1719N924O086
$$ -546 7017 -3520 -3673 6617 -1648 -6719 5195 2367 -6552 3233 5062 -6657 -733 5353
3747E353j0427K155R748q254l657J0718m847q211J0771N32j0516P560N168j1156
$$ 5353 -5074 -2919 6829 -1425 -5082 5636 789 -7422 3349 3881 -6635 925 6093 -5063
3761e063K785Q871r704j678J1356n616o987J0584j806j0115Q751M165j0303M364
$$ -5063 -2278 6593 -3111 -4789 6567 951 -6036 4548 2742 -7373 1378 5543 -4760 -396
3775c96Q034j0524j181R841p124n143J1956k221r078R028J946j1478N047O559
$$ -396 7638 -2886 -4067 5774 -1350 -6493 5463 3242 -5836 3192 5138 -6340 -1293 5266
3789E266r576R84J0712q195l910J0424m729q175J0058J259j0000O945N265j1153
$$ 5266 -4310 -3326 7386 -809 -4719 5705 976 -7199 2859 4118 -5882 1063 6328 -4825
3803d825J716R047q437k483J1052n402o994J0219q57r922P615N020j0853L917
$$ -4825 -3109 5938 -2499 -4982 6070 668 -6326 3893 3036 -6886 729 5749 -5104 -1187
3817a187Q090j0221j515J0352o119n532J1259j836r357Q689K422j0860M463P351
$$ -1187 6903 -3318 -4833 5519 -600 -6132 5127 3291 -6066 2623 5045 -5815 -1352 5999
3831E999r891P61R949p408m861J0664l770p912R038J904j0058N959N708j0693
$$ 5999 -3892 -3131 6818 -590 -5451 5213 1443 -6469 2569 4473 -5585 374 6082 -4611
3845d611J759Q842p901l143J0974m703p281R471K7r877P032M812j0365K944Q242
$$ -4611 -2852 5990 -1911 -5054 5920 1217 -6064 3407 3434 -6443 589 5401 -4964 -2020 6222
3860F222r385j833J0595n816n669J0207j232r216P757L271j0528M181P718r483
$$ 6222 -3163 -4996 5599 -217 -5886 4321 3089 -6127 1630 4901 -5627 -1446 6272 -3211
3874c211m22J0037o865n129J0026k739q084R149J648r724N433N833r679O84R469
$$ -3211 -3633 6404 -461 -5590 4436 1697 -6387 2762 4410 -5314 119 5952 -3727 -3043 6426
3889F426p816l677J0376m015p193R099P54r966O674N297j0147K012Q417q500k420
$$ 6426 -1390 -5067 5309 1294 -5899 3200 3954 -6012 662 5959 -4188 -2176 6241 -2259 -4679
3904d679J0518n323o650J0033m58r338O912L844j0266L495Q027r328l63R398o457
$$ -4679 5839 516 -6134 3899 3441 -5897 1015 4859 -5407 -1912 6115 -3213 -3576 5822 -635
3919f35n286R843j737q615Q498K918j0626M844O484r364K35R131o794l918R879
$$ -635 -5921 3922 2185 -6430 2068 4986 -5640 -796 5688 -3676 -3441 5690 -1104 -5022 4857
3934D857l194p583Q697J142r464N619N956r838J596Q433q103k963J0274m387o876
$$ 4857 1663 -5920 2777 3919 -5545 74 6030 -3808 -2212 6221 -1882 -4845 5429 1042 -5834
3949e834R804j75r591O876M071j0040L414P771q653j339R520n969n287R405j456
$$ -5834 3970 3795 -5796 1080 5151 -4889 -1475 6296 -2357 -3696 5824 -145 -5432 3973 2517
3964B517q662P879L066j0177M422O716r393j15R236o533m219R466k298p906Q297
$$ 2517 -6145 1734 4800 -5377 -955 5761 -3632 -3747 5489 -1044 -5263 4203 1905 -6001 2296
3979B296K120j0054N087N995r587J303Q933p370l510R986m110o930Q958P65r119
$$ 2296 4416 -5638 -551 5444 -4143 -2840 6093 -1277 -4787 5199 1089 -5841 3117 3882 -5237
3994e237O069M688r885J951Q583q249k361R990n156n748R269o71r001O582L985
$$ -5237 832 5520 -4365 -2414 6169 -2080 -4441 5549 393 -5355 3914 3243 -5758 824 4809
4009D809r338L542P267q997p15R034o223m903R773j706q279Q008K016r649M587
$$ 4809 -4529 -987 6280 -2717 -3432 5602 -621 -5524 4249 2543 -5736 2272 4288 -5361 -774
4024g74N853q605P98Q643o730m076R458l432p335Q591J262r026O000N001r833
$$ -774 5079 -3526 -2728 5915 -815 -4891 4567 1135 -6200 2391 3653 -5373 627 5628 -4205
4039d205J572P813p277k149R551m193o540Q859n05q867O496M504r130K722P556
$$ -4205 -2633 5180 -2097 -4246 5305 1112 -5428 3431 2926 -5941 555 5059 -4071 -1349 6207
4054F207q453j437Q662n098n290R300j048q360P563K678r838L674O701q168n6
$$ 6207 -2246 -3683 4979 -119 -5409 3891 2843 -5517 2046 4724 -5114 -1440 5261 -2907 -2963
4069b963R037o713m103R106k740p712Q195J925r136M853N153q750R64Q262p206
$$ -2963 6074 -639 -4742 4364 1624 -6088 2107 4032 -5104 -251 4902 -3848 -2884 5378 -1828
4084a828k937R567m018o028Q338j33q613O231M404r430K622P538q027j659Q765
$$ -1828 -4765 4802 784 -5244 3094 2961 -5652 579 4983 -4447 -1825 5713 -2314 -3973 4792
4099D792m583n513R001j084q127O863L482r470L174O922q340q79R319n943m525
$$ 4792 209 -5304 3697 2613 -5514 1349 4831 -4639 -1465 5457 -2883 -3762 5557 -386 -4911
4114d911R162k027p756P613J981q750M303N883q933L31Q673p137l514R541l005
$$ -4911 4251 2224 -5532 2081 4062 -4688 -385 5498 -3435 -3104 5569 -1568 -5082 4459 1454
4129A454p150Q411J042q805N185M895r113J851Q002p491k487Q998m297n784Q419
$$ 1454 -5696 2715 3757 -5048 137 5032 -4081 -2230 5772 -1719 -4206 4792 495 -5289 3130
4144C130m76q261O517L969r253K978O982q517j046R131n166m954Q774j290p983
$$ 3130 2654 -5607 910 4879 -4374 -1396 5586 -2931 -3977 5154 -12 -4966 3808 2518 -5465
4159e465P034K609r031M184O120q497J68Q690o594l948Q651k521o518P526J649
$$ -5465 1569 4178 -4853 -669 5451 -3046 -2878 5812 -782 -4730 3921 1400 -5118 2408 4057
4174D057r150N285N273q801P93Q164o982k685Q910l769o295Q246l19p738N583
$$ 4057 -5093 192 5465 -3336 -2543 5621 -1361 -4046 4864 1095 -5200 3046 2727 -5011 572
4189E72M500r092K070O994p197j726Q586m592n432Q942j045p999O272L315q536
$$ 572 5072 -4020 -1950 5044 -2153 -3879 4707 115 -5317 3625 2580 -5419 853 4168 -4368
4204d368L261O112p971j00Q254n886l948Q640j923p426P483J935q770M530N572
$$ -4368 -1107 5005 -2966 -3066 5188 -698 -4646 3994 2071 -5355 2128 4063 -4707 -177 5395
4219E395q412K80P808o128l523Q861k938o363P643O22q291N465M626q960J990
$$ 5395 -3017 -2737 5071 -1057 -4580 4281 1343 -5020 2623 3245 -5046 419 5045 -3915 -1925
4234a925P533p637j806Q161l560n804Q259l98q174O178L384q347K847O268p744
$$ -1925 5608 -2029 -3835 4326 766 -5038 3221 2823 -5351 827 4211 -4136 -1289 4979 -2765
4249b765q47Q398n122m361Q260j581p511P297K370q959L677O188p910k31Q054
$$ -2765 -3612 4786 -336 -4697 3563 1982 -5529 1768 4138 -4821 -1144 5044 -2866 -3097 4957
4264D957n941l319Q308k341o775P309J118q291N118M787q351J293P404o763k746
$$ 4957 -984 -4303 4005 1664 -5111 2198 3316 -4975 143 4930 -3421 -2128 5276 -1487 -4233
4279d233Q939l682o089Q316k26q079N997L660q345K141O883p313j379Q176m787
$$ -4233 4706 1024 -5065 3251 3025 -5054 943 4603 -3742 -1601 5282 -2031 -3410 4766 -21
4294b1m582Q269j349p502O599K859q666L570O032p987l28Q094n584l991Q148j915
$$ -21 -4603 3666 2317 -5185 1414 4273 -4393 -823 5209 -2778 -3106 4988 -596 -4587 3561 1646
4310A646o847P303J423q114M217N227q456J213P414o245l230Q312k856o169P719
$$ 1646 -5201 2102 3525 -4589 -372 4855 -3601 -2388 5026 -1219 -4449 3863 1007 -5162 2557
4325B557N93q059N239M264q236J986O828o878j730Q663n088m915Q088o48p727
$$ 2557 3150 -4909 330 4594 -3642 -1656 5172 -1706 -3436 5227 139 -4776 3312 2664 -5063
4340e063O205L195q207K962O156p800o49P997n044m155Q077j466p504O864K138
$$ -5063 1142 4337 -3870 -908 5248 -2552 -3201 4796 -248 -4403 3674 2208 -5296 1568 3706
4355C706q155L922N470q149N21P473n774l284Q348k795o358P444M59p430M303
$$ 3706 -4449 -527 4943 -3206 -2685 4788 -986 -4270 4078 1283 -5075 2369 2828 -4602 -299
4370b99M767q209J486P331o952j782Q245m553n091Q052K9p890N704L281q208K841
$$ -299 4468 -3741 -2255 5076 -1876 -3658 4587 34 -5057 2995 3024 -4866 838 4119 -4089 -1248
4386a248O293o913j402P951m480m613P643r37o727O065K579p965L044N196p546
$$ -1248 5045 -1868 -3270 4681 201 -4412 3231 2294 -4433 1632 4211 -3754 -710 4486 -3060
4401c060N5P468m847l799Q242k190o704O612J459q014M527N023p977J136O721
$$ -3060 -3005 4463 -384 -4183 4059 1869 -4835 1777 3236 -4778 -251 4772 -3205 -2069 4652
4416D652o152k534P894k986n388O984R36q027M583L974p884K036O767o507j543
$$ 4652 -1500 -4034 3860 874 -4514 2470 3406 -4621 -38 3936 -3948 -1912 4855 -1652 -3195
4431c195P650m104n533P766m90o859O439L008q505K807N745p634j87P766m719
$$ -3195 4455 351 -5182 2584 2094 -4765 1674 4682 -3823 -1016 4729 -2905 -3092 4674 -45
4446d5l767P602k121o522O396J854p687M011N285p539J53P298o079k831P863k364
$$ -45 -3812 3790 1669 -4853 1543 3397 -4290 -279 5006 -2533 -2380 4918 -1161 -3992 3871 1507
4462A507n648O776L99p826M945M044p769J842O829o496k139P836l845n390P500
$$ 1507 -4141 2635 3034 -4792 153 4197 -3572 -1730 5099 -1397 -3536 4300 455 -4935 2565
4477B565L16p497N601L194q080K323O208p162p56P925m756m102P493j270o670
$$ 2565 2881 -4616 985 4179 -3901 -1578 4630 -2532 -3288 4637 -119 -4221 3272 2002 -4668
4492d668O027K270p613L027N727p614M84P169n747k988P863k490n869O657N94
$$ -4668 1359 3629 -3984 -957 4770 -2844 -2360 4809 -938 -3926 3937 1447 -4422 2235 2829
4507B829p015M299M098p314J110O737n796k565P494l031n462P085L04p316N039
$$ 2829 -4186 113 4211 -3103 -1993 4744 -1052 -3617 3877 846 -4616 2469 2773 -4543 496
4522D96L483p555K102N908o410j605P702l957m613P585q77o635N228K943p725
$$ 496 3979 -3576 -1474 4434 -1976 -3581 4121 164 -4449 3136 2259 -4376 852 3795 -3930
4537c930K487N850o691l65P185m846l459O900j959n871O273J817p125L759M565
$$ -3930 -1443 4407 -2284 -2649 4536 -310 -3769 3131 1172 -4699 1574 3391 -3734 25 4590
4552D590p435K44P054n482k503P490k425n460O177L48o885M216M304p126J433
$$ 4590 -2845 -2601 4453 -1029 -3532 3958 1533 -3927 2250 2598 -4287 -71 4233 -2893 -1460
4567a460O348o636j770P412l266n340P654m38o737M927K514p225K725N547o392
$$ -1460 4888 -1748 -3518 3894 628 -4712 2942 2504 -4233 694 3208 -4017 -1292 4255 -2137
4582b137n00P135m325m151O749j539o041O125K456p466L097M922o920j83O485
$$ -2137 -2637 4498 173 -3978 2771 1232 -4809 1316 3772 -3694 -597 4325 -2595 -2778 3707
4597C707m770k511O920j942n791O486R03p156L708M639p051R45O298n486k599
$$ 3707 -1063 -3574 3346 1404 -4387 2099 3002 -4154 -446 4193 -2858 -1913 4385 -1101 -3700
4612c700P316l021m650O610J80o764M943L366p126J347N925n886j250O814l895
$$ -3700 3616 595 -4055 2555 2735 -4029 914 4280 -2846 -1499 4426 -1460 -2710 4104 209
4627B09m145O533o28o342N694K411p208K707N017o633l85O681m142l098O556j823
$$ 209 -3936 2597 1969 -4373 1321 3732 -3476 -769 4248 -2385 -2770 3911 -231 -3329 3227 1404
4643A404n744N841J642o910L315M232o597N60O610n176k617P016k693m917O064
$$ 1404 -4340 1501 3143 -3767 -452 3780 -2817 -2257 4353 -823 -3440 3576 883 -4034 2030
4658B030M24o363M158L644p053J799N326n567j435O759l149m858O838l69o061
$$ 2030 2454 -3909 249 3893 -3160 -1361 3965 -1602 -3037 3722 573 -4285 2553 2184 -3877
4673c877M717K763o634K121M971n734j285O983l988l461O268j164n954N680J872
$$ -3877 840 3603 -3031 -910 4061 -1673 -2958 4025 37 -3424 2844 1680 -4274 1406 3278
4688C278o837L128M608o446Q2O311m972k660O940k124n370N691R62o326L901L459
$$ 3278 -3559 -431 4177 -2269 -2187 4124 -848 -3508 3432 1308 -4062 1629 2591 -3735 166 3625
4704C625o229O91N953n007k683P225l228m574O237M26o467M638K801o385J677
$$ 3625 -2604 -1913 4040 -967 -3650 3575 347 -4227 2010 2436 -4031 607 3408 -2977 -1300
4719a300N019n197j217O046k767m400O562r00n867M858K386o644K756M638n959
$$ -1300 3719 -1478 -2695 3351 584 -3816 2746 1846 -4021 837 3223 -3421 -665 3973 -1986
4734a986l12O227m209l372O714j849n044N122J851o715L427M023o253L72N930
$$ -1986 -2298 3929 -280 -3652 3062 1213 -3831 1291 3142 -3573 -146 3877 -2376 -2004 3926
4749C926m801k660O626k023m865N768K79o069L976L578o443Q88N378n375j573
$$ 3926 -875 -3535 3091 1068 -3797 1971 2250 -3819 157 3735 -2708 -1820 3558 -1817 -3390
4764c390O531l096l629N734L9n783M606K305o578K189M641n167r51O593m193l491
$$ -3390 3141 45 -3584 2150 2189 -3594 1012 3317 -3261 -1072 3569 -1598 -2549 4044 -149 -3640
4780c640O375j054n839N202K195o075K529L836n665R3N862m258k819O578j904
$$ -3640 2735 1681 -4158 1044 3239 -2836 -307 3529 -2136 -2043 3819 -439 -3258 3320 1416
4795A416n058N787N06o224L656L511n939P68N848n467k046O050k451l928N875
$$ 1416 -3642 2145 2651 -3573 83 3594 -2345 -1577 4271 -1196 -3242 2808 357 -3571 2304
4810B304J3n747L957K674o415J543N202m833j109O109l504l543N630j012n139
$$ 2304 2317 -3430 527 3201 -3214 -1671 3531 -1302 -2411 3698 194 -3349 2281 1269 -3870
4825c870M464K616n880K066M438o045J1N399m084k249O183j608n026M709J306
$$ -3870 594 3210 -2670 -604 3834 -2211 -2200 3199 -885 -3134 3049 1441 -3585 1124 2430
4840B430n975L121M217n687M45N546m769k217N959k322m224N545L72n434L427
$$ 2430 -3545 -424 3793 -1894 -1449 4097 -672 -2889 3070 748 -3476 2069 2441 -2993 434
4855D34L166o546J314N463n205r48N726l036l721N399m57n255M418K577o089J870
$$ 434 3600 -2946 -1632 3831 -1374 -2322 3404 368 -3353 2046 1589 -3666 752 3329 -2760 -890
4871h90M258m978p65N642l566k977N817q96n017M456J665o037K784L541n125J02
$$ -890 3368 -1610 -2375 3267 -299 -3276 2541 1645 -3372 1084 2749 -3288 -504 3037 -2088 -1986
4887a986N474m017k388N520j670m571N116J093n628L253L290n706O93M728m097
$$ -1986 3488 -529 -2917 2603 933 -3638 1478 2571 -3057 196 3486 -2220 -1527 3201 -896
4902h96j717N825k323l748N044jn536L807K580n736K144M051m775r37N294l113
$$ -896 -2613 3212 889 -2859 2185 2184 -3352 455 3035 -2701 -557 3494 -1281 -2218 3076 -37
4918c7l380N711q30m951M395J825n530J735M164n078k19N516l422k828N490j591
$$ -37 -3417 2294 1464 -3487 908 2733 -2797 -1062 3102 -1976 -2195 3321 -101 -2929 2561 970
4934I70m532M231J570m942K395L719n454L58M519m068j529N709k188m038N480
$$ 970 -3562 669 2239 -2703 -308 3411 -2043 -1685 2834 -1234 -2763 2946 758 -3280 2200
4949B200M0n547L588K709n335J211M477m234j343N188k883l462N286j98m640M049
$$ 2200 2240 -3307 281 2990 -2345 -1134 3343 -891 -2234 2954 71 -3391 1895 1697 -2943 1106
4965A106K048n853J855M163m928n90N767l510k770N273j633m374M393J186m708
$$ 1106 3154 -2699 -844 3319 -1609 -2199 3568 58 -2712 2561 928 -3446 947 2133 -2575
4980b575K545K971m790qM948l938k256N617j816l703M413P52n358L283K544m950
$$ -2575 -30 2941 -1849 -1857 3091 -847 -3103 2514 698 -3005 1408 2160 -3198 85 2629 -2321
4996b321Q98M754m425j265M970k342l154M394K74m833L668K120m833J351L752
$$ -2321 -1423 3331 -1094 -2359 2611 269 -2885 1509 1783 -3050 618 2738 -2095 -744 3008
5011C008m353p04N119l017k799N040j003m501L921J654n084J874M276n114K0M888
$$ 3008 -1345 -2049 3070 53 -2746 2294 1291 -3210 711 2365 -2719 -845 3431 -1683 -1663 3225
5027C225l716k314N088j388l868M464L93m681K318L046m586M18M687l805j859
$$ 3225 -491 -2805 2283 895 -2973 1491 1884 -2797 -479 2567 -2019 -1601 3086 -719 -2578
5042b578N123k016l656M592J32m432L483K006m816J061M018l920j029M622k140
$$ -2578 2545 529 -3127 1465 1597 -2835 648 2654 -2162 -1101 2917 -1003 -2032 2590 450
5057D50l240M466n59m373M027J441m921K277L351m092p55M887l412k121M815j007
$$ 450 -2790 1676 1117 -3256 771 2212 -2709 -432 2919 -1173 -1928 2959 -453 -2574 2241 1234
5073A234m111M171P79m835K651K812m512L57M410l718j496N036j948l753M502
$$ 1234 -2877 1294 2073 -2762 -111 2701 -1811 -1454 2956 -762 -2258 2778 830 -2923 1579
5088A579N08m858L227K263m782J024L910l898j301M826k201l342M687k93m259
$$ 1579 2087 -2771 456 2719 -2063 -1039 2871 -1027 -2328 2498 297 -3045 1642 1349 -2910
5103b910L859J439m849J701L601m013o64M666k889k504M680p74m037L785J322
$$ -2910 949 2388 -2461 -760 2841 -1172 -1836 2830 -59 -2563 2117 1343 -2694 1091 2413
5118B413m834K160L242m724L38M292k895k437M502j271l635M173N91m207K526
$$ 2413 -2421 -261 2981 -1743 -1405 2887 -8 -2445 2057 786 -2849 1324 1915 -2292 234
5133B34K584m818P57M078l789j050M653k104l127M041K3m476L210K324m694J354
$$ 234 2818 -2000 -1243 2835 -954 -2004 2649 545 -2582 1459 1482 -2994 216 2540 -2154 -800
5149h00L539l634j342M575k349k459M354p44l709L597J079m475J568L524m312
$$ -800 2739 -895 -2237 2338 -11 -2470 1884 1140 -2569 1028 2107 -2368 -800 2724 -1588
5164a588k69M494k909k157M507j361l078L260J101m251K243K773m344M0M197l180
$$ -1588 -1857 2637 -272 -2429 2078 717 -2361 899 2000 -2251 -8 2765 -1579 -1539 2658 -522
5180e22j533M273j306l299L947K66m459L108J639m149J208L816l938j208M652
$$ -522 -2055 2218 912 -2387 1560 1826 -2633 475 2114 -2035 -827 2989 -949 -2157 2495
5195B495k464k553M014j51l981L067J626m362J672L242l759n93M672l171k073
$$ 2495 31 -2522 1492 1341 -2640 427 2053 -2309 -637 2605 -1154 -1747 2925 -246 -2319
5210b319M075r01l563L527Q76m097K087K954m078P0L827l016j773M299j111l503
$$ -2319 1756 855 -2708 819 1695 -2402 -315 2639 -1439 -1369 2458 -558 -2331 1968 857 -2646
5226b646L721M97l981K356K638m311P96L739l507j358M320j907k544L903k50m185
$$ -2646 1075 1572 -2409 -53 2585 -1726 -930 2809 -698 -2056 2264 357 -2187 1716 1466 -2719
5242b719K880K400m667J601L057l615o51M352k723k240M188p94l388L357J097
$$ -2719 161 2561 -2106 -505 2552 -1063 -1714 2638 -85 -2325 1863 1069 -2319 1038 2135
5257B135m358J740L062m274J36L860k559k299L981p42l122L340Q25m029K399K246
$$ 2135 -2223 -483 2579 -1695 -1559 2301 -258 -2557 1424 682 -2440 900 1725 -2304 95 2341
5273B341m415P36L765l051j294M078j855k714L658J30l887K769K363m248P82L428
$$ 2341 -2074 -1338 2427 -624 -1918 2160 305 -2409 1249 1379 -2508 261 2624 -1624 -842 2586
5289B586l611q71M292k296k098L508j38l763L013J391l893J442L226l943k24L500
$$ 2586 -1025 -1896 2396 100 -1998 1510 1372 -2391 622 2013 -1880 -438 2788 -1155 -1379 2121
5305B121k327k074L609l83l555L462R24l909J862K824l950J4L820k958j568L996
$$ 2121 -206 -2280 1329 946 -2609 853 1777 -2132 -270 2554 -1396 -1382 2438 -520 -2088 1908
5321A908j566k798L304N97l546K417J946l929M51L376l136j057M409k153k356
$$ 1908 342 -2456 848 1445 -2101 316 2262 -1667 -1216 2160 -976 -2033 2376 223 -2133
5336b133L631n08l426L150J225l934J535K787l204r44M071k198k017M034j169
$$ -2133 1498 990 -2436 714 1939 -1995 -460 2327 -877 -1821 2250 52 -1965 2069 900
5351I00l246L456R02l923J647K604l566j8L607k481j695L955j463l227L628O27
$$ 900 -2346 1110 2012 -1911 -264 2340 -1226 -1244 2363 -118 -1813 2142 679 -2548 1080 1707
5367A707l965K462K203m114N93L581l157j169L846j783k503L599k95l423K674
$$ 1707 -2258 204 2407 -1707 -1114 2467 -690 -1859 1987 204 -2299 1300 1005 -2418 256
5382B56J697l580O10L285l396o51L934j827k449L718m73l448K924J290l775J365
$$ 256 1953 -1627 -1017 2268 -1128 -1779 2155 328 -2121 1597 1124 -2324 600 1890 -1885 -520
5398e20K841l546j06L745k342k441L874k32l308L327M36l964K185K355l788M32
$$ -520 2321 -1225 -1331 2414 72 -2369 1505 1273 -2035 1292 1728 -2236 -51 2304 -1484 -1052
5414a052L647l059j397L990j403l043L606L36l921K154K430l959P64K806k539
$$ -1052 2595 -464 -1861 2129 726 -2317 1289 1625 -2296 -142 2288 -1671 -907 1899 -640
5429f40j176M105k215k216L457O5l565K642J066l543J637K606l384l75L686k352
$$ -640 -1816 2289 74 -2142 1315 1380 -2185 457 1523 -2020 -383 2223 -1161 -1536 2150 -202
5445b02j926L715r19l020L038J189m021J800K740l623J7L323k365j472L430j294
$$ -202 -2128 1587 668 -2352 686 1875 -2146 -346 2394 -1229 -1212 2111 -254 -1726 1704 410
5461D10k585L333L25l575K158K020l812R92K832k798o84L228j590k140K844Q5
$$ 410 -2175 1158 1483 -2092 66 2086 -1726 -734 2098 -700 -1384 1844 254 -1886 958 1043
5477A043l234K861J225l681J024L062l254p34L571j948k196M052j059l115K826
$$ 1043 -2191 670 1895 -1786 -762 2300 -954 -1688 1883 -65 -2261 1791 732 -2383 443
5492D43J274l638J546K488l390k44L686k611j502L606j091k917L389N39l675K089
$$ 443 1717 -1921 -375 2113 -1277 -1521 2165 -446 -1948 1658 567 -2350 1039 1578 -2097 -8
5508hJ978l559N39L353k815j280L855j619k613L182M03l358K455J478l446O04
$$ -8 1970 -1589 -1050 2303 -512 -1792 2063 444 -2169 1013 1416 -1942 513 1991 -1455 -851
5524h51K980k890r55L781j964k362L924n29l075K879P06l335J147K500l432K25
$$ -851 2129 -761 -1716 2065 101 -2261 1663 1134 -1941 938 1644 -1691 -544 1956 -1476 -1251
5540a251L432k480j745M020j116k743K684P88l615J911K151l460K90L017k378
$$ -1251 2181 -299 -2044 1976 860 -1883 801 1589 -2026 -115 2036 -1424 -1134 1883 -495
5555d95j264L401j083k755K986M85k891J857J815l439N67L122l129r15L652j641
$$ -495 -1759 1642 559 -2196 790 1275 -1616 241 2056 -1383 -816 2306 -823 -1738 1914 273
5571B73k113K954K30l599K461K098m194J081K796l068l16L436j897k093L525o93
$$ 273 -1840 1114 1344 -2255 206 2304 -1890 -809 1987 -1081 -1397 2039 142 -1951 1574 881
5587H81k787K558Q00l325J631K117l163J33L452k631j334K985p38k611L028L08
$$ 881 -1906 652 1452 -1873 -242 1875 -1288 -1155 2297 -334 -1668 1317 579 -2032 996 1304
5603A304l452K074J834l488O50L011k579p17L207j303k952L680L9l353K385J523
$$ 1304 -2148 -74 1760 -1728 -1078 1933 -646 -1363 1844 541 -2411 1269 1308 -2045 340 1863
5619A863l473J249K521l330m80L302j215k450L448l83l157K969Q21l683J657K496
$$ 1863 -1610 -361 2160 -1170 -1650 1652 437 -2013 1435 1052 -2105 864 1685 -1998 -341 2155
5635B155l291J49K866k304j325L137q38k614L064N65l449J806K207l439K22L383
$$ 2155 -1136 -987 1879 -425 -1750 1387 549 -2065 999 1564 -1885 -79 2128 -1311 -1089 2294
5651B294k678j046L160j402k527L335K30l586K707J555l551O91K789l465j96L699
$$ 2294 -384 -1430 1730 328 -2199 1136 1366 -2220 487 2042 -1509 -818 1971 -1494 -1690 2009
5667B009j902j886L088l46k826K377J108l533J604K360l115j60L179k112j820
$$ 2009 107 -1779 1309 963 -1863 514 1622 -1911 -307 2053 -1062 -1222 1957 -155 -1975
5682a975L650r70k475K337J189l570J639K291l367N21K724k519j260L214p39k611
$$ -1975 1675 705 -1770 567 1756 -1814 -175 2116 -1251 -730 1994 -525 -1785 1429 690 -1921
5698a921L083k44k908K062J538l127P33L018l084o03L510j907k053L130j40k883
$$ -1921 1162 918 -1990 72 1610 -1517 -784 2234 -850 -1453 2057 150 -1903 1227 1087 -1796
5714a796K380J006l317J201K576l016l22L124j829j845L429r08l189L296O44l391
$$ -1796 584 1590 -1727 -526 2050 -966 -1288 1836 7 -1838 1591 683 -2506 790 1434 -1957
5730a957J838J827k922j20L193k203j467L495j196k463K890K42l129K276J697
$$ -1957 -119 1708 -1214 -1334 1859 -344 -1811 1684 488 -1975 915 1157 -1972 304 2001
5745B001l279L67K944k469j018L157j663j819K732N40l023J849J311l441R37K801
$$ 2001 -1278 -911 2033 -436 -1454 1703 40 -1779 953 1493 -1530 319 1630 -1811 -874 1927
5761A927l075j76L161j546k050L001n10k642K616M37k896J332K518l302l9L160
$$ 1927 -1148 -1324 1837 291 -1759 1242 732 -1910 706 1143 -1753 -421 2097 -1205 -1244 1916
5777A916k122j569L246p84k497K565O34l241J483K639l402K62K701k258r67K884
$$ 1916 -206 -1775 1471 687 -1810 755 1389 -1852 -369 2270 -1132 -870 1831 -427 -1394 1490
5793A490j172k224K953K23l106K296J548l618O51K959k745n14L125j683j839K896
$$ 1490 318 -1906 1047 1270 -1836 460 2008 -1610 -959 2000 -745 -1259 1866 183 -1656 1240
5809A240l02k806K168J329l175J192K288k974j5K925j767j959L374j003k387K492
$$ 1240 938 -1868 300 1629 -1546 -354 1934 -1040 -1055 1870 103 -1856 1518 515 -1872 620
5825F20P79l194J698J844k817P0K749k533q27L359j133k552K835L55l302K342
$$ 620 1399 -1795 -97 1747 -1070 -1000 1749 -784 -1611 1748 615 -1937 898 1253 -2049 293
5841B93J453l050P10K573k623j071L733j876j900K686K73l152K380J447l499J064
$$ 293 1746 -1304 -594 1979 -644 -1715 2018 142 -1758 928 1201 -1951 429 1876 -1623 -559
5857e59K567k747o01L219k113j483K831m63k482K433Q92l247J336K531l119k72
$$ -559 2008 -739 -1340 1879 -234 -1717 1114 651 -1831 602 1494 -1753 -417 2114 -1005 -1277
5873a277L251k262j426L283q26k677K618O89l170K003J553l020M09K456k227r28
$$ -1277 1974 -288 -1714 1569 743 -1934 684 1373 -1797 206 1759 -1261 -852 1604 -623 -1551
5889a551L077j212k197K817k1k955K144J389l202R81K744l159j35L206j748k062
$$ -1551 1526 314 -1883 934 913 -2042 102 1491 -1711 -730 2014 -1145 -1280 1926 178 -1884
5905a884L164l65k802K639N94k819J145K276k769k30K824k010j330L142r08k539
$$ -1884 1280 915 -1887 752 1346 -1473 -328 1948 -821 -1051 1773 -237 -1567 1575 667 -1872
5921a872K750M84l172J740J853k879o7K979k590r95L377j363k293K794M12l070
$$ -1872 878 1362 -1810 -70 1783 -1096 -1163 1816 -774 -1769 1608 245 -2048 746 1158 -1912
5937a912K344J312l224Q13K702k953o45L047j292k173L031n17k367K094J392l140
$$ -1912 432 1744 -1480 -667 2035 -918 -1563 1484 192 -1981 1050 533 -1834 260 1652 -1488
5953a488J029K228k781j37K713j886j476K997m84k686K589R29l136J556K063l255
$$ -1488 -459 1769 -1012 -1149 1564 -322 -1798 1199 715 -1971 618 1547 -1589 -33 2030 -1225
5969a225q5L048k258q41K923j105k521L018M08l209J534J817l028Q28K316k215
$$ -1225 -1310 1738 -520 -1361 1562 457 -2064 954 1362 -1847 -313 1504 -1524 -696 1620 -595
5985e95j003L355j572j947K851j29k888K270J284l188Q22K436k611m80K911j519
$$ -595 -1598 1757 185 -1762 1089 960 -1928 342 1626 -1562 -740 1696 -915 -1395 1516 -3
6001cj759K934k56k609K398N32k791J562J786l053L99K773k383j009L033j111
$$ -3 -1762 1172 916 -1693 705 1237 -1554 8 1794 -1259 -860 1913 -470 -1479 1554 443
6017D43k287K817K49k888J832J277k717O08K447j951j335K872j213j703K274K15
$$ 443 -1844 973 1222 -1666 166 1443 -1274 -666 1781 -170 -1505 1367 154 -1549 725 940
6033I40k528K185R35l020R16K096k394l41K853j490j556K528n96k457K411J252
$$ 940 -1588 597 1532 -1488 -572 1524 -870 -1211 1642 152 -1404 1124 528 -1929 482 1734
6049A734l450J587K090l174L6K975k100j093K499n94k118K512L19k780J153J888
$$ 1734 -1716 -129 1961 -1213 -1177 1798 -302 -1395 1104 510 -1608 904 1223 -1557 -404 1484
6065A484k678j9L310k523r11L308j568k161K783k38k391J765J683k859K90K293
$$ 1484 -1194 -1213 2097 -426 -1337 1971 403 -1758 1025 787 -1604 161 1844 -1015 -725 1568
6081A568k386m28L240k033j414K538r5k748K096J038k805J002J972k275n37K828
$$ 1568 -818 -1246 1994 -39 -1453 1085 990 -1758 338 1376 -1429 -427 1545 -730 -1267 1561
6097A561j732j330K524o7k869K520P38l252J766J838k741K62K478k063j089K673
$$ 1561 -171 -1501 1023 956 -1913 607 1345 -1907 -141 1697 -1044 -782 1696 -367 -1456 1217
6113A217q82j933K618J1k671J845J387l181Q53K491k544n72K985j289j975K686
$$ 1217 335 -1598 1020 1031 -1640 205 1592 -1589 -736 1755 -789 -1361 1624 335 -1640 1046
6129A046Qk420J844Q80k658R21K066k431l14K873j933j555K811j58k764K395R78
$$ 1046 1054 -1366 478 1358 -1300 -379 1687 -744 -1058 1815 -118 -1673 1138 980 -1784 611 1589
6146A589l013J263J900k537o7K847k174j408K829m28k524K307M66k996K039J551
$$ 1589 -1424 -161 1739 -798 -865 1982 -192 -1600 1229 801 -1723 584 1050 -1946 93 1644
6162A644k717K46K310k492m49K756j071k056K821j91k174J533J124k667R22K469
$$ 1644 -1073 -827 1483 -1009 -1458 1298 227 -1829 992 801 -1373 160 1284 -1383 -461 2008
6178B008k746o98L323j889j575K887p93k110K271M74k615J013K260k711n3K463
$$ 2008 -738 -1436 1887 -2 -1577 1310 517 -1593 678 1152 -1463 -450 1810 -901 -954 1509
6194A509j955r90L120j060k041K366M74k956J870O80j872q9K434k027r08K860
$$ 1509 -446 -1436 1684 624 -1417 949 1423 -1533 337 1017 -855 -944 1490 -537 -1445 1415
6210A415j379j854K874j71k355J723J290k888O77K528k985k00K596j304j833K956
$$ 1415 36 -1818 1056 885 -1470 253 1543 -1345 -668 1860 -1125 -1325 1271 -33 -1866 1090
6226A090m90k230K043R39k686Q38K202k684M6K404j683j423L032q95k027J907
$$ 1090 600 -1630 413 1352 -1334 -496 1706 -978 -932 1472 -211 -1634 1398 503 -1524 383
6242C83O80k638J198K147k899L60K388k068q08K553p16k209K100Q17l024J718
$$ 383 1063 -1575 -377 1770 -1129 -769 1619 -449 -1257 1296 580 -1629 471 1288 -1736 -18
6258a8J597k922P15K090j926n31K621j431j670K353L4k610K128P88k523R89K170
$$ -18 1579 -1343 -628 1462 -464 -995 1626 195 -1475 878 912 -1698 430 1218 -1305 -316 1854
6275A854k905K1K644j804j447K581n6k387J976P45k812J588J580k465J45K285
$$ 1854 -1051 -1030 1614 -190 -1637 944 888 -1499 477 1222 -1590 -2 1578 -887 -742 1543
6291A543j870q82K417o71k019K422j6k239J431J515k848R59J716k225O4K087j240
$$ 1543 -327 -1209 1208 537 -1482 940 924 -1315 116 1631 -1217 -258 1458 -767 -703 1384 144
6308A44j588K126o2j751J402J260l007J217J795k277j51K158j201j377K424j92
$$ 144 -1444 682 620 -1131 271 1531 -1476 -259 1536 -741 -892 1266 65 -1312 1112 920
6324I20k443K418K03k763J112K014k273k5K287j696j001K620p63k147K335J14
$$ 920 -1523 895 1098 -1665 -553 1461 -812 -837 1450 -246 -1247 1373 610 -1537 798 912
6340I12k461J699J268k398L73K046j830r35K639q06k127K320M98k604J661R87
$$ 912 -1549 150 1418 -980 -607 1439 -391 -1326 1313 507 -1620 700 1198 -1406 255 1242
6356A242k114L18K084j991q15K527j041j410K305l72j887J577R35k687J084K040
$$ 1242 -872 -554 1530 -461 -1276 1251 210 -1200 1105 733 -1154 423 1358 -1329 -245 1795
6372A795k508j79K542j664j505K521n07k034K046N40k449J410J281k370M13K108
$$ 1795 -713 -892 1650 -14 -1519 1002 495 -1539 507 1047 -1402 8 1289 -1081 -668 1440
6388A440j818q70K433q59j911K269Q9k306J621J217k494P45K003k260j67J933
$$ 1440 -378 -1248 1185 326 -1585 684 773 -1533 88 1305 -1189 -444 1559 -701 -868 1065
6404A065q67j865K404Q3k015J603O89k534J219J614k172QK287j318j634K607p90
$$ 1065 198 -1667 737 820 -1195 408 1097 -1437 -218 1396 -776 -768 1519 201 -1433 1174 384
6421C84j727J980N71k300R86J514k236K41J912j691p13K463j110j495K027J29
$$ 384 -1343 637 1208 -1092 -106 1408 -828 -587 1325 -366 -1079 1384 274 -1221 806 935
6437I35k515J506J428k440O39J946k249k09K251j170j638K350J18k148J494Q45
$$ 935 -1580 -74 1354 -1086 -447 1499 -750 -959 1292 122 -1516 834 952 -1196 298 1143
6453A143k352J040J728k480J18K409j523j205K239r41j734K060P30k405J183J358
$$ 1143 -1209 -169 1559 -921 -803 1606 83 -1122 1117 176 -1558 502 1232 -1173 10 1368
6469A368k243K71J983j376j266K588r16j832K206L15k368J228J348k156K67J840
$$ 1368 -875 -604 1379 3 -1263 1325 409 -1423 783 1098 -1270 -42 1306 -850 -583 1257
6485A257j864m86K347r80j701K299jk654J942J074k269N49J752j885l24K275j104
$$ 1257 -607 -1093 1254 274 -1427 872 871 -1783 159 1233 -1036 -487 1265 -620 -944 1331 227
6502B27j580K307m20j822J623Q57k394J180J506k412L09J931j704n61K098o87
$$ 227 -1353 954 534 -1288 335 1192 -1202 -22 1484 -928 -619 1312 -392 -953 1145 458
6518D58j929K072L36k059Q85J495j984L56J906j866l81K082r06k188K462J52k111
$$ 458 -1471 601 937 -1122 -237 1258 -726 -370 1536 -330 -711 1371 465 -1723 739 891 -1220
6535a220J313J195k248O20J666k063k23K150j512q77K012o1j911J403J009k397
$$ -1220 93 1288 -960 -340 1326 -737 -960 1190 -322 -1199 813 752 -1159 244 1253 -1144
6551a144R03J616k180mJ900j446p88J829m84j471J701N75k379J417J239k056J07
$$ -1144 -241 1375 -805 -809 1091 -355 -1143 686 202 -1269 432 1007 -1372 45 1284 -772 -665
6568f65K116j776p32K115p43j451J637M25k528K104Q96k401N17J799j773m01J931
$$ -665 1451 -325 -1057 1058 315 -1136 501 926 -1602 502 1398 -1003 -486 1313 -460 -861 1070
6585A070r97j121K083l60k018J696O75j911O41J538j828l07K057j696n85K251
$$ 1070 73 -1048 1035 675 -1343 353 1028 -883 -242 1296 -532 -839 1218 -478 -1063 1188
6601A188r99j482J901L80k293J264J401k338K91K086j428j154K240p59j731K130
$$ 1188 189 -1293 608 988 -1305 -41 1360 -978 -687 1399 -29 -1183 1057 298 -1433 697
6617F97J96k221J534Q98k099M39K010k023o81K481j159j347K107k15j664J410
$$ 697 893 -1328 206 1104 -995 -556 1454 -569 -1250 1231 72 -1275 832 617 -1047 363
6633C63Q13k003P52J153j712j33K151j445j050K041m68j721J309Q85j745R36J085
$$ 363 1176 -827 -75 1078 -634 -767 1384 -61 -1111 930 462 -1259 50 935 -810 126 1211
6650A211k020J48J945j765m18K052q64j558J834L08j973J050Q92j883K79J767
$$ 1211 -809 -661 1284 -481 -899 1153 289 -1269 565 873 -1100 -50 842 -1041 -762 1005
6666A005j430n14J911q56j205J792J30k050J575P71k036L99J964k064k81J890
$$ 1005 -425 -939 972 116 -1089 703 833 -1217 358 1129 -907 -508 1456 -608 -889 1001
6682A001j012j387K347n90j608J669N39j975P54J302j807J71J489r04j101K255
$$ 1001 -11 -1398 949 359 -1249 420 959 -1016 -262 1040 -767 -596 893 -11 -1112 1143
6698A143o29j677J801K58j635Q58J219k098L18J667j547r24K155n64j499J829
$$ 1143 514 -1163 638 896 -739 119 1338 -760 -442 1225 -322 -1246 909 345 -1154 675
6714F75J30j832J106R12k074M89J812j928j90J742o46j444J878l32j687J698N10
$$ 675 805 -1027 79 991 -1083 -594 1218 -710 -900 842 196 -1248 630 298 -1389 309 819
6731H19k088J122J555k359R3J833j265n80J785p80j397J613M33j719P44J192j784
$$ 819 -1269 -147 1408 -951 -858 975 -290 -870 915 135 -1262 351 784 -935 -191 1001 -783
6748g83M75J571j612o45K091r33j451J923j39j529J199J274k112J88J329r85p53
$$ -783 -308 1263 -349 -994 1097 164 -1287 636 497 -1032 167 1441 -671 -483 846 -139 -892
6765h92J797n96j700K253k57j658J502J089k559P31J441j695o12K175j106j121
$$ -892 905 309 -1391 862 605 -1053 449 1538 -1021 -290 1151 -544 -1156 1019 -87 -1208
6781a208K296m33j748J500N28j824O67J478j919N6J713j359n38J473k98j605J747
$$ -1208 1088 655 -1093 407 935 -889 -222 1256 -663 -607 1106 -253 -791 682 384 -1221 526
6798E26L41j843J104J134k269L32J852j556p11K512j320j222J730J50j825J401
$$ 526 867 -976 128 1262 -1007 -675 1177 -379 -1090 1422 102 -1120 610 760 -1065 336
6814C36L04j531N52J525j435m91J696r28j049K122l58k030J302P89j662Q47R60
$$ 336 640 -891 -339 1186 -249 -740 956 28 -1021 1101 743 -1287 15 804 -858 -11 949
6831I49j707K13J536j403o44J833l41j520J372N71j649P28J540k183N1K087j792
$$ 949 -758 -545 991 -412 -1056 777 436 -1084 288 859 -790 -62 1478 -705 -654 1433 -359
6848c59p20J864n64j559J744K67j583J012Q80j925N43J688j693j13J577p30j389
$$ -359 -1079 785 221 -1338 406 673 -910 102 982 -943 -400 1288 -405 -518 1059 329 -1060
6865a060J618J8j806J872O0j767O38J308j536J45J782j426m33J465m62j595J722
$$ -1060 558 576 -1230 642 702 -1065 -427 881 -655 -510 1272 -154 -587 878 416 -1179 543
6882E43O7j369R08J135j734J73J477j571p42J949o16j122J504O6j809J118Q05
$$ 543 610 -759 149 1284 -450 -277 1200 -371 -1113 836 220 -902 602 668 -1141 -23 782
6899G82j594K53J672j358j95J498j103r85J817l70j458J419M40j587L78J587j866
$$ 782 -812 -559 1113 -245 -440 1058 -45 -1030 787 417 -1041 378 818 -769 -391 1196 -670
6916f70L6J810j221j043J740k41j587J449L58j641Q87J360j990L10J449j287m07
$$ -670 -634 1176 -45 -1088 652 411 -1176 273 631 -1010 -123 1237 -753 -443 1006 -281 -688
6933f88J327j67j658J871J15k049J327N83j321J75J616j317p63J997q06j003J246
$$ -688 639 472 -1186 685 800 -1249 78 661 -660 -485 1131 -186 -949 1048 242 -761 485
6950D85Q8j544J327P89j949N62J387j923J40J550j068j019K062k84j736J243Q99
$$ 485 573 -971 356 1145 -804 -242 1145 -778 -638 912 -156 -1175 887 603 -1133 110 1009
6967A009k063P98J304j576j62J802j288j010K252o34j518J505M14j610J001J244
$$ 1009 -1054 -256 1048 -528 -690 1112 -176 -1186 1066 432 -1086 419 833 -777 224 1468
6983A468k192K49J582j339p05J891q86j141J804j58j367P01J397j985J30J590
$$ 1468 -724 -475 1107 -232 -937 954 68 -1073 731 573 -794 -93 1304 -681 -551 1039
6999A039j595m96K018j129o36J485j10j739J358M82j543K86J596j407j52J600
$$ 1039 -556 -1052 966 -163 -799 686 576 -1163 195 677 -866 -580 1016 -391 -543 1057
7015A057j303p71J720n68j221J476M65j986J030R96j585J79J612j577j92J578
$$ 1057 -246 -1017 703 135 -1086 390 855 -1131 -101 895 -690 -511 1101 -476 -668 910
7031I10o18j421J559K52j517R16Q33j718L94J707j636n75K022r94j293J575L28
$$ 910 292 -1129 430 682 -835 81 914 -804 -410 1297 -339 -914 1108 114 -1179 396 724
7048G24k056J506J035k158J021N29j130l2J679j148q84J372J04j599J355O65j965
$$ 724 -1332 174 1209 -949 72 601 -529 -561 1118 -30 -914 458 562 -1037 318 983 -982
7065i82P70J256j379j74J607j238r06J931m63j599J779M17j969R46R07j576L28
$$ -982 -212 1044 -335 -509 1098 -140 -1046 885 422 -1177 602 1019 -950 -4 903 -673 -345
7082c45J343j350l15J682j164q79J420L15j989J518P52j972P57J347j670R8J611
$$ -345 998 -352 -667 1015 -149 -1028 392 707 -1282 236 988 -984 -227 1120 -550 -452 1159
7099A159j315p40J686j98j370J040L32j657Q83R67j263k44J650j147r30K188r55
$$ 1159 -156 -896 790 592 -778 262 594 -1063 -180 787 -476 -720 930 -217 -1147 1041 86
7116H6j273J719N25j993J219R81j969M24J394j648m54J896r45q76J225O19j931
$$ 86 -1187 532 1057 -936 283 1264 -705 -281 1113 -535 -989 907 -38 -914 311 930 -1001
7133a001J029R01j787M47J609j534k94J438o38j200J829r2j754J533M53k035N45
$$ -1001 28 929 -858 -411 1198 -336 -630 808 170 -1030 799 707 -1047 486 939 -1096 -551
7150e51J842j711k58J630j212n36J658p10j223J489R3j536J207Q35j516o6J701
$$ -551 1291 -420 -678 952 -260 -796 862 152 -1071 418 511 -1025 182 1017 -499 -565 1136
7167A136j314p01J618l84j539K069m18j425Q57J144j987N18J485j543j35J690
$$ 1136 -178 -879 739 355 -1184 885 467 -958 -101 1043 -944 -426 1059 -484 -619 1071
7183A071j080q20J430J89j911J411O66j862N51J332j719r8J888j358o08J558l33
$$ 1071 -9 -829 601 790 -1121 290 956 -906 -355 977 -742 -840 1048 -310 -918 640 307
7200C07j498J579N75j668P15J252j892K7J664j180o56J659n51j694J799J06j658
$$ 307 -1191 388 963 -705 10 1262 -630 -603 1061 -119 -775 884 333 -1361 438 544 -1114
7217a114J063Q19j625M52J525j379m03J478n28j436J407M02j928J467P34j633
$$ -1114 -51 768 -857 -405 1120 -259 -662 816 288 -1148 259 661 -1267 200 934 -699
7233f99L24J459j326l41J796j506q44K003k07j553J182M78j814J071J200j694
$$ -699 -375 1084 -242 -583 1213 -293 -1137 866 659 -894 288 766 -1048 23 1223 -471
7249d71J0J522j131q73K008q85j299J647M2j557Q22J002j732N69J311j403m51
$$ -471 -461 1061 -70 -943 1065 180 -1119 528 570 -987 -165 837 -895 -326 985 -418 -869
7266h69J806q68j026J345K80j583J114Q73k049N62J274j430m62J811j018o50J543
$$ -869 937 69 -957 388 668 -915 199 1072 -977 -415 859 -571 -1033 778 -240 -890 653
7283F53J07j834J403M32j654P02J171j727K00J556j588j33J357l67j445J608N16
$$ 653 760 -1074 329 761 -893 -191 980 -747 -547 1009 -579 -712 645 278 -1167 441 957
7300I57k061J170P90j579LJ526r38p27J650n97j269J462J0j361J151N38j609Q88
$$ 957 -1104 66 856 -723 -720 806 -132 -859 791 194 -1075 387 397 -964 187 725 -884 4
7318DJ200j677l85J899p01j334J628j2j539J177P42j856L69J164j343K18J271
$$ 4 1204 -473 -858 1041 340 -994 634 622 -917 260 1002 -854 -485 679 -664 -446 825
7335H25p08j062J779p36j144J304M78j834R36J124j584L24J337j365o32K166j239
$$ 825 117 -945 834 98 -1046 258 736 -1098 -162 962 -622 -298 1039 -326 -958 1208 -31
7352c1q02J258N2j412Q81J065j560L45J107j047m02J505o85j392J626J20j431
$$ -31 -833 425 477 -935 -54 1011 -549 -204 903 -144 -546 959 274 -1118 508 628 -803
7369h03J081O10j707P02J155j343l02J669j208q75J900n57j393J247N08j659P52
$$ -803 278 888 -819 -117 1038 -305 -607 1062 -146 -1021 879 322 -1071 176 684 -975 -223
7386b23R74j486J40J524j205q36K004n78j442J622M4j452Q21J188j998N30J137
$$ -223 751 -735 -595 929 -276 -1112 892 314 -1128 494 538 -914 -93 1095 -903 -373 764
7403G64j226m05J641o66j404J818K80j712J219P75k115Q14J267j661m0J594j155
$$ 764 -462 -867 774 108 -1296 522 802 -910 309 1084 -1031 -217 1050 -611 -651 943 -212
7420b12j145J987R8j812J617M42j636L85J317j088o32J758j008j274J886j39j212
$$ -212 -1357 630 728 -1084 533 975 -661 -276 1041 -47 -679 1079 71 -1203 683 544 -668
7437f68J293J65j480R14L09j405K99J898j323r49J754m05j303J614j04j753J221
$$ -668 625 790 -690 224 533 -872 -573 1325 2 -947 807 402 -901 713 609 -1144 77
7454G7P54j721N61J463j440l61J540n41j332J797k08j700J355O39j761P68J286
$$ 77 831 -890 -329 1134 -306 -667 873 332 -1000 797 589 -1111 244 883 -878 -110 1176
7471A176j913j31J930j183r54J757n58j203J365O80j920Q73J301k035N36J327
$$ 1176 -737 -868 1062 -121 -1075 682 124 -1079 286 966 -954 -81 1220 -815 -279 1048
7487A048j172n36J588o07j395J657k06j402P94J111j739N08J359j401l75J587
$$ 1048 -124 -660 928 321 -1074 583 377 -1025 -231 880 -859 -351 1008 -393 -768 819
7503H19n70j504J891l58j147J088Q65j945Q64R45j332l94J692r05r37J683m69
$$ 819 249 -1255 636 278 -869 219 1084 -861 3 948 -384 -778 914 9 -928 755 286
7520B86j209J322R2j530R15R99j624J35J714j373q12K080p56j260J494K32j859
$$ 286 -923 399 491 -1039 -124 875 -749 -614 1100 -273 -1085 995 239 -1021 473 705 -1154
7537a154J434R00j878K79J679j650o06K115j141j070J463K32j652J198Q43j710
$$ -1154 280 1180 -698 -419 1260 -390 -996 1119 -22 -1092 371 603 -1049 149 992 -718
7553g18M20J424j908L4K113j204j012J508n6j786J956J06j862J048Q64j597L15
$$ -718 -298 1126 -782 -748 1365 161 -851 657 601 -1185 771 877 -985 63 927 -670 -355
7570c55J266j289k59J424o84q61J289J29j548Q33R64j661M37J482j178o38J551
$$ -355 911 -378 -637 787 103 -758 531 660 -888 -55 909 -752 -315 1167 -11 -649 902
7587I02o07j297J688m7j712J178R66j771M44J398j418k29J700j122j024J677l26
$$ 902 295 -1002 686 639 -1073 105 1071 -700 -256 1142 -276 -505 1195 73 -951 726 400
7604D00j699J704N53j646O50J156j383k88J601j201p13J571n20j233J564L46j926
$$ 400 -1299 405 958 -688 -38 1118 -265 -553 1048 -153 -866 705 185 -1048 516 862 -1064
7621a064J017Q40j514K34J598j238p21J601m79j075J476k98j273R17R62j885N48
$$ -1064 -47 793 -721 -487 1111 -127 -848 753 274 -801 675 377 -896 21 983 -902 -354
7638c54R82j112j88J627p31j682K282k44j468J008R10j559M00J447j772O9J554
$$ -354 628 -484 -672 955 224 -1458 824 580 -888 120 1030 -529 -129 1318 -454 -385 1169
7655A169j232p63J269kj211J074O32j600Q23R44j799R6J475j144o26J347j31j246
$$ 1169 -63 -826 443 441 -770 304 936 -664 159 1103 -696 -600 875 -269 -895 452 321 -925
7673i25J300M91j777Q28J008j860O16J070j141o65K144q09j193J788n9j821J144
$$ -925 375 866 -911 -83 925 -935 -319 751 -390 -1055 1089 280 -913 875 816 -1005 139
7690A39P46j708L89J597j654k64J536q44o51J686n66j452J288O71j668O33J176
$$ 139 885 -823 -434 1163 -491 -755 781 -63 -714 972 406 -1046 242 913 -755 -122 1054
7707A054j609r4J618j420n89K030n73j692J693M43j983J035J093j595q7J430j107
$$ 1054 -555 -649 969 -451 -1040 990 417 -1275 418 861 -1122 -87 1006 -589 -676 754 -353
7724c53k45J516o21j309J526J00j730J417N41j891Q39J240j405l66J736j150m94
$$ -353 -598 918 297 -1012 514 614 -1116 301 842 -1049 -210 1030 -375 -741 995 -155 -649
7741f49J634l08j818J459L38j408Q54Q55j740K82J399j119p43J727o69j115J162
$$ -649 985 677 -1141 318 656 -752 102 957 -783 -501 898 -221 -964 763 94 -1021 141
7758A41M48j402Q94J124j602K83P73q69l35J483p88r66J433J97j975J056R96j699
$$ 141 589 -813 81 1205 -397 -114 659 -210 -545 938 150 -816 617 814 -1161 -105 891 -808
7776h08K03K130j836k81J758j039r20J544m83j100J058Q42j630K7J625j644j48
$$ -808 -605 1525 -311 -592 1166 127 -793 751 268 -832 226 1068 -562 -535 1090 -554 -702
7793g02J586j087p89J506k65j190J229L94j505Q84J126j608jJ251r41q14J600
$$ -702 884 -203 -992 514 249 -941 288 682 -823 61 1187 -421 -422 829 -112 -926 674
7810F74m05j306J489K21j708J077R50j529L05J314j446l24J424p36r26J346N6
$$ 674 269 -1037 452 673 -1035 42 992 -537 -232 1082 -364 -688 736 0 -926 420 476
7827D76j672J395L05j324O41J129j337r2J068n07r90J595o5j828J582M82j425
$$ 476 -1196 199 504 -820 -179 950 -387 -479 589 82 -908 687 622 -1206 376 858 -567
7844e67K93J049j403J10J674j298o99J490m20j128J221L73j741R90Q17j448K18
$$ -567 -274 775 -628 -518 1156 -142 -841 649 229 -899 322 695 -1046 -56 761 -687 -469
7861d69J440p87r55J506m24j149J069N43j673R49R42j872N80J374j423n39J756
$$ -469 971 184 -771 735 311 -838 231 774 -899 50 992 -880 -300 1074 -349 -888 868
7878H68o44p19J094m88r66J225M97j497L96J051j000k86J544j325p30J963n48
$$ 868 224 -495 599 111 -855 370 867 -630 -234 817 -183 -469 1075 -250 -980 983 435
7895D35j312J144L47j695J125R26j301q2J127q55m79J622j145p86J514R0j514
$$ 435 -877 267 614 -1081 44 970 -331 -413 714 -141 -620 1002 -143 -929 585 675 -839
7912h39P69R75j514K28J395j276m78J637q59r37J520O1j888J415M60j036K4R83
$$ -839 -70 905 -609 -381 1014 -262 -740 897 38 -899 621 682 -1206 209 669 -367 -343 640
7930F40j128K44J263j329o87J759l19j484J492L76j792P83Q27j066p7J142q96
$$ 640 -488 -244 1019 -310 -997 762 443 -1041 451 827 -965 -182 645 -421 -498 644 -252
7947b52p26J364J55j537J044P15j729J202M78j453L12J669j585j07J514r30r65
$$ -252 -978 386 541 -996 48 763 -966 236 714 -739 -427 1242 -343 -450 1064 134 -831
7964h31J531K8j381Q44P06j838O42J095j348P5J578r34p83J330k61j373J376K35
$$ -831 700 728 -653 191 897 -941 -299 796 -552 -477 1101 167 -616 714 453 -920 456 691
7982F91j909J307R15j501n2J533j436n24J855q43j187J764k48j522O89J420j495
$$ 691 -1218 89 1004 -497 -549 984 -452 -976 879 36 -1151 613 365 -1157 -468 952 -543
7999e43j41J246r09l67J569n73j504J761R7j455O74R54j415K02J196j141l55J589
$$ -543 -684 562 -347 -714 855 282 -1222 539 636 -819 -145 809 -606 -404 792 -349 -704 885
8017H85r83q10J137L89j683J272O88j391N00O84j659L16J654j035q03J548j37
$$ 885 -98 -908 229 618 -1065 207 895 -496 4 688 -971 -655 999 -36 -839 709 572
8034E72j255J100K03j380P69P31j254Q1J154q00p56J138r0j241J334K75j438Q90
$$ 572 -683 417 620 -760 9 740 -514 -433 721 -79 -835 303 213 -1028 306 581 -857 33
8052C3P49j527O47J013j106l51J356o79j237J799k85j381R81O73j877J143Q62
$$ 33 782 -745 -98 915 -191 -542 814 135 -1102 697 412 -969 12 685 -1192 -49 813
8069H13j471K78J358j250l12J185j98j637J650P2j394N84J200j621K5K058j297
$$ 813 -658 -380 978 -272 -584 601 403 -1234 416 488 -906 -322 878 -743 -718 1340 43
8086D3q63J632m30j424J596K12j871J344L84j005l27J755j404j25J261q87o08
$$ 43 -820 812 382 -1042 554 766 -1105 239 623 -382 -709 1046 -358 -483 778 -109 -717
8103g17J237J68j571R68M51j388M68J066j097j26J461p43j102J555k69j064J097
$$ -717 520 688 -883 85 536 -852 -384 682 -415 -541 920 177 -925 630 361 -703 394
8120C94M49j441M40J079j852M40J438j129q19J920n09j238J248L89j745P39Q98
$$ 394 843 -598 -158 921 -931 -491 947 -182 -1001 919 410 -828 420 809 -936 -197 701
8137G01j557L96J275j100m42J764p21j224J401J48j181Q11L04j231M50J168j433
$$ 701 -856 -460 815 -285 -727 1037 316 -908 493 641 -540 271 575 -656 -206 962 -471
8154d71j61J230o63n67J260l89j406J389L71j449P86O52j014j36J513j119o21
$$ -471 -632 598 -65 -632 628 239 -1167 222 593 -856 -70 582 -432 -568 945 -174 -795
8171g95J378m46j018J142M11j718P76J216j483M4J318j217n02J820n67j118J168
$$ -795 583 137 -881 261 672 -1046 -270 946 -537 -493 825 -392 -894 926 359 -759 409
8188D09J88j291O19
$$ 409 597 -694 -75
8191g5
$$ Imaginary data points
##PAGE= N=2
##DATA TABLE= (X++(I..I)), XYDATA
0@%%%%%%%Qj6J6j6K4l2L9m7N6o9P7q8J07j28J48j69J93k24K60k93L29l74M23m76
$$ 0 0 0 0 0 0 0 0 8 -8 8 -8 16 -16 23 -24 32 -37 40 -48 59 -69 79 -90 103 -121 139 -154 175 -199 224 -252
31b52N33n97O68p45Q29r20J022j134J256j393J543j705J887k092K323k585K880
$$ -252 281 -316 352 -393 436 -484 538 -596 660 -733 810 -895 992 -1100 1223 -1362 1518
48A518l220L620m096M669n374O273p461R101j1521J5445k2823M1161j62367k59119
$$ 1518 -1702 1918 -2178 2491 -2883 3390 -4071 5030 -6491 8954 -13869 27292 -135075 -394194
62c94194M50792P1108k24939J57482J12595k51278j4004J44519m4516l7342k3987
$$ -394194 56598 127706 -97233 60249 172844 -78434 -92438 52081 7565 -29777 -53764
73e3764p5680K02608J65704k80295j17195K36375j21490j58356L59757R4075m21000
$$ -53764 -129444 73164 238868 -41427 -158622 77753 -43737 -202093 157664 251739 -169261
84a69261J4206L00033j43023j25147J96072k2919j22356J20102K7346r6905J5903
$$ -169261 -155055 144978 1955 -123192 72880 49961 -72395 47707 75053 -21852 -5949
95e949q5252m6456K69966M8763k86703Q1386J84348k74402p0656L44995p5207
$$ -5949 -91201 -137657 132309 181072 -105631 -24245 160103 -114299 -184955 160040 84833
106H4833k79865K12833J77658k11969m2551Q5474r7784K1382J12470p1489K0724
$$ 84833 -195032 17801 195459 -16510 -59061 26413 -71371 -49989 62481 -9008 11716
117A1716Q1162j75815k0088K55949j07591k34110K20387J04684k63945P3898K21315
$$ 11716 92878 -82937 -103025 152924 45333 -188777 31610 136294 -127651 -53753 167562
128A67562k03626j03547K32426k7567j52297J02490N658r9401J11665K0609j26863
$$ 167562 -36064 -139611 92815 65248 -87049 15441 21099 -78302 33363 53972 -72891
139g2891J03282M9114j84660Q5219J67307k18454o8384K72048o7437k09422J83422
$$ -72891 30391 79505 -105155 -19936 147371 -71083 -139467 132581 65144 -144278 39144
150C9144P3468k14432P3763J55622j56158m5919J17888p6278n635J45866r6308
$$ 39144 112612 -101820 -28057 127565 -28593 -74512 43376 -32902 -38537 107329 11021
161A1021r0613J57834m7517j57418J60347N3315k14116R5112J97228j74275p4152
$$ 11021 -79592 78242 30725 -126693 33654 86969 -127147 -32035 165193 -9082 -83234
172h3234J69459j02144j26416J90647L3225j51178Q9560N1685j45536N7601Q9068
$$ -83234 86225 -15919 -142335 48312 81537 -69641 19919 71604 -73932 -16331 72737
183G2737j45572J9918J51301j17296n1463J70975q9365j51520J82355N1899j86049
$$ 72737 -72835 -52917 98384 -18912 -70375 100600 11235 -140285 42070 93969 -92080
194i2080Q8946J17734j83181j2446J68057r7499o9581J58850l5438j10475J14527
$$ -92080 -3134 114600 -68581 -81027 87030 -10469 -80050 78800 43362 -67113 47414
205D7414j3089j43119J12081P3018j44731P0672J25606j73197l7570J77793j00831
$$ 47414 34325 -108794 3287 76305 -68426 2246 127852 -45345 -82915 94878 -5953
216e953j18019J88091J4947j66840J08055P9963j71644K0132J23230j09293j1425
$$ -5953 -123972 64119 79066 -87774 20281 100244 -71400 -51268 71962 -37331 -48756
227d8756J34978q9687o5488J39433n8026j18790J54337K6439j73596R5898J10923
$$ -48756 86222 -3465 -68953 70480 12454 -106336 48001 74440 -99156 -3258 107665
238A07665j80929l154J77017j03074q9019J60974k3402j31171J05395K6484j29233
$$ 107665 -73264 -76418 100599 -2475 -91494 69480 46078 -85093 20302 46786 -82447
249h2447P8890P3798j23693M6682J06262j47107l1383J62103q4924j01830J72766
$$ -82447 -3557 70241 -53452 -6770 99492 -47615 -78998 83105 -1819 -103649 69117
260F9117O631j66905R8731Q5547j58605J6640J26785j01444k8180J30654p0118
$$ 69117 75748 -91157 7574 93121 -65484 -48844 77941 -23503 -51683 78971 8853
271H853p5142J22123l3899j10348J26513L1547j51365P7279J02129j57566o607
$$ 8853 -66289 55834 21935 -88413 38100 69647 -81718 -4439 97690 -59876 -66483
282f6483J58045r3190q0449J50198k5583j31035J03307L6772j26032O9561Q0334
$$ -66483 91562 -1628 -82077 68121 42538 -88497 14810 51582 -74450 -4889 75445
293G5445j24072K2982J11060j20680m2209J45351o5142r6386J53560J1607j54758
$$ 75445 -48627 -25645 85415 -35265 -77474 67877 2735 -93651 59909 71516 -83242
304h3242Q2931P4835j46150K5939J27756j02385l3108J31535o7993q6300J23052
$$ -83242 -311 74524 -71626 -45687 82069 -20316 -53424 78111 10118 -76182 46870
315D6870j7327j17181J13294N1037j40335N2849R6838j36348j0807J44075q0768
$$ 46870 29543 -87638 25656 76693 -63642 -10793 86045 -50303 -61110 82965 2197
326B197p4283J37857k6111j22183J03175L5051j29259O6606Q9765j22196N091
$$ 2197 -72086 65771 39660 -82523 20652 55703 -73556 -6950 82815 -39381 -34290
337c4290J13024j02495n2464J36824m2508r5780J23531J3816j35311P3699P0153
$$ -34290 78734 -23761 -76225 60599 18091 -77689 45842 59658 -75653 -1954 68199
348F8199j30794K1927J17250r7314l4136J26199o2132q8724J19056k855j16597
$$ 68199 -62595 -40668 76582 -20732 -54868 71331 9199 -79525 39531 36676 -79921
359g9921R3050N6352j29221L8545R9284j13554j9738J25557p0676p0770J25311
$$ -79921 13129 69481 -59740 -21195 78089 -35465 -55203 70354 -322 -71092 54219
370E4219j8690j10869R9137L7642j27605N4341Q8008j17971j170J21016q5266
$$ 54219 35529 -75340 23797 61439 -66166 -11825 76183 -41788 -42958 78058 -7208
381g208n8008J25328l5696j01588J08362K3276j21514O9361P2382j24003J3507
$$ -7208 -65216 60112 24416 -77172 31190 54466 -67048 2313 74695 -49308 -35801
392c5801J08136r6449l8444J28296m8222q7556J13081J025j23016P9392O0888
$$ -35801 72335 -24114 -62558 65738 17516 -70040 43041 44066 -78950 442 61330
403F1330j19587L5466J03128j04165k9265J14838o6904p3091J21054o876j03583
$$ 61330 -58257 -22791 80337 -23828 -53093 61745 -5159 -78250 42804 35928 -67655
414f7655R2670L8322j27690M1476Q6528j07351k559J21532p1250o2126J11625
$$ -67655 25015 63337 -64353 -22877 63651 -43700 -46259 75273 4023 -58103 53522
425E3522l1842j01294R8180L2419j09244O2516P3267j16700J293J01094q5455
$$ 53522 21680 -79614 18566 50985 -58259 4257 77524 -39176 -37883 63211 -22244
436b2244l9974J23470l4837q6532J00575O268j18644O5916O3621j06048K7617
$$ -22244 -62218 61252 26415 -60117 40458 46726 -71918 -6002 57619 -48429 -20812
447b0812R9540r3454l5294J06492n7897p4081J13459K232j00520Q0419M2347j20889
$$ -20812 78728 -14726 -50020 56472 -1425 -75506 37953 40185 -60335 20084 62431 -58458
459e8458L0851Q7399r7094j0081J15775o2163o5091J05153k2853j00280Q9694
$$ -58458 -27607 59792 -37302 -47383 68392 6229 -58862 46291 23438 -76842 12852
470A2852L6356j06862N4329P6512j09749n100J01828p7245m6680J18028k7507
$$ 12852 49208 -57654 -3325 73187 -36562 -41662 60166 -17079 -63759 54269 26762
481B6762q8576R4060J5369j12086N8557O4882j04335J8198R9549q4207l6943J06668
$$ 26762 -61814 32246 47615 -64471 -5914 58968 -45367 -27169 72380 -11827 -48770 57898
493E7898n0207p8429J04131Q906j01593P2398N0477j11371K3105Q5583q9045j8703
$$ 57898 7691 -70738 33393 42299 -59294 13104 63581 -47790 -24685 60898 -28147 -46850
505d6850J07405n4324o2776J01170j5157r7984P9694L7402j04836M4769Q0037
$$ -46850 60555 6231 -56545 44625 29468 -68516 11178 48580 -56256 -11487 68550
516F8550r8833j1030R9327o6664n4019J04198j7355q2869Q3111K1497j02480M9624
$$ 68550 -30283 -41313 58014 -8650 -62669 41529 24174 -58695 24416 45913 -56567 -6943
528f943O0497r7618J3169R6276p7416l8558J05147m0733q2259R4994J6736j00430
$$ -6943 53554 -44064 -30895 65381 -12035 -50593 54554 13821 -68438 26556 43292 -57138
540e7138N9541N8730r8629J2947Q1725p8972k2947R8466m6045n9246R4910j3338
$$ -57138 2403 61133 -37496 -24549 57176 -21796 -44743 53723 7678 -51568 43342 30004
552C0004r5504P9075M1863j08039L5805Q5264r2866k0234J02751n4328o3943R4330
$$ 30004 -65500 13575 55438 -52601 -16796 68468 -24398 -44632 58119 3791 -60152 34178
564C4178o058q0611P1673K3603r4878M3974O0755r0599R441R0695p8825m1144
$$ 34178 28120 -52491 19182 42785 -52093 -8119 52636 -37963 -28522 62173 -16652 -57796
576e7796J10618l1782q9736Q8726K5536j01728M9158O5744r1284j635Q2122n9572
$$ -57796 52822 21040 -68696 20030 45566 -56162 -7004 58740 -32544 -34179 47943 -11629
588a1629k6068Q5089m3858n8499Q9414m384q7050P2446L7484j07389L3379R2606
$$ -11629 -37697 47392 3534 -54965 34449 30065 -56985 15461 52945 -54444 -21065 71541
600G1541q9804l4021J02060l7258o5186Q6161K107q5597N3065L4783p3634L6919
$$ 71541 -18263 -52284 49776 12518 -52668 33493 35600 -49997 3068 37851 -35783 1136
612A136N0001q7995O198Q9850o7981m1480R9843l2232q7237R3983L5718j10190
$$ 1136 51137 -36858 -30660 59190 -8791 -50271 49572 17340 -69897 24086 59804 -50386
624e0386K8485P0733p6486k179Q2794n6504m1976P5488k4727m8645P8135j0857
$$ -50386 -21901 48832 -27654 -29833 52961 -3543 -45519 29969 5242 -43403 34732 23875
636B3875q7382P2045M8051j01024K2463Q2380q8671k8223J13147l2175q0557P4797
$$ 23875 -63507 8538 56589 -44435 -21972 60408 -28263 -56486 56661 24486 -56071 18726
648A8726J1399p7755N3421L8670q0218K2767N8742p0094J792P7300o8316m2369
$$ 18726 30125 -47630 5791 44461 -35757 -12990 45752 -24342 -22550 54750 -13566 -55935
660e5935J04238j9060q7246P7985K9212j01902L7548P6104q2551j6490Q4337m3542
$$ -55935 48303 29243 -58003 19982 49194 -52708 -15160 60944 -21607 -38097 46240 2698
672B698m0419P3258k5546o1253P2993J1679p6596N0967L7699r1477K2867Q3255
$$ 2698 -37721 35537 9991 -51262 21731 33410 -43186 7781 45480 -45997 -23130 60125
684F0125p7122l4390R6482l0771o6470Q0630O437r2742M8348N5822p1611J2138
$$ 60125 -16997 -51387 45095 14324 -52146 28484 34921 -57821 -9473 46349 -25262 -13124
696a3124N7797o9300j2935Q1703m1076m7360P6024j5402o7253P6187K3924j01851
$$ -13124 44673 -24627 -37562 44141 3065 -44295 31729 16327 -50926 25261 49185 -52666
708e2666K9896P2574p1613k443Q5344o2819n8671Q8433Q91o8336N4507J6751p5602
$$ -52666 -22770 49804 -21809 -24252 61092 -1727 -60398 28035 28926 -39410 15097 31848 -43754
721d3754M2938N3579p6264r70N9905n8950p889R5105m7452p8283P8703J2336q0090
$$ -43754 -816 52763 -23501 -24471 35434 -23516 -31405 63700 16248 -62035 16668 29004 -51086
734e1086O1203N0418j00598J507Q7584m8632l4593O4402l2964m4146P6553J805
$$ -51086 10117 60535 -40063 -38556 49028 396 -34197 30205 -2759 -46905 29648 31453
746C1453o6719M4115J0225p5036N4992O7169r1765j4736Q7997n2377m9531R5270
$$ 31453 -35266 8849 19074 -55962 -970 66199 -25566 -40302 47695 -4682 -54213 41057
758D1057p622r1942N5855M9115o8984J2968M3208o0406K878O4377m4065j8886
$$ 41057 33435 -58507 -2652 46463 -22521 -9553 33655 -26751 -23873 40504 -3561 -22447
770b2447O3210m7088n0249R3498M484r5115N4410N7584r3841K36Q9794n3985m8700
$$ -22447 40763 -6325 -56574 36924 41408 -53707 703 58287 -35554 -35318 54476 491 -48209
783d8209P7022m584n4033M4265m02n3675M8429K1662o4598L8101M6488q8398j205
$$ -48209 28813 24229 -29804 14461 14059 -39616 8813 30475 -34123 3978 50466 -37932 -39137
796c9137R3604n6447n7260R7676J888r4094M9806M7692p8319P545O4390m2620
$$ -39137 54467 -1980 -59240 38436 40324 -53770 -3964 43728 -34591 -27046 37344 -5276
808e276j0700M8850m4442k2399O2296l2911m0739Q7030r23r5880N3479N5159r7226
$$ -5276 -15976 32874 -11568 -33967 28329 -4582 -45321 41709 40786 -55094 -1615 53544 -43682
821d3682J67J01238m7302n2770P4721n904o5980L9988J4925m6842M3881K5792
$$ -43682 -43515 57723 10421 -42349 32372 26468 -39512 476 15401 -31441 12440 38232
833C8232o2562K5532M0177q1668n22R5383m7214n6140Q9928j744r6227M6600N2390
$$ 38232 -24330 1202 41379 -40289 -40811 54572 7358 -48782 41146 39402 -56825 -10225 42165
846D2165p2728P766O8400m3663k3060M6160l7380k5612O3189j7945m2967P0916
$$ 42165 -30563 -22797 45603 1940 -21120 25040 -12340 -37952 25237 7292 -35675 35241
858C5241J061q9276M3322N4392q4545J435R5407m2754n4747O6560r497o4901M8433
$$ 35241 36302 -52974 -9652 44740 -39805 -38370 57037 14283 -40464 26096 16599 -48302 131
871A31K5577n0506L3131K7936o3709J6079N0446o5841j0652Q4400l5617n4246
$$ 131 25708 -24798 8333 36269 -27440 -11361 39085 -26756 -37408 46992 11375 -42871
883d2871P5942p81q7178M7758N2907o8200P115O0026n4294k3562O2632k7710l5906
$$ -42871 33071 32290 -54888 -7130 45777 -22423 -15308 44718 -9576 -33138 29494 1784 -34122
896c4122O2401j1067n4210N7599J2516q0636L4944N7774o9652j974P7982n0363
$$ -34122 28279 17212 -36998 20601 33117 -47519 -12575 45199 -24453 -26427 51555 1192
908A192n0335P2864l557o1439N0826K0341o4536L0630M1419o3176N118N9744n1146
$$ 1192 -49143 23721 20164 -41275 9551 29892 -34644 -4014 37405 -25771 -20653 39091 -12055
921a2055k0929P1838l1349n7476O7026J2394o7293M3936L9477p5708M829O2819
$$ -12055 -32984 38854 7505 -49971 17055 29449 -37844 6092 45569 -30139 -25310 37509
933C7509m9947k0538O9572k5303m4703O0005l702o5057M3742K8227o2566K8704
$$ 37509 -12438 -32976 36596 11293 -33410 26595 22893 -42164 1578 29805 -32761 -4057
945d057N4778o5211j4947O5678l9213l9798P1703m606o1971M9640K1529o9790
$$ -4057 50721 -14490 -29437 36241 -2972 -42770 28933 24327 -37644 11996 33525 -36265
957c6265K4237M8245n7972J650O4831m5954l6355O2774j9288n1894O2439J7283
$$ -36265 -12028 36217 -21755 -20105 44726 -1228 -37583 25191 5903 -45991 16448 33731
969C3731o5207L4885L5874p2018M144O1942m7316j8159P4208k4356n5298N4840
$$ 33731 -31476 3409 39283 -32735 -28591 33351 -13965 -32124 42084 17728 -37570 17270
981A7270P85o4556M4002L8583o0993J7538N2638n9021j7723O4072l5199l8569
$$ 17270 18055 -46501 -2499 36084 -24909 -7371 45267 -13754 -31477 32595 -2604 -41173
993d1173P0122k695o1872M6524K2049p0038K4927N3693n7265o125O3156m2086
$$ -41173 28949 26254 -35618 10906 32955 -37083 -12156 41537 -15728 -21853 41303 -783
1005g83l8021O3288j1116n2369N5719J7734o4770K8669L7297o5738L855O2647
$$ -783 -38804 24484 13368 -39001 16718 34452 -30318 -1649 35648 -30090 -26235 36412
1017C6412m3283k2789O7598k2573n5721N3678P605o2988L8623M0085n9108J0167
$$ 36412 -6871 -29660 37938 15365 -40356 13322 20927 -42061 -3438 36647 -22461 -12294
1029a2294N2485n3442j9792O2429k8453m1104O3140R54o0205M2720K6964o5524
$$ -12294 40191 -13251 -33043 29386 933 -40171 22969 23923 -36282 6438 33402 -32122
1041c2122J8219N2293n4052j0243O2616l5988l8533O2556o723n4362M9866K0198
$$ -32122 -13903 38390 -15662 -25905 36711 723 -37810 24746 18023 -36339 13527 33725
1053C3725o5037K4547M2469n9846l93O3516l9980k8500O3380j8590n5578N1857
$$ 33725 -31312 -6765 35704 -24142 -24535 38981 -999 -29499 33881 15291 -40287 11570
1065A1570J2713o1727L5928M1412n9739N337N4001n0381k3891O2892k2848m3868
$$ 11570 24283 -37444 -1516 39896 -19843 -14506 39495 -10886 -34777 28115 5267 -38601
1077c8601O0158N030o1914L8016L0624o3802J4164N3616n0659j4747O1751l1735
$$ -38601 21557 26587 -35327 2689 33313 -30489 -16325 37291 -13368 -28115 33636 1901
1089A901m0024N9633k070n5968M5846K3735o3793J8941M5748n4634m614O2754
$$ 1901 -38123 21510 19440 -36528 9318 33053 -30740 -11799 33949 -20685 -25299 37455
1101C7455l4828l2305N8874j4190n5487M7945J7296n7790L1798M2906n7244j270
$$ 37455 2627 -29678 29196 15006 -40481 7464 24760 -33030 -1232 41674 -15570 -16840
1113a6840N2845m5424k6787O2821j5748m4510N4322Q358o1048L1503L2659n9451
$$ -16840 36005 -9419 -36206 26615 10867 -33643 20679 29037 -32011 -508 32151 -27300
1125b7300R746N4283m6030j7988N9944k7259m2551N6220J417n5973M0769K6546
$$ -27300 -17554 36729 -9301 -27289 32655 5396 -37155 19065 20482 -35491 5278 31824
1137C1824o1686J5628M8351n0692r036O0508l2496l5834N7396r175n4565M6463
$$ 31824 -29862 -14234 34117 -16575 -25611 34897 2401 -33433 23963 14788 -39777 6686
1149F686K0567n8738K6186M3993n6087l610N5701m1026k8925O0752j3654m7579
$$ 6686 27253 -31485 -5299 38694 -17393 -21003 34698 -6328 -35253 25499 11845 -35734
1161c5734N2192J3159n9148K9407L4462n9186M389N4271m2757j8366O1596k1613
$$ -35734 16458 29617 -29531 -124 34338 -24848 -20459 33812 -8945 -27311 34285 12672
1173A2672m5412N0778K286n8162L7071L2712n5522J3890M9597n0467j6836N5830
$$ 12672 -32740 18038 20324 -37838 -767 31945 -23577 -9687 39910 -10557 -27393 28437
1185B8437k8604l6275N7714k86n2071L9970K0389o1637J8261M5851m7997l701
$$ 28437 -167 -36442 21272 20986 -31085 8885 29274 -32363 -14102 31749 -16248 -19949
1197a9949N7017l5791l5597N3421j0602m7413M9701K0378n6063K4785L4790n9260
$$ -19949 37068 1277 -34320 19101 8499 -38914 10787 31165 -24898 -113 34677 -24583
1209b4583k590N3861l4534j8761O1901j6507m9282M3274L578n7663L5968L9351
$$ -24583 -27173 26688 -7846 -26607 35294 18787 -30495 12779 16357 -41306 -5338 34013
1221C4013n0177J0452M8266n0881k3780N4317k3467l4910O0184N330n5149L3457
$$ 34013 -16164 -5712 42554 -8327 -32107 22210 -1257 -36167 24017 29347 -25802 7655
1233G655J9966o1123J5705M9289m3400n301N6536l4711l8784N1346r197m7838
$$ 7655 27621 -33502 -17797 31492 -11908 -17209 39327 4616 -34168 17178 7981 -39857
1245c9857N0078K4027n6360K0127L4675n8517m015N7385l1419k2871N9043j5021
$$ -39857 10221 34248 -22112 -1985 32690 -25827 -29842 27543 -3876 -26747 32296 17275
1257A7275n0081M1846P877n5732L2667L9520m8388O737M6458m8426k3878N6141
$$ 17275 -32806 9040 16917 -38815 -6148 33372 -15016 -8279 38179 -10247 -34125 22016
1269B2016j9014l7038N5594N675n4983L2243K5680n8293R749M8996m0241j0060
$$ 22016 3002 -34036 21558 27233 -27750 4493 30173 -28120 -18371 30625 -9616 -19676
1281a9676N4493k8300l8011M8508l336m7382M2601K1008n5382K0019M1264n2432
$$ -19676 34817 6517 -31494 17014 13678 -33704 8897 29905 -25477 -5458 35806 -16626
1293a6626p783N3899l2434k8323N7668p169n0546L8393J4922n2763K5101L6109
$$ -16626 -24409 29490 -2944 -31267 26401 19232 -31314 7079 22001 -30762 -5661 30448
1305C0448m8794K289M8814l8615k1040N2644k2388m2583N4162J0460n5155L1950
$$ 30448 -18346 -16057 32757 -5858 -26898 25746 3358 -39225 14937 25397 -29758 2192
1317B192L1279n8106M631N0266l9302j8057N3755j8515l4723M6847l777n0354
$$ 2192 33471 -24635 -20004 30262 -9040 -27097 26658 8143 -26580 20267 16490 -33864
1329c3864L6487K1764n0950K2395M3549n2858j0682N5618l1843l4638N5848q38
$$ -33864 2623 24387 -26563 -4168 39381 -13477 -24159 31459 -384 -35022 20826 19988
1341A9988m9325L8793K0119n3888J4424L5689m3491J823M8694l4947k1865N0544
$$ 19988 -29337 9456 29575 -24313 -9889 25800 -17691 -15868 32826 -2121 -23986 26558
1353B6558k0641m3927N0180J1898n4604L1103L6518n6791k499N0337l5085k1753
$$ 26558 5917 -38010 12170 24068 -30536 567 37085 -19706 -22205 28132 -6953 -28706
1365b8706N1935j2915l6222M1615R20m7576L1747K1115m8982K0215M4566m9530
$$ -28706 23229 10314 -25908 15707 16627 -30949 798 21913 -27069 -6854 37712 -11818
1377a1818j3335N4424k9078l7065N5549L212n1922L4466K5422n0438R781L6560
$$ -11818 -25153 29271 193 -36872 18677 21889 -30033 4433 29855 -20583 -10802 25758
1389B5758m1547k326M8367k9300k3654M7645j7329m3617M9378J3299n7017K7132
$$ 25758 -15789 -18115 30252 952 -22702 24943 7614 -36003 13375 26674 -30343 -3211
1401c211L9726n3479k944N1415l4745k8216N2004p382l7421L8412L739m7899K9140
$$ -3211 36515 -16964 -19908 31507 -3238 -31454 20550 13168 -24253 14159 17898 -30001 -861
1414h61K6190m7816J3177M2543m6117j2905N6675k6484m0617N1073M699n0438
$$ -861 25329 -22487 -9310 33233 -12884 -25789 30886 4402 -36215 14858 19557 -30881
1426c0881L4018K7648n1728O433L9731l7538o971M6659k6979k6741M7266r531
$$ -30881 3137 30785 -20943 -14510 25221 -12317 -19288 27371 392 -26349 20917 11386
1438A1386m2882M1664J4279n3728K3849M0406m9216n640M9769l1740k8518N1094
$$ 11386 -31496 10168 24447 -29281 -5432 34974 -14242 -19882 29887 -1853 -30371 20723
1450B0723n861m0605L6801R552m7068K4482K9273m6074O126M3732l8705j6676
$$ 20723 14862 -25743 11058 20610 -26458 -1976 27297 -18777 -12651 31081 -7624 -24300
1462b4300N1892k0799l9783M6324O988m8602L0854K7260n1056O215M2318l7043
$$ -24300 27592 6793 -32990 13334 20322 -28280 2574 29834 -21222 -15007 27311 -9732
1474i732j2077M8216k3913l1471M6537k661m4711L5117J7893m9662J9471L9319
$$ -9732 -21809 26407 2494 -28977 17560 14899 -29812 5305 23198 -26464 -6993 32326
1486C2326m5585p508M6969k9988k5243N1477q012m3973L8643J4031m9708K2149
$$ 32326 -13259 -20767 26202 -3786 -29029 22448 14436 -29537 9106 23137 -26571 -4422
1498d422L2864m6268J559M6822l2480k0953M5741j7540l6219M4637P526m6481
$$ -4422 28442 -17826 -16267 30555 -1925 -22878 22863 5323 -30896 13741 21267 -25214
1510b5214K8275K5024m9582Q678M3338m0196j5684N2169j8812l4776M2865M36
$$ -25214 3061 28085 -21497 -12819 30519 -9677 -25361 26808 7996 -26780 16085 16521
1522A6521m7027L0325K4289m3191J2949L4480m1239o600M4688k8372k5384M8633
$$ 16521 -30506 -181 24108 -19083 -6134 28346 -12893 -19493 25195 -3177 -28561 20072
1534B0072o929m2203L8884J5174n3164J7084L8018m0356l789M5709k7853k5354
$$ 20072 13143 -29060 9824 24998 -28166 -11082 26936 -13420 -17209 28500 647 -24707
1546b4707M2219j0929l4951L8318Q393m2346K8208K5123n0403N220M3640l6629
$$ -24707 17512 6583 -28368 9950 18343 -24003 4205 29328 -21075 -15855 27785 -8844
1558h844j5540N2864j7303l9528M1364O678m6547K4824K5637m0730J0620L5963
$$ -8844 -24384 28480 11177 -28351 13013 19691 -26856 -2032 23605 -17125 -6505 29458
1570B9458l7693j0677M1674k5820k4735M9709n238m5360L6221J7528n1288J5623
$$ 29458 -8235 -18912 22762 -3058 -27793 21916 16678 -28682 7539 25067 -26221 -10598
1582a0598L8978m0714p470M6570k3445k7572L9804q610l5318L7300J1076m3178
$$ -10598 28380 -12334 -19804 26766 3321 -24251 15553 6943 -28375 8925 20001 -23177
1594b3177K3335K6147m6572M000M4199l4756j9915N0379j2537l8984L8735Q846
$$ -23177 158 26305 -20267 -16267 27932 -6824 -26739 23640 11103 -27881 10854 19700
1606A9700m6264K2884K8147l9856N286L6338l3933j1057M2486k1437k8537M3033
$$ 19700 -26564 -3680 24467 -15389 -10103 26235 -7698 -18755 23731 2294 -26243 16790
1618A6790j498m2646L3459K0964m8448J1362L8630l8013j1238M4859k0975k7137
$$ 16790 15292 -27354 6105 27069 -21379 -10017 28613 -9400 -20638 24221 3246 -23891
1630b3891M1330l970l8410L0898J2687m2908K0810L0768m1801o35M2335l2006
$$ -23891 17439 13469 -24941 5957 18644 -24264 -3454 27314 -14487 -15122 27213 -4793
1642d793k2414M6371r837l7282L8481J1496m4691J8804K6199m1574M103M0757
$$ -4793 -27207 19164 9327 -27955 10526 22022 -22669 -3865 22334 -19240 -15137 25620
1654B5620k9899j4154M1861j9121l2768L9899K459m1169L0758K4187m4746P905
$$ 25620 -4279 -18433 23428 4307 -28461 11438 13897 -27272 3486 27673 -17073 -9168
1666i168L5477l8097j1985M5436j7115k5873M0582l666m1317K9114J5443m2033
$$ -9168 26309 -11788 -23773 21663 4548 -21325 19257 15591 -25726 3388 18831 -23202
1678b3202J7592L4611l7599n318M0294k9237k5107M3695n087l4479L5508J1902
$$ -23202 -5610 29001 -8598 -13916 26378 -2859 -27966 15729 10642 -23837 11671 23573
1690B3573m5763J6180K7598l9115K093M1736k7209j8401M0640j5459l5206L6306
$$ 23573 -22190 -6010 21588 -17527 -15434 26302 -907 -19308 21332 5873 -29333 6973
1702F973P472l8349K6237K5151m2913K556L4681l2631j2473M4812j4786k8379
$$ 6973 14445 -23904 2333 27484 -15429 -12873 21808 -10823 -23296 21516 6730 -21649
1714b1649L7014o52m1322K6752J9720l9902J3332L4848l5467r555L8628k3212
$$ -21649 15365 14713 -26609 143 19863 -20039 -6707 28141 -7326 -16881 21747 -1465
1726a465k4660M1932j928l5792L0964J2308m3216J5220L0244l7038p54M0886k6697
$$ -1465 -26125 15807 13879 -21913 9051 21359 -21857 -6637 23607 -13431 -14185 26701 4
1739Dk1642L9830j0654l4324L5794J0043l9757K1060K4265m1099K599L7167k9487
$$ 4 -21638 18192 7538 -26786 9008 19051 -20706 354 24619 -16480 -13881 23286 -6201
1752f201j4037M2293j5450l1307L6413J892l9025K6214K1568l9460Q578L3528
$$ -6201 -20238 22055 6605 -24702 11711 13603 -25422 792 22360 -17100 -8522 25006
1764B5006l4868j0284M0446j8701k4876L9030k008l7655K7847J4833l9680J4621
$$ 25006 -9862 -20146 20300 1599 -23277 15753 13745 -23910 3937 18770 -20910 -6289
1776f289L1188l4697m956L8045k4397k2299L9118n958l2224L1935J0624m0143
$$ -6289 24899 -9798 -14754 23291 -1106 -23405 15713 9755 -22469 9466 20090 -20053
1788b0053J6620K5641l7066J634L7825k6383j7200L8509j2831l1648L4328O541
$$ -20053 -3433 22208 -14858 -13224 24601 -1782 -18982 19527 6696 -24952 9376 15917
1800A5917l7694K3108K2443l8967M386L2778l0846j0913M0386j5675k6950L5560
$$ 15917 -21777 1331 23774 -15193 -10807 21971 -8875 -19788 20598 4923 -22027 13533
1812A3533q21l7814K6337J8328l7854J1683L1080l3952p335L7102k1842k2191
$$ 13533 12712 -25102 1235 19563 -18291 -6608 24472 -9480 -16815 20287 -1555 -23746
1824b3746L8934l817l3885K9457J1749l9339J5131K7672l5070J4L7205k5624j8736
$$ -23746 15188 11371 -22514 6943 18692 -20647 -5516 22156 -12914 -12900 24305 -1319 -20055
1837b0055L7311j0386l0983L3427Q417l7643K0329K2459l7329L039L3943k8332
$$ -20055 17256 6870 -24113 9314 17731 -19912 417 22876 -14453 -11414 22529 -5803
1849e803j2346L8501j3809k7731L2942K020l6420K3842J9360l6481Q359L0940
$$ -5803 -18149 20352 6543 -21188 11754 13774 -22646 1196 20556 -15925 -7566 23374
1861B3374l1181r471L6364j8236k3067L6317k152l3844K6436J3266l7245J2601
$$ 23374 -7807 -17278 19086 850 -22217 14100 11948 -21896 4540 17806 -19439 -6838
1873f838K8012l2073l106L5979k2704j9919L5482p232l1166L0626J0479l6231
$$ -6838 21174 -10899 -14005 21974 -730 -20649 14833 7601 -23565 7061 17540 -18691
1885a8691J6747K3233l4871N68L4018k4999j4078L6769j1696k8782L1653M574
$$ -18691 -1944 21289 -13582 -13014 21004 -3995 -18073 18696 7000 -21782 9871 14445
1897A4445l5635K1887K0336l5098O292L0658k9481j1164L6341j5209k3959L4621
$$ 14445 -21190 697 21033 -14065 -7773 22885 -6596 -17760 18581 3372 -20587 14034
1909A4034o07l4053K3945J4817l6201J1137K9153l0562n889L4896k0499k1361
$$ 14034 13427 -20626 3319 18136 -18065 -6928 22225 -8337 -14226 20670 171 -21190
1921b1190L4571m454l0627K7845J1393l5547J3769K4112l2913j111L4607k2591
$$ -21190 13381 8927 -21700 6145 17538 -18009 -4240 19872 -13041 -14152 20455 -2136
1933b136j5950L4709j0341k9551L0372O930l3613J9111K1712l4453J999L1434
$$ -2136 -18086 16623 6282 -23269 7103 14033 -19580 -469 21243 -13210 -11211 20223
1945B0223k5634j2754L5672j2333k4154L0478J671l3788K1455J7652l3660R075
$$ 20223 -5411 -18165 17507 5174 -18980 11498 13169 -20619 836 18488 -15172 -6097
1957f097K8916k9100r168L3427j6847k1340L3363n13l1400K3624J2537l5188J1598
$$ -6097 22819 -6281 -15449 17978 1131 -20209 13154 12641 -18759 4865 17402 -17786 -6188
1970f188K5796k9006k059L2849k1658j9236L2376o993k7800K9381R333l3538J4920
$$ -6188 19608 -9398 -11457 21392 -266 -19502 12874 5881 -21919 7462 16795 -16743 -1823
1983a823K1475l3973M77L1976k2000j2451L4415j1516k6936K7389L240l1331K1419
$$ -1823 19652 -14321 -13844 18132 -3868 -16319 18096 6580 -20356 7033 10273 -21058 361
1996C61K0149l2281N322K6751k8558r790L4527j3807k0972L2756p56l2994K1279
$$ 361 20510 -11771 -6449 20302 -8256 -18046 16481 2674 -18298 14458 13702 -19292 1987
2009A987J3438l3086J1239K8225k7381n062L0587k0887k0337L2097k574k6205
$$ 1987 15425 -17661 -6422 21803 -5578 -10640 19947 -940 -21277 10820 8246 -17959
2021a7959K6892R945l4708J1985K0962l0482K92L2851k0058j5041L2304r984k8761
$$ -17959 8933 18878 -15830 -3845 17117 -13365 -13073 19778 -280 -15321 16983 6999 -21762
2034b1762K6196P067k9872J9326K0121l1437Q76K5954k4431r904L3821j0774k2823
$$ -21762 4434 11501 -18371 955 21076 -10361 -9485 16469 -7962 -17866 15955 5181 -17642
2047a7642K9081J64l1822J9976J5731l1307Q910K8252k6401q546L0232j6885k0172
$$ -17642 11439 11603 -20219 -243 15488 -15819 -6909 21343 -5058 -13604 16628 -257 -20429
2060b0429L1493p8k7535K2369J0272l2051J1216K2600k8236j090L1075j9469j6549
$$ -20429 11064 10986 -16549 5820 16092 -15959 -4743 17857 -10379 -11469 19606 137 -16412
2073a6412L1926q459k7675K6384R747l1450J4357K0769k9989O02K8227k1078j1637
$$ -16412 15514 7055 -20620 5764 15511 -15939 -1582 19187 -10802 -10200 18027 -3051 -14688
2086a4688K9570j1008k2649K7976K218l0282K0300J6883l2251N871K7286k6822
$$ -14688 14882 3874 -18775 9201 11419 -18863 1437 18320 -13931 -8060 19226 -7596
2098g596r478L3071j2370k1251K8126l15k8567J9451J2963k8145J0441K2233k6673
$$ -7596 -17074 15997 3627 -17624 10502 10187 -18380 1071 14034 -14111 -3670 18563 -8110
2111h110l794K8903j9219j6217L2201m338k7741K4574R882l2551J0852K2489k5603
$$ -8110 -11904 16999 -2220 -18437 13764 9426 -18315 6259 16141 -16410 -5558 16931 -8672
2124h672p69K8287j7954j4677K6105r415k2050K7034N113k7633J7947J5569l2458
$$ -8672 -9441 18846 892 -13785 12320 2905 -19145 7889 13002 -14631 3316 18885 -13573
2137a3573K882K8436k2914j0700L2359r467k3280K5002J525k8879J6992J5335
$$ -13573 -10691 17745 -5169 -15869 16490 7023 -16257 8745 10270 -18609 -1617 13718
2149A3718k5022Q671K1229k6794n619K8374j6368j6676L1460k569k8361K2582
$$ 13718 -11304 -2633 18596 -8198 -13817 14557 -1811 -18487 12973 10404 -17957 4625
2161D625J0951l2029Q821K3820k4068j877K8100j7646j6340K5822o545k1583K5622
$$ 4625 15576 -16453 -7632 16188 -7880 -9757 18343 697 -15643 10179 3634 -17949 7673
2174G673N899k8432J5863J7245l0474J276K8037k1240j0809L1472q130k4498K2718
$$ 7673 13572 -14860 1003 18248 -12226 -10950 17087 -4153 -14962 16510 8380 -16118 6600
2187F600L698k7322J6790J6036k6281N553K2826k3531p143K7593j4604j8459K9687
$$ 6600 10298 -17024 -234 15802 -10479 -4926 17900 -5631 -12774 14819 215 -18244 11443
2200A1443m66k7619J9410J2001k9673P904K3775k3239n383K7016j4744j6011K5900
$$ 11443 10977 -16642 2768 14769 -14904 -7000 16775 -6464 -11847 15169 425 -15586 10314
2213A0314m403k3724K2649Q131k7420J3034J8376k7798r00K8081j8307j3615K9046
$$ 10314 5911 -17813 4836 12967 -14453 -1419 16957 -10841 -11741 16340 -1967 -15582 13464
2226A3464o725k3430K2834N572k7299J4114J6832k5683L935K3966k1794r079K7666
$$ 13464 6739 -16691 6143 11715 -15584 -1470 15362 -10321 -6386 17580 -4214 -13293 14373
2239A4373j1159j9997K6578J365k7014J8204J3580k8305N516K3286k2346n486
$$ 14373 3214 -16783 9795 11160 -15854 2350 15930 -12375 -6859 16427 -5919 -11405
2251a1405K7205j3937j7735K5555j872k4531K0786R794k7707J0099K0540k5273
$$ -11405 15800 1863 -15872 9683 7811 -16720 4066 13860 -13847 -3748 16792 -8481
2263h481k627K6050j6882j3766K7952n399k3276K1477O131k7045J3691J8248k5604
$$ -8481 -11108 14942 -1940 -15706 12246 6847 -16429 5048 11179 -15866 -2175 16073 -9531
2276i531P61K4769j9213j1217K7230q647k0638K3794M122k5969J4772J4454k6174
$$ -9531 -8770 15999 -3214 -14431 12799 4152 -16486 7308 11430 -14539 233 14687 -11487
2289a1487M171K3276k0363o977K6973j2761j8883K5133J54k5267J8760J2664k7065
$$ -11487 -7316 15960 -4403 -11380 15593 2832 -16051 9082 9236 -16031 2729 15393 -11672
2302a1672P037K1177k2943n102K5718j3725j4893K5856l721k3338J9921P296k6680
$$ -11672 -4635 16542 -6401 -11503 14215 490 -14403 11453 7732 -15606 4315 11611 -15069
2315a5069J1666J9477k4539o20K5302j8187j3550K6289n853k1426K2604O054k5778
$$ -15069 -3403 16074 -8465 -9085 16217 -1970 -15520 10769 4916 -16510 6094 12148 -13630
2328a3630J2660J4888k5408K695K3883j9430p503K6475j0904k0015K3586J600
$$ -13630 -970 13918 -11490 -8795 15088 -4342 -11845 14630 3726 -16289 7297 8897
2340H897k5405J7361J4508k5668N194K1282k1621p326K5222j1502j5128K5192
$$ 8897 -16508 853 15361 -10307 -5113 16169 -5452 -12778 12444 942 -14186 11006
2352A1006j455k3720J7920Q579k6314R846K0586k3217k105K5261j6100j5677K4981
$$ 11006 9551 -14169 3751 12330 -13984 -4138 16448 -6769 -8874 16387 287 -15390 9591
2365I591l974k1519K1520P382k5131J0741J5899k4742Q08K3307j7205r083K6002
$$ 9591 5617 -15902 5618 13000 -12131 -1390 14509 -10233 -9425 13882 -3323 -12406 13596
2378A3596q319k0799K1556K609k4981J5063J5873k3822L553K1565k0689q407K4316
$$ 13596 5277 -15522 6034 8643 -16338 -1275 14598 -9224 -5671 15894 -4795 -13202 11114
2391A1114r919j5938K3946P90k3886J6245J0719k6256P692K0591k1291l225K5098
$$ 11114 1195 -14743 9203 9993 -13893 2352 13071 -13185 -5493 15098 -6193 -9418 15680
2404A5680j4221j5561K3595l757k1748K0240Q842k4296R937J6929k3836r99K3244
$$ 15680 1459 -14102 9493 5736 -16012 4228 13070 -11226 -1289 15640 -8196 -9195 14049
2417A4049j6329j0909K5678o431j9878K0350L820k5764J3540J5547k3525L569
$$ 14049 -2280 -13189 12489 6058 -13820 6530 10350 -15414 -1874 13673 -9852 -6283
2429f283K2529j9091r675K4009j0325j7574K3590K389k2921J5769J1355k5966
$$ -6283 16246 -2845 -12520 11489 1164 -16410 7180 9569 -13352 2417 13772 -12194
2441a2194N008K0291k0046m002K5334j1686j5826K2454k952k3044J8138J0324
$$ -12194 -7186 13105 -6941 -10943 14391 2705 -13121 9333 6381 -16663 1475 11799
2453A1799k3093R483J8638k2799m081K2332j4592j1887K5717l547k0226J8941
$$ 11799 -11294 -1811 16827 -5972 -10053 12279 -2313 -14200 11517 7970 -12256 6685
2465F685M691k5615J0498J6947k2133K458K3797j7409j1311K2548r311j8933K2621
$$ 6685 11376 -14239 -3741 13206 -8927 -6469 17328 -81 -11392 11156 1845 -17088 5533
2478E533M919k2430J4239J2489k5054K420K0157j8671n397K5771r907j6727K1026
$$ 5533 10452 -11978 2261 14750 -10304 -7884 12273 -6398 -11795 13976 4069 -12658 8368
2491H368j825k2912J6536J1681k2853Q191J8981k2217n059K2563j3415j3009K4865
$$ 8368 6543 -16369 167 11848 -11005 -2814 16167 -6050 -11109 11454 -1961 -14970 9895
2504I895j921k0839J8295O057k5451R888J6830k0835J159K2998j6059j2388K2702
$$ 9895 7974 -12865 5430 11487 -13964 -4076 12754 -8081 -6922 16076 17 -12371 10331
2517A0331p004j9096K1185N305k2429J2835J3754k3792J562K0830j7467p692K4449
$$ 10331 3327 -15769 5416 10721 -11708 1127 14881 -8911 -7349 13481 -3986 -11678 12771
2530A2771q614j7352K1224P41k3175J5094J1911k3493O100J9615j9815n459K3005
$$ 12771 4157 -13195 8029 8770 -14405 689 12600 -10893 -4793 14822 -4993 -10452 12553
2543A2553j2071j4521K2488j305k1095J6453R001k3262P971J7687k1564j876K2478
$$ 12553 482 -14039 8449 7144 -13951 2502 11503 -11759 -3788 13899 -7665 -9541 12937
2556A2937j3436j2297K3107m577k0083J8427O100k2819J1302J5686k1961P00K0940
$$ 12937 -499 -12796 10311 5734 -14349 4078 10178 -12641 -1339 14347 -7614 -6914 14026
2569A4026j6788j0135K3509o808j7012K1137K776k2871J2523J1814k3176M366
$$ 14026 -2762 -12897 10612 3804 -13208 7929 10705 -12166 357 12171 -11005 -6639
2581f639K1314j7987n653K2732j1370j6570K0771k9k1047J7174J0691k3275O630
$$ -6639 14675 -3312 -8965 13767 2397 -14173 6598 6569 -14478 2696 13387 -9888 -3258
2594c258J7041k0814l692K2990j2246j2473K2592l358k0698J7066O459k2914J0362
$$ -3258 13783 -7031 -10723 12267 21 -12452 10140 6782 -13916 3150 9609 -13305 -2943
2607b943J7037k0982o28K0792j6251j0934K3242m818j7750J9696M233k3232J1213
$$ -2943 14094 -6888 -7516 13276 -2975 -13909 9333 4515 -13235 6461 10694 -12538 -1325
2620a325J2913k1546K973K1031j6222p232K2265r750j7554J9887K116k0968J5872
$$ -1325 11588 -9958 -6985 14046 -2176 -9408 12857 3107 -14447 5440 7556 -13412 2460
2633B460J1395k2626M628J7604j9287m964K3130j1022j3207K1154k161k0313J5996
$$ 2460 13855 -8771 -4143 13461 -5826 -10790 12340 1318 -11889 9265 7104 -13209 2787
2646B787Q235k2683Q461J7146k0138k433K0985j3920j1993K2958l638j8792J8050
$$ 2787 11022 -11661 -3200 13946 -6192 -8625 12360 -1560 -13553 9405 5767 -13025 5025
2659E025N363k2928R876J4270k0548J723K1079j5628r340K2471q419j7341J9430
$$ 5025 10388 -12540 -2664 11606 -8942 -7219 13860 -1768 -11108 11363 2944 -14397 5033
2672E033K911k0661J3754J2690k2229K999J8498j7690o589K2967r009j4777K0963
$$ 5033 7944 -12717 1037 13727 -8502 -5503 12995 -4695 -11284 11683 2674 -12103 8860
2685H860p84k1283J4905R723k1653O694J7759j9565l392K0842j1983j2893K1917
$$ 8860 8076 -13207 1698 11421 -10232 -3538 14221 -5344 -8736 12106 123 -12770 9147
2698I147k383j9583J7158O354k2390Q674J4931j9367N3K1384j4298j1125K0825
$$ 9147 6764 -12819 4339 10693 -11697 -3023 11908 -7459 -7406 13978 -320 -11445 9380
2711I380o537j7543J9183M874k0881J1850J2872k1414J413J8989j6829p058K2669
$$ 9380 2843 -14700 4483 9357 -11524 326 13198 -8216 -6803 12186 -4643 -11701 10968
2724A0968p268j5737J9068M41k1115J3628J1308k1106N887J8149j8972m938K1254
$$ 10968 3700 -12037 7031 7472 -13643 -15 11293 -9813 -3926 14223 -4749 -9687 11567
2737A1567j1111j3268K1775j343k0093J5954P638k2536P607J6503j8455j035K0624
$$ 11567 456 -12812 8963 7620 -12473 3481 11119 -11417 -3810 12693 -5762 -6797 13827
2750A3827j3958j1431K0531n345j7250J8484N596k1504J1319J3139k1840L85J9955
$$ 13827 -131 -11562 8969 3624 -13626 4858 10454 -11050 269 13408 -8432 -8047 11908
2763A1908j5248p569K2049o746j6756J8182K251k0944J2793J1483k1133M366J8625
$$ 11908 -3340 -10909 11140 4394 -12362 5820 8071 -12873 -80 11403 -9730 -5364 13261
2776A3261j7727n760K1512j0017j4164K0353o60j9660J4546Q951k0931O643J6694
$$ 13261 -4466 -10226 11286 1269 -12895 7458 6798 -12862 1684 10635 -10296 -3653 13041
2789A3041j8351k959K0086j1703j2184K0520k579j8311J6676O434k1396Q625J4885
$$ 13041 -5310 -8269 11817 114 -12070 8450 5871 -12440 4236 10670 -10726 -2101 12784
2802A2784j9331o87K0107j4404r549K0765n148j6774J7977L831k0740J1442J1673
$$ 12784 -6547 -7234 12873 -1531 -11080 9685 4537 -12237 5740 9571 -11169 273 11946
2815A1946k0941K448J8828j5272o001K0969r116j5648J8319N85j9064J4190J0781
$$ 11946 -8995 -6547 12281 -2991 -8992 11977 2861 -12787 5532 6117 -12947 1243 12024
2828A2024k1142N560J6642j9034m698K0403r867j1852K1176k029j9456J4259O767
$$ 12024 -9118 -3558 13084 -5950 -10648 9755 -112 -11964 9212 7183 -12273 1986 8753
2841H753k0321Q504J6182j8565r67J8756j3868j0838K0551m617j6040J8549M883
$$ 8753 -11568 -3064 13118 -5447 -6414 12342 -1526 -12364 8187 3570 -12470 6079 10962
2854A0962k1599R648J1970k0049J521K0572j3975p702K0045p805j6537J7428K020
$$ 10962 -10637 -989 10981 -9068 -7547 13025 -950 -8652 11393 3588 -12949 4479 6499
2867F499j8237J3499J1572k0435K951J6040j7665n274K1674q369j3376J9657j284
$$ 6499 -11738 1761 13333 -7102 -4151 11889 -5776 -11050 10624 2255 -11121 8536 7252
2880G252k0017J3119Q800j9644O782J6537j7211l212J8684j2552j1196J9957k550
$$ 7252 -12765 354 9154 -10490 -3708 12829 -4382 -7594 11090 -1462 -12658 7299 4749
2893D749j6481J6571N191k1555Q335J4119j8891Q84J9703j3174r314J9134n619
$$ 4749 -11732 4839 10030 -11525 -3190 10929 -7962 -7078 12625 -549 -9863 9271 3652
2906C652j6619J6920M269j8551J1832J0657k0283K707J7381j6346n353K1176q533
$$ 3652 -12967 3953 8222 -10329 1503 12160 -8123 -5416 11965 -4381 -9734 11442 2909
2919B909j4375J8398Q62j9961J2933J0249j9489M670J6324j6869m326J8920j0381
$$ 2909 -11466 6932 7794 -12167 766 11015 -8474 -3804 12520 -4349 -8675 10245 -136
2932a36j0963J9429k597j7890J5122O624k0621P884J5415j8323j357J8921j2275
$$ -136 -11099 8330 5733 -12157 2965 9589 -11032 -3148 12267 -6056 -7413 11508 -767
2945g67j0547J9409m186j6112J6627M773j9705R442J1815j9144K104J8525j4871
$$ -767 -11314 8095 3909 -12203 4424 9197 -10508 -1066 10749 -8395 -6291 12234 -2637
2958b637o986J9617o889j5655J7933K350j8987J1795J1096j9352L161J5434j5316
$$ -2637 -9623 9994 3105 -12550 5383 7733 -11254 541 11637 -7715 -4554 10880 -4436
2971d436m245J9466q760j2521J8328j660j8210J3895Q328j9419O593J5408j7491
$$ -4436 -8681 10785 2025 -10496 7832 6172 -12038 1857 10185 -9234 -2641 12767 -4724
2984d724l192J8917j1664j0693J9352k813j6545J5354M835j9701Q800J2762j7762
$$ -4724 -7916 11001 -663 -11356 7996 5183 -11362 3992 8827 -10874 -2074 10688 -7074
2997g074P36J8384j3934q745J9608o243j5057J7129L374j8871J0501J0854j8803
$$ -7074 -6338 12046 -1888 -10633 8975 2732 -12325 4804 8178 -10693 -192 10662 -8141
3010h141K656J6606j4878n429J9502q261j3239J7933l20j8107J2830R290j9049
$$ -8141 -5485 11121 -3757 -9186 10316 2055 -11184 6749 6429 -11678 1152 10442 -8607
3023h607N367J5577j6900l541J8491j0365j0634J8576j874j7190J4245O059j8896
$$ -8607 -3240 12337 -4563 -8104 10387 22 -10612 7964 6090 -11100 3145 9204 -9692
3036i692P507J3720j7523p39J7972j2079r369J8544m243j5799J5878M114j8609
$$ -9692 -2185 11535 -5988 -6727 11245 -834 -10203 8341 4098 -11701 4177 8291 -10318
3049a0318R692J1223j8213J672J6792j3583o571J8745o950j4358J7314J431j8011
$$ -10318 -626 10597 -7616 -5944 10848 -2735 -9306 9439 2489 -11869 5445 6876 -11135
3062a1135J1685R685j8446M016J5510j5983l906J8454q981j1792J7885q21j7245
$$ -11135 550 10235 -8211 -4195 11315 -4668 -8574 9880 899 -10893 6992 6171 -11074
3075a1074J3375P113j8466O310J4330j6713j846J7848j0974j0081J8295l298j5859
$$ -11074 2301 9414 -9052 -2742 11588 -5125 -6971 10877 -97 -10178 8117 4819 -11040
3088a1040J5056M613j8347Q653J2026j7785Q15J7170j2933p449J8359o113j4303
$$ -11040 4016 8629 -9718 -1065 10961 -6824 -6009 11161 -1772 -9221 9138 3025 -11278
3101a1278J6079K422j7803J0580J0201j7969L145J5119j3849n494J8358p875j2275
$$ -11278 4801 7223 -10580 0 10201 -7768 -4623 10496 -3353 -8847 9511 1636 -10639
3114a0639J6536n9j6745J2206P836j8005N495J4222j5460l283J7903r929j0404
$$ -10639 5897 5838 -10907 1299 9135 -8870 -3375 10847 -4613 -7896 10007 78 -10326
3127a0326J7587k415j5636J4020N311j7846P437J2607j6306o66J7230j2024q274
$$ -10326 7261 4846 -10790 3230 8541 -9305 -1868 10739 -5567 -6233 10997 -1027 -9301
3140i301J7664m721j4153J4956L813j7695R173J0879j7443J467J5994j3060o164
$$ -9301 8363 3642 -10511 4445 8258 -9437 -264 10615 -6828 -5361 10633 -2427 -8591
3153h591J7415o041j3161J5517R38j6588J1379R132j7630L722J4301j4575l997
$$ -8591 8824 2783 -10378 5139 6077 -10511 868 10000 -7630 -3908 10393 -4182 -8179
3166h179J7341q597j0943J7033j181j5780J2238O313j7168O116J3223j5151k168
$$ -8179 9162 565 -10378 6655 5474 -10306 1932 8245 -8923 -2807 10416 -4735 -6903
3179f903J6961j0891r380J7227l220j4638J4555M775j7344P724J1415j6619L10
$$ -6903 10058 -833 -10213 7014 3794 -10844 3711 8486 -8858 -1134 10281 -6338 -6028
3192f028J6272j1539p452J7427n504j3247J4564K247j6541R845J0386j6931K713
$$ -6028 10244 -1295 -8747 8680 3176 -10071 4493 6740 -9801 44 10430 -6501 -3788
3205c788J4374j3706n417J7377p240j1413J5798L49j6039J0854P323j6935M937
$$ -3788 10586 -3120 -8537 8840 1600 -9813 5985 6334 -9705 1149 8472 -8463 -3526
3218c526J3678j4253k709J6375r323j0179J5996j870j4855J3350N567j6408O352
$$ -3526 10152 -4101 -6810 9565 242 -9937 6059 4189 -10666 2684 8251 -8157 -1805
3231a805J1605j5702p73J5655j0172p855J6858l977j3878J3709L296j6424Q503
$$ -1805 9800 -5902 -6675 8980 -1192 -9047 7811 3834 -10044 3665 6961 -9463 -960
3244i60J0635j5966K026J4683j2484o463J6428o276j1288J5313J180j5627J0097
$$ -960 9675 -6291 -4265 10418 -2066 -8529 7899 1623 -9665 5648 6828 -8799 1298
3257A298P761j6623L812J3855j3831l202J6334q235j0370J5218j448j4642J2046
$$ 1298 9059 -7564 -3752 10103 -3728 -6930 9404 1169 -9201 6017 4569 -10073 1973
3270A973O183j5712N477J2021j5131j986J5908r747q064J6377k864j3973J2667
$$ 1973 8156 -7556 -2079 9942 -5189 -7175 8733 -1014 -9078 7299 4435 -9538 3129
3283C129L796j6141P555J0713j4639M53J4868j1069p057J5259m710j2061J4099
$$ 3129 6925 -9216 -1661 9052 -5587 -5134 9734 -1335 -8392 6867 2157 -9904 4195
3296D195L079j6027R172Q372j5749K613J3771j2229m698J6550p172j0876J4217
$$ 4195 7274 -8753 419 8791 -6958 -4345 9426 -2803 -7501 9049 1877 -8999 5218
3309E218J55j4786J0385P812j5350M167J2726j3963l261J5462q089r474J5469
$$ 5218 5373 -9413 972 8784 -6566 -2399 10327 -3636 -6897 8565 476 -8998 6471
3322F471j480j3991J1678N132j5950N731J1380j4171l32J4584r816p682J5120
$$ 6471 4991 -9000 2678 7810 -8140 -2409 8971 -5200 -5532 9052 -764 -8446 6674
3335F674l677j3040J3331L438j4939P810R347j5063J085J3572j1240n269J5711
$$ 6674 2997 -10043 3288 6726 -8213 -403 8944 -6119 -5034 8538 -2702 -7971 7740
3348G740n436j1165J3628J046j5247R605P806j4409L217J2931j2448l936J4813
$$ 7740 2304 -8861 4767 5813 -9434 171 7977 -6432 -3215 9716 -2732 -6668 8145
3361H145p584r746J4330J13j3430J0665N612j5282M667J1373j3300j481J4899
$$ 8145 561 -9185 5145 5258 -8172 2493 8105 -7177 -2510 8863 -4437 -5918 8981
3374H981q209q628J4556l352j2808J1823M362j4431P020J0125j4368j2J2965j0276
$$ 8981 772 -7856 6700 3348 -9460 2363 6725 -7706 -686 9439 -4929 -4941 8024 -2252
3388b252o134J5449m174j1712J3020K201j5219P971Q522j3717J652J3698j1343
$$ -2252 -8386 7063 2889 -8823 4197 6398 -8821 -850 7672 -6045 -4393 9305 -2038
3401b038n059J4012n960j0327J4177J9j3348R790O643j4994L889J1665j2363k409
$$ -2038 -7097 6915 955 -9372 4805 4824 -8524 1266 7909 -7085 -3196 8469 -3894 -6303
3415f303J4708p429q753J3569j833j2817J0468N538j3991N987J0155j3794r02
$$ -6303 8405 976 -7777 5792 3959 -8858 1610 7148 -6843 -856 9299 -4495 -5397
3428e397J3468r091o813J4397l100j1726J1892K988j4981O778R607j3377J141
$$ -5397 8071 -1020 -7833 6564 3464 -8262 3630 6618 -8363 -1585 8022 -5355 -4214
3441d214J2638j0034n532J4011n389j0454J3164J561j4038Q977P533j4656K773
$$ -4214 8424 -1610 -7142 6869 1480 -8974 4190 5751 -8287 690 8223 -6433 -3660
3454c660J1923j1467l716J4686o316r727J2832j04j2891R781N692j3710M442J0942
$$ -3660 8263 -3204 -6920 7766 1450 -8277 4555 4451 -8440 1341 7033 -6677 -2235 8707
3468H707j2338k349J3741q101p233J3762k205j1937J0987L591j3913N734R673
$$ 8707 -3631 -5980 7761 -340 -7573 6189 3984 -7953 3034 6625 -7288 -1554 8119
3481H119j2372k10J3220r264o517J3541l867j0875J1535K447j3014P444P642j3379
$$ 8119 -4253 -4463 8757 -507 -7024 6517 2650 -8225 3310 5757 -7257 187 7829 -5550
3495e550J947J1600j0230m447J3838n263j0151J2362K47j2456Q947O616j3197
$$ -5550 -3603 7997 -2233 -6680 7158 1895 -8256 4106 4353 -8103 844 7460 -5737
3508e737K987J0635j1588k335J2908o820p529J3167j590j2407J0026M773j3976
$$ -5737 -2750 7885 -3703 -6038 6870 50 -7479 5688 4098 -8309 1717 6490 -7486
3521g486N430J0028j1465p54J2378q505p203J2901k968j0628J1309L328j3208
$$ -7486 -2056 7972 -3493 -4247 8131 -374 -7577 5324 2356 -8272 3037 6365 -6843
3534f843O676Q078j2748O95J2068r240n169J3402m942r720J1294J382j2204P736
$$ -6843 -167 7911 -4837 -4142 7926 -1314 -6483 6919 1977 -7743 3551 4933 -7271 465
3548D65P193j2976K362J0317j0457l164J2721n314q737J2679o51j2481Q858N445
$$ 465 7658 -5318 -2956 7361 -3096 -6260 6461 1147 -7590 5089 4438 -8043 815 6260
3562F260j2990L993J0298j0857j851J2464p540p066J2231k333j0709J0441L748
$$ 6260 -6730 -2737 7561 -3296 -5147 7317 -223 -7289 4942 2609 -8100 2341 6089
3575F089j2524N708Q373j1862k18J1595q546n601J2844l447r518J0728K044j2623
$$ 6089 -6435 -727 7646 -4216 -4434 7161 -1385 -6986 5858 2411 -7107 3621 5665 -6958
3589f958O817P252j2336J797J1385r807l799J2703n724q859J1442L11j1573Q603
$$ -6958 -141 7111 -5225 -3428 7957 -1850 -5649 7054 1330 -7529 3913 4224 -7349 1254
3603A254N854j2642L270R473j0280k688J3035o405p879J2406j958j1602R349M283
$$ 1254 7108 -5534 -2264 7209 -3071 -5759 7276 871 -7008 5398 3440 -8162 1187 5470
3617E470j1943N522R102j1607j523J1589q265o115J2972k180r683J0366K209j2933
$$ 5470 -6473 -951 8151 -3456 -4979 6610 -1655 -7770 5202 3022 -6661 3705 5914 -7019
3631g019N712O999j1284J766J2099q759m977J1857m987r723J1182J467j0654P739
$$ -7019 -1307 5692 -5592 -3826 8273 -486 -5463 6394 1407 -8316 2866 4333 -6321 1418
3645A418O103j2499K145R780j0165k644J2884n520p366J0590j274j1322Q459N366
$$ 1418 7521 -4978 -2833 6947 -3218 -5862 7022 1502 -5864 4726 3452 -7870 589 5955
3659E955j1329M555Q864j0835k414J1096p209n979J2396j174r935R417K104j2529
$$ 5955 -5374 -819 8045 -2790 -5204 5892 -1317 -7296 5100 3926 -6009 3408 5512 -7017
3673g017M918P499j0031P20J1886q371n400J1287m524r292J0987J960j0884O950
$$ -7017 -2099 5400 -4631 -3911 7975 -396 -5796 5491 967 -8325 2662 4622 -6262 688
3687F88O703j2275J669R642q870l142J1881m878q170J0984l54j1116Q194N559
$$ 688 7391 -4884 -3215 6427 -2443 -5585 6296 1418 -6752 4232 3878 -7238 956 6515
3701F515j1423L181R252j0333k301J1238o319o250J1628j467j0271Q639L389j1802
$$ 6515 -4908 -1727 7525 -2808 -5109 6129 -190 -6440 5188 3721 -6550 2089 5478 -6324
3715f324M884Q330j0671k2J0709p369n882J1668k970r252R198K473j0994N848
$$ -6324 -1440 6890 -3781 -3803 6906 -463 -6345 5323 2353 -6899 2299 4772 -6222 -374
3729c74P163j0740O05J0155q664m245J1258m113q258J1228Q82j1498P345N343
$$ -374 6789 -3951 -3346 6809 -1855 -6100 5158 1045 -7213 4015 4897 -6601 744 6087
3743F087j1547K028R687q639k270J1529n723p713J0767j167j0304Q674M403j0960
$$ 6087 -5460 -3432 6255 -2384 -4654 6875 1152 -6561 4206 3039 -7265 1409 5812 -5148
3757e148L738Q211r904j291J0750o545n548J1000k001j0324R153K536j0856N418
$$ -5148 -1410 6801 -3103 -4394 6356 -189 -5737 5263 3262 -7062 2091 4627 -6229 -811
3771h11P769j0199L59R453q268m455J0394k833p627R941J660j1071N495N689j1047
$$ -811 6958 -3241 -2882 6571 -1697 -6152 4242 1409 -6218 3723 5383 -5688 -193 5496 -5551
3786e551K163R499q069k449J0857n103q336R772K70j0156Q167N149j1122L249
$$ -5551 -3388 6111 -1958 -4407 6450 1347 -6989 2783 3053 -7103 1064 6213 -4909 -1660
3800a660Q137r511k004J1073n757o299J0738j565r685Q103L236j0853M943Q017
$$ -1660 6477 -3034 -5038 6035 278 -6021 4717 3152 -6533 1570 4806 -6047 -1104 6913
3814F913r868m81R566p147m973J0682k165q714R492K383j1117N048O238j0622
$$ 6913 -2955 -3436 6130 -1017 -5990 4692 2527 -6187 3305 5688 -5429 -381 5857 -4765
$$ [...]
8191I55
##END NTUPLES=NMR FID
##END=
