##TITLE=1H_D5-B-Dep
 200.13MHz,CDCl3,
 8 sc
 
 7.7.2025
##JCAMPDX= 6.0         $$ Bruker NMR JCAMP-DX V2.0
##DATA TYPE= NMR FID
##DATA CLASS= NTUPLES
##ORIGIN= UXNMR, Bruker Analytische Messtechnik GmbH
##OWNER= pz
$$ XWIN-NMR		Version 3.5
$$ Mon Jul  7 16:35:45 2025 Russian Standard Time (UT+4h)  she@DPX200
##.OBSERVE FREQUENCY= 200.1313
##.OBSERVE NUCLEUS= ^1H
##.DELAY= (6, 6)
##.ACQUISITION MODE= SIMULTANEOUS
##.ACQUISITION SCHEME= undefined
##.AVERAGES= 8
##.DIGITISER RES= 18
##SPECTROMETER/DATA SYSTEM= spect
##.PULSE SEQUENCE= zg30
##.SOLVENT NAME= CDCl3
##.SHIFT REFERENCE= (INTERNAL, CDCl3, 0, 14.3821)
##AUDIT TRAIL= $$ (NUMBER, WHEN, WHO, WHERE, WHAT)
$$ ##TITLE= Audit trail, XWIN-NMR		Version 3.5
$$ ##JCAMPDX= 5.01
$$ ##ORIGIN= Bruker BioSpin GmbH
$$ ##OWNER= she
$$ F:/spectra/data/she/nmr/H-C/1/audita.txt
$$ ##AUDIT TRAIL=  $$ (NUMBER, WHEN, WHO, WHERE, WHAT)
(   1,<2025-07-07 16:34:28.18 +0400>,<she>,<DPX200>,
      <created by zg, POWCHK disabled, PULCHK disabled
       configuration hash MD5:
       00 E9 B6 7A A2 85 ED C7 34 08 36 98 17 FE 4E 26
       data hash MD5: 16K
       42 20 AC 59 41 BF FD 03 06 84 8F DB 65 08 D1 18>)
$$ ##END=
$$ 
$$ hash MD5
$$ 15 3F 93 40 31 CD 41 E2 E9 51 22 FD A8 B1 C1 57
##$RELAX= 
##$RELAX= 
##$RELAX= 
##$RELAX= 
##$RELAX= 
##$RELAX= 
$$ Bruker specific parameters
$$ --------------------------
##$DU= <F:/spectra>
##$EXPNO= 1
##$NAME= <H-C>
##$PROCNO= 1
##$TYPE= <nmr>
##$USER= <she>
##$AMP= (0..31)
100 100 100 100 100 100 100 100 100 100 100 100 100 100 100 100 100 100 
100 100 100 100 100 100 100 100 100 100 100 100 100 100 
##$AQSEQ= 0
##$AQ_mod= 1
##$AUNM= <au_zg>
##$AUTOPOS= <>
##$BF1= 200.13
##$BF2= 200.13
##$BF3= 200.13
##$BF4= 200.13
##$BF5= 200.13
##$BF6= 200.13
##$BF7= 200.13
##$BF8= 200.13
##$BYTORDA= 1
##$CFDGTYP= 0
##$CFRGTYP= 5
##$CHEMSTR= <none>
##$CNST= (0..31)
1 1 145 1 1 1 1 1 1 1 1 1 1 1 1 1 1 1 1 1 1 1 1 1 1 1 1 1 1 1 1 1 
##$CPDPRG= <>
##$CPDPRG1= <>
##$CPDPRG2= <>
##$CPDPRG3= <>
##$CPDPRG4= <mlev>
##$CPDPRG5= <mlev>
##$CPDPRG6= <mlev>
##$CPDPRG7= <mlev>
##$CPDPRG8= <mlev>
##$CPDPRGB= <>
##$CPDPRGT= <>
##$D= (0..31)
0 0.7 0 0 0 0 0 0 0 0 0 0.03 0 0 0 0 0 0 0 0 0 0 0 0 0 0 0 0 0 0 0 0 
##$DATE= 1751891667
##$DBL= (0..7)
120 120 120 120 120 120 120 120 
##$DBP= (0..7)
150 150 150 150 150 150 150 150 
##$DBP07= 0
##$DBPNAM0= <>
##$DBPNAM1= <>
##$DBPNAM2= <>
##$DBPNAM3= <>
##$DBPNAM4= <>
##$DBPNAM5= <>
##$DBPNAM6= <>
##$DBPNAM7= <>
##$DBPOAL= (0..7)
0.5 0.5 0.5 0.5 0.5 0.5 0.5 0.5 
##$DBPOFFS= (0..7)
0 0 0 0 0 0 0 0 
##$DE= 6
##$DECBNUC= <off>
##$DECIM= 32
##$DECNUC= <off>
##$DECSTAT= 4
##$DIGMOD= 1
##$DIGTYP= 9
##$DL= (0..7)
0 120 120 120 120 120 120 120 
##$DP= (0..7)
150 150 150 150 150 150 150 150 
##$DP07= 0
##$DPNAME0= <>
##$DPNAME1= <>
##$DPNAME2= <>
##$DPNAME3= <>
##$DPNAME4= <>
##$DPNAME5= <>
##$DPNAME6= <>
##$DPNAME7= <>
##$DPOAL= (0..7)
0.5 0.5 0.5 0.5 0.5 0.5 0.5 0.5 
##$DPOFFS= (0..7)
0 0 0 0 0 0 0 0 
##$DQDMODE= 0
##$DR= 18
##$DS= 0
##$DSLIST= <SSSSSSSSSSSSSSS>
$$ [...]
##$SUBNAM0= <"">
##$SUBNAM1= <"">
##$SUBNAM2= <"">
##$SUBNAM3= <"">
##$SUBNAM4= <"">
##$SUBNAM5= <"">
##$SUBNAM6= <"">
##$SUBNAM7= <"">
##$SUBNAM8= <"">
##$SUBNAM9= <"">
##$SW= 18.0517328524113
##$SWIBOX= (0..15)
0 0 2 0 0 0 0 0 0 0 0 0 0 0 0 0 
##$SW_h= 3612.71676300578
##$TD= 16384
##$TD0= 1
##$TE= 0
##$TE2= 300
##$TE3= 300
##$TEG= 300
##$TL= (0..7)
0 120 120 120 120 120 120 120 
##$TP= (0..7)
150 150 150 150 150 150 150 150 
##$TP07= 0
##$TPNAME0= <>
##$TPNAME1= <>
##$TPNAME2= <>
##$TPNAME3= <>
##$TPNAME4= <>
##$TPNAME5= <>
##$TPNAME6= <>
##$TPNAME7= <>
##$TPOAL= (0..7)
0.5 0.5 0.5 0.5 0.5 0.5 0.5 0.5 
##$TPOFFS= (0..7)
0 0 0 0 0 0 0 0 
##$TUNHIN= 0
##$TUNHOUT= 0
##$TUNXOUT= 0
##$USERA1= <user>
##$USERA2= <user>
##$USERA3= <user>
##$USERA4= <user>
##$USERA5= <user>
##$V9= 5
##$VALIST= <valist>
##$VCLIST= <CCCCCCCCCCCCCCC>
##$VD= 0
##$VDLIST= <DDDDDDDDDDDDDDD>
##$VPLIST= <PPPPPPPPPPPPPPP>
##$VTLIST= <TTTTTTTTTTTTTTT>
##$WBST= 1024
##$WBSW= 4
##$XGAIN= (0..3)
0 0 0 0 
##$XL= 0
##$YL= 0
##$YMAX_a= 95300
##$YMIN_a= -126675
##$ZGOPTNS= <>
##$ZL1= 120
##$ZL2= 120
##$ZL3= 120
##$ZL4= 120
##$ABSF1= 10
##$ABSF2= 0
##$ABSG= 5
##$ABSL= 3
##$ALPHA= 0
##$AQORDER= 0
##$ASSFAC= 0
##$ASSFACI= 0
##$ASSFACX= 0
##$ASSWID= 0
##$AUNMP= <proc_1d>
##$AZFE= 0.1
##$AZFW= 0.1
##$BCFW= 1
##$BC_mod= 2
##$BYTORDP= 1
##$COROFFS= 0
##$CY= -3
##$DATMOD= 1
##$DC= 2
##$DFILT= <>
##$DTYPP= 0
##$F1P= 0
##$F2P= 0
##$FCOR= 0.5
##$FTSIZE= 0
##$FT_mod= 4
##$GAMMA= 1
##$GB= 0.15
##$INTBC= 1
##$INTSCL= 1
##$ISEN= 128
##$LB= 0.25
##$LEV0= 0
##$LPBIN= 0
##$MAXI= 10000
##$MC2= 0
##$MEAN= 0
##$ME_mod= 0
##$MI= 1.114404
##$NCOEF= 0
##$NC_proc= 0
##$NLEV= 6
##$NOISF1= 3.799351
##$NOISF2= 2.8
##$NSP= 1
##$NTH_PI= 0
##$NZP= 0
##$OFFSET= 14.38212
##$PC= 1
##$PHC0= -1207.576
##$PHC1= 15.59238
##$PH_mod= 1
##$PKNL= yes
##$PPARMOD= 0
##$PSCAL= 0
##$PSIGN= 0
##$REVERSE= no
##$SF= 200.129724274929
##$SI= 16384
##$SIGF1= 3
##$SIGF2= 2
##$SINO= 400
##$SIOLD= 16384
##$SREGLST= <1H.CDCl3>
##$SSB= 0
##$STSI= 0
##$STSR= 0
##$SW_p= 3205.1282051282
##$SYMM= 0
##$S_DEV= 0
##$TDeff= 0
##$TDoff= 0
##$TI= <>
##$TILT= no
##$TM1= 0
##$TM2= 0
##$TOPLEV= 0
##$USERP1= <user>
##$USERP2= <user>
##$USERP3= <user>
##$USERP4= <user>
##$USERP5= <user>
##$WDW= 1
##$XDIM= 8192
##$YMAX_p= 0
##$YMIN_p= 0
$$ End of Bruker specific parameters
$$ ---------------------------------
##NTUPLES= NMR FID
##VAR_NAME=  TIME,          FID/REAL,        FID/IMAG
##SYMBOL=    X,             R,               I
##VAR_TYPE=  INDEPENDENT,   DEPENDENT,       DEPENDENT
##VAR_FORM=  AFFN,          ASDF,            ASDF
##VAR_DIM=   8192,          8192,            8192
##UNITS=     SECONDS,       ARBITRARY UNITS, ARBITRARY UNITS
##FACTOR=    0.0002768,     1,               1
##FIRST=     0,             0,               0
##LAST=      2.2672688,     0,               0
##MIN=       0,             -126675,         0
##MAX=       2.2672688,     95300,           0
$$ Real data points
##PAGE= N=1
##DATA TABLE= (X++(R..R)), XYDATA
0@%%%%%%%%%%%%%%%%%qJ6j6J6j6J6k4L2l2L8m6N1n9O7p5Q7r8J10j26J42j58J74
39I1j95K19k43K71l00L30l65M03m45M92n40N94o55P22p96Q79r74J080j203J347
59G12j516J717j963K278k687L244m057N363p790J3779n7432p8323J31965P4164
73G9454o0623o3176L939O4246n649m5782M7040k4886l5905K4270K9731q94l2722
86b0957k9621M3436L3055m6336J4661Q767j9080K3415M156J0644j1215k9690K7005
99H240L7962m4380j3437K9310j0266K648j8639R907K5752l8546o013L8542j0105
112A0975j9807J6151j953P504j5771q769M8372k6811m3572K9029K7293j1588l0280
125a9227j6681M2725J7353n8348R720K9885q599k143j5345J2394K2219k2131m701
$$ plain form
0 0 0 0 0 0 0 0 0 0 0 0 0 0 0 0 0 0 0 -8 8 -8 8 -8 8 -16 16 -16 22 -24 27 -32 35 -40 47 -51 59 -67 75 -83 91
39 91 -104 115 -128 143 -157 173 -192 211 -234 258 -282 312 -343 379 -417 462 -512 568 -635 712
59 712 -804 913 -1050 1228 -1459 1785 -2272 3091 -4699 9080 -48352 -126675 5290 79454
73 79454 18831 -44345 -40406 23840 18191 -27591 19449 -5437 -41342 -17072 12659 11765 -20957
86 -20957 -50578 -7142 25913 -20423 -5762 3005 -16075 7340 11496 22140 10925 -18765 8240
99 8240 46202 1822 -11615 17695 7429 10077 -8562 1345 27097 -11449 -17462 21080 10975
112 10975 -8832 7319 5366 12870 -2901 -11670 36702 9891 -33681 -4652 22641 11053 -19227
125 -19227 -35908 6817 24170 -34178 -24458 5427 -3172 -5315 -20660 -8266 13953 -8178 -12879
138a2879K0462j7672Q170J7428k3938L488j210N534K0243k6584j0444K9376o780
151E194r181J5643r195K864o191n460L8634j4802l8661J7152K0970K916r581k8264
165a7962J1899K3848j7399R252m539k7214J9510J5871k555r089k7036J3521L6680
178B4787k3349j7308R303m127J4320n529j1359J6395j2161r052K5075l652j0963
191g620N721r286J5370P041k0238J1429j864j0093K0864n208j5504Q607k421Q874
205E672N566k4743J3488J4953j6389N455J367j471J0884j4770k296K1044j5536
218C224o304R728j0409P672j257j3259J2482m650p271J6505j0217p838J6302n885
232a177K411J154j3236J7435K274j8873R356M27n178Q879j2911l85J2526j4944
$$ plain form
138 -12879 7583 -10089 -1919 15509 -8429 -4941 -6151 -617 19626 -6958 -17402 11974 5194
151 5194 -3987 11656 2461 5325 -866 -6326 32308 17506 -21155 -4003 16967 19883 10302 -17962
165 -17962 -6063 17785 386 9638 5099 -22115 -2605 13266 10711 1622 -25414 -11893 24787
178 24787 1438 -15870 -6567 -10694 3626 -1903 -13262 3133 -9028 -18080 6995 3343 -7620
191 -7620 -1899 -11185 4185 11226 -9012 2417 553 -9540 11324 6116 -9388 -781 -3202 5672
205 5672 11238 -13505 -17 14936 -1453 4002 5369 3898 14782 12 -2284 18760 3224
218 3224 -3080 6648 -3761 3911 2654 -10605 1877 -2773 -10044 6461 -3756 -11594 4708 -1177
232 -1177 1234 2388 -10848 6587 8861 -10012 -656 -229 -5407 3472 -9439 -9824 2702 -12242
246a2242O569Q897j3570Q092L394n248J2965p109m351J5095j0484l2J2141j5106
260i89J853M836p407R314p879j1860J7849k460q459Q093q034O188R247j3925P758
275D125M121j1725J1423j046j0288Q584p053j590R180j4943K981Q658j3868O249
289e192M394q270R081l969l382J5033q899m088J2255q216L465L299j1740R163
303B934M80j0659J0634n025o663J2492o608m14P169j0324P839O529j2153Q908
317E139K439r206R963m669l689R291j1248O30R199j2270L329L619r020Q738j791
332D54q126J1516m865l467J0762r519J197O796q797N918O43j0719J0776j486q081
347f998Q821n776j327Q583r203L263O366j0088P157K755q305Q881k901m856J0210
$$ plain form
246 -12242 -5673 3224 -10346 -2254 1140 -4108 8857 1748 -2603 12492 2008 1976 14117 -989
260 -989 864 5700 -1707 7607 -272 -12132 5717 3257 -5202 2891 -5143 1045 10292 -3633 4125
275 4125 8246 -3479 7944 6898 -3390 5194 -1859 -3449 5731 -9212 -6231 2427 -11441 -5192
289 -5192 -798 -9068 13 -3956 -7338 7695 -1204 -5292 6963 -1253 2212 5511 -6229 2934
303 2934 3414 -7245 3389 -1636 -8299 4193 -2415 -2829 4340 -5984 1855 8384 -3769 5139
317 5139 7578 -1628 8335 3666 -23 9268 -1980 -1350 7849 -4421 -1092 2527 -6493 2245 454
332 454 -7672 3844 -1021 -4488 6274 -3245 -2048 4748 -4049 1869 2512 -8207 2569 1083 -6998
347 -6998 1823 -3953 -5280 3303 -5900 -2637 3729 -6359 798 3553 -4752 4129 1228 -3628 6582
362F582p313j200Q161r536L584N672r607N877P42o776J0783m668o338R830o056
377b63L92O615j0331L667L899q764Q001j477q358R255l687k652Q503q334Q35O962
393D263q279N282K214q865P063p44n799Q212o445k645Q409p644J707N932q281
408e620N180K260o416Q948k094n286Q621m927r62P689q509O29M199p458O821j37
424B938r791P335p80k097P538q354k87R177n997L063K313q293P184M39o388O957
440D957n039m453P576o372J72N089r298L783M236o490O338o78m403Q849m635j843
456b211Q746n841p06L225o950O799J517j0662M385L07k102P042p046k963Q365
471A905m349L841L893r399M751M097l217O685o450n758R173k160j828J694r586
$$ plain form
362 6582 -731 -1931 6230 -3306 278 5950 -3657 2220 2962 -3814 6969 2301 -4037 5793 -263
377 -263 129 6744 -3587 80 3979 -4785 3216 1739 -6619 2636 -1051 -3703 4800 -3534 -2699 4263
393 4263 -4016 1266 3480 -5385 1678 934 -4865 3347 -3098 -5743 2666 -4978 -3271 2661 -5620
408 -5620 -440 1820 -4596 4352 2258 -3028 5593 666 -296 7393 -1116 -487 3712 -3746 3075 2938
424 2938 -6853 482 -298 -2395 5143 -3211 -3498 5679 -318 2745 5058 -3235 3949 4388 -2000 4957
440 4957 -82 -4535 3041 -3331 -3159 1930 -7368 -3585 651 -5839 499 -179 -4582 4267 -368 -2211
456 -2211 6535 694 -12 3213 -3737 3062 4579 -6083 -1698 -1391 -3493 3549 -3497 -6460 1905
471 1905 -2444 1397 5290 -4109 642 4739 1522 8207 1757 -4001 5172 3012 1184 2878 -6708
486f708M480N946p965L524k75n123Q191j843k197P104p080K51P076n317K214N31
502B809p705P324k65p058N935l220k238N263o366L667N784r467K823M406k152
517d60O211n612n760J0328n37l169K050p214L625N713p546K847k39n869P139J81
533A688l256M460o334J091Q828o062p06K377m487O554j062p170O685j936l684
548c014N249m694J027M190o874L000L274n890N183K87n318N616l248p76O949o887
564a926j662M959k976M494r82q954O790L351l570K894n854K06R238n499j559K764
580A714n007M943J065n166N019k884m444Q193j996k200K083m954M472M732p622
595b052K436J106l586N613k767k959N181n162p57N894n797J631K149n459M778
$$ plain form
486 -6708 -2228 3718 -4247 -723 -998 -6121 2070 227 -1970 5134 -1946 -1695 5381 64 2278 2809
502 2809 -4896 2428 2163 -4895 1040 -2180 -4418 845 -5521 -1854 3930 -5537 -2714 1692 -460
517 -460 5751 139 -5621 4707 4170 1001 3051 -4163 -538 5175 -2371 476 237 -5632 1507 1688
533 1688 -1568 2892 -3442 -2351 6477 415 -291 2086 -2401 4153 3091 -4079 2606 670 -3014
548 -3014 2235 -2459 -1432 2758 -4116 -1116 2158 -3732 1451 1738 -3580 2036 -1212 -1988 4961 -1926
564 -1926 -3588 1371 -1605 2889 1907 -7047 -257 3094 -476 2418 -3436 -3230 6008 509 -1050 1714
580 1714 -3293 1650 2715 -2451 2568 -316 -4760 3433 1437 -763 1320 -3634 838 5570 -2052
595 -2052 384 1490 -2096 3517 750 -2209 2972 -2190 -2947 2947 -2850 -1219 930 -4529 249
610B49J432m373N544l636j889P386l948q89L030o087L668L106o229K940k105l055
626d856P841l239m018M474k433L074L125o906L670L259m882M136o97l680M669
641C537m217l22M964o603l44L981l904L068k38m604O255o43l334N324l020L38
657B38M549n573J351K325m515M232j670n971N791j104k586L096m304J486M961
672B306n288K406K669m676M701P35l638M319k921j263N039n201j79L392n486K366
688g19J399m567M480j951k764P014k642k323M750l180K299K231n612L560J167
703C142n170M075j440l318M109l466n37M139m722J509K870m614L910J103l520
718a930M080j623j507N387m694j233M394l928J222J117m858M315k57m204N003
$$ plain form
610 249 1681 -2692 2852 -784 -2673 4713 765 -124 2906 -3181 487 3593 -2636 304 -1801 -4856
626 -4856 2985 -254 -4272 202 -2231 843 3968 -2938 732 3991 -891 3245 2548 -1132 3537
641 3537 -680 -1002 3962 -2641 -2985 996 -2908 160 -78 -4682 1573 930 -2404 2920 -100 238
657 238 4787 -786 565 2890 -1625 2607 937 -5034 757 -347 -2933 163 -4141 -2655 2306
672 2306 -2982 -576 2093 -2583 2118 2853 -785 3534 613 -650 4389 -812 -991 2401 -3085 -719
688 -719 680 -3887 593 -1358 -4122 2892 250 -2073 2677 -503 1796 4027 -1585 1975 3142
703 3142 -2028 2047 607 -2711 1398 -2068 -2605 1534 -3188 -1679 1191 -3423 487 1590 -1930
718 -1930 2150 527 -980 4407 -287 -1520 2874 -1054 168 1285 -3573 742 485 -3719 1284
733A284k130j866M945l156J72L221m401L067J633m802M225n04l731M444k721j270
749a590L768m658J247M205n628K304J340l047M206j556k970M886k939r14M454
764C108m708R96K635m321L130J98m034M533j215k715M818l143p63L848m212K209
780C64K070n262L360O56l474L801k501j347M888l893J80L664m544K895J546m436
796b033L379j14k799M747l570j711M776m054K12K863m680K640J329l938M340p97
812E90l043M671k259n66M068m525J366K664m511K379N29m037L659j275k624M000
828A086l139k36M185m446J942K707l708L153N24l514M230j684k173M031l682q4
844h08K800m702J744J800m460L621l52k794M558j675j277M269l347J154L144m516
$$ plain form
733 1284 -846 -2712 2233 -923 -751 2470 -1931 1136 2769 -2033 2192 1688 -2043 2401 -320 -1590
749 -1590 2178 -2480 -1233 2972 -2656 -352 988 -2059 2147 591 -2379 2507 -432 -1346 3108
764 3108 -1600 -604 2031 -2290 840 1038 -2996 1537 322 -2393 2425 -718 -1481 2367 -1845 364
780 364 2434 -2828 532 1188 -2286 1515 -986 -2333 2555 -1338 -1158 2506 -2038 857 2403 -2033
796 -2033 1346 1232 -1567 3180 -390 -2101 2675 -1379 -1167 1696 -2984 -344 985 -2953 1387 590
812 590 -2453 2218 -41 -607 3461 -1064 302 2966 -1545 834 1363 -2674 985 -290 -2914 1086
828 1086 -2053 -2289 1896 -2550 -608 2099 -1609 1544 2068 -1446 2784 1100 -1073 2958 -724 -808
844 -808 1992 -2710 -966 834 -3626 -5 -357 -3151 1407 -268 -1545 2724 -623 531 3675 -841
860h41K363J340m144L144j041l284M150l086j576M117l657P77L276m633L285J180
876A370l531M587j104k301M153k558p15L271m445R18J990m279K780k9l911M028
892B24j025j905M241k998K81L979l391J319K012l929L479k25l537L935k547k010
908b097L959l659J84K759m057K522J261l443L879q64k117M186k191r33L777l909
924g43O53K686m148K114J37l835L769n35k705L715k671m56M186l505J190K234
940B086m113K972J102l352L301j829j828M036l091n04K580l363J936J679m119
955b507K666O72l147M225j737j457L610l418o1L723l601J430O86l632L675j77
971I50k961L981k457q54L494l033P15K078m298K968J475l701K412j092j785M128
$$ plain form
860 -841 1522 2862 -1282 1862 821 -2463 1687 -1399 -2975 1142 -2515 -1738 1538 -3095 190 1370
876 1370 -2161 2426 1322 -979 3174 616 -99 3172 -1273 -355 1635 -2644 136 107 -3804 224
892 224 -801 -2706 1535 -1463 -1182 2797 -594 725 2737 -1192 2287 2062 -1475 2460 -87 -2097
908 -2097 1862 -1797 -1613 1146 -2911 -389 872 -2571 1308 444 -1673 2513 322 -611 3166 -743
924 -743 -90 2596 -1552 562 699 -3136 633 98 -2607 1108 -1563 -2019 2167 -1338 -148 2086
940 2086 -2027 945 2047 -1305 1996 167 -1661 2375 -716 -1220 1360 -2003 -67 1612 -2507
955 -2507 159 831 -2316 1909 172 -1285 2325 -1093 -1154 2569 -1032 398 1084 -2548 1127 950
971 950 -2011 1970 -487 -1341 2153 -880 -165 1913 -2385 583 2058 -1643 769 -323 -2108 2020
987B020k403j239L239l557J262K817m241K672P16l226M145j393k045L375k723
1002e81k94L637m192P29J525k994K728m92l002M383j316k060L966k297M00K309
1018B449l815K317J737m151K713o77k821L771k081j437L284l683J175K875l443
1033a787J560J105k613M007o32k777L515j893m60K966m167K47K488l763K215J55
1049A66l480L604j069j823L918k188m13L196k856K100J461l833L053K47l464L160
1065A779j517j636K995l584j78L520l771J260J774l079L532p3k818M061j371j566
1081f72L838l194K32K215l852J747J162m124K945n52k650L859k037j338L985k956
1097a392J142K260l596K835R93l171L218j210k041L281k834o08K912l840P28K411
$$ plain form
987 2020 -383 -1622 1617 -1940 -678 2139 -2102 570 1286 -1940 2205 812 -1233 2142 -581
1002 -581 -875 2762 -1430 -701 824 -2170 558 66 -2936 1447 131 -1929 2037 -260 140 2449
1018 2449 -1366 951 2688 -1463 1250 573 -2248 1523 -558 -1995 1289 -2394 -1219 1656 -1787
1033 -1787 -227 878 -1735 2272 1640 -1137 2378 485 25 2991 -1176 -929 1559 -2204 11 166
1049 166 -3314 290 -779 -2602 1316 -872 -1285 1911 -945 1155 2616 -1217 1836 2083 -1381 1779
1065 1779 262 -1374 1621 -1963 -2141 1379 -2392 -1132 642 -2437 1095 1022 -1796 2265 894 -672
1081 -672 3166 -28 204 2419 -1433 314 1476 -2648 297 -255 -2905 954 -1083 -2421 1564 -1392
1097 -1392 -250 2010 -1586 1249 2242 -929 2289 1079 -962 2319 -515 -1123 1789 -2051 -1323 1088
1113A088l566K491J52k246L343j061j906L965k163k50K376k938J719R08l707K834
1129A039l13k915L282j963j136L000k579M96K723l517J627J822l071K963n76k225
1145a343L087j601j283K929l030N47K108l547K333N96k750K977p71j829L183j812
1161b06p67K758k733P62J817l554K776L05l247L302j076j573L052k250rK632l489
1178a500J560J443k878J944K01k328K840j298j656L270k485N4K320l024J539J221
1194A223l035L035o24j999K996j084j270K851k710L66J888l270J520R93l337L030
1210E73m09k318L172j463p27K990k646Q17J933k676J760M66k717K770j175j822
1226a472K771k461m05K667l181J044J805k928K767l4k057L345j349j002K675k412
$$ plain form
1113 1088 -2478 13 165 -2081 1262 201 -1705 2260 97 -153 2223 -715 1004 1912 -1795 1039
1129 1039 726 -2189 1093 -870 -2006 994 -1585 -1089 1634 -1883 -256 1566 -1505 1458 882 -1343
1145 -1343 1744 143 -1140 1789 -1241 -694 1414 -2133 200 796 -1954 1023 252 -1577 1606 -206
1161 -206 -973 1785 -948 -186 1631 -1923 853 1158 -2089 1213 137 -1436 1616 -634 -643 1989 -1500
1178 -1500 60 1503 -1375 569 770 -1558 1282 -16 -1672 1598 -887 -833 1487 -1537 2 1223
1194 1223 -1812 1223 599 -1400 1596 512 -758 2093 -617 -251 1637 -1633 -113 880 -2457 573
1210 573 164 -2154 1018 -445 -1172 1818 -828 -11 1922 -754 1006 1472 -1245 1525 350 -1472
1226 -1472 1299 -1162 -1567 1100 -2081 -1037 768 -2160 607 573 -1484 1861 512 -490 2185 -227
1242b27K73K223l330J247J122l441K197R7k369K846j840o88K848k256Q20K381
1258A903k890J673J202k577K437p61j901K728k103j071K834k786R8J698k876K040
1274c52K98k586L558o73j360L133j779k56K567k725R22P96k803K026K75k841K206
1291D06j181j370K826k188K11K520k698J389J365k463K625Mk340K962j607j007
1307e46K713k844J7J907l102J639N60k536K494n08j666K719p62j087K880j951
1323g3L44J751k651J404P23k771K053n43j499K423k038o14K788k904J005J794
1339A192k655J752O16k211K465p43j148K490k340R1J813k172J015Q66k595J955
1355C91J79k290K575j057j106K521j913K23K034k443J198P09k382K315m36j930
$$ plain form
1242 -227 46 2269 -1061 186 1308 -2133 64 161 -2208 638 -1202 -1890 958 -1298 -478 1903
1258 1903 -987 686 1888 -689 1748 987 -914 1814 -289 -1360 1474 -1312 -1214 484 -2392 -352
1274 -352 -54 -2640 918 245 -1115 2018 239 -17 2550 -175 747 1543 -1260 766 1041 -1800 406
1291 406 -775 -2145 681 -1507 -1296 1224 -1474 -85 1280 -1183 1442 1446 -894 2068 461 -546
1307 -546 2167 -677 -660 1247 -1855 -216 344 -2192 302 -206 -1872 847 85 -1002 1878 -73
1323 -73 271 2022 -629 775 1498 -1273 780 237 -1262 1161 -877 -1491 1297 -1607 -602 1192
1339 1192 -1463 289 905 -1306 1159 416 -732 1758 -582 -491 1322 -850 165 1031 -1564 391
1355 391 570 -1720 855 -202 -1308 1213 -700 -477 1557 -886 312 1021 -1361 954 518 -1412
1371a412K547j267p92K354k353M32J858k490J774L56k300K205o12j549K441j408
1387b16m96K157k918J213J485k410J503J58j825K609q70j386K605j901L1J951
1403A690k607P95J350k614J726K15k483K497j086j124K595k001R4K346k125J326
1419E94P20k244K022k75k013K581j416r65K178k473N34J356k101R33P66j977K333
1436E53j81j429K386j095o34K601k410M39J427k854J718K04k481K179q27j380
1452a784K367j649l9J906k055J163J329k232J943K57k031K706j200j353K298k013
1468c87j04J532k323Q29O62k261J695K40j483K420j036q33K872k183O84J272j965
1485c69J247N99k294J734n99j605K119j764n64K222k014L67J630k017J618L32
$$ plain form
1371 -1412 1135 -132 -924 1430 -923 -491 1367 -1123 651 1007 -1293 912 300 -1249 1192 -216
1387 -216 -712 1445 -1473 -260 1225 -1185 318 476 -1349 1260 390 -996 1609 -292 -261 1690
1403 1690 -917 -122 1228 -1386 340 555 -1928 569 -517 -1641 954 -1047 -953 1393 -732 594
1419 594 1314 -930 1092 817 -1196 1385 -31 -996 1182 -1291 -757 599 -1502 -569 197 -1780 553
1436 553 372 -1057 1329 234 -400 2201 -209 230 1657 -1197 521 725 -1756 423 -404 -1784
1452 -1784 583 -1066 -1105 801 -1254 -91 1238 -994 949 1206 -825 1881 681 -672 1626 -387
1468 -387 -491 1041 -1282 -453 209 -2052 -357 -117 -1600 820 -216 -1049 1823 -360 324 1596 -369
1485 -369 878 1477 -817 917 318 -1287 832 -932 -1496 726 -1288 -921 709 -1308 310 642
1501F42j532K227n14j654K531j650l50J712k057M65J113k451J373N28j984K114
1517E13q89p45K063j328j62J912k053R91J194k459K018m20j619J746p19q90J589
1534G42j860M11J561k275J234P84j898J873j89j369K245r89o83K034k146K86J306
1551A067k118R81R16k177J824m70j436K173j241k24J765j790M63J270k049J568
1567E22L59k000J721m43j019J842j450l1J463j877Q23O40j773J863k17j384K081
1584A120r96j061J968j458l47J434j762Q87O56j572J473K18j441J828r68n46J782
1601A215j601L85R94j804J050M03j726J394q8j434J989j325n94K118j763M74J714
1618A401k453J685M36j614J654q57r20J847j003r62J801k035Q62O33k263J818
$$ plain form
1501 642 -890 1337 823 -831 1700 50 -300 1412 -645 -180 933 -1518 -145 383 -1601 513
1517 513 -376 -1121 942 -386 -548 1364 -689 302 1496 -963 1055 635 -984 762 43 -847 742
1534 742 -1118 -707 854 -1421 -187 597 -1301 572 383 -986 1259 270 -413 1621 -525 -239 1067
1551 1067 -1051 -70 846 -1331 493 23 -1413 760 -481 -705 1060 -730 -267 1003 -1046 522
1567 522 881 -1119 602 159 -860 982 -468 -499 964 -913 -90 550 -1223 640 423 -961 1120
1584 1120 124 -937 1031 -427 -774 660 -1102 -215 441 -1131 342 560 -881 947 -21 -567 1215
1601 1215 -386 -1 993 -811 239 642 -1084 310 222 -1212 777 -548 -1142 976 -787 -313 1401
1618 1401 -1052 633 1069 -545 1109 252 -668 1179 176 -786 1015 -1020 -158 475 -1788 30
1634C0P8j096J684m17r79J782j174J50J497j875Q46N99j782J403m46j519K077
1651H58j422o60J702j561L14J276j476J010R05j700J881j97j268J831j099o32
1667b38J488j614L26Q94k119J016L61j662J592k54j318K318j130k68K073j744
1683b79Q29P64j608J119K22j825J980j170r87J707j543j44J187j415O58Q19j294
1700i80J214L35j197J943q84n82J360j293K78R44j848R45M48j957J451k61j274
1717a358K035j426k86J928j745O34J154j593J149M28j355J594p31j072J729j191
1733a06n20J410k016P57P93j470J259K10j398J600m60o41J894j223m49J368j556
1750e48J172K41j717J180o4j315J453m78n55J446j394L96R09j581R42Q34j465
$$ plain form
1634 30 108 -988 696 279 -700 1082 -92 58 1555 -320 526 1125 -657 746 300 -1219 858
1651 858 -564 -1224 478 -1083 -769 507 -969 41 946 -754 1127 930 -338 1493 394 -238
1667 -238 1250 -364 -38 856 -1263 -247 114 -1548 44 -210 -1528 790 -340 -608 1465 -279
1683 -279 550 1314 -294 825 1047 -778 1202 32 -955 752 -791 -935 252 -1163 -505 314 -980
1700 -980 234 569 -628 1315 431 -151 1209 -84 194 1138 -710 235 683 -1274 177 -84 -1358
1717 -1358 677 -749 -1035 893 -852 -218 936 -657 492 920 -435 1159 428 -644 1085 -106
1733 -106 -626 784 -1232 -475 318 -1152 107 317 -1081 519 59 -582 1312 89 -360 1008 -548
1750 -548 624 865 -852 328 264 -1051 402 -76 -631 815 -579 -183 726 -855 87 921 -544
1767e44J177k95j250J665r09n71J743j413K57R25j372Q65K41j152J411n87j003
1784h12J804j372j98J586j763P12R24j751J129o5j145J553m34p95J353r61k4J172
1802I13j307M50Q41j561J178j38j445J477q47l94J331j231N3J153j357J053N20
1819F89j589J340o3r83J622p27n88J391j294j18J039j684Q41L98j385J255m40
1836b96r33J560m93n08J640j400Q58J160j759R86R6j467J143p42n47J143q51m31
1854h41J160j597O79R36j454J440k9j082J821n46p99J587j103J11Q55j762N27
1871i7O09j618J231o7j246J146k97p10J638q71k01J655j690R21P16j367J497o70
1889E79r95J025q12m57J470j415L49N14j524J334J51j188J400k00r22J753r94
$$ plain form
1767 -544 633 338 -912 753 -156 -727 1016 -397 -140 785 -587 278 519 -633 778 191 -812
1784 -812 992 -380 -578 1008 -755 -43 881 -870 259 194 -951 602 168 -627 726 -235 -259 913
1802 913 -394 56 897 -664 514 376 -1069 408 -439 -833 498 -733 -680 473 -884 169 689
1819 689 -900 440 377 -606 1016 289 -299 1092 -202 -320 719 -965 -124 274 -1111 144 -296
1836 -296 -1229 331 -162 -670 970 -430 428 1588 -171 815 911 -556 587 -155 -702 441 -410 -841
1854 -841 319 -1278 -599 337 -1117 323 294 -788 1033 487 -312 1275 172 283 1138 -624 -97
1871 -97 512 -1106 125 58 -1188 -42 -339 -1049 589 -282 -483 1172 -518 403 1119 -248 1249 579
1889 579 -416 609 -203 -660 810 -605 -256 258 -1266 68 219 -969 431 231 -691 1062 68
1906F8j99J474j492M45N57j622J048L8j527J549n82o63J231j136K20J168r69J97
1924a95Q77j175J326j58j167J666j100o52J532j340p1J054j272N97K66j045R81
1941A24J20r19J314o71k44J167j372M48R11j329P46N04j639J366l70j019J540
1958F77r50j25J196j320M93P15j361Q67K46j131J146l08n70J403j343O9P84j319
1976h31R58N36j292J100l24q65J215k30n98J024p76p3J224j895R13L15j391J079
1994H9J71j212J542n81n74J323j098M27Q12j280P42M44j402J187l67q60J162q99
2012c74m32J687j737N08P28j289J170%j160J457j64q50J442j099K06R71j565N61
2030F0N28j506J052j3r92J166p78j78J302j164K92J241j449O67N50j293J266k26
$$ plain form
1906 68 -131 1343 -149 296 853 -769 279 317 -1210 339 -243 -906 325 -811 -591 577 -392 -195
1924 -195 682 -493 833 675 -492 1174 74 -578 954 -386 -457 597 -675 -78 188 -857 124
1941 124 244 -675 639 -32 -276 891 -481 -33 878 -451 295 799 -840 526 156 -863 677
1958 677 -273 -398 798 -522 -29 686 -675 192 438 -693 453 145 -425 978 -365 -296 488 -831
1976 -831 127 663 -629 471 147 -718 497 267 -331 693 -83 -156 1068 -827 86 401 -990 89
1994 89 260 -952 590 9 -565 758 -340 87 899 -381 361 805 -597 590 223 -637 525 -374
2012 -374 -806 881 -856 -348 380 -909 261 261 -899 558 394 -456 986 -113 93 1064 -501 60
2030 60 588 -918 134 121 -871 295 -483 -661 641 -523 -231 1010 -439 228 778 -515 751 525
2048E25q88J467j399j94R64j128K25N86j253Q37L75j164J572p03o97K014r01m21
2066a83J439j594L63J086j567Q01qj488J654q26p58J309j145O7J556j328N57O88
2084F23r80R42K98j257J431o80p04J021r57k5O60j050M39N44j418J305k27r95
2102a030J772q38m75J285r79J09J095j329O96J37j072Q06k12q82J430j106j67
2119g60J256j313M56Q55j372R91K15j123J387nj128J425r16j21P99p94L7M54j432
2138a089J165L99j436J096j12o95J135r04K86J062j363N68M68j245J200j83r64
2155f12J118p92m28J417j527J98J253j398R63J92j101R93K4q24J164o91m69J240
2173G20r72J89O58j252Q69O3p81R42j06r44J295j010J85O66j085N98O56j412R47
$$ plain form
2048 525 -363 1104 -295 -489 475 -653 -428 158 -1095 -258 117 -1047 525 -178 -875 1139 238 -183
2066 -183 1256 -338 25 1111 -456 345 337 -1151 503 -323 -1081 228 -917 -850 706 -622 -65 623
2084 623 -357 585 883 -374 1057 377 -327 694 -263 -288 372 -678 -239 305 -1113 192 -35 -1030
2102 -1030 742 -96 -571 714 -265 -156 939 -390 306 443 -629 177 -35 -917 513 -593 -760
2119 -760 496 -817 -361 494 -878 113 328 -795 592 587 -541 884 -32 -153 646 -148 -111 343 -1089
2138 -1089 76 475 -961 135 23 -672 463 -441 -155 907 -456 112 580 -665 535 352 -612
2155 -612 506 -286 -714 703 -824 -626 627 -771 192 384 -717 276 300 -524 640 -51 -520 720
2173 720 -252 -63 595 -657 212 275 -506 436 330 -614 681 -329 -144 522 -563 35 691 -721 226
2192B26J21j214J384n51q22J423j091K19J150j501N34O02j038J075Jj073J302
2209G47q47m49J159j205L21P73j331Q58K93j015R88J10q01R78n88m10J090q52
2227a81J91R07j766Q53N31j372J182m02p08J012n75k39P69q02O65N87q62O02K64
2246F56j117J142l74q87J152o73K4Q78j534L09N95j033R23j00o83J201l62l81
2264b64Q96o99M24N57q87K64O56j286Q18k47j191J471p42l42Q84j068R0R18q25
2283e73N47O62j292J328m72j77Q53n96o75J110j073K1P43j155N53K88r22J022
2301A92m05m70J223p90j73J231j051M85M69r37Q33m2j058R47j42q06J141j016
2319c69q4O19q95L56Q40q04O62j1q97J144j80o79J208r57j4Q72j277N65K87r37
$$ plain form
2192 226 347 -867 517 -34 -856 567 -524 -305 845 -656 -122 480 -558 517 518 -555 747
2209 747 -100 -549 610 -595 -274 499 -832 26 319 -696 292 402 -399 579 -9 -419 671 -181
2227 -181 10 917 -849 4 535 -837 345 -57 -765 247 -328 -567 202 -600 65 652 -210 392 656
2246 656 -461 681 307 -580 572 -101 -77 801 -733 -424 171 -862 61 -39 -722 479 117 -264
2264 -264 632 -67 357 914 27 291 947 -339 479 232 -959 512 -230 -572 312 -756 -666 252 -573
2283 -573 -26 636 -656 672 200 23 876 280 -395 715 -358 -337 406 -749 -196 92 -830 192
2301 192 -213 -683 540 -250 -423 808 -243 242 711 -226 607 565 -493 454 312 -494 647 -369
2319 -369 -453 166 -729 -373 467 -337 325 314 -583 561 381 -298 910 -47 -61 811 -466 99 386 -551
2339e51M98j28o74J449j058P4J029j259L23R41j186O28J44q31J148j82q12Q37
2357C90l67l59O62r27K95Q98j188N95L49j189J304o26l66R39p73K12P41j153P34
2376A71L09r61J253o24n34P10k44m10P15l26l11P31q46P74o6o35R57q86l64P97
2396B10j13k82O14q82J02P07r83J036j74n60J124n14o81R41o10k69Q18q46O0O48
2416C46o98L46Q0o87O90p5l77R39q12L92P00q98N0K81p40P16r0n90P31n00l74
2437e70R61o44k38Q13q08M48M72p05P23j67n48R92q05k34P84q77K54M19q08M14
2457a24K57q60R58l84o06J201n54k3Q98j057J63R15q55K55O5n87P58n84n63R84
2477B57p77j11R39j084M05O86j199J053k41m26J075m34m00J159p16L6M84j100
$$ plain form
2339 -551 -53 -181 -855 594 -464 -390 639 -620 -297 644 -542 86 230 -601 547 365 -447 390
2357 390 23 -336 326 -601 -306 592 -596 -1 348 -841 463 -163 -529 410 -363 -151 590 -563 171
2376 171 480 -481 772 148 -386 324 80 -330 385 59 -252 479 -367 407 341 -294 663 -223 -587 210
2396 210 97 -185 429 -453 -351 356 -627 409 235 -325 799 285 -396 545 -65 -334 484 -362 -302 346
2416 346 -352 -6 74 -613 77 2 -375 564 -248 144 844 -54 -4 277 -463 253 163 -427 304 -196 -570
2437 -570 391 -253 -491 322 -486 -38 434 -271 452 285 -263 729 -76 -310 474 -403 -149 270 -538 -124
2457 -124 133 -727 231 -153 -759 442 -112 -135 763 -294 -131 784 -71 184 249 -338 420 -164 -727 257
2477 257 -520 -631 308 -776 -371 315 -884 169 -72 -498 577 143 -257 902 186 222 706 -394
2495c94K64N27j008O78qp95R79o41j41J080q85K40O63q15M51M87j311J002k15
2514A58m33N68l46j67M27m69K32L77r66M89N6m70P37L37o05O82n94k12O74p18
2534b43K45O98r44K94J24m81O86o52m8Q45o61j01Q57j362N98O86o84L18j24n38
2554d87P66k07m79R26j007M77L83q21O24rp21R30l52n32J146n34k70P69p72m5
2574b15O79r33O29j17p09R09k89l69P74m41oO55q97K30N53q72N16N4n10O47l44
2595e6k50Q40p97O4L61o34N67K53n28L56k1n17R69n75j77P84n48n6K64o30J94
2616a37J96n28Q52l39o45P58n79N1R67p43K02N39p96L51J56r80J102n34l92O51
2636A52l10n71Q05m17J54M58j008N85M45n04M57J07m32P81o80j66O85q25N63j7
$$ plain form
2495 -394 -130 397 -611 67 59 -736 243 -398 -539 541 -344 -104 559 -256 195 682 -629 373 158
2514 158 -275 293 -53 -220 207 -262 -30 347 -619 -130 -74 -544 193 530 -75 607 13 -199 475 -243
2534 -243 2 700 -244 50 174 -307 379 -273 -321 524 -137 -238 619 -743 -145 541 -143 175 51 -487
2554 -487 279 72 -407 519 -488 -11 372 -449 175 166 -555 375 23 -509 637 103 -167 602 -170 -215
2574 -215 464 -469 160 43 -666 243 -46 -415 359 -82 -88 567 -330 -100 453 -419 97 151 -359 288 -56
2595 -56 -306 534 -263 -199 162 -472 95 348 -180 176 155 -362 607 32 -145 639 91 35 299 -331 -137
2616 -137 59 -469 383 44 -601 157 -422 -371 596 -147 55 594 -202 149 305 -675 427 -107 -499 152
2636 152 -158 -729 76 -341 -187 271 -737 -152 293 -211 246 353 -79 702 22 -144 541 -284 279 262
2656B62p07M16l2n50P65l19l25Q45m14n3N64m78K61K40o45P60k09l83O8R8k27
2677f3K99o21RN57q33N91J08n48R19m66J18J23Mj02N08n74p6M99o78N00J19q83
2699d90M41mn41N93l50qO59p81O35J78m97O17m8n30L81M8n26N48n12j73P36q88
2721e12M05J95o36P36K26j021J002l77l0M98o46Q1P73p53L91m1p08M97J13k73
2741h0K87k79l80P99p80J60K84k68K77K18q36Q37l49l19Q04m73r8M79m56Q1K44
2762A52m96N87n2o49O26j48oK22o25L50M20n50K11L26q27N49O3o31O55l21l79
2783e23R63p37K19O01q53O58Qn16M36K4o68P66l57n65Q71o41K18L14o98L51J49
2804B0p21Q31j21l39P63k62K8m7l42P9L23m05N5K56m30K22J7n17O40l29K43K70
$$ plain form
2656 262 -445 -29 -61 -611 154 -165 -490 355 -59 -112 452 -26 235 475 -170 590 381 -2 66 164 -63
2677 -63 236 -385 -376 181 -652 -61 47 -501 418 -48 70 193 197 95 603 29 -47 452 -226 274 393 -490
2699 -490 -49 -53 -594 -1 -351 -359 300 -481 154 332 -165 452 404 -126 255 303 -223 325 -187 -360 376 -512
2721 -512 -107 88 -548 188 414 -607 395 18 -12 486 -160 -79 694 -59 332 291 -417 80 193 -80
2741 -80 207 -72 -452 347 -433 -273 11 -257 20 238 -598 239 -110 -429 375 -98 -196 283 -173 -92 152
2762 152 -344 243 191 -458 168 20 14 236 -389 -39 381 -169 42 368 -459 90 153 -478 177 -144 -523
2783 -523 440 -297 -78 523 -330 328 336 -180 256 280 -388 378 21 -544 327 -314 -96 218 -480 -129 20
2804 20 -701 130 9 -330 433 171 199 152 -190 -111 212 -193 -138 118 -312 -90 -73 -590 50 -279 -36 234
2826B34m82M52R5o15Q14R6p46P08p47o6N08m99q6L25j33L1J42o64R55j91n91N17
2848E7q4J35J84l51J51L37o54P51mr09M00K7n29N29m01O8M90o21L75M17n74O48
2870D42K80p28M18k55l65O11l62k41L67m71K09M1n40O36q9l49O11l67J12M62m67
2891d5M39J30o11N35k26o59O01j61n76O83j26k36L88m79J06L14m10M85K4l77P23
2912E22l52j17L60m58K63j29k14m3K52o68O83k12o80R22r7m87Q33n37J07M44n98
2933b06K79K06m48L90k67j38L53k05m17Q18m88K02L29r65O00L5l72M11J80n00
2953b03N39n04j18O45o70K9N50n73O16j03l55K56k55k03K99j24j10N19m85J82
2973f8J23m46N25k02k41L77J57l74N52p65J06Q99q44l4L21l40M26l9n02P51k53
$$ plain form
2826 234 -248 204 299 -316 498 594 -152 556 -191 -257 251 -248 -334 -9 -142 -111 31 -633 322 131 -460 57
2848 57 -27 108 292 -59 92 429 -225 526 522 -387 13 40 -489 40 -361 -293 197 -424 -49 368 -206 442
2870 442 722 -6 412 157 -208 403 41 -200 167 -304 -95 -54 -594 42 -47 -396 215 -152 -40 422 -45
2891 -45 394 524 -87 448 222 -437 164 3 -573 110 -16 -252 136 -343 -237 77 -333 152 176 -201 522
2912 522 170 53 413 -45 218 89 -125 -168 84 -584 99 -113 -793 129 32 -455 378 -159 -52 392 -206
2933 -206 73 279 -169 221 -46 -184 169 -36 -453 365 -123 79 408 -557 43 78 -294 117 297 -203
2953 -203 336 -168 -286 359 -311 -282 268 -305 311 208 -147 109 -146 -349 -50 -174 -284 235 -250 -68
2973 -68 55 -391 134 -68 -309 68 225 -149 403 -362 -256 643 -201 -235 86 -254 172 133 -369 382 129
2994A29j21M30q24L41M35n71J59L9l43N40j16l61O88o07P9L83n65K69L34o26M28
3015A20L02o93M73l25n34J093o46J27M86o67K03K04m20L73J30n50L89K59n27Q22
3035F19p01K14p0P1O9o9n82M34L1k36K54j12nK35j82J00K21o28N04J21j24q1L8
3058A21m57L95k59j22N83q15M26M15n87M73j53m97O94j0l5J27m21J85K86m54M1
3079f4J97m56K12j9l36M33j74o1L76k16j08M94k78O8K73m66M87O5p13N04m48R9
3101a31K37l82J46L63o85O97j63j40K62j48l43N79l46n1N60o89L51p9k20M63j10
3122A71n39N80n07k49Q70p27J56M12l48J94J74m53M66j18k92K44j35J07N35p20
3142a79J64K40p60N67J84m42L77k75l41P57k12k88O37m52o1Q24j127L33L44o31
$$ plain form
2994 129 8 438 -386 -45 390 -181 -22 17 -326 214 98 -263 425 -182 -103 280 -285 -16 318 -308 120
3015 120 422 -271 202 -123 -657 436 -210 -83 403 -264 -61 143 -277 96 226 -324 65 324 -203 619
3035 619 -82 132 62 133 202 133 -449 -15 16 -220 34 -78 -83 152 -30 70 291 -337 167 288 164 83 121
3058 121 -336 59 -200 -322 261 -554 -128 287 -300 173 20 -477 217 207 172 299 -122 63 349 -105 -64
3079 -64 133 -323 -111 -130 -466 -33 -207 -268 108 -108 -216 278 0 68 341 -125 362 427 -286 218 -230 -131
3101 -131 106 -276 -130 233 -452 245 82 -58 204 56 -287 292 -54 -105 455 -234 117 38 -182 281 171
3122 171 -368 212 -295 -544 326 -401 -245 167 -181 13 187 -266 200 82 -210 34 -101 6 541 -179
3142 -179 -15 225 -535 32 216 -226 151 -124 -465 292 80 -208 429 -23 -84 740 -387 -54 290 -341
3162c41K50J39m68P37m89J67M26p38J44M54m91K76m4k00L57m71N2K78k75K24J28
3183A15k98j55L51n59P61j67k06L09j70k80O90l81k06O91q18L08J02m22N77l05
3203f3l23N28k90l0M69k47k92P29n90J33K24l51M64m67R0J80k70j31N76m93q7
3224b41K25m42L45L02k44L44n3n12O11j80l72M09k17j45K84m20J32J97n23L08
3244a92J33k29N09m16o5O74l80j92M35l10J87n3k46K24l14JM49n91K10K20l75
3265c21K99J35n18L35J34l1L69n30L47M43o91J84J27o47M99J37n53M29k06l92
3285d51O43m87J60N80j028N36L80n55L51L38o05L29k28o9M91n25o1M06m44M7Q6
3306a06j84L69q5k17L58j64k17R54n60k92K97l23rL37m89L90L2m65N51m41j81
$$ plain form
3162 -341 -91 48 -420 317 -172 -5 421 -317 -173 281 -210 66 22 -178 179 -292 -240 38 -237 -13 115
3183 115 -183 -338 13 -546 215 48 -158 151 -19 -299 391 10 -196 495 -323 -15 87 -335 242 -63
3203 -63 -386 142 -148 -178 291 44 -248 481 -109 24 248 -103 361 -106 -16 164 -106 -237 339 -154 -241
3224 -241 -16 -458 -113 189 -55 289 236 -276 335 155 -217 192 -25 -170 114 -306 -174 23 -500 -192
3244 -192 -59 -288 221 -195 -260 414 34 -158 277 -33 154 101 -145 79 -235 -234 215 -376 -166 54 -321
3265 -321 -22 113 -405 -70 64 33 402 -128 219 662 -29 155 282 -365 134 271 -282 147 -59 -451
3285 -451 192 -295 -135 445 -583 -47 333 -222 129 467 -138 191 -37 -106 385 -140 -201 205 -239 -192 -106
3306 -106 -290 79 -6 -223 135 -29 -246 708 148 -144 153 -170 -179 158 -331 59 91 -374 177 -264 -445
3327d45O27n55Q2O97q06L82L47o00N91n9m52N37l74j99M73n50K09M6l27K55M22
3348C01o59K73Q3j24M55k51q1K49l63K65M7m51K43J27m88N39m17J74K8k18J37
3369a31N87o68L40K47n67K81k21O8L93n22M4K05k86J59L34o05L33q1k90M55L7
3390A12m17M45l9j08L36m29J69R7k07k8K06l82J13l9J37L83m26MR1k98K61K20
3412B01j12K28j22k79K23j41j18K66m46m3O52p59M07K6j40M95l27l32N29k65L2
3433b5K13l51M03n5l92K96k63k68P70m56k54N91m06j65O07n73K93M74m70K13q
3454A74l69N51m42k5M62l65j7K8k42J56L22m69p0J72p8K51j32j47O84m77K83J53
3476D03n20L40r1m81M45Ro49L91J51j25L96m59K22K07n85M93Ml95O06L6m64L01
$$ plain form
3327 -445 182 -373 -291 406 -400 -18 329 -271 320 261 -191 346 -28 -227 246 -304 -95 -49 -376 -121 301
3348 301 -358 -85 -2 -126 329 78 -3 246 -117 148 195 -256 -13 114 -374 165 -252 -78 -50 -268 -131
3369 -131 456 -212 128 375 -192 89 -132 -64 329 -193 -149 56 -230 -71 263 -342 -9 -90 -380 75 112
3390 112 -305 140 101 -7 329 -100 69 166 -41 -69 137 -245 -132 -171 -34 349 -77 -73 18 -280 -19 201
3412 201 89 317 195 -84 139 -2 -120 146 -300 -343 309 -450 -43 -17 -157 338 11 -321 208 -57 -25
3433 -25 188 -163 240 185 -207 89 -174 -442 328 -128 -382 209 -197 -362 245 -328 -35 439 -31 182 174
3454 174 -195 356 -86 -111 351 -14 -31 -3 -245 -89 233 -236 -306 -134 -212 39 -93 -240 444 -33 250 403
3476 403 -117 223 132 -349 96 105 -544 -153 -2 -127 269 -190 32 239 -346 147 151 -244 362 398 -66 235
3498B35j18l58M86k54k81L52k87J02K80n53M22m9m69O48k86j54N42m65J90K22
3518B05j24J57Q3n96M94m14j83N58j30j47J30l73L64J93m78M29k16j53K49O1m30
3539c21N34l87K90Q9m85K20N5m35N97l07O5j9O9j59K76l91L6N32n94N66jn48M48
3562A30k62k9K92j68P9P8k06Q0K45o30K73N85p86M65J2n4M4m72J6N05l72R0j5
3585a00J72J59j29l03L73m2n11N17k20q8K36k18p8O04m55J41j18l19K92q2K0M17
3607B68m86L21J51m72K23J60j98r8K1k7L95k33j02L08m87J98L15n45P5L40k19
3628i2J21J9j81K58l4j1K1k73L15p3m9K21k21l16K91j04j57M02m87K05L60l38
3650a23K44p3P0J67Nm37M43k04l28L51m88M06K31n95J79L33p51L74L02k30R4R6
$$ plain form
3498 235 117 -241 245 -9 -290 62 -225 -123 157 -396 26 -23 -492 156 -130 -284 258 -207 -17 205
3518 205 81 238 321 -275 219 -195 -378 180 50 -97 33 -340 24 217 -261 168 -48 -201 48 109 -321
3539 -321 213 -174 116 205 -280 -60 -5 -440 157 -150 -85 -104 -35 -194 82 -309 -273 259 -335 231 230 -318 130
3562 130 -132 -161 131 -37 42 120 -86 -6 239 -391 -118 467 -319 146 158 104 148 -324 -308 197 -175 -85 -100
3585 -100 72 231 102 -201 172 130 -381 136 -84 -172 64 -154 -232 372 -83 58 -60 -379 -87 -169 -149 268
3607 268 -218 103 254 -218 5 165 -33 -131 -110 -137 258 25 -77 231 -256 -58 257 -288 -213 127 -92
3628 -92 29 48 -133 125 91 80 101 -172 143 70 21 242 21 -295 -4 -108 -265 137 -350 -145 215 -123
3650 -123 121 48 118 285 290 -147 296 92 -236 115 -373 33 264 -331 -152 181 -570 -196 106 -124 -30 66
3672F6o6J92j7j08K87m51L10l2k27J3J05k34N74m13k42J92k08K21K80l78l8K02
3694B8k48M24l26j4J84j71L17K1k50k50J75j96M22m2m51L21O2j48O0l49M13J65
3716A47l99L47J26m90L68j19L3L06k61k71K49m81N21J41m35R9n5J28Q1J36l48
3737a77L17q0P1J15l45J13K69m12N12k02k47J77k21J10L18j98j3J79k72K75Kn77
3759b86L09J61l44J60j63K97O7j07Nj03k58K30J61l47L62q7l33M25k53O6lq7K73
3782A45J93l54j85J29j1K08k18K4J49q3j99N21k60j01M37m16K45k36k15J88j08
3803a47J9L89k55k57L53m32L56K52o26O19k00l54L32J5j45M22k71O8q7j94K23
3824H0j1j56P9Rm88O38k09p7Nk07J56N23n60L67Qk90J5j4m4R6L1k83K65l39K36
$$ plain form
3672 66 0 192 175 67 354 -97 213 181 -46 -33 72 -162 412 -1 -243 -51 -259 -38 242 -136 -174 28
3694 28 -220 204 -122 -136 48 -123 194 215 -35 -285 -110 -306 116 74 -377 -56 6 -142 -82 -431 -18 147
3716 147 -252 95 221 -269 99 -20 13 319 58 -213 36 -445 76 217 -218 -119 -174 -46 35 171 -177
3737 -177 140 60 131 246 -99 14 283 -129 383 181 -66 111 -110 0 318 120 107 286 14 289 291 -286
3759 -286 23 184 -160 0 -163 134 201 94 99 -4 -262 -32 129 -218 144 57 -276 149 -104 -38 -41 -128 145
3782 145 338 -16 -201 -72 -83 125 -93 -69 80 -3 -202 319 59 -42 395 -21 224 -12 -227 -39 -147
3803 -147 -128 261 6 -251 102 -330 26 278 -348 271 71 -283 49 64 -81 341 70 138 51 -143 80
3824 80 69 -87 -8 1 -487 151 -58 -135 -130 -337 -181 342 -218 149 157 -133 -118 -132 -176 -80 -49 -332 -67 -406 -170
3849a70L22m18K65j6k29K92j46k7L69j43p9K16k10J73K2n15M26k1j94j02J5m7
3871b17M31m02j4M89o45L27K07m35N95r0p00P62p9m04L4R9j6M62n60J93k8l06
3893b97K50N6j92J64P2k81M88l95K84K7k32K81k26j96J16M5r1L6k65L53J07l34
3915b30Q8M58l91L39j70l87M92O5n11O33l87rN6l93L77j82o3K44o0l15M68l01
3937a79O9N93n48K23R2k53n6M15k69j3K03n21J78j01J81N3k13J81P4j74J15J6
3959F6n8l78K40k06L33p7N8L66m87K94j22n9J40L2j9n3J3p9L00l90N9Mj33L40
3983A84L7k58J40N0k86M06l64J8L57j30j09K0o5Q1J25j76j19Pj18L67r0j94K14
4006I7j90J48L57l61j81J01j00M70m74M4J38j23j26K16q1J42J67m33M02k37j4
$$ plain form
3849 -170 152 -266 -1 -17 -246 46 -100 -127 242 99 20 236 26 199 221 -294 132 111 -83 -185 -170 -217
3871 -217 214 -188 -202 287 -358 -31 176 -259 336 246 -454 308 229 -175 -141 -42 -58 404 -156 37 9 -297
3893 -297 -47 9 -183 -19 53 -228 260 -135 149 176 -56 225 -1 -197 -81 -36 -127 -91 -356 -3 104 -230
3915 -230 -142 316 -75 264 94 -293 199 264 -247 386 -1 -10 46 -347 30 -152 -215 29 -31 -346 122 -179
3937 -179 -110 483 -65 158 250 -3 -59 356 87 74 277 -244 -66 -167 14 67 -146 35 109 -65 50 66
3959 66 8 -370 -130 -336 -3 -80 -22 344 -143 151 29 -30 110 142 123 70 83 4 304 -86 -27 -23 -156 184
3983 184 221 -37 103 153 -133 273 -91 -73 284 154 45 65 0 81 206 30 -89 -82 -200 167 77 -117 97
4006 97 -93 55 412 51 -130 -29 -129 341 -133 -89 49 -74 -200 16 -65 77 244 -189 213 -24 -38
4027c8J47j60j62J56M2j40L04k37K60J13l89L36n22K82K2N9k38L15k93L6N7l48
4049c98M13R0k01R6l44N45k2j41Q2M7j92K19M6l11n7J31l21L21k2m57N29j74M1
4072h0L11l98m8L01k67R0O4pJ04k58L50m2j70Q0K54k95j3O6m40J61K84l09J65
4095i7J4J6L10n01K25J40j21K09O0m25j60L82j00J66k32J2L08l84J57Q2k16L71
4117B16k23k8N3K78l23j17M65j40O4k11oj65KL17Qm32K97j33k48N57l22j09L63
4140A63j96j14K51k21O6L75k85Q6m7j72L35m42J17Q9j83K51M0j95J02K12l61o5
4162a94q9K20L89m84LL47k69K68k37j26M45k99N7K82m71K26n2k48M80K8k19J42
4184A99q6j11J58k82J3j16qJ94k0J26m7m2k54L73K0k63L99l52JJ98k2j01J58j58
$$ plain form
4027 -38 109 -51 -213 -57 -15 -155 149 -88 172 285 -104 232 -290 -8 14 73 -165 150 -143 -107 -50 -398
4049 -398 15 105 -96 0 -344 201 179 38 120 167 -25 194 240 -71 -128 3 -318 3 -19 -476 53 -121 -80
4072 -80 231 -167 -215 86 -181 -91 -27 -34 70 -188 162 120 -50 30 284 -11 -24 42 -398 -237 47 -262 -97
4095 -97 -83 -67 243 -258 -33 107 -14 195 255 -170 -330 52 -48 118 -114 -102 206 -178 -21 61 -155 216
4117 216 -7 -35 18 296 -27 -144 321 181 245 34 28 -137 -135 182 190 -242 55 -78 -326 231 -91 -200 163
4140 163 -33 -147 104 -117 -51 324 39 125 78 -94 241 -201 -84 5 -178 73 113 -82 20 232 -129 -194
4162 -194 -283 -63 326 -158 -155 192 -77 191 -46 -172 273 -26 31 313 -158 68 16 -232 248 276 57 199
4184 199 113 2 160 -122 -109 -225 -233 -39 -59 67 20 -22 -276 97 117 -146 253 -99 -98 100 78 -23 135 -23
4208b3K09j01j65K36l4J20l43L2r9L7qM03kk54k33K86k88L11K60m26K33l14J74
4231A1mp4Rq6Q2q5L64m69O18k67j32Q4O1k67J66l23K57J08k74J45p6j41L85j92
4255a00o9K14p9m1J08p9J77J3k22J19l3j06L73l51n6j8j89J15J90L0Qo2o5L06
4279A83j91n4J68j18j80L71l76P7J86j05j74J51k34L00M3j88J5J7Q4J74j74J93
4301A68k95k96N09j14L16j70j85m4K68p6n6P2K6k33J04k83K03O1J46j5j80n5K26
4324I7k5j27J27o5j90L33l25K88k47j73L14k04M9J49n6oK33j96J84n3j29L28p5
4347B31l69O2%K60k31j04o7M25m29M39l51R4K7k9j71K58j97K48Q8k45j54L68k57
4370a04K26m6p1n8J14j28J74p7J97J45o94L15m2J19K38l18k7r8k11M19j33J00
$$ plain form
4208 -23 186 85 -80 156 122 242 -101 -69 -168 -131 -139 264 262 8 -225 61 -227 84 344 -82 151 -163 11
4231 11 7 -67 -58 -144 -62 -147 217 -252 366 99 -33 51 112 -155 11 -312 -55 53 -221 -76 -152 -293 92 -100
4255 -100 -169 45 -34 -75 33 -46 131 144 -78 41 8 -98 275 -76 -132 -150 -339 -224 -34 -4 4 -58 -123 183
4279 183 -8 -62 106 -12 -192 179 -197 -120 66 -39 -213 -62 -296 4 47 -141 -126 -109 -25 149 -25 168
4301 168 -127 -423 86 -28 288 118 -67 -111 157 81 25 97 123 -110 -6 -289 -86 -25 121 106 -74 -129 97
4324 97 72 -55 72 7 -183 150 -175 113 -134 -307 7 -197 -148 1 -55 -61 172 -24 160 107 -22 306 231
4347 231 -138 -76 -76 184 -47 -151 -218 207 -222 217 -134 -40 -13 -42 -213 45 -152 96 184 -61 -215 153 -104
4370 -104 122 76 5 -53 61 -67 107 30 227 372 -322 -7 -49 70 308 -10 -37 -135 -346 73 -60 40
4392D0k73L06k62R6K93k22L84l99k33M1L34J7J50o67O50l00J94j79m2l04N14j07
4414C1j45M5O8%J50k9p3k10J14J96l03K01Q6o3j53K73n76J36J68j90J21J41j37
4437a49J13J17l09L48o7J69N2k86L16k06j29J53o0m33L47N8p8j39M3m0N12l83
4459e1l3L38l00N1Q2O1n2J21m94J57J62j51mj34M96l29N2j00o0J59J30kj68Q0
4483A1J29j52J11l35L72j2p5J4j79p8J94k52J26K01j22k4R5J35M0K9n34L90j73
4506h9L66O2m23J16J57k49L17k74k67N8J04j73L51k65K91J51m5k33Q3j54J80R7
4528A61j54j47K00J46o9k34M2J23r9J05j78J71K04J01l31J7J31k93L72m80J59
4549e3R2o9R9J01l48N3J88j90K38k54J21J49j88J8K57l19K93k51j64M20j3l94
$$ plain form
4392 40 -233 73 -189 -93 200 -22 362 -37 -270 -229 105 122 272 -395 255 -45 149 -30 -72 -376 138 31
4414 31 -114 -69 -1 -1 149 120 47 -163 -49 147 -156 45 131 68 -85 188 -388 -252 -84 -274 -153 -12 -149
4437 -149 -36 81 -228 120 53 222 274 -12 304 98 -31 122 62 -371 -24 34 -44 -183 -140 -180 332 -51
4459 -51 -84 254 -46 5 87 148 96 217 -277 -120 42 -109 -113 -247 249 -80 -28 -128 -188 -29 101 99 -69 11
4483 11 140 -12 99 -236 136 124 49 63 -116 -194 0 -252 -126 75 -47 -71 24 159 199 228 -306 84 -89
4506 -89 277 339 -84 32 189 -60 257 -17 -284 -226 -122 -295 56 -209 82 233 188 -45 38 -116 64 161
4528 161 7 -140 60 206 137 -97 -55 68 -31 74 -104 67 271 372 41 58 189 -104 268 -212 -53
4549 -53 39 -30 69 170 -178 -125 63 -127 111 -143 -22 127 -61 -43 214 -105 188 -63 -227 193 180 -214
4571b14N57l58l7K66j36o9j50J31M2Rj06M5J67j69K73k37p3J76k55K59n9l04L22
4594H0N7l17n1L22o2R5l04J09l0k9K22R8o7qMl42K94j64j55K80K4k82L03j63J32
4619D6J28n01O00m21q6L18j04K7J12nl86M49n10L11J14j56K32q0l09N30l75K7
4641c9K76k58j20L50l31J73J92n29N54k59l05R6J3K32K10k54l02J68J87J21l78
4662b03L97m53K41L6L36l02j10K16l51J71K43N9l52K40k92k43M39L2R4k71O2M21
4684D10n45kl2M4J20j03j53L67p1k75L20l71K73O0j63K92l26mJ93j79K14j9m5
4707EP2J68l25j49L07k57K50k91J14M00n30J25J73j70m6L63k63k8K22j04K26L7
4729B99k49J51k69L5L99n76L14k10n3J00qK6J60j8k84j22M11p2J27q7Q3j08j47
$$ plain form
4571 -214 343 -15 -52 214 78 9 -141 -10 32 41 -65 -20 147 -22 251 14 -59 117 -138 121 62 -242 80
4594 80 137 -180 -231 91 29 124 -180 -71 -101 -130 92 190 123 115 119 -223 71 -93 -248 32 56 -226 77 -86 46
4619 46 174 -327 273 -148 -234 84 -20 7 119 114 -272 177 -333 -22 92 -64 168 88 -221 309 -66 -39
4641 -39 237 -21 -141 209 -122 51 243 -286 268 9 -296 -200 -187 45 255 1 -301 -133 54 175 -203
4662 -203 194 -259 -18 18 354 52 -58 158 -193 -22 221 280 -72 168 -124 -367 72 104 198 -73 -11 410
4684 410 -135 -137 -169 -125 -5 -108 -261 106 35 -240 80 -291 -18 42 -121 171 -155 -159 34 -145 69 50 5
4707 5 77 245 -80 -229 78 -179 71 -220 -106 294 -236 -111 62 -108 -154 209 -54 -82 140 36 262 299
4729 299 50 201 -68 -33 366 -210 104 -106 -159 -59 -67 -41 119 101 -183 -305 106 34 161 74 157 49 -98
4752i8J54J11k66j67M12m20L41r0n0J1J28k23K50j02j62m9r2N32n45L40j40j3
4774a38M45j78j71mk9k22N42m3l31M1L60j48j21NO9j30L3J25K10l50j22K35j50
4797g2J71k12r6K85k4pK8l20K07M2J33j44Q4o9P1N6l28K65l73J60N01l08k64K47
4821C3R7L9j15j17L28m49J92Q5K7n3K64k15j54J48p1m9j40J2J58K03k04K81pl9
4845B54k89j20J12J50j72K87l51J68j97P9l3Rl16O43j45l2N1o3R6j18j47J20K17
4868B03j47L1r3R8k11j16L79j72k42L05j01o4K72p6k89K93k1k19M29m82j29N09
4890A57Ml37J19nJ31J21n59L22J88j6N9k37j48L95j12J50j69J27l30j7O1K29K76
4913D09l74N4j81k72N80k42n4N05l68j95J11O5j9J39oj03J06l26J48J07l03L64
$$ plain form
4752 -98 56 167 -99 -266 146 -274 67 -23 -73 -62 66 -157 93 -9 -171 -220 -312 220 -325 15 -125 -138
4774 -138 307 129 -42 -46 -75 -297 245 202 -129 -88 272 124 3 8 77 -53 -20 105 315 -35 -157 78 -72
4797 -72 99 -113 -209 76 52 45 73 -247 -40 2 135 -9 75 6 77 133 -195 70 -303 -143 358 50 -214 33
4821 33 130 169 54 -63 265 -184 8 93 120 67 331 116 -38 110 39 -10 -150 -138 20 223 19 300 293 254
4845 254 -35 -155 -43 107 -65 222 -129 39 -158 -79 -112 -103 -419 224 79 47 98 35 131 13 -134 -14 203
4868 203 56 87 -6 92 -119 -235 144 -28 -270 35 -66 -130 142 66 -223 70 49 -170 259 -223 -352 157
4890 157 161 -176 -57 -62 69 190 -369 -47 141 125 184 -53 -201 194 82 232 63 190 -140 -157 -96 133 409
4913 409 35 89 -92 -364 216 -26 -80 425 57 -138 -27 38 19 158 152 49 155 -171 -23 84 -219 145
4935A45j25K35k06n03L72n6lQ2LJ36J35m9k55M12q6l48L82l58L16k86O9r4K07
4958A25j12J33k37k5L25m31K44j53J32O5j60o7J95J08k52J36J19m2r2QJ7m6k0
4981c0k95M82k02N3J26j61Nj90L5L40j67J34j28j24k3L44j54km90O75j71o8Q4
5004G3O0k64J85k6k90K17J3%j03L04k66J17P1n8J3Q1j88J8j26J2L11k79L17l64
5028a72K4Q1j76J92K89k80J18l1l1q6OQ0L7p1n9K46n44N36j57J28mj77l9r3O2
5053a21n4J83J41l37J38j39j94M88k60j18J25kJ65J10J61k80J01j81J87n3l2l3
5075ek11L16k04K58K65m54K6k8R2N6M1j56K36m57K82P1qk46k23J08L48Oj44k81
5099c12K18r7K02k04K15J53j92o6O6J22k68K36k47M27k68k90M68J88m40J03l65
$$ plain form
4935 145 20 255 49 -454 -82 -138 -141 -59 -56 80 215 166 -89 323 237 -111 271 -87 229 -57 12 -82 125
4958 125 13 146 -91 -116 209 -222 22 -131 1 66 -94 -161 34 142 -110 26 145 103 11 19 36 -10 -30
4981 -30 -325 157 -45 8 134 -27 -22 -212 -177 163 -4 130 2 -122 -145 199 45 43 -447 228 57 -11 73
5004 73 133 -131 54 28 -262 -45 -32 -32 -135 169 -97 20 91 33 46 127 -61 -43 -169 -157 154 -125 192 -172
5028 -172 -148 -67 -243 -51 238 -42 76 45 14 -72 -66 14 51 -20 -79 167 -377 159 2 130 126 -51 -90 -183 -121
5053 -121 -175 8 149 -188 -50 -189 -383 105 -155 -273 -148 -150 15 125 286 6 107 -74 113 60 28 -5
5075 -5 -216 100 -104 154 419 -35 -9 -37 55 111 152 -4 232 -225 57 128 120 -126 -349 -241 107 113 -31 -312
5099 -312 -94 -191 11 -193 22 175 -17 -83 -17 105 -163 73 -174 253 -15 -305 163 351 -89 14 -351
5120c51J94K23p2j35K5l7M03j72qJ56k40k46L62q7R8l7j43pP2J30j35P5r5n4m4
5145a25M6J41MQ6j64N2J08j56Q6pr4M2l1j30R1K69m13R3k42M42j59M88o01j0Q2
5170a02l0%j5K2J05kJ27m07L08k97L24r6J03k60j85O52n02J69K53J00k48L6n7
5193bJ5K68k39R7k68N4J05L0J4Or2N4j21o0K05J18k51J55j20K69k34p1J0K15k95
5218a38K12j62L5J24J7J6r3j6K8k03r7K84k21M3L38j7n32N00m89M31Q4k22K89
5241B11j19o8n4J06J28MJ50l89L6n8J36l71K75k4L1m9J30j51k28L59j5J46Q1m40
5265a73L46j86k62M64k26j3R8j16o7N9P4L4J54m32j1L21j77k6J20J96j10j66j30
5288b29O15l44m2J76k09r6J27q6K92N8m12Q4Q5LK01j30j16L2R2n25L70j52L76
$$ plain form
5120 -351 -157 66 -6 -141 -116 -153 250 78 70 226 -14 -260 102 15 113 76 -67 -74 -2 128 -7 68 -27 -81 -125
5145 -125 -79 62 66 152 -12 40 148 -8 78 71 -23 19 -12 -142 -51 218 -195 -102 -344 98 -61 427 -174 -184 -102
5170 -102 -132 -132 -147 -125 -20 -22 105 -302 6 -291 33 -63 40 -220 -405 247 -255 -86 167 267 19 55 -2
5193 -2 13 281 42 139 -129 -75 30 60 74 80 -12 42 -79 -139 66 184 -67 88 -32 237 3 -68 -58 157 -138
5218 -138 74 -88 -53 71 88 104 11 -5 23 -180 -277 7 -214 -171 167 150 -382 118 -371 60 144 -78 211
5241 211 92 24 -30 76 204 208 358 -31 5 -53 83 -288 -13 -37 -6 -55 75 -76 -304 55 40 186 267 -173
5265 -173 173 -13 -275 189 -37 -50 48 -68 -135 -76 -2 32 186 -246 -257 64 -113 -139 -19 177 67 -99 -229
5288 -229 386 42 0 176 -33 -129 -2 -88 204 262 -150 -66 19 22 223 93 -23 9 101 -424 -54 -206 170
5311A70k03p3L26j53j04j10r1J84J04m1J08L0k01R4J2n4Jj16j1J47n7j4K30k54
5335g6K67j07m1J29M1q7k86K60o8k11J42J45M7m1QJ66l58K8J67p4Q0k10j88O13
5359C46o13L15j19n4lk4J80m8j50R8J15k7j57J39J14L4N1k73N7N4j18Q3j02K57
5383A55l7P0k53J28L0J8j76M2K91l96Q5J4j41j41L48N9r5k9j95J49j78M17J70
5406C35k36j36q0L7O6M9k76L24n9N8o6R7l37K27rj20K46k99K17P9k60K84R0k91
5430f0Q8o3p6J82k2o4N7j09P3J86j09k02L42l84K04k20J96K5j10j70L85j65o4
5453h0J9k03L22M0q2L71k92j94q0m9K42o2K35k40k3j0Q7K49m23J81J7J12k43K45
5477A39k9k07J57k0J22j28M0j41Q3j11Q8k23J43j18K20J16l06J29L16k96L35j96
$$ plain form
5311 170 -33 -106 220 67 -37 -147 -238 -54 50 9 117 147 -54 40 52 -2 -1 -117 -128 19 -38 -52 178 -76
5335 -76 191 84 43 172 213 126 -160 100 32 -179 -37 108 155 114 122 288 -70 -42 125 51 131 -79 -267 346
5359 346 -267 48 -71 -125 -128 -152 28 -20 -170 -72 43 16 -141 -2 112 146 197 -76 -19 35 -83 0 -102 155
5383 155 118 188 -65 63 93 111 -65 -23 268 -128 -43 -29 -170 -311 37 96 1 -28 -223 -74 -252 165 335
5406 335 99 -37 -117 -80 -14 35 -241 83 24 82 16 113 -224 3 -6 -126 120 -179 38 117 -143 141 231 -60
5430 -60 28 -35 -111 71 49 -15 42 -67 6 192 83 -119 223 -161 43 -177 19 44 -66 -236 149 -16 -80
5453 -80 -61 -264 58 98 16 387 95 -99 -179 -228 14 -48 187 -53 -76 -86 1 250 -173 8 25 137 -106 139
5477 139 110 -97 60 40 162 34 74 -67 16 -95 -7 -230 -87 -205 15 131 -175 -46 270 -26 309 113
5499A13Lk07J04j3j90L57l12K52j90J27k65N81j72m0k99L6J29P9j46q2J13J02
5521H0j58K62j64J29j81RK07j9l22k6L66k33J23j58O2K18J24n11J06P7L25m97
5543a81J65N5k7K64l29kP9R5j28r2J26O1k36J80k9M7p8r6LJ98p4O2k67L06k2j99
5569a19J71R9k17K9P5k49L29j33R2J81m47K94J53k81k5K0l71L48L10l66N1K68
5591B12n3l7j58j78K77ON2j41o8J40J31j22m2J00N8k40J5o7J49N3k20Q3J5J72
5615A37j38j36K14l1k31J34J14J69l35L5Q4o1j17l1L56r0q5m9J52j75qJ26m3k03
5639b12L27Kl11o8J78q0K84k52J81J70Qk81P3q4J41j4l4lJ36m27L29k99J85p1
5663a22k21N57J1k3l60J32n6K85l35M85k18n2K4j19o2L56k82k90L31o9k40N20
$$ plain form
5499 113 116 -91 13 0 -190 167 -145 107 -83 44 -221 360 188 148 -151 -115 14 93 -53 -135 -22 80
5521 80 -78 184 20 149 -32 -23 184 165 -157 -183 183 -50 73 -85 -23 195 319 -192 -86 -9 316 -181
5543 -181 -16 39 12 276 -53 -55 24 119 -9 -101 25 86 -150 30 1 48 -30 -126 -123 75 1 63 -204 102 80 -119
5569 -119 52 151 -66 -37 38 -211 118 -15 77 258 -189 105 258 -23 -48 -28 -399 -51 259 -107 -56 212
5591 212 159 122 -36 -214 63 69 121 -20 -88 52 183 61 19 119 177 -63 -48 -115 34 87 -133 -50 -35 137
5615 137 -1 -137 77 46 -185 -51 63 232 -103 -68 16 -45 -162 -193 163 73 -12 -61 91 -84 -92 34 -9 -212
5639 -212 115 117 -194 -262 -84 -164 120 -132 49 219 227 -54 19 -65 76 62 28 25 161 -266 63 -236 -51 -122
5663 -122 -343 214 225 202 -158 -26 -82 203 -132 353 135 83 107 -12 -74 282 0 -290 41 -28 -268 252
5685B52l10j21J23J92m06M24K8k09J88k21j09J90L56l71j29K71k81J63J65J10
5705C05m55J7L54k93K56%l09K48l29J20o0Rm8K55qk62L86n82M28M8M9n9j08J6
5729b2J74m13N01l73K28J43j15l09J18KO2J42j46j13k96M63j92N01n58K49j7l95
5751c66N87j86K26j09j85J42L8j97J6J90l01J63J84l37K63j37j98L33M5k72J94
5772I3j43J53j47Q2q7j38K64K22k75j12N2k80L23r5m6K98k69n6L2J69k83L95k54
5795a02R8OJ5l9kj10J75J38k14O6k8o3N1l9j0J43j04P9k72K83r6J54k85J76j17
5820i7m38O88j68m9Q9j2K8j04J06p3Q3k31J36L6L3k19K45j06L37o52M84j06n6
5843d6K28j91j03J22M17o13K10p5K38k22j07R5P1o3M2q3j34K00L0Q8j48l5M1J74
$$ plain form
5685 252 -58 -179 -56 136 -270 154 182 -27 161 -60 -169 21 377 6 -123 148 -133 30 195 305
5705 305 -150 -133 221 -72 184 184 -125 123 -206 -86 -146 -137 -185 70 62 -200 186 -396 32 80 129 70 -38 -22
5729 -22 152 -261 240 -133 95 238 123 -186 -68 -66 -4 138 -8 -121 -417 46 -146 355 -203 46 29 -366
5751 -366 221 35 261 152 -33 109 147 -50 -34 156 -145 18 202 -135 128 -9 -207 126 171 -101 93
5772 93 -50 103 -44 38 -49 -187 77 299 24 -88 -36 -316 7 -88 -134 164 -105 -161 -129 40 -243 152 -102
5795 -102 -4 2 17 -22 -24 -134 41 179 -35 31 3 -60 -9 -48 -58 85 -19 60 -212 71 -25 129 -156 20 -97
5820 -97 -535 153 -15 -64 25 13 41 -63 43 -30 53 -178 -42 -6 27 -192 53 -53 284 -368 116 10 -46
5843 -46 182 -9 -112 10 427 -186 24 -51 187 -35 -142 -47 24 -39 3 -80 -214 -14 16 104 -44 -79 -38 136
5867A36k79J59r6J62Q4k53L64k83m6J50k57L84k74J02l28K85qR5J39l11J29j12
5889e8R1l1J04l43K82P9l49K71J13k82M08k19k50J15j10P8J66J0n1k31L09m2J63
5912B23j18j40P1K94l31J66j39j15p4K71r5j46Q0k13L41J86j63l14M79l28J5m9
5934i9M4J29M3k66L74l43K74pm22L57j55K13m5l70R2J87O1j20J1J28j8oj00m1
5958g9Q2k01K75J29l02P6p9O40n47K0n9O5j07K72k8k15o3K13O3j37K7J12j4l48
5982b05K72l1j71J65J41k02K7K44k30K8j6K8j58k33N91l67M55m00R9O0j08R5o5
6005A9m1j22K65r0J54m7j41l0Ko6J77l2l6J1R2k48K4J59k28L57k79L76n39K16
6029d7KK7L11j65M9j65k14J43J53n2J49j32l81K97J37j37%K52k28J55qj57J32
$$ plain form
5867 136 -143 16 -80 82 166 -87 277 -6 -52 98 -159 225 -49 53 -275 10 2 97 236 -75 54 -58
5889 -58 33 2 106 -237 45 124 -225 46 159 -123 285 66 -184 -69 -179 -101 65 75 24 -207 102 60 223
5912 223 105 -35 36 330 -1 165 26 -89 -163 108 13 -133 -53 -266 75 261 98 -216 263 -65 -50 -99
5934 -99 -55 74 117 -149 225 -118 156 149 -273 84 -71 142 97 -273 -181 6 67 -53 -42 86 68 62 -38 -79
5958 -79 3 -198 77 206 -96 -20 -99 541 -6 14 -45 20 -87 185 157 -58 -121 92 155 18 45 157 143 -205
5982 -205 67 36 -135 30 171 -31 -4 240 10 38 22 50 -108 -341 250 -117 338 -62 37 97 -11 84 19
6005 19 -22 -144 121 31 185 138 -3 -33 -31 -97 80 48 12 23 115 -133 -109 50 -178 179 -100 276 -263 -47
6029 -47 -45 -18 293 128 177 12 -202 -59 94 42 191 59 -322 -25 112 -25 -25 227 -1 154 146 -11 121
6052A21J8M0j37J33k32q5J99k58J14O4JJ04J03l25K08L1J23k30j63K43J96o0l28
6075a20J92%K18k21j47L59l42K9J59l6n7k2l8J30l35K10J44l03J6q5J98j16j9
6098a86L53m58O05m69mk7k8K21j33J53O0m4k05L33l47K65Rl08P8J81m30L46O5
6121C0j07K55m08J66K23j67k35J20J42M5J59k72M7P9l5J0j92L28k77R4J5k83N42
6144B79l46J23j03J45l93J74J00M7l12J74M81o68K44K47k17L81m49L38n20N43
6164B68l09N2KK5j28J66K3k01J26N7p2R5J32k46r0O4J74j70j95RK85r2J78k94
6188a41J37P9j04j25L10j82m1M5l55M15m6q7K86J02l28K32k68k4J79j39j39J64
6210c0j79J92L40k92j58m1M8K10m08K07J87l29J64k39M89Q3j22j94K28j74J92
$$ plain form
6052 121 139 179 42 175 -57 -142 57 -201 -87 -23 -22 82 185 -140 68 99 222 -8 -171 72 268 208 -120
6075 -120 72 72 290 69 -78 281 -61 -32 127 91 34 12 -26 104 -231 -21 123 -180 -164 -249 -51 -167 -186
6098 -186 167 -291 314 -155 -159 -186 -214 7 -126 27 87 43 -162 171 -176 89 98 -210 -132 49 -381 -35 30
6121 30 -77 178 -230 -64 159 -8 -243 -123 19 64 223 -49 -2 77 42 52 -140 188 -89 5 20 -263 279
6144 279 -67 56 -47 98 -295 -121 -21 26 -286 -112 369 -299 -55 192 -25 356 -93 245 -275 268
6164 268 -41 11 13 38 -90 76 99 -102 24 81 9 104 236 -10 -100 -36 138 -32 -227 -218 67 -25 153 -141
6188 -141 -4 75 -29 -154 156 -26 -67 -22 -377 38 -8 -95 191 293 -35 197 -71 -95 84 -55 -194 -30
6210 -30 -209 -17 323 31 -127 -168 -120 90 -318 -111 76 -253 -89 -328 161 244 122 -72 156 -18 174
6231A74j96k46L64k02K94l3k37J39j29J63J8j95p9K2P4j9o9K72j62q1P2K9J80
6254A53o0n3jj04J33l01J40q5Q3J6J7p5j10J63m2q1O9M77l81J62RK20l02r9K47
6279A95j21m20K88JJ39rk05R7p1M79o48J36o7M9K56kj75O2Ml4L8n1q2m7K87J45
6305B44n17L87k12ML3J33k31n9L70k20L12k33J08Qk08M0R4Q2J29k31j99J35J8
6328a3J14k13L59k39l26J56j1L18j7rr1m4J39O0j03Q8o02L71K73l12O1J8j11M9
6352h5l9K05j08K10N3L2l13k7J33j64L03k01o5K55m5p9k00M0J36j45qJ82k98l2
6376b60K94p3n2L7J86J01j14j86N0M9j34J17mr1R7m7j69J25j44L47j15j32j2K43
6400A13k90J32K6J2K61j50k39K91j10j47J66p4q3j33K11K00j30k33J56j34J16
$$ plain form
6231 174 -22 -268 96 -106 188 155 -82 57 -72 91 109 -86 -165 -143 -69 -88 -157 115 -47 -128 -56 -27 153
6254 153 93 40 39 -65 68 -233 -93 -178 -95 -79 -62 -137 -247 -84 -126 -207 -138 339 -42 120 129 349 47 -52 195
6279 195 74 -346 -58 -57 82 73 -132 -35 -106 373 -275 -139 -206 -157 99 97 -78 -16 -12 -46 -8 -59 -141 -188 99 244
6305 244 -273 114 -98 -94 -61 72 -159 -218 152 -68 244 11 119 127 -81 -41 53 135 264 33 -166 -31 -13
6328 -13 101 -112 247 8 -318 -162 -173 145 128 119 28 -16 123 183 80 168 -434 -63 210 -102 -41 -23 -134 -85
6352 -85 -124 81 -27 183 236 268 -45 -72 61 -103 200 -1 -66 189 144 65 -135 -95 41 -104 -112 70 -228 -260
6376 -260 34 -39 -91 -54 132 233 119 -67 -17 32 -102 15 11 -80 17 -30 -199 -74 -218 129 14 -118 -130 113
6400 113 -177 -45 -19 -7 254 104 -135 156 46 -101 65 -9 -92 -225 -14 186 56 -177 -21 -155 -39
6421c9j00m4K40j30J51J29l38K00l0k5l5J91j02j02M7k50L81k04J39j70O7J10
6443H6l4o2j55M6o0K3K36M4KRk16l4N1M7J2p2L7R4O9n0q7K6k5JJ55q5j19L9J06
6472H4Oj82J25Kj21J70j22o3M2Q9k18Q4P7O6j88K48j46J00J90j97n5N9qk83J76
6497f5LK37j77n8R3j43r7K27m9M45n12Q8M52n11L17l20p6J53o5L0K86n4k13K1
6521A2k62N41k72Nj51J46p4%o9l3L70k72J6J44k49J69J2j67K88k39Q2L26j29o9
6545A25O4k24M3j24J04k59K86k3Q0j15R1k48J30r9K15rN1K56o32L31k1J19k64
6568a23K4P8K6o1J6j6l8K87q8j13K34j2k02J95j37q2J17j68R6k3K20j71n3O5k44
6593a73J89K5J59j04m6k9P1j95K65k20R7k66M93n19L17K71o20K27M5J54k11O0
$$ plain form
6421 -39 -139 -183 57 -73 78 207 -131 69 39 14 -21 170 68 -34 13 -237 144 -60 79 -91 -24 86
6443 86 52 -10 -165 -119 -179 -156 80 124 126 135 -81 -115 -64 -17 -5 -77 -40 54 123 73 -14 12 -13 -12 143 58 -61 -22 84
6472 84 90 -92 33 35 -86 84 -38 -101 -59 30 -188 -104 -27 39 -149 99 -47 53 243 46 -9 50 42 -241 -65
6497 -65 -62 175 -2 -60 33 -110 -207 20 -29 416 -96 -8 444 -67 250 -70 -146 7 -58 -28 258 204 -9 12
6521 12 -250 291 19 24 -127 19 -55 -55 -124 -157 213 -59 -43 101 -148 21 33 -134 154 -85 -3 323 194 125
6545 125 189 -35 8 -116 -12 -271 15 -8 72 -43 48 -200 -70 -169 46 37 88 344 -288 43 22 141 -123
6568 -123 -99 -21 5 -56 -40 -56 -94 193 105 -8 226 214 12 207 70 -12 105 -63 33 10 230 59 6 71 -173
6593 -173 16 41 200 96 50 21 92 -103 162 -58 39 -227 266 -253 64 335 -285 -58 -13 141 -70 -10
6615a0p8Q4Q4K24p1k62N7q1Q4P5R0l49J17j74J98J2q0J87l10M11j69n8k38J58
6639i9J97k33L66m10J22K63j61o3J73k40j30L06k18J37n3k24J99N4K3q6J66k46
6661a57L92Pk10j14J49M5k29J08R5j1l67K88J48Ll0o2j31j41J78J75m8K9j60j57
6685b00J71k02j1J42J93R6j35m6j19M0k0J91l58J69L97k35n7J12M9n0k04Q2K6
6708C1j11k32K21L2J67l7j9n4P1P3j2k84K53j5j01l5J17k3m8O6J90k54q2J80j16
6733b2J41j99k5J77ok32K88k73L42j93P3n5J05l15J16oK13k35J97K04m79K34j81
6756a31n8J94k53J57J62J02j85o7J33o0l3K4J17Qk23Q6l6j52K69k2R1k71N30o18
6780b36J99j14Q5j10K47k21L59j89j18J76l15M39l15Q3L1J03rk56L54k68J84j9
$$ plain form
6615 -10 -88 -4 80 304 233 -29 28 -53 31 106 196 -153 -36 -210 -12 0 -80 107 -203 208 39 -19 -257 -99
6639 -99 98 -135 231 -179 -57 206 45 -18 155 -85 -215 91 -127 10 -43 -267 -68 -14 9 -77 89 -157
6661 -157 235 242 32 -82 67 112 -117 -9 86 75 -292 -4 144 147 117 55 -76 -217 -39 136 88 117 -43 -200
6685 -200 -29 -231 -242 -100 93 189 54 8 -111 -71 -91 100 -258 -89 308 73 16 128 177 127 -77 5 31
6708 31 -80 -312 -91 -59 108 71 52 -2 69 142 130 -154 99 84 -17 -52 65 42 -6 60 250 -4 -86 94 -22
6733 -22 119 -80 -105 72 66 -166 122 -151 191 -2 71 16 121 -194 -78 -84 129 -106 91 295 -184 50 -131
6756 -131 -189 5 -248 -91 71 173 -12 -79 54 -6 -39 -15 102 110 -113 -27 -63 -215 54 32 123 -148 382 -236
6780 -236 -37 -151 -66 -176 71 -150 209 20 -98 78 -237 202 -113 -30 1 104 95 -161 193 -75 109 90
6802I0J5Rj34k6J98j57J23m9j32J61k5k3j38q3j74L86k93J48q0K40P9j68j80J46
6826f7J53o6m20L49K01l15J46J4R1j06r1Q9Q8m2j9j38K83n8j43P7n1o0J23k40
6850b02L40k91K71k70j14K64J00j24mM9J40m0k21N3O7O7pr7K56l20J23j69K87
6873A58J80n83M17r2n3J4k27K60j08K0p4j5j8J7ml70N98j27o9L17m59M06k65J10
6897C3l23J52K19k7j64K7P7L7l9J23N4j19J4j63R2K3J27k5nk93M18j17j17Jk32
6922b27J76J29o2l4p1k81Q75n62m7r8J8K35J64k83j54O2r9K07n6j30N50l21q0
6945h9J01j35J82p4J00j42J79OK7l29mk2qJ13J33j58k8R6P2j24J16J6k46n9L61
6970H4p0k29K03j76J87j65K11l28K02K75l67K58r6M1k79rl8N61l85O4R8kJ36m79
$$ plain form
6802 90 105 114 -20 -46 152 -5 118 69 -63 98 73 50 -88 -171 -345 41 -252 -104 -184 56 135 -33 -213 -67
6826 -67 86 20 -400 -51 150 -165 -19 -5 86 -20 -111 -22 66 24 5 -133 150 92 -51 26 -25 -85 38 -202
6850 -202 138 -153 118 -152 -266 -2 98 -26 -30 19 159 119 -102 -49 18 85 78 -19 237 -83 40 -129 158
6873 158 338 -245 172 80 27 41 -186 74 -34 -14 -88 -103 -121 -104 -108 -478 120 -7 -76 241 -218 188 -77 33
6897 33 -290 -138 81 54 -110 -83 -6 31 -8 115 169 50 64 -99 -7 16 143 118 113 -180 238 121 4 5 -227
6922 -227 -51 78 16 -18 -89 -370 505 -57 -104 -202 -184 51 215 -68 -222 -160 -259 -52 -108 -238 312 -9 -89
6945 -89 12 -123 59 -15 85 -57 122 128 155 -174 -178 -200 -208 -95 38 -120 -148 -52 20 -104 12 28 -218 -277 84
6970 84 14 -215 -12 -188 -1 -166 45 -283 -81 194 -173 85 -11 30 -249 -258 -296 265 -120 -56 42 40 176 -303
6994c03K85K71k53q9J06j4l6L08k52O5r1K32j35P5j56J44k29Kk27J90J74j16K44
7017A95o35O00k08j9jK1K37k40j08K14l37J63L54k22j24k21L0M04Oj66J99k95
7039a53J36J36j89k83L51j08j99M00K5J90m32K02k59L49q5L6m40J22K99j75J07
7060C0j66L53k33j00o4K06m0l82N08l55L37l33J84J68olj77J53j55L07j70k61
7082a99L43j21KJ81l24N3q2o7K95j61J50m3J59k79J33R9m03K45K52m26j28R7J98
7105b6Q5J6m1k64K30l69L90q4J3K81m1p1j30Or2R2j59N6P9Mr1K65j80o4p4N3K10
7132I4n3j67J22J25n7q0J67n6l65M50k93M2K57k26J0K73l43OK9m6j12R1j66K08
7156i0m3L6K96n06M28n4J23j01Q6P3j75o0J26j18R1j13r9J12k40P8R3L72m12m9
$$ plain form
6994 -303 -18 253 0 -89 17 3 -33 275 23 88 -3 229 94 169 13 157 -72 -70 -297 -107 67 -49 195
7017 195 -440 160 -48 -67 -68 -47 190 -50 -158 56 -281 -118 236 14 -110 -331 -301 103 109 -57 142 -153
7039 -153 -17 119 -70 -353 -2 -110 -309 91 116 306 -126 76 -183 166 81 117 -323 -201 98 -77 30
7060 30 -136 217 -16 -116 -180 26 -14 -396 112 -243 94 -239 -55 113 107 104 -73 80 -75 232 62 -199
7082 -199 144 23 25 206 -118 -65 -147 -214 81 -80 70 27 186 -93 40 139 -264 -19 233 -193 -321 -224 -26
7105 -26 59 75 34 -230 0 -369 21 -63 -50 231 190 119 -11 -5 -97 -5 -164 -108 -29 -25 -116 149 -31 -95 -169 -116 94
7132 94 41 -126 -4 121 64 -16 151 95 -270 180 -113 -71 186 -40 -30 243 -100 -94 -65 -111 -223 -132 -298 -90
7156 -90 -133 -97 199 -307 121 67 190 89 175 248 73 13 139 21 112 -1 -100 12 -228 -150 -57 315 -97 -146
7180a46K31j60j65K47j17K05lk98R7L11k41L20m14K66l39P6M25l46Q2r4j38J44
7202e7K91l83J21MP7O9j3J2J5K1k54n8J00j17L01k4l42J79L39k35j6m7K74l66
7226a09L73j55O5k94J18r6K32k08mJ40k78J41q7%M64l63J81J02k12j68L46l87
7248a99Q2K54l15M17l74q7K36P6k36K55L7o1k05J54R4l33O1J65J6k16R8N3P0O
7272D8O4n20M37R4k32L64m57R0J12k51k9K58K1j72J69K11j11J6k12K8J08K8N8
7295A22j83K29j51M3k49mj70L02J51R3j60m9j49K01P1J22l34K46Nk8l62K35K7
7318HNj62K74j21QN8J46j50r4J06k33M09k94K70rk92R5J85m0q9L17m92M87l06
7342H6k53J97o2nJ18q2O1j04N7j13J31k88N8L0K98K6j40J25m51K13K54n4o4O2
$$ plain form
7180 -146 85 -75 -240 7 -110 95 92 -206 -109 202 -39 281 -133 133 -206 -130 295 -51 31 -63 -201 -57
7202 -57 234 -149 -28 -24 53 122 109 121 136 157 -97 -155 -55 -172 129 105 -237 -58 281 46 30 -17 257 -109
7226 -109 264 109 174 -120 -2 -98 134 -74 -78 62 -216 -75 -162 -162 302 -61 120 222 10 -158 188 -199
7248 -199 -117 137 -178 239 -135 -222 14 90 -146 109 146 85 -120 34 128 -205 -144 21 37 -179 -81 -28 42 48
7272 48 112 -408 29 123 -109 255 -202 -112 0 -251 -280 -22 -1 -173 -4 207 96 112 -100 -72 36 64 122
7295 122 -61 168 17 60 -189 -193 -363 -61 90 183 23 -26 -175 26 97 219 -115 131 136 108 -254 -19 8
7318 8 13 -149 125 4 12 70 216 66 -28 78 -155 254 -40 230 221 -71 24 209 169 80 397 -95 392 86
7342 86 -167 30 -32 -37 81 -1 60 -44 13 -100 31 -257 -199 -169 129 155 15 140 -311 -98 156 102 38 100
7366A00k42K23l45M35Jk92L74n3j09K4m33M95j43j04k1o9K92J65l05J10j72J82
7388A13J1n9r6K1K98l10P5j24M0K36k05r7OJ23l7J45M1j61j9l01J93j28N2J36
7412d7o0K56j23k7K6O1k51OK60J18j32j08k40L08kn9j98J80j35P9l0P8j39o8K60
7437A3N5j00N9m3j88J71k93p0K22k7J86q6K16j70P7M4K4N8j66j32K83l20L14k93
7461a66L19Q0k00J22j73J69p4o4J46j85j45J68J71j42m6N3j27J79j11m9K16j22
7483A9l6J30p6k8N4k38K07l6j20J95p7J17j48M8L1j30r3m6K54J89K2k56j08J83
7507E7j5j31N0N5R6q3lJ58j74n5j17Q9K0K0j02o1M38j47M6k35j05K13J38k67K15
7532A00n2q4J54k87K16l3j37K46Ll3Lj03r4K13R0k44K2j31O8J17J60m2N3n3j47
$$ plain form
7366 100 -142 81 -264 171 172 -120 254 201 92 116 -317 178 35 -69 -90 -159 133 298 -7 103 -69 113
7388 113 124 65 -31 -10 288 -22 53 -71 -31 205 0 -97 -91 32 -5 140 181 20 1 -300 -107 -235 -183 -47
7412 -47 -107 149 26 -1 25 86 -165 -159 101 219 87 -21 -261 47 45 -14 -212 -32 -167 -88 -118 -40 -179 -247 13
7437 13 68 -32 27 -16 -204 -33 -326 -396 -174 -201 -15 -101 115 -55 22 66 90 148 -18 -150 133 -187 127 -166
7461 -166 153 233 33 155 -18 151 77 13 159 -26 -171 -3 168 26 -20 33 -94 85 -26 -75 141 19
7483 19 -17 113 37 9 63 -175 32 -4 -124 71 -6 111 -37 11 42 -88 -181 -227 27 216 238 -18 -126 57
7507 57 42 -89 -39 16 112 29 26 184 10 -45 -162 -73 -53 -33 -135 -196 242 95 141 -94 -199 14 152 -115 100
7532 100 48 -36 118 -169 47 14 -123 123 126 93 96 -7 -101 112 202 -42 -20 -151 -83 34 194 152 205 152 5
7557EK29k51p6p3J00L8m0J31R3l82K88k69M47N7l89J80k9r9l1P6LJ32k90M3K05
7582I8k56N62m14P9o5L6j58Q9K10k52J14j38L6k4J16j14O3r3L1k9j34J50J81J56
7606B44N3k39k85L03M4l38N01l88K86l66n6K33O5m6q6K33j46L23n86J59K53Q6
7628B47Q0m12J31p6j44J99j29J58k71L55P2L7l37J72j83J08M9k8k1M0j72K11j54
7651f8r7Q2O3k87J57J24J93j01k55K48J90l50K32j37J25j07k74L14r1J26k60L01
7673A28L9j07q1q4J18j97N6J00j04p0L38o3J17l9o7k83J40j76J26K4M0kJ22K29
7697C04l16K73k47N3J06l07M8L4j52M30k56J99o9j75n8K90k64j47M57k68k23K41
7719d7o5RK79j96J13J24k44J29k61O2jL62l31J79j89K13o6m21L37L6j22J13p5
$$ plain form
7557 5 234 -17 -93 -166 -66 -28 -68 63 156 -226 62 -207 240 297 -92 88 59 -40 -71 5 8 140 -150 -107 98
7582 98 -158 404 -10 69 4 40 -118 -29 181 -71 43 -95 -59 -83 33 -81 -18 -111 -80 -109 -243 -93 88 244
7606 244 297 58 -227 76 120 -218 283 -105 181 -185 -241 -8 57 11 -75 158 12 335 -251 -92 161 247
7628 247 327 -85 46 -30 -174 25 -104 54 -217 138 210 247 -90 82 -101 7 56 28 7 47 -125 86 -68
7651 -68 -165 -83 -20 -307 -150 -26 167 66 -189 59 249 -101 131 -6 119 12 -262 52 -39 87 -173 128
7673 128 167 60 -21 -105 13 -184 -128 -28 -132 -202 136 73 190 151 84 -199 -59 -235 -109 -85 -45 -47 75 304
7697 304 -12 261 14 67 173 -134 -86 -52 -204 226 -30 169 100 -75 -133 157 -107 -254 203 -65 -288 -47
7719 -47 -112 -103 176 -20 93 217 -27 102 -159 -97 -98 264 -67 112 -77 136 70 -351 -14 22 -100 13 -62
7742f2P0oM1N9J65l00J45J52m44N98o29K63QJ56k44J57l16L64j1j98M59n40j21
7765b34L59r7j36J78k08J31p3K49l22j34Q4K82j21j75N38k26q8N5k78K29o4J38
7787H7k13J23r0j07M05K51m37m2K8m1j13J72j6J40l1m4M9r5r9J34l0k10K2K15
7811E8J28m55o4R1L40j21J47r8j12O1J11j79Q7n5N0L44l43K6k34L04k07J89K50
7834C18j57r0j9J98j75n7J78n59M31k90L34k95L09J05j37o5P9J9j62q0O4J63p7
7857C5K1o6J9M2J32j77Q0j03j21Q7j69M92m6l78J08J43j16P1j26%K85j98K81j82
7881A14j78m3M9M6O1q0R5J04k48J28m5l7j39j75K47j49L9M1K57K19m55L91j43
7904I9j8j0k8J1n4K19j10n0k47J45J22k12J96l8k01M01j84N8l73J35J80L02k07
$$ plain form
7742 -62 8 2 43 102 267 -33 112 264 -180 418 -211 52 60 216 -28 129 -187 177 166 -32 427 -113 -234
7765 -234 125 28 -108 70 -138 -7 -80 169 -153 -287 -203 79 -42 -217 321 95 7 62 -216 13 -51 87
7787 87 -126 -3 -93 -200 205 456 19 -23 5 -36 -149 23 7 147 116 72 121 26 -73 61 31 -179 -157 58
7811 58 186 -269 -333 -242 98 -23 124 26 -86 -25 86 -93 -6 -61 -11 333 -10 16 -218 86 -121 68 318
7834 318 161 71 52 250 75 18 196 -363 68 -222 112 -183 126 231 94 29 108 127 -35 -115 -51 112 35
7857 35 56 -10 9 51 183 6 86 -17 -138 -51 -220 272 226 -152 -44 99 -17 54 -72 -72 213 15 296 114
7881 114 -64 -107 -58 -12 49 -31 64 168 -80 48 3 -34 -173 -348 -101 -250 -211 -170 87 306 -149 242 99
7904 99 81 71 43 54 0 219 109 59 -188 -43 79 -133 63 25 -176 225 41 99 -274 -139 41 343 136
7927A36k23L18o9o7k58J34J76l79J24J79m4j0K69j59m41J60K23j75J21k12K76
7948G9P3l33J94k99M04p8l06L01j88K53J65l43K80m11J86K14l32J39O6J41k99
7969i4K0m3j3J26j6j29J20l5M9P3q6J68J21k18N6j59J8J57L3O4k79J40l3j76L30
7994A94l59L53l26J32J60K2j74m1P0K47k49O3j04o8L9J40j40L49m26J15m6j16
8016a65L64k80J99k09N2j40K34j85K63m31K99J48l12j42L15J6l33J88M06l72K29
8037A44k80K88k9j30j7n0J36j94N5l9R6k71L09j71J9J19K12k90J50j03M21n02
8059a27L04k57j32K25J00l91M3L80j95K25k89K80j46r3n2L86k71j53K39J36n9
8080A53J7k3K10n88J56j23P7J70k5r8L8J19l90L88j86J94L4pJ0k7J08m04K80l05
$$ plain form
7927 136 -87 231 162 95 -163 -29 147 -232 -108 71 27 17 286 127 -314 -154 69 -106 15 -197 79
7948 79 152 -181 13 -286 118 40 -266 35 -153 100 265 -78 202 -209 -23 191 -141 -2 64 205 -94
7969 -94 -74 -117 -130 -4 -20 -149 -29 -64 -15 58 -28 140 261 43 99 -60 -42 115 148 212 -67 73 40 -136 194
7994 194 -165 188 -138 -6 154 176 2 -39 31 278 29 92 -12 -80 -41 99 -41 308 -118 -3 -49 -165
8016 -165 199 -81 118 -91 -39 -179 55 -130 133 -298 1 149 -163 -305 10 26 -307 -119 287 -85 144
8037 144 -136 152 123 -7 -24 -74 62 -132 -77 -116 -20 -291 18 -153 -134 -15 197 -93 57 -46 375 -127
8059 -127 177 -80 -212 13 113 -278 -235 145 -50 175 -114 166 20 -73 -125 261 -10 -163 76 212 153
8080 153 170 147 357 -231 -75 -198 -121 49 24 -74 -36 83 -307 81 -105 89 123 116 126 99 207 -197 83 -222
8104b22k25M56k91M06k13k4K1J99p2O6j58J18j18mK06m42O25k01n30M23q2J44
8126H2J30l38l5L19rMl29L33o2o8J90Rpj35l60L14P7l30J07J55J03m20j9K31O6
8151Hq1N9%J1ro5oK71k85j00L13k90N7j47J02J55L3q2m3O3j06L42m47K94m4J83
8177A86j08j35k8K21l50P4K80j2l53K65J29J04k93K9
$$ plain form
8104 -222 -447 9 -282 124 -89 -113 -92 107 35 101 -57 61 -57 -61 145 -297 328 127 -403 20 -62 82
8126 82 212 -126 -161 158 149 153 -176 157 95 27 217 226 219 84 -276 38 115 -215 -108 47 150 -270 -289 -58 8
8151 8 -73 -14 -14 -3 -12 -77 -83 188 -97 -197 116 -174 -117 -264 -162 -7 26 -56 -99 -36 -142 200 -247 47 3 186
8177 186 78 -57 -85 136 -214 -140 140 128 -225 40 169 273 -20 9
8191I
$$ Imaginary data points
##PAGE= N=2
##DATA TABLE= (X++(I..I)), XYDATA
0@%%%%%%%%%%%%%qJ6j6J6j6K4l2L2m0M8n6P1q0Q9j04J21j42J65j89K14k42K74
35A45l10L49l90M36m87N43o04O71p44Q22r10J006j110J224j349J487j637J803
53I45j987K193k424K687k986L330l733M211m789N504o415P623r314J1869j6229
68i515K5688q6221O6110R9238j11008m7056R598Q9181j3158m0529J8582J9885
80B0795m6166L1166L8143k4591k0809k6462M1081L4555n4189m954J9865j1513
92c079J286K2290j6317K84j9572J5122M7350m5881j8328L4473J6j3059n519J462
106E28J6323j9798k8835M6282q691l2762J8283O21J664q281n246L1071m409m8299
120d1549L1442M0412k7784j9467r521L9188J9031n5917j335M2766r467j8384J610
$$ plain form
0 0 0 0 0 0 0 0 0 0 0 0 0 0 0 -8 8 -8 8 -8 16 -16 16 -24 24 -32 39 -41 48 -56 65 -77 88 -101 113 -129 145
35 145 -165 184 -206 230 -257 286 -318 353 -391 431 -479 527 -583 641 -708 779 -858 945
53 945 -1042 1151 -1273 1414 -1572 1758 -1975 2236 -2553 2951 -3464 4159 -5155 6714 -9515
68 -9515 16173 -70048 -3938 95300 -15708 -62764 -53166 36015 22857 -17672 910 20795
80 20795 -25371 5795 43938 19347 -1462 -27924 13157 47712 -6477 -11431 8434 -3079
92 -3079 -1793 20497 4180 4464 -15108 14 47364 1483 -16845 17628 17644 4585 -934 528
106 528 16851 -2947 -31782 14500 5809 -26953 -8670 -8049 -6385 -14666 -19912 11159 6750 -41549
120 -41549 -10107 30305 2521 -16946 -26467 12721 31752 -24165 -25500 17266 7799 -10585 -8975
133h975J533K4151j6404j7216K9842j0702j419J9007j7002o194J3521n47J0018
146A9613j3114k2929L3421j535k1644J4460o542m232K085m204K0535k416m3239
159b9741J8529L3484j3764r951k1069J0859K9258j7751p821O140k0328J2142K5711
172A5698j5892r806j2240R183L8715k1976k6467J7825N724L309J946j6058J1014
185I75K526j7817K4144J322k0909R252j186O451J0646j8828K171J3183j3660J3825
199A2095L810k2956J0887L496j655N413k0425K703K1140j7717n073J1295p727
212d714P699n742q653K2238q283j3589J5445l655j830O294j3755O494N393j5001
226a1659J2832l471j4949J6141o67o925O806q709R634J1929j9627O079J2585r387
$$ plain form
133 -8975 -7442 16709 305 -16911 12931 2229 810 19817 2815 -3379 10142 9595 19613
146 19613 6499 -16430 16991 15456 -6188 8272 1730 -2502 -417 -4621 15914 13498 -29741
159 -29741 -11212 22272 8508 -1443 -22512 -11653 17605 -146 -7967 -1827 -22155 -10013 15698
172 15698 -194 -10000 -22240 -13057 25658 3682 -22785 -4960 764 4073 6019 -10039 975
185 975 3501 -14316 9828 11150 -9759 -507 -1693 4758 15404 -3424 -1253 11930 -1730 12095
199 12095 15905 -7051 3836 7332 5677 11090 -9335 -6632 14508 -3209 -8282 3013 -4714
212 -4714 2985 -2757 -11410 10828 2545 -11044 4401 746 -1084 5210 -8545 -2051 3342 -11659
226 -11659 1173 -2298 -17247 -1106 -1773 -8698 -1892 -10601 -967 10962 -8665 -2586 9999 612
240F12P664m690o420J5036j0247m623J3324j3619j667J0560j0577O559L93j1026
254h721J5306k977p608J4935q135m930J2630p112K366Q07j5187J3657L736j7466
268h699O639k330l268J0516j1844j387J2290j1276N699Q285j2705Q371K637o489
282c561J0913p849m518J3458j1143j834J0014j1026K436K985q713J1843k655j0415
296a0065J4313k139m118R741q622L664Q781j2462O539L033j2124J0478j527r338
310c846Q251p278q87J0274j3028K622Q743j0942O368L290q118R543m076n654J2714
325G976q479l922R413r399K901M036j1354P894J262r320R837l357n337J0984o008
340b873L41P418r991O427N398j1250O894J016o836R077n286l727R747q814O35
$$ plain form
240 612 8276 3586 -2834 12202 1955 -2668 10656 -2963 -4630 5930 -4647 1912 2305 -8721
254 -8721 6585 3608 -4000 10935 2800 -2130 10500 3388 5754 6561 -8626 5031 8767 -8699
268 -8699 -2060 -4390 -7658 2858 -8986 -10373 1917 -9359 -3660 4625 -8080 291 2928 -3561
282 -3561 7352 -497 -5015 8443 -2700 -4534 5480 -5546 -3110 -125 -8838 3005 350 -10065
296 -10065 4248 2109 -2009 7732 -890 2774 11555 -907 5632 8665 -3459 7019 5492 -3846
310 -3846 4405 -2873 -3760 6514 -6514 -3892 4851 -6091 277 3567 -4551 4992 916 -4738 7976
325 7976 -503 -4425 4988 -4411 -1510 2526 -8828 -934 328 -8992 845 -2512 -7849 3135 -2873
340 -2873 -2532 4886 -5105 1322 6720 -4530 2364 3380 -3456 5621 335 -3392 6355 -2459 -1824
355a824Q248r864M394L881q592Q384r96p277R790n237l490R549q708J44O059q749
371d288O542J169j0805R095Pn883Q242o438k074Q971q231L139M007j0516O121
386i42K718q160Q017l707m978J0474n951q47P511q602L853N696q121O019R7p144
402d067R117l146n005Q292p166m68N992p415M329K604q634P480P85n797R110m535
418A476l475Q394n819J815M068j0458M075M357p221M970m597n601J0616m146l640
433e186O218o704L462O366p710N108J605p181Q312j899m634P139o480j864P276
448C828p506R97L578p718O397M16n941R044k054m662P236l376K627N570j0273
463a837K449N542n092L990m022o965Q767k192l541N159q151Q61Q595n205K947
$$ plain form
355 -1824 6424 -3440 954 4835 -3757 4627 3631 -3646 6144 907 -2583 6966 -1742 -1598 4461 -4288
371 -4288 2254 3423 -7382 1713 1720 -4163 4079 -2359 -4433 4538 -3693 -554 3453 -7063 -942
386 -942 1776 -6384 1633 -2074 -7052 3422 -2529 -3376 4135 -4467 -614 5082 -3039 2980 3077 -4067
402 -4067 5050 1904 -3101 5191 -1975 -2443 3549 -3866 463 3067 -5567 1913 2698 -3099 6011 1476
418 1476 -1999 6395 576 2391 6459 -3999 76 4433 -2788 2182 -2415 -8016 2600 -1546 -5186
433 -5186 1032 -5672 -2210 4156 -3554 1554 3159 -4022 4290 2391 -2243 4896 -1584 -3448 3828
448 3828 -3678 -2681 897 -6821 -424 -8 -5949 3095 1041 -3621 3615 239 2866 8436 -1837
463 -1837 612 6154 1062 5052 1030 -5935 2832 640 -2901 2258 -5893 -5032 3563 -1642 1305
478A305m44p037J0104K396o499L478n419J069Q748q571j869M141o952N120J316
493H86p070N933k514m008R340k982j968N163n810M901M481q553M341J455n894
508b299N339k723k421O708p953k053P814l063J538o65p409R398L858p616L642
523B095l115P45P721o416j675M222o808M182L337p496L101j820l107R250m375
538a59n209N608k448L070K914q435M998L619p226M882q51l308O070n363j475O639
554C326n884J271L946o592M135J216m169O454l195n197P903j668o59K206q193
569e100M298O945o600K89j443k173R568l451o077N448k563Q61M401o582K747J194
585A762o093O663R68o702L199k230Q54O229p357q76N584l810K991J306n866N395
$$ plain form
478 1305 861 -6176 3928 6324 -175 3303 -2116 -1047 7701 -870 -2739 1402 -5550 -430 886
493 886 -6184 -251 -2765 -6773 2567 -415 -2383 2780 -3030 1871 6352 -2201 2140 3595 -2299
508 -2299 3040 317 -2104 4604 -3349 -5402 2412 -651 887 222 -7187 2211 6069 -1547 2095
523 2095 -1020 -275 7446 1030 -645 3577 -3231 951 4288 -3208 -107 -1927 -5034 4216 -159
538 -159 -5368 240 -2208 862 3776 -4659 339 3958 -3268 1614 763 -2545 3525 -1838 -3313 3326
554 3326 -2558 -1287 2659 -3933 202 1418 -2751 3703 508 -4689 3214 1546 887 3093 -5100
569 -5100 -802 6143 -457 -168 -1611 -3784 5784 2333 -3744 1704 -859 2 4403 -2179 568 1762
585 1762 -4331 2332 3300 -3402 -203 -2433 -1579 4650 -2707 -3583 2001 -1809 1182 2488 -3378 2017
601B017p95l916O487l750k651M695n209J777L712o033L198N56m892P270q32m415
617b781N059l153P63O051o058K31K545m204N166p24p403M610k26j411L980n896
633c451l0O206m902J695L089n013M259j47k619N720l734l812O065l075j000K261
649A512n582L434J900o124L952K77l088N659k963j909N921l230J240L037o310
664b274M069K812n828K865j579k386N019m050j962M456m648K088L524m993K982
679I5J443l559N724k069k831N526l333r93M291n415J300J263n085M674n9n850
695d878M473o81j316M477m519J212M533n092K730K565n191L584j09l462M122k576
711a28k293M341m226L41L389m767J947K093l300M575j388l432N916j746j903L813
$$ plain form
601 2017 1222 -2694 3793 43 -2608 2087 -3122 -1345 2367 -3666 -468 88 -4804 2466 1634 -2781
617 -2781 2278 -875 -112 5939 -119 112 2657 -1547 3619 2895 -4508 102 -124 -1535 2445 -3451
633 -3451 -3481 2725 -2177 -482 2607 -2406 1853 1706 -913 4807 1073 -2739 3326 251 -749 1512
649 1512 -4070 -636 1264 -4860 -908 -631 -3719 1940 -1023 -2932 2989 -241 999 4036 -2274
664 -2274 1795 4607 -1221 1644 65 -2321 2698 -1352 -3314 1142 -3506 -1418 2106 -2887 95
679 95 1538 -2021 3703 1634 -1197 4329 996 3 4294 -1121 179 1442 -3643 1031 972 -4878
695 -4878 -405 -1086 -2402 2075 -2444 -1232 3301 -1791 939 3504 -1687 1897 1788 -1674 2448 -128
711 -128 -2421 1920 -2306 -1965 1424 -3343 -1396 697 -2603 1972 584 -2848 3068 1322 -581 3232
727C232m266J854K964o024K997O15m505M642j455l053M282k914p7M458m797K161
743A14K649n080L731O43l865M140k135k211N271m466r56L903l707J769J766m806
759c240M257L0l632M756k282k182N193l805K68K908m519K661J207m609M106o47
775D70k942M449k584r28M567m821J210L542m392K093P44l761M461j240l712M907
791B063l076q13L926m162J241K686l876L393K75m034M714j528k366M355l349m81
807a032L162m467J512K301n072L464N74l454M356k018j430N067l605L79L413m454
823a304K306J514m322L412o23l342M186k888j811M274l770P34L248m136L065R97
839A540l625M271o63k168L782k935o43M082m477N54K193m843K859N38l864L687
$$ plain form
727 3232 -1034 820 3784 -2240 757 1372 -3133 1509 54 -2999 1283 -1631 -1708 2750 -2047 114
743 114 2763 -2317 1414 2057 -1808 2332 197 -2014 3257 -1209 -2165 1738 -1969 -200 1566 -3240
759 -3240 1017 1047 -2585 2171 -111 -2293 2900 -905 -637 2271 -2248 413 1620 -2989 1117 470
775 470 -2472 1977 -607 -1535 3032 -1789 -579 2963 -1429 664 1408 -2353 2108 868 -2844 2063
791 2063 -1013 -1826 2100 -2062 -821 1865 -2011 1382 1657 -2377 2337 809 -1557 2798 -551 -1032
807 -1032 2130 -2337 -825 1476 -3596 -132 442 -3012 1344 -674 -2104 2963 -642 -263 3150 -1304
823 -1304 1002 2516 -1806 1606 983 -2359 1827 -1061 -2872 1402 -2368 -1634 1614 -2522 543 1540
839 1540 -2085 2186 1523 -645 3137 202 -441 3641 -836 -282 1911 -2932 -73 465 -3399 288
855B88j444j803M738l034j36M204l762J641K296l876L193k67l884M111j937k346
871b018L638l894j60L602m695K440J965m357M140J89k614M364j981j242M199l387
887A89J84K723m704K207J248m643L275j281k183L988k215r85L769l310J310K908
903B480l791K709P64l510L831j037k572L389k923q78L567m009R76J822m403L571
919a4M58l252M268j421j882M373k357j97K691m032K401J687m492K614m56k741
935b352M025k162j912L795l259O68L198m027J814J752l275L528m35k937L671k127
951c5p47L246l941P21K367l733K204Q35l110L471j451k215M441j963j191K951
967A850l504J802J967m092K270L33l100L895j344j891L350l185M94L877m211J098
$$ plain form
855 288 -1156 -2959 1779 -1255 -1391 2813 -949 692 2988 -888 2305 2038 -1846 2265 328 -2018
871 -2018 1620 -2274 -2434 1168 -3527 -1087 878 -3479 661 850 -1764 2600 619 -623 3576 189
887 189 373 3096 -1608 599 1847 -2796 479 -802 -2985 1003 -1212 -2197 1572 -1738 -428 2480
903 2480 -1311 1398 2162 -1348 2483 1446 -1126 2263 -660 -1538 2029 -1980 -1004 818 -3585 -14
919 -14 444 -2808 1460 39 -1843 2530 173 -24 2667 -1365 1036 2723 -1769 845 389 -2352
935 -2352 1673 -489 -2401 1394 -1865 -1197 2001 -2026 -212 1540 -1735 1793 1358 -1579 2092 -35
951 -35 -782 2464 -1477 -756 1611 -2122 82 917 -2193 1278 -173 -2388 2053 90 -1101 1850
967 1850 -1654 148 2115 -1977 293 626 -2474 1421 77 -1814 1536 -1649 -1155 2722 -1489 -391
983c91J922l237L379n53l433L301j376j164L918m286N88K798l555K201J745l866
999b009L300l64k638M539k637j325L779l191L30K082m065K228P69l763L528j75
1015C88k577K989k341O79L816l733M68K736l375K612J42l128K915j354j996L656
1031A897l074q22K805l236J699J827m039K915Q75k233L717j823j669M241k913
1046A67J20K101l611J740Q95l911L208p90l185L815j518p81L360l521J233L328
1062B650l924K189J384k821K790j145k217L674k367j847K766l015Q88J659l782
1077c118K449Q60k786L753q56k042L764j984K72K796l595J023J816l872K563j40
1093I03l435L319j527j502L184l186P12L109l727K166J944l391K793N3k383L519
$$ plain form
983 -391 1531 -1706 1673 1120 -2313 988 -388 -1552 2366 -1920 -1332 1466 -2089 112 1857 -2009
999 -2009 1291 927 -1711 2828 191 -1134 2645 -546 -216 1866 -2199 29 798 -2965 563 388
1015 388 -2189 800 -1541 -862 2954 -779 -311 2425 -950 1662 1804 -1324 1591 237 -1759 1897
1031 1897 -1177 -1999 806 -2430 -731 1096 -2943 -28 847 -1386 2331 508 -1161 3080 167
1046 167 287 2388 -1223 517 1412 -2499 709 -81 -3266 549 -969 -1750 1610 -1911 -678 2650
1062 2650 -1274 915 2299 -522 2268 1123 -1094 2580 213 -1634 1132 -1883 -995 664 -3118
1077 -3118 -669 191 -2595 1158 302 -1740 2024 40 312 3108 -487 536 2352 -1520 1043 903
1093 903 -2532 787 -740 -2242 942 -2244 -1532 1577 -2150 16 1960 -1431 1362 1415 -968 2551
1109B551j830j521K992k696j35K151l677J916M07l032L458k69k700L502j618l07
1125h08L250l211Q19K120l179K110N04l129K789r10j861L021k685m90L106l112
1141a666R79J903k857K422J38k345L436j811j313L363k590n05K789l271J320J119
1157A111l238K692j78k550L342j304j334L234k812M81K487l274J305J620l419
1172a837K716l35k097L160k083j027L279k733L92K294l169K029O59k829L001r32
1188D88k220L269j927r47K852l120R55J714l035K433L39k630L421j340j593L252
1204A911k094k46K341l163J262J572l290K055j31k061K557j343r27K912k388J82
1220h51K600l036J834J291k895K690m78k452L043j890j085K401k651N90J700l257
$$ plain form
1109 2551 721 -800 2192 -504 -639 1512 -2165 -249 158 -2874 584 315 -2385 1117 -501 -808
1125 -808 2442 -769 50 2170 -1009 1101 1605 -1524 1265 355 -1506 1515 -1170 -1660 1446 -1666
1141 -1666 -687 1216 -1641 781 919 -1426 2010 199 -1114 2249 -341 -846 1943 -1328 -8 1111
1157 1111 -2127 565 387 -2163 1179 -125 -1459 1775 -1037 -556 1931 -1343 -38 1582 -1837
1172 -1837 879 544 -1553 1607 -476 -1503 1776 -957 -565 1729 -1440 589 1248 -1581 1420 488
1188 488 -1732 1537 -390 -1337 1515 -1605 -650 1064 -1971 462 801 -1829 1592 252 -1341 1911
1204 1911 -183 -429 1912 -1251 11 1583 -1707 348 217 -1844 713 -630 -1557 1355 -1033 -851
1220 -851 1749 -1287 547 1838 -1057 1633 1155 -1297 1746 -144 -1229 1172 -1479 -889 811 -2446
1236b446K347P63k954K935k10j901L400j832k44K560k641N21J808l264J725L67
1252I34k851K489j106j751L023k094j73K761k970J289K105k562K016L83k294K987
1268B186j320j444K521k184l94K079l301J395Q35k869K328p2j835K894j135n05
1284h21K801k510P97K224l035J504M65k567K422r12k236K877k058m84K558k875
1300a850P63J984k681K225M49j969K693n41j766K787j984k20K103k895N92J299
1316I89k819J735K99k374K785j201r75K856k017J54K580k833J308J513l039K264
1332A225l65k229K798j561j364K646k204j13K391l013J900O79k669K876l05j928
1348a236K797j348r24K502k439O60J530l041J850N18k612K534o70j488K580j604
$$ plain form
1236 -2446 -99 664 -2290 645 435 -1466 1934 102 -142 2418 -223 298 2106 -1158 567 934
1252 934 -1917 572 -534 -2285 738 -1356 -1529 1232 -1738 -449 1656 -906 1110 1493 -801 2186
1268 2186 866 -578 1943 -241 -635 1444 -1857 -462 373 -2496 -168 -240 -2075 819 -316 -821
1284 -821 1980 -530 267 2491 -544 960 1425 -1142 1280 368 -1868 1009 -1049 -1533 1025 -1850
1300 -1850 -1087 897 -1784 441 890 -1079 1614 1073 -693 2094 110 -110 1993 -902 -310 989
1316 989 -1830 -95 204 -2170 615 -586 -1561 1295 -722 -568 2012 -821 487 2000 -1039 1225
1332 1225 860 -1369 1429 -132 -1496 1150 -1054 -1167 1224 -1789 111 790 -1879 997 692 -1236
1348 -1236 1561 213 -711 1791 -648 12 1542 -1499 351 869 -1743 791 121 -1367 1213 -391
1364c91m62K408k489R52J587k944J860K56k083K380r61j439K478j609r4J926k469
1381a094J149J334k511J951o0j797K201j175r51K281k132J73J733k419R77J080
1397G40k412J871R0j652K907j808m85K464k263J49J844k454J355P98k459J906
1413E91j013r60K055j565j66K058k276J072J295k052J912N49k348K234p32j197
1429e43K221k126l21J665k410J059J182k879K144J59j831K396p56j009K590j573
1445c2j44K290k614J162O86k106J790o14j618J821j215r79K049k009K29K116k168
1462a356J424R17j522J974j58j692K480j745m58J729k086J37J336k263J245n7
1478i5j929K194q11j064K410j157n7K134j967O68J404k238J463Q2j750J945j532
$$ plain form
1364 -391 -853 1555 -934 18 1605 -1339 521 777 -1306 1074 113 -1326 1152 -457 -551 1375 -1094
1381 -1094 55 1389 -1122 829 769 -1028 1173 -2 -953 1328 -804 -631 1102 -1317 -340 740
1397 740 -1672 199 289 -1363 1544 -264 -749 1715 -548 -399 1445 -1009 346 1144 -1315 591
1413 591 -422 -1382 673 -892 -1058 1000 -1276 -204 1091 -961 951 1500 -848 1386 654 -543
1429 -543 1678 -448 -769 896 -1514 -455 727 -2152 -8 151 -1680 716 -40 -1049 1541 -32
1445 -32 -176 2114 -500 662 1348 -758 1032 418 -1200 621 -594 -1573 476 -1533 -1304 812 -1356
1462 -1356 68 985 -537 1437 1279 -413 2067 322 -136 1593 -493 -356 980 -1283 -38 -95
1478 -95 -2024 170 -641 -1705 705 -452 -509 1625 -342 326 1730 -508 955 1037 -713 1232 -300
1495c00j016K010j789l6J438j938J179R96k211J972L26j754K328q32o69K037j766
1512b5O7J402k063P29P81k343J878p04j289K167j087n70J977j904Q79J291k199
1529a013J703N89k223J964o83j306K137j530m28J826j864K72Q94j862J621K92
1545C89j535J936p18p71J652j210K2J579j954L67J200j940J719l21j804K115o79
1562D7j236K098j643K68J456j959J215O48j762J568n53j079K011j187n32J691
1578A051j642L37J069j780J381N08k236K295o51j021K027j460l28J543k016P00
1594b23R32k000J265N14j873K247o13j134K237j491j56J685j941P53J164k229
1610h63J429j39j498J635p04j229J958j724L84J420j840R68J047j899K143l79
$$ plain form
1495 -300 -1316 694 -1095 -1131 307 -1631 -452 544 -1667 305 631 -1123 1205 373 -296 1741 -25
1512 -25 42 1444 -619 110 891 -1452 426 -278 -1567 600 -487 -1057 920 -984 -105 1186 -1013
1529 -1013 690 1279 -944 1020 337 -969 1168 -362 -790 1036 -828 -556 338 -1524 97 389
1545 389 -1146 790 72 -699 953 -257 -235 1344 -610 -243 957 -983 736 415 -1389 726 47
1562 47 -1189 909 -734 -466 990 -969 246 894 -868 700 147 -932 1079 -108 -640 1051
1578 1051 -591 -254 815 -965 416 924 -1312 983 332 -689 1338 -122 -450 1093 -923 -223
1594 -223 709 -1291 -26 488 -1385 862 249 -885 1352 -139 -295 1390 -551 202 1366 -863
1610 -863 566 427 -1071 564 -140 -1369 589 -1135 -751 669 -1171 -203 844 -1055 1088 709
1626G09j402K254j160n93J409j754K87J295k094P94M89j876J838l10r88J591j001
1643e12L8J637j654Q07J357k114J266L87j913J610o22j264J684j394m43J407j335
1660a058N54R35j590J469J39j377J712j57r98J839j491J64R34j651P30O63k195
1677a378J517l86j266J777q42o17K030j447K16J642j708R76M46j353J591l20j263
1694c85J411j103n19J086j428J75J116j678J050K89j090J534k64j176K021p51
1710B88l46J669j913O51P41j887J186R8j815J672p71o21J550j610J95J557j405
1727g61R91Q27j743J305Pj521J972j117l80J660j642O6J012j846Q73P85j744J594
1745C38k91r64J459r46j39J593j382M06Q93j926J427K32j371J322n47j086K044
$$ plain form
1626 709 -693 1561 401 -192 1217 -537 -250 1045 -1049 -255 234 -1642 196 -114 -1102 489 -512
1643 -512 -474 1163 -491 316 1673 -441 825 1212 -701 909 287 -977 707 -687 -1130 277 -1058
1660 -1058 -504 431 -1159 310 449 -928 784 627 -371 1468 -23 141 1075 -576 154 817 -1378
1677 -1378 139 -247 -1513 264 -578 -1195 835 -612 -396 1246 -462 514 960 -393 1198 878 -385
1694 -385 1026 -77 -596 490 -938 -763 353 -1325 -275 14 -1076 458 194 -982 1039 288
1710 288 -58 1611 -302 349 1090 -797 389 487 -1328 344 -427 -1048 502 -1108 -913 644 -761
1727 -761 230 1057 -686 619 626 -895 1077 -40 -420 1240 -402 -336 676 -1170 -297 488 -1256 338
1745 338 47 -917 542 -404 -543 1050 -332 74 967 -959 468 700 -671 651 104 -982 1062
1762A062j305o85J726j262M08P42j490J071L79j536J472m59j022J928j353l52
1778f76J343j629P51R77j750J325l8j148J455q53l61J701j407P4J062j452N93
1795c3M12j237J078N6j229J511o97p54J812j427M42J062j857J192M11j436J444
1812G50m05j434J797j293k59J227j161NJ219j511J304J72j357J897n34p36J344
1829A025j203m3J345j643N47N48j492J228n60j033J398n30n66J866j414J65J217
1846H55j508J213M27j408J385k27j042J253j149l56J322j512L63N04j258R97P42
1863F01j772J376j67p57J626n87m49J362j360M62O10j568J097Oj525J334n99p88
1881a098J642j199j36J367j460O46J148j510J392K74j126J005m87p58J332j325
$$ plain form
1762 1062 -243 -928 798 -464 -56 686 -804 267 646 -890 582 123 -899 1029 -324 -676
1778 -676 667 -962 -211 766 -984 341 303 -845 610 -243 -604 1097 -310 -236 826 -626 -33
1795 -33 379 -858 220 276 -953 558 -139 -893 919 -508 -66 996 -861 331 742 -694 750
1812 750 345 -1089 708 -585 -844 383 -778 -773 446 -1065 239 411 -946 951 417 -319 1025
1829 1025 -178 -221 1124 -519 28 576 -916 312 -248 -1281 117 -413 -979 887 -527 -362 855
1846 855 -653 560 987 -421 964 737 -305 948 -201 -557 765 -747 -384 120 -1138 -141 601
1863 601 -1171 205 38 -719 907 320 -129 1233 -127 335 945 -623 474 480 -1045 289 -310 -1098
1881 -1098 544 -655 -791 576 -884 -238 910 -600 792 1066 -60 945 458 -300 1032 -293
1897b93Q7P67j487M29P21j364J321lj383J726m59o19J628j577O52R46j255O57
1915D94K55j289R32j16j089J554j337l34J354r70K03R92j458J237P9j298J614
1932H23l90q76J517j234j9P72r73K65Q22j446O28K60j228J432n93n15J534j226
1950d47K08Q82j277R64M73j527J320k16j240J396p29m78J317j403L61J144j416
1967f68Q57K47j140J402l64q52J318j002n88J607j405L37P46j282Q77K18j266
1984i58J287m25p63J745p44n97J340j200M33L04j096P38K27j052J230o21n68J264
2002E44r30K34Q59j403R02O88j425J272k57j039J337o73p53J450j256r4R69j382
2020i57P53L69j147J477m41n87J447j037K8J352j122L5Q13j645J072m1j147J172
$$ plain form
1897 -293 -206 561 -926 -497 224 -1140 181 178 -1205 521 62 -557 1071 -506 146 1092 -163 494
1915 494 749 -540 392 276 -813 741 -596 -930 424 -546 -343 649 -809 428 507 -791 823
1932 823 433 -443 1074 -160 -179 593 -380 -115 707 -739 -111 149 -1079 353 -240 -755 779 -447
1950 -447 -239 643 -634 330 803 -724 596 380 -860 536 -193 -671 646 -757 -396 748 -668
1967 -668 189 436 -704 698 334 -518 800 -202 -790 817 -588 -251 495 -787 90 308 -958
1984 -958 329 -96 -859 886 142 -455 885 -315 118 422 -674 64 291 -761 469 -152 -720 544
2002 544 -386 -152 707 -696 206 894 -531 741 484 -555 782 109 -644 806 -450 -544 425 -957
2020 -957 -204 165 -982 495 54 -533 914 -123 -95 1257 135 170 983 -662 410 369 -778 394
2038C94l23j169J388j015P0J364j366N25P59j158Q10M62r79J397q49p82J637j445
2056b80k63J096j343N65M16j195J098k57q99J783q41m74J374q97M1J136j278O90
2074D72K08j146Q91k03j080J207n83q01J111q11J88Q27r57J045L21q92J111l88
2092E20m85J089q27l86J128j600N68N88j321N38K46j258J523n90m73J365j216
2109e91K99J057j061L44O76j199R51M09j448J133p25n90J163q29k34Q01j019Q21
2127d2N97j341R33K3o65J216n49l87J073j126L35J006j645N12M20j017Q35Pj182
2146i97J442p02l69J119r94K29J077j354J168j95j107J202n52l20Q40m68k76O94
2164D37j009L62P39j129R99l3r74J232m35o90J206j139R9R17j142O43K49j134
$$ plain form
2038 394 71 -1098 290 -725 -655 709 -657 -132 627 -531 279 741 -238 1159 310 -472 1165 -280
2056 -280 -543 553 -790 -225 191 -1004 94 -163 -1062 721 -120 -594 780 -117 -76 1060 -218 472
2074 472 680 -466 425 222 -858 349 -234 -1035 76 -735 -547 280 -677 368 689 -203 908 520
2092 520 35 1124 297 -89 1039 -561 7 595 -726 -188 58 -1200 323 -267 -740 625 -591
2109 -591 -292 765 -296 48 724 -475 476 885 -563 570 -155 -745 418 -411 -645 156 -863 -42
2127 -42 555 -786 147 170 -495 721 172 -215 858 -268 67 1073 -572 -60 360 -657 178 185 -997
2146 -997 445 -257 -626 493 -501 -272 805 -549 619 424 -683 519 -33 -353 487 19 -257 437
2164 437 -572 -210 529 -600 399 366 -608 624 189 -501 705 -434 -335 582 -560 83 332 -802
2182h02J320j61r59J263p34k78J100r94Q3O24j125Q77K86j212J041j60r42J179
2200D06p35k69J021r84N51Q21j375R63P3j217J228k28q07J042o31m37R80q17K28
2219a87L01r84J060O3j063J286p03l34J471r58J86J169j769P83J61j065Q69l02
2237a6q13J086m13n51R89q84K2P64q47P85L01j069J532l00j110J196o91r4Q86
2256G73j133J22O04j170N06M72j324J218q5o92J338p42p9Q33p65J84N65q86R27
2275F66j89p90Q54k94o55N72q60N8P97r23M99M37q97Q52J82r14J277m91l58J354
2295A177j121J36O54j223P80p3r14N10k40n50J152q33j89R57o79K58R41j043O98
2314C98m4n88Q55l60n51Q46o71l63J019j250N28L90q84O49Qp17R74m38k72J184
$$ plain form
2182 -802 518 357 -602 661 -73 -351 749 -245 -162 462 -663 214 500 -712 329 169 -773 406
2200 406 -329 -598 423 -561 -10 811 -564 399 472 -745 483 255 -552 490 -141 -578 402 -415 -187
2219 -187 114 -870 190 253 -810 476 -227 -561 910 -48 138 1307 -462 321 482 -583 286 -16
2237 -16 -829 257 -156 -707 282 -602 -580 184 -663 122 423 -646 886 586 -524 672 -19 -113 773
2256 773 -360 -238 366 -804 -298 174 -1150 68 -17 -709 629 -113 -192 641 -124 60 625 -261 666
2275 666 477 -313 541 247 -408 164 -696 -638 159 -764 -265 172 -725 127 309 -605 672 181 -177 1177
2295 1177 56 192 846 -377 403 330 -584 -74 -314 -864 288 -545 -734 223 -456 -198 743 -300 398
2314 398 354 -234 621 261 -290 556 -115 -478 541 -709 -181 209 -675 -26 -18 -735 239 -199 -471 713
2334G13j039J74Q40r40N68K83j095O38J28q75R71m80l60J030p32L8Q26j041K71
2353h2N15p25N77j09o01J121p17k43R96j045o9R68j207N84O63j325O47Np23J057
2373B87k91m91J120j133J64J019j211N67n9n66J033l10q22J157o96J0R29q50M22
2392B79K29r19Q21j47n79N45k71m91J080q39p5Q93j317Q91K96q03P54J57r13R99
2412E90n48j19P59r58J42N44j024L87N16r35N76Qn92J019m03k68J012j007N01
2431B00N36r72O75J82p00M67j60q74R63o10k15R17j048K37M72o69P61J34o09J106
2451G93k42q02R27o27r3P14j050N19M21j234P47k71o62Q98m54k66Q08n06K45O75
2471E40n12J78K94p51J006k69q54R27o51j36N22r21J84Q18j002N80J10q07Q31
$$ plain form
2334 713 -326 -152 688 -252 316 599 -496 142 270 -605 366 -114 -474 556 -176 -138 688 -353 -82
2353 -82 433 -292 285 176 -425 696 -21 -264 732 -313 -382 586 -621 -37 626 -699 -52 -47 -770 287
2373 287 -4 -495 625 -508 -344 675 -536 31 -28 -594 439 129 -693 464 -232 -222 707 -143 279
2392 279 508 -411 410 263 -316 229 -42 -533 547 -292 -367 526 -791 100 396 -407 347 504 -409 590
2412 590 42 -77 682 -276 -134 410 -614 -227 289 -646 -70 -62 -654 365 -38 -306 706 -301 200
2431 200 736 -236 439 621 -79 388 228 -646 317 -293 -508 409 -639 -402 70 -599 162 296 -313 793
2451 793 551 -251 676 49 -44 670 -380 139 560 -674 73 -198 -860 38 -416 -682 126 -380 -135 540
2471 540 28 206 500 -251 755 486 -368 559 -92 -228 294 -627 -443 375 -627 -47 63 -744 87
2490H7J94o57J081p17K28P91q44l7M35q64M59Rj119R76k10k19N95n38J06P14j013
2511e43L77Q09j130J064L8r50R80l00n73J085j279l5Q00j139O41M22q45O43L9
2530A04n46P54m50k98J017o08K13K01o83L52J22o82O48j17n79P07n39J75M85j045
2550g69O06L45q79J034k22n17Q31r0o53O97n39J42M15q99P31J3q07O38J24n17
2570c16O81l40j97P44n53j1M67o93L08J68m65M11l33l82P59r6k72L74m78l3R93
2591G36r89M32J42r13J277m51o24N92k58J01L78o56J29L30q71R47k5q33J177l05
2611C16n16N08l75j12Q22j016K76M77j045M82J1m28P53n9o23J068n50k45M89m35
2631b02K88N25r13O22J71r55Q79m85j3M48o65N9L85o40M82Q5n30N35q0k32Q15
$$ plain form
2490 87 281 -376 705 -12 216 1007 163 126 561 -303 156 165 -954 22 -188 -407 188 -350 -244 470 -543
2511 -543 -166 643 -487 577 615 -335 645 345 -228 857 -422 -457 343 -796 -155 267 -578 65 104
2530 104 -442 312 -138 -436 581 -27 186 387 -296 56 178 -504 144 27 -552 155 -384 -209 276 -769
2550 -769 -163 182 -697 337 115 -402 429 339 -314 383 -156 -14 401 -498 233 246 -561 77 201 -316
2570 -316 365 25 -172 572 19 8 475 -218 90 258 -207 204 -129 -511 248 152 -120 254 -224 -257 736
2591 736 -253 179 321 -592 685 234 -390 202 -56 45 423 -233 -104 226 -645 302 277 -556 621 316
2611 316 -200 308 -67 -179 643 -373 -97 380 -665 -183 -172 -600 153 94 -529 539 -11 -256 233 -202
2631 -202 86 611 -302 320 491 -464 415 -70 -83 365 -300 -241 144 -496 -14 71 -459 76 -4 -236 579
2652E79o30J55O53q47J70M32q04M74j02p21P08j55n71P57o87J19N91j66N6K39
2672B50o09Q85j22l65L68l2q39R63n52l17Q67r51K93K08o32M78J57m00M93k64
2692a21j21O26q58M37O22q30N29K8n42N29m81l60Q99n84m08O51m35O1N59q08Q17
2713B10J01o46Q74j94p79Q30l66n9N03n53j17L87m48O3J70n93J027o73O4O96m83
2734A4k2N33n56K52lo77P75j42m15O62n66k38R86q87K36J75p22O84K10p08M10
2755AJ00k66N98m15j30O02o71K06L78o50K41O2n25Q96o90MQ06p67J93N86p41J50
2777c2L72n51K51P0n86R86k23n09N31n28J80K75n75L24J48n71O26N7o11P62l83
2798A3r1O46q31J45L87o10K1K55l30O68k01n06O61j06j99O19o18K28K36p55M84
$$ plain form
2652 579 -51 104 757 -90 80 512 -292 182 80 -641 67 -88 -659 98 -589 -470 121 -45 11 250
2672 250 -359 526 404 39 407 375 -464 499 -53 -370 497 -454 -161 47 -585 -107 50 -350 143 -121
2692 -121 -242 384 -474 -37 585 -245 284 312 -230 299 -182 -542 357 -227 -635 16 -419 -358 201 -607 210
2713 210 311 -335 539 345 -434 396 30 -29 474 -79 -196 191 -257 -194 -24 -617 410 -263 -199 497 14
2734 14 -8 525 -31 221 218 -459 316 174 -241 421 -145 -383 603 -284 -48 127 -595 89 299 -409 1
2755 1 101 -165 433 18 -112 490 -181 25 403 -247 -6 56 -469 427 -263 -259 547 -220 -27 559 -182 -32
2777 -32 340 -211 40 110 -476 510 287 -222 309 -219 -39 236 -339 -15 133 -438 188 245 -366 396 13
2798 13 -78 568 -263 -118 269 -341 -320 -65 -395 273 72 -434 227 121 -78 541 -77 151 387 -368 116
2819A16K72r24J007m41m84P90n39R5M45o09K89K81n97N80k55m63Q36j44m48N03
2839C10n92J30O19q81K17L7k59K74J3l08P90m21k8P30n20J12K10n87K83J56n98
2860c13P76p57j41N20l30o7N92p03J60L88m20M18J08k50K50J73m29K34K03m15
2880cL56n72J60K63m53M92m56m41R04l97j45N98l65ON34n75J89K82p30P90m83
2901d6K48M7l49j25M38n29j62O10o25N37J21l22L75l43k9M19l60j23M01j86P3
$$ plain form
2819 116 388 -536 471 30 -454 336 -203 -108 337 -272 17 298 -299 281 26 -437 399 255 -193 310
2839 310 -282 -152 467 -414 -197 -160 -419 -145 -132 -440 350 -71 -99 631 111 223 433 -154 129 285 -313
2860 -313 463 -294 -435 85 -245 -312 280 -423 -263 125 -295 123 231 -19 231 404 -25 209 412 -3
2880 -3 353 -219 -59 204 -249 243 -213 -654 250 -147 -292 306 -59 -53 481 -94 95 377 -353 437 -46
2901 -46 202 249 -100 -225 213 -316 -478 132 -493 44 165 -157 218 -125 -154 265 -95 -218 183 -3 70
$$ [...]
8191g7
##END NTUPLES=NMR FID
##END=
