##TITLE=1H_AmS-DEA-N-3
 200.13MHz, CDCl3,
 8 sc
 
 29.8.2025
##JCAMPDX= 6.0         $$ Bruker NMR JCAMP-DX V2.0
##DATA TYPE= NMR FID
##DATA CLASS= NTUPLES
##ORIGIN= UXNMR, Bruker Analytische Messtechnik GmbH
##OWNER= pz
$$ XWIN-NMR		Version 3.5
$$ Fri Aug 29 15:36:32 2025 Russian Standard Time (UT+4h)  she@DPX200
##.OBSERVE FREQUENCY= 200.1313
##.OBSERVE NUCLEUS= ^1H
##.DELAY= (6, 6)
##.ACQUISITION MODE= SIMULTANEOUS
##.ACQUISITION SCHEME= undefined
##.AVERAGES= 8
##.DIGITISER RES= 18
##SPECTROMETER/DATA SYSTEM= spect
##.PULSE SEQUENCE= zg30
##.SOLVENT NAME= CDCl3
##.SHIFT REFERENCE= (INTERNAL, CDCl3, 0, 14.3821)
##AUDIT TRAIL= $$ (NUMBER, WHEN, WHO, WHERE, WHAT)
$$ ##TITLE= Audit trail, XWIN-NMR		Version 3.5
$$ ##JCAMPDX= 5.01
$$ ##ORIGIN= Bruker BioSpin GmbH
$$ ##OWNER= she
$$ F:/spectra/data/she/nmr/H-C/1/audita.txt
$$ ##AUDIT TRAIL=  $$ (NUMBER, WHEN, WHO, WHERE, WHAT)
(   1,<2025-08-29 15:35:00.60 +0400>,<she>,<DPX200>,
      <created by zg, POWCHK disabled, PULCHK disabled
       configuration hash MD5:
       00 E9 B6 7A A2 85 ED C7 34 08 36 98 17 FE 4E 26
       data hash MD5: 16K
       A3 D9 ED AB B5 55 B1 9D 54 60 04 0D 5E AD F5 85>)
$$ ##END=
$$ 
$$ hash MD5
$$ 54 DE 76 44 E1 19 0F DF AC B9 AD 7E C9 20 FB FE
##$RELAX= 
##$RELAX= 
##$RELAX= 
##$RELAX= 
##$RELAX= 
##$RELAX= 
$$ Bruker specific parameters
$$ --------------------------
##$DU= <F:/spectra>
##$EXPNO= 1
##$NAME= <H-C>
##$PROCNO= 1
##$TYPE= <nmr>
##$USER= <she>
##$AMP= (0..31)
100 100 100 100 100 100 100 100 100 100 100 100 100 100 100 100 100 100 
100 100 100 100 100 100 100 100 100 100 100 100 100 100 
##$AQSEQ= 0
##$AQ_mod= 1
##$AUNM= <au_zg>
##$AUTOPOS= <>
##$BF1= 200.13
##$BF2= 200.13
##$BF3= 200.13
##$BF4= 200.13
##$BF5= 200.13
##$BF6= 200.13
##$BF7= 200.13
##$BF8= 200.13
##$BYTORDA= 1
##$CFDGTYP= 0
##$CFRGTYP= 5
##$CHEMSTR= <none>
##$CNST= (0..31)
1 1 145 1 1 1 1 1 1 1 1 1 1 1 1 1 1 1 1 1 1 1 1 1 1 1 1 1 1 1 1 1 
##$CPDPRG= <>
##$CPDPRG1= <>
##$CPDPRG2= <>
##$CPDPRG3= <>
##$CPDPRG4= <mlev>
##$CPDPRG5= <mlev>
##$CPDPRG6= <mlev>
##$CPDPRG7= <mlev>
##$CPDPRG8= <mlev>
##$CPDPRGB= <>
##$CPDPRGT= <>
##$D= (0..31)
0 0.7 0 0 0 0 0 0 0 0 0 0.03 0 0 0 0 0 0 0 0 0 0 0 0 0 0 0 0 0 0 0 0 
##$DATE= 1756467299
##$DBL= (0..7)
120 120 120 120 120 120 120 120 
##$DBP= (0..7)
150 150 150 150 150 150 150 150 
##$DBP07= 0
##$DBPNAM0= <>
##$DBPNAM1= <>
##$DBPNAM2= <>
##$DBPNAM3= <>
##$DBPNAM4= <>
##$DBPNAM5= <>
##$DBPNAM6= <>
##$DBPNAM7= <>
##$DBPOAL= (0..7)
0.5 0.5 0.5 0.5 0.5 0.5 0.5 0.5 
##$DBPOFFS= (0..7)
0 0 0 0 0 0 0 0 
##$DE= 6
##$DECBNUC= <off>
##$DECIM= 32
##$DECNUC= <off>
##$DECSTAT= 4
##$DIGMOD= 1
##$DIGTYP= 9
##$DL= (0..7)
0 120 120 120 120 120 120 120 
##$DP= (0..7)
150 150 150 150 150 150 150 150 
##$DP07= 0
##$DPNAME0= <>
##$DPNAME1= <>
##$DPNAME2= <>
##$DPNAME3= <>
##$DPNAME4= <>
##$DPNAME5= <>
##$DPNAME6= <>
##$DPNAME7= <>
##$DPOAL= (0..7)
0.5 0.5 0.5 0.5 0.5 0.5 0.5 0.5 
##$DPOFFS= (0..7)
0 0 0 0 0 0 0 0 
##$DQDMODE= 0
##$DR= 18
##$DS= 0
##$DSLIST= <SSSSSSSSSSSSSSS>
$$ [...]
##$SUBNAM0= <"">
##$SUBNAM1= <"">
##$SUBNAM2= <"">
##$SUBNAM3= <"">
##$SUBNAM4= <"">
##$SUBNAM5= <"">
##$SUBNAM6= <"">
##$SUBNAM7= <"">
##$SUBNAM8= <"">
##$SUBNAM9= <"">
##$SW= 18.0517328524113
##$SWIBOX= (0..15)
0 0 2 0 0 0 0 0 0 0 0 0 0 0 0 0 
##$SW_h= 3612.71676300578
##$TD= 16384
##$TD0= 1
##$TE= 0
##$TE2= 300
##$TE3= 300
##$TEG= 300
##$TL= (0..7)
0 120 120 120 120 120 120 120 
##$TP= (0..7)
150 150 150 150 150 150 150 150 
##$TP07= 0
##$TPNAME0= <>
##$TPNAME1= <>
##$TPNAME2= <>
##$TPNAME3= <>
##$TPNAME4= <>
##$TPNAME5= <>
##$TPNAME6= <>
##$TPNAME7= <>
##$TPOAL= (0..7)
0.5 0.5 0.5 0.5 0.5 0.5 0.5 0.5 
##$TPOFFS= (0..7)
0 0 0 0 0 0 0 0 
##$TUNHIN= 0
##$TUNHOUT= 0
##$TUNXOUT= 0
##$USERA1= <user>
##$USERA2= <user>
##$USERA3= <user>
##$USERA4= <user>
##$USERA5= <user>
##$V9= 5
##$VALIST= <valist>
##$VCLIST= <CCCCCCCCCCCCCCC>
##$VD= 0
##$VDLIST= <DDDDDDDDDDDDDDD>
##$VPLIST= <PPPPPPPPPPPPPPP>
##$VTLIST= <TTTTTTTTTTTTTTT>
##$WBST= 1024
##$WBSW= 4
##$XGAIN= (0..3)
0 0 0 0 
##$XL= 0
##$YL= 0
##$YMAX_a= 110221
##$YMIN_a= -139116
##$ZGOPTNS= <>
##$ZL1= 120
##$ZL2= 120
##$ZL3= 120
##$ZL4= 120
##$ABSF1= 10
##$ABSF2= 0
##$ABSG= 5
##$ABSL= 3
##$ALPHA= 0
##$AQORDER= 0
##$ASSFAC= 0
##$ASSFACI= 0
##$ASSFACX= 0
##$ASSWID= 0
##$AUNMP= <proc_1d>
##$AZFE= 0.1
##$AZFW= 0.1
##$BCFW= 1
##$BC_mod= 2
##$BYTORDP= 1
##$COROFFS= 0
##$CY= -3
##$DATMOD= 1
##$DC= 2
##$DFILT= <>
##$DTYPP= 0
##$F1P= 0
##$F2P= 0
##$FCOR= 0.5
##$FTSIZE= 0
##$FT_mod= 4
##$GAMMA= 1
##$GB= 0.15
##$INTBC= 1
##$INTSCL= 1
##$ISEN= 128
##$LB= 0.25
##$LEV0= 0
##$LPBIN= 0
##$MAXI= 10000
##$MC2= 0
##$MEAN= 0
##$ME_mod= 0
##$MI= 1.114404
##$NCOEF= 0
##$NC_proc= 0
##$NLEV= 6
##$NOISF1= 3.799351
##$NOISF2= 2.8
##$NSP= 1
##$NTH_PI= 0
##$NZP= 0
##$OFFSET= 14.38212
##$PC= 1
##$PHC0= -1563.796
##$PHC1= 13.19228
##$PH_mod= 1
##$PKNL= yes
##$PPARMOD= 0
##$PSCAL= 0
##$PSIGN= 0
##$REVERSE= no
##$SF= 200.129724274929
##$SI= 16384
##$SIGF1= 3
##$SIGF2= 2
##$SINO= 400
##$SIOLD= 16384
##$SREGLST= <1H.CDCl3>
##$SSB= 0
##$STSI= 0
##$STSR= 0
##$SW_p= 3205.1282051282
##$SYMM= 0
##$S_DEV= 0
##$TDeff= 0
##$TDoff= 0
##$TI= <>
##$TILT= no
##$TM1= 0
##$TM2= 0
##$TOPLEV= 0
##$USERP1= <user>
##$USERP2= <user>
##$USERP3= <user>
##$USERP4= <user>
##$USERP5= <user>
##$WDW= 1
##$XDIM= 8192
##$YMAX_p= 0
##$YMIN_p= 0
$$ End of Bruker specific parameters
$$ ---------------------------------
##NTUPLES= NMR FID
##VAR_NAME=  TIME,          FID/REAL,        FID/IMAG
##SYMBOL=    X,             R,               I
##VAR_TYPE=  INDEPENDENT,   DEPENDENT,       DEPENDENT
##VAR_FORM=  AFFN,          ASDF,            ASDF
##VAR_DIM=   8192,          8192,            8192
##UNITS=     SECONDS,       ARBITRARY UNITS, ARBITRARY UNITS
##FACTOR=    0.0002768,     1,               1
##FIRST=     0,             0,               0
##LAST=      2.2672688,     0,               0
##MIN=       0,             -139116,         0
##MAX=       2.2672688,     110221,          0
$$ Real data points
##PAGE= N=1
##DATA TABLE= (X++(R..R)), XYDATA
0 0 0 0 0 0 0 0 0 0 0 0 0 0 0 0 0 0 0 0 0 -1 8 -8 8 -8 8 -8 8 -13 16 -16 16 -19 23 -24 27 -30 34 -37 42 -45 51 -53
42 -53 60 -65 72 -80 88 -95 103 -112 123 -135 150 -165 183 -203 229 -258 293 -335 392 -463 563
63 563 -701 904 -1233 1819 -3061 6707 -42834 -139116 -32557 67015 45700 -10564 -8563 13548
77 13548 -4364 -9051 25791 18843 -25099 -22006 5936 7931 -16713 -16485 18419 26894 2280 765
91 765 -7347 -39383 -38324 10107 49947 32903 -14162 -16520 -129 -4537 9560 31498 6664
104 6664 -36813 -39705 5526 33976 12021 1426 11465 -12215 -35426 -15590 10272 5831 -11249
117 -11249 6997 36781 6814 -34210 -7817 32745 19324 -20487 -23791 10501 10121 -20611 -3986
130 -3986 34994 29009 -9686 -41924 -36958 -3492 22870 30630 6548 -28613 -16261 22106 23965
143 23965 854 -12745 -6536 1726 -6246 -2275 13094 5536 -1934 9804 10306 -10809 -33115 -23993
157 -23993 12279 21963 6656 1918 -5244 -12633 -1134 17277 20385 -5485 -27777 -8551 13130
170 13130 8854 8974 12439 3216 -12040 -18574 -3677 5513 -9840 -10374 9376 14813 3167 -11835
184 -11835 -10171 9278 13304 2119 -6997 -14394 -3551 16688 15692 3909 -3202 -2705 -1 -12106
198 -12106 -17617 2022 12536 3185 -5026 -5562 1309 4414 241 2935 512 -8967 -3980 5175 7088
213 7088 7763 4040 3401 2200 -7642 -8119 -2125 -4800 -1856 5221 5398 56 -9300 -5266 8520 4607
229 4607 -5033 -4360 -2356 1023 4863 6098 9882 4411 -5435 -3506 -2541 -3976 -392 -1338 -1567 1463
245 1463 0 1549 -1287 -7553 -789 5558 -508 -4304 -4354 4032 11399 4314 -18 2529 -1754 -3134
261 -3134 -1981 -2975 335 848 -85 1777 -2741 -4498 720 -1213 -2851 -637 -1300 661 1392 1399 7492
278 7492 5397 -1911 -1513 -46 -92 -153 -3004 318 3711 -1186 -1194 -1434 -4559 -1399 -81 -910 -139 -2896
296 -2896 240 5225 2252 2029 3454 -346 -1431 -795 -82 3368 -243 -2580 1803 546 -2762 -2513
312 -2513 -3292 -285 210 -3176 -352 1211 -832 3021 3379 1119 1282 -1033 182 2196 -889 981
328 981 2508 -1466 -758 -467 -1895 -546 -3317 -2631 1150 -1147 -2044 1169 467 2192 2118 -1126 1443
345 1443 1313 310 2727 731 -781 1570 -426 -500 -411 -2713 -830 -1016 -3032 -210 169 -1587 402
362 402 73 484 2236 -673 712 2423 235 1768 1759 -673 984 13 -535 566 -2502 -3237 -37
379 -37 -818 -268 -333 -2639 -139 611 -426 2501 802 -545 2449 1184 1057 998 -848 1470 1864 -1445
397 -1445 -866 -1237 -2552 404 89 -1305 -677 -3028 -1946 1468 556 2024 2251 -909 -437 235 1565
414 1565 4438 536 -2535 -278 211 797 204 -2888 -1257 558 -1168 -727 -2473 -2532 1616 1850 1496
431 1496 1353 -1913 -1418 2140 2505 3577 1067 -2592 -696 -591 32 2825 698 -2091 -3545 -4423 378
448 378 3881 343 -2218 -2159 -56 3524 802 -1495 838 1105 2176 3321 -719 -2072 -1633 531
464 531 4803 1913 -5473 -6120 -2455 2940 4906 -920 -3333 -1696 -1594 730 3570 2915 1847 -2306
480 -2306 -3222 2694 4422 1619 -1109 -3347 -118 2382 -968 -2452 -2405 -1881 2054 2369 -1150 -3451
496 -3451 -4829 702 7436 4438 -1768 -4581 -2819 4414 5824 1070 -885 -2697 -2831 -493 807
511 807 2635 1631 -4448 -4376 -274 1607 1573 -1058 -1503 1762 1248 -115 1274 -376 -652 1022 2628
528 2628 3942 -857 -7332 -3118 5052 6058 507 -7409 -7208 357 3722 3702 1773 -2960 -3020 -948
544 -948 1718 4896 2507 -2171 -1427 -154 2111 2291 -1201 -1366 -107 -925 -108 -386 -3188 -2588 -486
561 -486 3397 5228 -1234 -7201 -3657 3715 7947 3402 -4362 -3514 163 1909 4130 2734 -981 -3827
577 -3827 -4760 -239 3528 94 -2005 -897 -153 673 -1525 -1877 1552 1892 375 992 465 20 18 -81
595 -81 2742 3612 -396 -3921 -5160 -1974 4115 4016 -301 -3167 -4299 -1415 2334 2387 1698 -925 -3017
612 -3017 35 2612 2426 2188 920 264 -178 -2550 -1419 1113 -391 -197 853 468 -460 -3491 -3631
629 -3631 2149 3585 1306 -1298 -3389 -1157 2916 4143 4057 -315 -4378 -3174 -372 1713 2732 -284
645 -284 -1715 -822 -876 450 -418 -1906 214 942 -523 -1041 -369 1548 3606 1870 535 -46 -2395
662 -2395 -2244 192 1792 2931 581 -2303 -2031 -2070 -310 2264 348 -2075 -2346 -1565 1562 2588 1591
679 1591 1997 618 -1747 -1636 -921 1088 2210 425 413 281 -1368 -833 -407 -1092 233 -404 -1468 -980
697 -980 -1303 1473 3736 1950 288 -1076 -2617 -874 980 2290 2492 -465 -1951 -154 34 77 154
714 154 -1799 -1306 -908 -1183 736 1237 665 1956 875 -897 -1290 -1454 627 2243 1156 1270 789 -1406
732 -1406 -929 -52 320 274 -1828 -2368 -447 -148 1082 2046 759 63 -1147 -1784 -181 251 1137 2194
750 2194 1118 372 421 -512 -13 -214 -1242 -469 -727 -1755 -422 661 929 1469 -158 -828 -869 -1376 175
769 175 1609 1482 1653 828 -409 167 -73 213 -99 -1509 -1605 -404 -467 376 888 112 253 -529 -1866
788 -1866 -510 -280 552 2164 1501 1133 486 -684 353 310 -627 26 -939 -1391 -296 512 644 928 -563
807 -563 -808 -807 -1485 -457 891 1249 1778 858 92 721 171 -89 521 -509 -868 -468 -770 450 795 24
827 24 237 -767 -1690 -1000 -571 261 1121 1247 1205 710 -466 318 354 48 510 -719 -972 63 -99 592
847 592 642 -421 -662 -1066 -1963 -657 -5 332 1304 654 491 558 -338 219 758 -309 -117 -480 -1079 376
867 376 567 222 464 -868 -1389 -1019 -926 219 981 329 665 837 -23 432 202 73 401 91 -253 124
887 124 -171 503 1151 -226 -393 -1028 -1981 -707 -467 -130 837 146 114 258 23 371 775 -333 106 327
907 327 104 838 764 169 -97 -895 -562 -543 -1544 -858 290 163 482 101 -576 287 226 310 666 -307 -238
928 -238 280 226 1367 616 -655 -543 -417 -495 -159 -662 -112 12 -757 205 937 -58 -335 -637 -125 994
948 994 611 -50 220 -58 478 1027 -342 -429 -790 -1148 39 664 -387 -534 -522 79 993 -174 -470 -363
968 -363 -175 544 1067 466 775 10 -954 404 785 55 -528 -1224 -471 559 -69 -56 -263 -738 -185 36
988 36 -146 439 -573 -258 1032 1069 540 63 -848 168 1200 -56 -386 -864 -1033 179 258 96 306
1007 306 -1022 -1045 -322 173 1156 371 -489 298 454 379 715 224 -320 220 -708 167 343 -841 -927 315
1027 315 454 755 -909 -1615 -255 710 867 709 -607 -475 75 103 1738 1315 -692 -872 -337 -75 1019
1046 1019 -117 -398 -305 -1169 -385 60 -228 99 -154 -249 646 201 -246 -134 372 965 1308 -297 -694 -317
1066 -317 -93 1008 708 -415 -604 -1388 -1082 1110 845 -153 -632 -772 119 460 217 952 666 -199 304
1085 304 260 555 574 -418 -298 568 -265 -683 -744 -759 668 562 401 -13 -1354 -765 801 997 915 200 -606
1106 -606 -246 251 508 1010 -84 -837 -211 -355 -181 530 -411 -341 -452 -691 77 -190 -407 504 241 78
1126 78 569 -205 -157 544 457 570 245 -957 -765 -437 -98 637 -35 -947 -655 -872 -28 748 174 61 -219
1147 -219 -438 386 468 226 521 -48 74 282 -47 136 -37 -434 400 -20 -940 -945 -623 -129 772 -11 -33
1168 -33 -73 -161 506 1124 632 509 -151 -595 186 190 406 175 -599 -777 -346 -272 7 -180 -383 54 79 -97
1190 -97 240 213 -80 615 582 244 152 -133 193 446 69 206 -462 -764 -335 -84 -39 396 -647 -490 57
1211 57 -124 595 518 -353 57 35 -76 708 2 232 466 -222 -156 -72 -555 -321 -110 -173 97 -259 -321 -52
1233 -52 -113 595 566 -85 59 271 216 380 1070 82 155 -284 -358 476 -38 -432 -355 -724 -350 -6 -195 166
1255 166 -361 -291 601 439 -135 519 266 235 399 -19 209 -61 -353 107 124 -151 -354 -610 -410 304 -74
1276 -74 73 310 -530 83 385 -13 207 238 136 223 193 147 363 -227 -89 298 -268 -233 -208 -339 18 -124
1298 -124 -164 105 -146 -145 247 -76 340 -60 53 389 140 19 419 -10 66 -62 -323 -170 -77 -391 -186 48
1320 48 -479 -75 -225 31 343 301 196 399 193 117 245 75 232 226 -272 -5 -335 -344 -31 36 -126 89 -321
1343 -321 3 78 241 164 110 -75 201 233 108 561 109 145 399 -227 -22 -108 -306 12 -121 -268 -83 -96
1365 -96 -180 100 52 134 209 -339 -44 328 300 356 375 147 -3 -283 -248 10 -196 -150 -158 -324 -130 -45 -27 -135 -85
1390 -85 -156 50 145 87 470 292 271 139 -329 -74 -53 -287 113 186 -158 -62 -403 -177 205 -485 -137 -313 -240
1413 -240 -30 48 -59 605 40 -118 269 -108 40 234 -275 266 374 -292 -130 -96 -247 80 -93 -165 -96
1434 -96 -33 86 254 41 430 178 -314 -2 36 50 183 136 -135 186 -133 -47 -189 -457 -153 -239 -209 163 -130
1457 -130 -93 552 202 188 89 -231 318 236 91 379 490 -121 -134 22 -53 -69 -673 -453 -302 -150 42 77 -113
1480 -113 188 238 -325 171 34 -202 460 334 76 341 -84 -19 266 -162 -34 -467 -533 -152 62 32 412
1501 412 -235 -266 -167 -13 288 317 -57 260 164 232 454 -76 78 -168 -59 -234 -222 43 102 77 -272 175 242
1524 242 -203 134 -36 428 186 89 -89 39 29 182 250 -92 -101 -615 -163 188 19 -278 188 -566 -393 56
1546 56 -103 202 47 -291 108 281 175 282 -27 5 420 -335 -138 -142 -72 116 -378 88 -66 -460 -255 193
1568 193 44 89 -161 -87 83 163 221 43 210 -237 -372 121 245 276 -373 -181 33 -201 227 -164 -149 -249
1590 -249 -215 -101 271 -133 39 273 63 281 63 -313 78 -8 16 416 -34 -560 -71 -407 0 206 -261
1611 -261 -182 30 -177 196 67 81 376 72 99 139 -64 81 -211 -126 149 130 -289 -7 -314 -155 67 -270
1633 -270 -99 -267 -384 291 447 144 69 -278 -254 478 476 234 315 -142 -46 204 101 -12 189 -626 -323 -112
1655 -112 -237 10 -1 -86 135 57 3 313 47 -161 338 341 314 -273 -122 315 47 -89 155 -114 -546 -106
1677 -106 20 206 18 -334 -287 -40 27 -12 215 578 255 -100 140 103 -63 -235 -148 -118 44 -173 -344 -29
1699 -29 -50 -189 -178 -31 106 39 -180 216 247 -110 -91 88 1 326 230 61 -159 -222 -190 -174 -224 -41 -35 -165 -90
1724 -90 211 -18 -74 -175 0 220 243 137 -122 57 203 116 -323 222 -77 -108 -7 -64 -22 -8 -108 -198 79
1747 79 98 199 99 -269 68 -7 102 109 -20 74 90 54 22 144 -69 -108 -38 -147 38 -414 -446 76 -151 219
1771 219 444 11 32 352 -144 281 82 -58 333 -89 236 173 -269 -117 -117 -191 27 9 -277 -96 -363 -174
1793 -174 61 211 3 196 -78 -111 32 12 142 -60 -223 98 -41 -54 80 -140 -172 -253 -17 -12 -368 -160
1815 -160 29 24 27 16 -268 47 42 168 -154 -170 146 -29 222 16 -137 30 -111 -30 -347 -104 163 -166 125
1838 125 284 -305 143 378 -39 -47 193 13 359 -153 223 128 17 -111 76 7 130 -38 -237 -120 -357
1859 -357 -59 40 383 202 244 187 -66 10 -213 249 102 -97 -67 -256 272 228 -53 -126 86 -24 45 -233 249
1882 249 317 -249 -132 108 -2 -90 -5 -159 -53 80 7 53 -176 -258 -138 15 -247 37 -82 -45 150 38
1904 38 127 314 177 29 -62 -15 87 43 -162 128 -19 -192 -155 59 -73 37 -256 27 -55 20 -156 -383 27
1927 27 166 -130 113 88 -86 -82 -3 1 410 104 -4 -110 -286 216 347 119 -116 -15 -153 -201 99 103 208
1950 208 67 -186 142 -53 98 232 -144 117 -225 120 39 -40 30 -65 -159 -330 -217 -167 143 -101 68 -13
1972 -13 -7 53 -56 -14 150 -52 169 17 101 -150 -87 214 136 1 -159 -189 112 14 -316 183 -393 -263 80
1995 80 -13 -142 25 443 9 175 213 196 -289 -208 -57 -79 -183 -69 -21 -179 23 -138 57 -92 91 -89
2017 -89 41 103 150 75 -284 250 33 66 25 123 191 -64 -174 -84 -115 44 69 -23 -93 129 -258 20 113 -106 307
2042 307 96 161 97 97 2 -39 60 126 -39 -16 -265 -32 -184 4 76 73 273 -55 -152 -7 -159 -11 -105 78 53
2067 53 -134 266 204 254 -330 -105 91 96 23 25 134 -164 60 185 -7 -45 -231 -229 -212 -172 140 151 279 27 -320
2092 -320 119 -12 -27 -29 286 183 90 -32 -30 -336 63 44 -275 -43 -34 -216 13 308 -57 -12 -135 158 326
2115 326 123 88 -117 -11 25 -213 -370 7 74 104 270 -246 -109 82 -211 227 79 -111 137 -75 -61 263
2137 263 185 -22 95 -210 -54 146 -84 -14 36 -65 20 -290 81 -4 -40 -19 -198 -59 25 99 -212 134 -23
2160 -23 113 107 -205 -265 -137 -61 177 66 181 -251 58 149 174 -58 -101 -226 190 -278 126 86 97 -42 42 -289
2184 -289 6 -79 -25 61 -268 174 23 -257 -131 -287 -155 32 35 105 -94 -31 76 -44 147 -48 -247 -63
2206 -63 205 154 -34 -53 -168 -55 13 -335 -99 -32 -124 46 -190 149 8 -146 99 269 -30 2 -231 142
2228 142 -229 252 172 -181 42 -65 -72 161 -27 -142 43 114 -65 277 -40 -137 -30 -219 101 206 -60 173
2250 173 276 -119 76 35 -116 -48 -19 -224 228 23 -127 -27 -15 106 -157 -196 -12 -59 -75 -191 137 -15
2272 -15 -79 -48 -27 -299 33 -384 161 83 -94 24 283 199 -197 -125 225 -30 41 69 -97 155 26 -66 93
2295 93 71 2 -143 199 301 121 266 54 95 -49 118 -116 -12 20 109 84 2 -57 -377 239 192 -178 149
2318 149 48 50 59 -44 -48 -42 144 -235 132 5 -165 -88 91 248 81 195 24 -91 63 152 26 78 63 -72
2342 -72 59 218 4 -133 167 -158 -5 -43 -173 -115 87 -91 116 92 123 121 112 63 151 177 111 48 213 -34 133
2367 133 81 -192 28 73 99 -215 183 225 -13 -5 -175 -6 -212 -67 5 69 132 321 -18 -244 -26 6 10 17 132
2392 132 -109 -258 -93 101 -104 -324 -125 -2 -173 -32 -177 -126 -214 -80 -104 -96 -52 115 29 10 -89 -9 -33 -124
2416 -124 272 -22 -121 -15 -67 -157 -248 -141 52 -106 -13 122 -211 82 -227 172 136 -2 -181 -371 -36 -75
2438 -75 -43 -29 174 -202 -32 -310 -76 10 92 117 226 110 88 18 -147 211 -71 21 -68 121 -145 165 39
2461 39 78 89 127 -19 313 -128 250 -21 -208 66 213 -67 196 68 11 77 -181 -167 -166 49 114 -207 -91
2484 -91 -163 37 83 145 -196 114 84 -24 -53 48 -21 107 173 66 148 159 78 33 -56 -173 225 -52 131 288
2508 288 -295 -111 6 10 -135 -50 -51 -4 63 99 311 196 -179 117 141 -171 -9 -57 -185 -71 131 -150 36
2531 36 18 -68 -156 -23 18 59 72 -75 -175 134 228 -157 -219 -9 126 -2 131 -158 -31 -94 101 -260 40
2554 40 -47 42 117 -150 311 122 345 -84 -3 -1 214 -103 7 -62 -101 72 43 -190 -27 -30 45 -29 -34 -129 -175 -114
2580 -114 -7 40 96 -40 -235 99 -214 108 37 55 213 55 18 70 56 -229 50 -20 39 13 75 -37 -180 203
2604 203 178 -54 165 125 193 85 -15 -82 110 -75 -22 62 194 -123 -27 -55 258 -38 -56 -69 121 7 -11 172
2628 172 -43 127 51 2 27 55 -175 -181 -43 154 -19 -257 -76 62 -10 -91 -100 -43 -56 77 30 114 116 42 -75 -94
2654 -94 146 180 128 39 135 195 -156 -150 -150 95 5 234 43 94 -172 211 258 128 253 -156 -76 -18 -8 -38 213 14
2680 14 -33 -12 -110 -47 -222 139 194 -207 56 -123 154 0 -46 275 17 -55 -122 53 -145 -53 193 186 -115 -155
2704 -155 -90 75 -102 -396 -12 -105 -30 201 122 168 108 32 258 120 -205 38 19 -100 -146 31 -80 65 25
2727 25 85 -236 -175 38 135 -29 -111 -80 11 -126 -5 275 206 190 8 84 -12 239 -71 105 -89 177 -36 -239
2751 -239 -48 -28 -2 -25 4 -84 105 13 -104 -17 -207 84 27 -62 4 155 -18 44 7 -6 -137 -258 -240 193 -122
2776 -122 11 199 -37 -157 -92 99 13 -13 91 -83 29 -22 -158 134 93 -48 -156 -150 -260 -210 143 -82 -79
2799 -79 109 -3 -61 233 33 187 131 -188 -7 -48 180 -237 202 -242 -49 -212 -199 -27 127 -26 -142 -207
2821 -207 106 -291 -115 -61 -182 -110 88 203 38 40 24 -30 162 246 26 -44 -118 16 -146 -97 162 13 70 108
2845 108 19 -240 103 130 52 -200 101 66 203 -203 -53 -163 -216 -166 -220 53 -167 61 -67 72 36 -302 -68
2868 -68 -75 -75 43 59 174 13 -37 77 13 -70 140 -47 126 45 248 -27 -281 -195 -54 -154 -5 -134 99 -27
2892 -27 -196 -135 -40 118 18 93 -198 -122 -129 -60 -84 -91 -231 -18 -130 9 92 -35 2 -120 -103 -37 -380 -55 -133
2917 -133 197 76 179 54 -276 122 76 -228 389 -14 30 201 -318 -181 -152 -23 -328 18 88 -3 -94 -194
2939 -194 -65 -85 165 4 -133 82 238 -268 -94 20 138 154 -74 -11 146 -140 -265 32 168 -223 157
2960 157 -44 -95 72 -21 65 35 270 -32 249 63 29 -95 -73 236 -95 -65 -221 -134 -47 -15 -24 71 140 -49 121
2985 121 -56 27 49 163 -78 153 -40 -271 122 15 -130 -313 -2 -129 -158 -17 -109 52 -125 61 -250
3006 -250 116 50 -83 -64 68 -210 61 63 -206 14 148 -95 -53 123 -48 128 -145 -29 -114 -247 78 194
3028 194 -42 -27 110 -151 -297 -265 -68 -376 98 -121 14 163 13 -55 219 209 -352 -77 29 169 -22
3049 -22 -83 -157 -51 194 -177 117 118 -79 -129 -86 191 -50 42 -64 70 -266 -11 -31 -44 -130 0 -87 230 73
3073 73 37 136 -113 160 96 -16 261 263 116 -71 153 -2 3 -319 -9 -76 -94 46 -15 86 -165 38 104 -151
3097 -151 245 -12 -5 -216 31 10 207 49 -34 101 -131 26 -12 0 -166 171 62 -203 -228 -157 -142 -103 -218
3120 -218 -3 132 143 158 -114 -264 55 288 -166 -98 34 199 -86 -229 -47 34 -54 -86 -76 -38 -29 -107 69 194
3144 194 176 353 -172 33 156 188 75 14 148 -129 43 0 -52 86 -27 55 269 40 373 -73 -221 157
3166 157 80 215 53 -273 -34 209 271 -80 -125 -290 -264 -135 92 -105 -217 -57 -88 93 -81 -54 -121 -213 -59
3189 -59 272 -58 221 -59 324 91 -232 -146 -169 -10 -37 121 158 -84 -23 223 -81 -101 -69 64 -50 28 179
3212 179 129 -141 171 227 -15 -272 -322 -125 114 61 -84 -71 -3 -57 -241 -40 8 266 47 -146 -103 -20 85
3235 85 302 -101 51 -45 -120 186 263 -13 156 15 -104 183 -257 111 271 -83 -124 18 9 56 0 196 -239
3258 -239 157 -76 222 -402 102 -50 24 -155 -37 -192 -47 70 -86 95 200 -81 -195 -127 -21 -124 31
3279 31 -47 -10 -7 -88 4 -439 49 38 -9 2 -246 -193 295 -128 157 -47 113 -150 180 -52 27 -84 -94 -95 -295
3304 -295 -90 206 104 -44 290 15 248 108 75 -53 -258 100 -213 165 -253 -123 -101 -24 -99 135 53 -115
3326 -115 -177 172 -89 -116 166 -146 -16 15 -51 -46 -53 99 38 -236 106 175 43 114 -26 30 145 166 -146 272
3350 272 -98 -24 -24 -131 68 111 -134 154 -46 70 -208 44 -207 57 246 -79 -25 -52 -244 121 -130 -112
3372 -112 139 132 -2 13 5 -23 57 -126 181 34 -36 120 35 63 5 182 -35 -85 115 -38 15 3 -81 -259 5
3397 5 3 -25 -31 -164 111 26 34 0 60 164 37 62 161 122 -111 -96 25 -491 -77 -8 -153 169 -7 -61 298 136
3423 136 162 -95 4 -103 -185 151 299 25 -290 -47 77 -141 -98 198 -55 -136 -82 -96 103 187 102 163 -83
3446 -83 20 -57 -248 57 109 -36 27 76 105 108 88 -79 53 86 89 -99 109 196 -128 -302 -55 -89 -49 88 120
3471 120 -10 92 96 106 -169 -142 -167 42 -69 110 162 144 45 -100 209 201 -189 -274 103 44 -114 271 -127 -142
3495 -142 19 69 69 92 -114 -180 -60 100 242 -62 139 -32 -186 -52 61 -117 -68 217 -7 -23 -15 -3 26 -231
3519 -231 84 -26 -348 176 55 2 7 73 -229 213 147 -104 -146 306 58 -304 -126 173 156 -212 97 -36
3541 -36 196 -72 104 -81 109 -145 129 72 -8 44 59 -59 198 -59 84 214 -76 -64 -27 87 -109 12
3563 12 160 -12 -136 -105 -71 -361 82 -30 42 -186 -29 -62 214 115 -16 -94 204 107 397 63 -95 29 -191
3586 -191 1 91 -166 232 -81 -196 42 -308 -31 157 -31 26 -105 152 0 -214 139 -255 -99 -42 -227
3607 -227 -99 46 132 14 -33 -80 88 -66 198 65 128 156 67 -1 -341 26 63 10 -58 102 19 183 97 -253
3631 -253 -160 -30 -12 182 -298 139 159 -140 -100 171 -44 130 -74 90 105 166 -49 -261 -85 168 23 -146
3653 -146 -50 58 78 128 -87 178 -52 -139 93 262 -137 46 -76 7 77 187 -128 80 -22 -65 135 -56
3675 -56 -146 122 213 167 -157 135 -124 108 -109 84 -197 -338 283 -23 -113 -213 152 64 -50 -87 -221 71
3697 71 132 157 56 -95 96 37 240 57 -145 45 24 49 167 226 -113 295 -102 16 4 -76 -132 64 -61
3720 -61 -184 234 90 92 -65 60 145 -29 -100 -100 -37 328 373 3 -276 -53 259 -120 211 -389 11 61 -110
3743 -110 202 -52 271 1 394 -58 89 -30 -351 190 -287 -119 -132 -62 66 -19 -388 -111 79 139 -82
3764 -82 131 40 -102 -64 26 184 207 -118 120 135 119 -183 25 38 59 -51 -61 -279 -73 191 -321 159 -75
3787 -75 328 59 -85 -123 256 110 98 -48 64 238 18 -8 -57 118 95 21 328 36 -107 88 161 3 166
3810 166 -60 44 319 1 85 149 -14 -319 254 -6 90 -32 137 107 179 -87 -139 -104 -280 356 -41 -84 -10
3833 -10 5 -79 17 -132 163 166 -104 -97 132 -96 254 134 -123 208 -38 40 -52 54 -108 -117 41 -114 -164 -93 -49
3858 -49 -55 16 36 7 -20 101 109 209 -53 126 251 -181 -117 155 356 -276 155 -194 -226 -9 -175 52 183 -111
3882 -111 -63 -307 86 26 39 147 -93 -187 82 275 -40 87 -73 -47 -197 -150 171 214 -30 127 -22 55 -3
3905 -3 -202 101 92 -23 -75 -172 31 -102 -45 61 -81 -1 -29 117 -40 15 -99 -196 86 243 -8 103 -74 -74
3929 -74 -76 177 -30 40 46 -97 1 74 -60 -275 181 -24 -351 11 156 94 198 46 154 -46 191 50 5
3952 5 178 -26 -311 157 78 -281 11 26 -19 115 -24 147 82 -163 -34 124 -99 -179 27 126 62 108 334
3975 334 137 -118 166 -79 -155 55 20 -181 -139 -58 10 4 41 24 -19 25 69 -97 -283 -46 163 329 13 -98
3999 -98 -132 86 -197 36 -38 67 -98 -179 -275 136 87 48 -204 -118 32 -80 -164 -119 141 -293 87 -225 -72
4022 -72 208 135 -137 15 199 81 223 108 -188 -102 -96 138 145 -102 212 -137 108 -39 120 -28 -108 -166 -81
4045 -81 11 -169 -53 283 201 -191 5 6 31 -28 87 -215 -100 22 -123 143 28 -126 96 32 -110 82 -210
4068 -210 -188 99 159 -50 -63 -136 -157 90 -218 213 123 8 -63 192 48 331 171 123 119 -34 67 -42 -23 -188
4092 -188 -149 23 41 -77 10 184 62 77 -88 -183 -187 -228 145 -74 60 -70 -30 -124 -76 297 93 71 176 174 -63
4117 -63 -26 -104 45 243 -1 67 111 212 123 103 -248 149 114 212 -199 107 -133 -350 -126 5 -76 118 48 81
4141 81 46 -329 22 -134 -201 -66 -169 -1 162 27 152 -78 37 -60 113 55 241 -92 5 -69 202 282 -31
4164 -31 -162 76 31 392 86 -97 271 -152 -167 -85 151 23 54 -51 171 44 191 182 -99 -23 103 -19 -74
4187 -74 -19 -28 -106 44 62 -133 51 -58 -132 -114 70 276 -132 30 3 -156 -147 86 -78 115 61 -236 21 -77
4211 -77 201 58 29 205 120 69 171 -54 109 -14 176 -267 -82 130 -39 21 -65 61 68 -45 -88 78 -176
4234 -176 -118 213 -21 284 -14 -217 128 -71 -169 47 59 158 -114 -65 206 1 -238 -72 -73 284 -108 24
4256 24 308 -322 194 -155 12 -213 175 -89 35 -201 63 86 207 -104 -255 -6 -24 142 73 -147 151
4277 151 -190 129 48 129 84 214 119 -67 125 0 329 54 243 160 172 52 218 221 -68 -55 -102 59 -18 21
4301 21 -72 -221 -70 -46 129 -80 112 -24 166 -168 -151 25 317 81 -97 -155 22 311 -40 32 -53 92
4323 92 18 -22 -236 -353 -256 144 -47 -201 -170 1 -218 -72 257 -31 93 -70 118 209 141 -46 282 121
4345 121 -266 61 -73 -228 -134 128 42 176 -73 159 237 52 136 15 74 -129 74 -29 211 -173 -173 -61
4367 -61 163 153 -20 79 48 -30 -121 324 2 158 94 25 179 -349 -30 52 98 -76 139 33 -72 -173 35
4390 35 164 104 -135 87 291 122 -311 -116 126 13 -157 -95 -47 98 422 -52 -361 -163 145 -95 110
4411 110 162 43 7 34 162 22 -1 -68 81 -157 -74 163 250 -136 -30 328 399 -155 -114 212 50 160 7
4434 7 136 9 -91 -126 1 -270 61 116 13 62 43 120 -29 -16 -42 -74 -31 -453 21 202 295 -46 -242 166
4458 166 115 -6 12 44 -40 485 105 70 -279 -89 144 27 -2 -96 19 -134 -24 46 172 193 242 167 22 -98
4482 -98 140 -154 -74 -105 -122 93 111 -58 -40 -95 135 200 106 -24 90 30 -42 36 -74 -63 -63 -72 -170 -50 -189 17
4508 17 -106 -58 137 -57 -40 -162 -29 103 -32 16 -75 -185 -98 -15 -58 -183 -174 64 26 45 49 -9 198 227 246 -1
4534 -1 173 8 -60 144 -10 147 -176 -125 199 -109 -114 -78 123 -81 -302 72 76 14 50 110 154 4 14 300 -130
4559 -130 171 -30 334 8 31 -154 -76 64 -54 -119 245 17 -50 41 106 11 45 113 -220 -274 156 -78 282
4582 282 221 71 2 -7 72 50 2 199 -35 -182 10 -66 -70 154 6 6 90 -240 -128 71 -194 -254 -143 -260 63
4607 63 -45 -147 -125 55 126 -181 -8 152 -38 -7 -228 -292 36 252 -113 -69 265 -141 188 310 45 48 -3
4630 -3 189 -7 167 -108 -62 35 -102 -219 -117 -12 -154 -5 -8 329 -22 -9 -177 38 -65 -234 93 250
4652 250 -157 -129 -65 -280 313 -302 -18 48 42 2 -90 -72 55 -2 -133 148 99 30 111 135 -49 82 151 -165 20
4677 20 112 53 -2 -138 -1 31 -130 -19 -105 107 24 -47 -19 -41 211 92 -62 -101 230 -161 -65 -33 -74 -173 73
4702 73 -277 7 -75 -97 -180 -62 255 -42 -184 -103 71 63 -27 58 263 21 92 -225 -214 139 304 -1 91 -90
4726 -90 -14 -145 51 -170 -166 180 -268 -125 -12 -224 144 -119 93 102 280 302 162 31 50 1 -209 -71 -32
4749 -32 -15 87 -82 187 -53 59 -17 122 61 253 27 48 102 -208 -39 27 49 -102 275 29 3 -80 -127 -118
4773 -118 27 276 -300 22 12 177 136 332 -90 -107 -58 248 72 -61 -106 7 230 -201 -149 -8 -301 -98
4795 -98 -110 92 140 87 26 80 -83 80 -229 -94 -38 -240 -298 0 -253 -32 -36 -185 -23 -291 -148 -127 92 34
4819 34 -444 16 175 63 -176 166 -47 150 326 191 -160 -31 52 81 35 -259 3 -125 95 24 85 50
4841 50 249 170 88 -16 -71 -199 -61 75 26 -138 205 -41 -28 159 -275 134 -63 -175 107 -159 105 -191
4863 -191 28 51 272 -182 -144 -58 15 162 109 97 -291 -147 -212 44 -156 39 58 -43 132 -1 -59 27 -154
4886 -154 159 52 -67 -435 131 76 -26 439 -153 49 -97 -21 -50 402 -25 173 -59 90 -62 -10 -55 -289
4908 -289 -23 -72 -66 -28 72 38 -72 12 -99 122 28 61 7 46 -10 -46 -65 228 95 -77 39 228 46 -32 127
4933 127 -152 -1 -89 84 14 13 108 -120 194 -119 -15 133 -169 93 -67 -8 118 -188 -150 115 5 -100
4955 -100 -91 -105 -257 -190 1 78 109 -176 367 292 -23 -61 -277 -125 136 -190 53 -91 -74 -46 130 -149 44
4978 44 74 -261 -54 21 62 32 142 208 -254 -120 63 1 71 -75 105 96 -250 317 -40 -22 76 112 -277 -3
5002 -3 116 -8 -62 113 0 243 -65 191 -19 -11 89 -9 111 -166 164 193 -60 -382 -90 4 -146 68 -138
5025 -138 -102 170 127 -222 -26 92 -108 43 118 -18 -99 -292 -55 227 53 143 -155 -98 78 -33 -210 80
5047 80 72 -98 -366 -257 -175 -40 -80 -20 -16 -7 -391 -83 78 12 4 120 8 -165 242 176 -153 -279 5 143 38
5072 38 30 -19 -38 362 157 147 28 -21 2 -167 -281 20 42 -356 -11 104 -271 26 85 69 118 -194 -53 27
5096 27 209 -136 -110 -83 74 4 127 69 -87 102 -71 219 -120 -144 76 95 -35 -390 12 -12 -224 -40 -47
5119 -47 20 -112 69 -196 -197 -26 -41 140 -41 42 -108 59 -293 116 63 -140 -117 196 261 -2 81 85 133 -57
5143 -57 324 39 134 -163 -128 -44 217 -205 -105 103 89 -17 58 61 20 57 -171 107 -156 121 181 -52 21 186
5167 186 -127 188 -24 -160 220 -72 62 -209 -68 30 -119 -30 -142 23 -12 -72 -87 110 139 -56 -156 -6
5189 -6 -12 231 147 189 -51 28 -31 35 24 68 -80 219 105 -379 -137 -49 59 292 -66 131 208 2 88 -206 3
5214 3 38 142 -152 23 233 -205 259 -57 242 77 142 -214 -4 105 -53 -128 169 -234 222 260 -1 146
5236 146 -31 -11 56 133 -35 -66 -341 -111 80 -473 124 -3 1 -35 43 -21 20 -167 -92 182 -309 260 -101 -312
5260 -312 91 -186 -237 77 -44 -161 -215 89 -260 110 -76 -164 246 90 -56 126 -245 -191 -34 116 -236
5281 -236 -39 -238 17 -54 -240 -27 -22 50 121 -241 49 -39 3 -169 104 161 11 183 25 81 -50 -192 -339
5304 -339 -2 78 61 -40 -61 390 -172 59 43 87 67 82 -164 -80 77 158 -112 43 -15 -67 -33 -88 33 -111
5328 -111 -53 -236 88 -77 -178 -75 199 -154 -91 69 105 138 160 96 -18 87 -165 111 162 -235 54 -173
5350 -173 78 180 -52 173 45 -23 154 207 -53 -120 -16 37 114 31 -101 22 -68 -138 -188 -98 28 -62 17 -302
5374 -302 10 86 -154 -81 -108 211 121 -280 -349 252 116 -172 -37 -34 -21 74 -136 -233 -225 -1 -184 100 -122 170
5398 170 48 299 89 -104 85 -200 17 -41 -97 -90 104 17 -17 87 -29 -97 174 5 114 -111 -237 23
5420 23 -214 255 106 -39 110 -315 79 -227 146 174 -142 47 -152 240 165 -102 58 77 -34 6 -259 -10
5442 -10 -43 40 -203 0 90 86 -123 68 219 157 0 -61 136 -13 13 117 -65 212 29 50 -242 -233 -136 -209 93
5467 93 172 81 -56 23 -91 -55 -32 47 71 -69 -147 71 -134 -9 160 158 9 72 20 -31 -9 -13 -313 227 -23 -160
5493 -160 -218 87 51 -265 2 103 -73 -397 57 -128 -110 -135 146 111 118 -42 -89 178 271 -132 15 189 45
5516 45 -337 -67 83 -216 -102 13 244 -148 63 -56 87 90 -28 144 138 25 -11 134 -196 -23 -85 235
5538 235 104 -139 -145 -160 138 -116 -26 10 153 42 47 -116 68 -12 -56 119 46 -118 -104 -205 231 -114 -158 43
5562 43 -156 149 -125 325 16 146 78 151 -91 -64 233 -222 120 -175 -24 142 323 -306 -32 -136 29
5583 29 -53 -253 118 -293 15 109 -202 171 210 -12 103 -140 -262 -156 101 133 -81 59 -69 -39 6 -17 -34
5606 -34 -172 -146 -26 -3 -43 1 53 148 231 45 -62 -98 10 -278 -101 -253 -255 -58 -122 -31 -75 -23 -88 78 -25
5631 -25 10 -59 -16 -69 135 125 -64 -79 -56 -80 -17 87 129 -175 -190 -17 -95 207 -270 -20 68 287 -121 59 -43
5656 -43 205 62 -113 93 -97 91 -96 198 -154 103 -15 197 52 43 255 1 130 132 -90 38 14 38
5678 38 -26 143 -95 176 71 -6 95 125 95 -39 -373 -493 -35 35 123 -18 40 33 -289 -61 159 95 -281 -165
5702 -165 -89 108 -297 -61 67 63 79 -389 19 34 62 3 154 207 -75 -95 424 143 56 -86 -59 0 -161 21
5726 21 -122 130 142 -61 27 -87 -107 -122 -25 81 -332 37 -92 131 3 -82 95 -96 72 -29 -114 140 83
5749 83 211 -26 -85 38 66 32 -33 -18 -118 -239 115 117 245 -80 39 71 -109 -237 167 -265 -110 53 -18
5772 -18 -131 -123 26 -200 174 -192 241 -212 76 -176 217 -206 4 -114 -104 -117 53 -44 197 -135 -33 -50
5794 -50 49 34 139 -224 14 -149 -48 -21 -274 -121 -98 88 -105 -6 101 124 -221 -103 83 126 23 4 59
5817 59 116 191 111 -24 151 -150 -97 207 151 -178 -25 50 84 145 160 31 71 -55 251 457 -43 23 -6 28 -74
5842 -74 -258 -221 34 -123 -50 -323 -61 72 87 -65 2 110 198 131 243 -133 -245 -18 -144 -91 118 58 -129
5865 -129 -131 -2 -145 -252 -106 -60 64 229 -9 -19 -38 155 -327 -78 178 72 -153 153 51 66 100 -326
5887 -326 87 29 -1 -69 168 -19 294 28 138 -28 33 49 -133 -19 -104 -350 -146 355 -40 -5 -2 48 8 14
5911 14 45 -330 -8 -23 25 132 -89 156 -81 -216 -205 -166 -33 -109 96 104 -205 200 -40 -60 52 55 228 176
5935 176 -91 100 241 177 -119 -5 1 -105 -198 147 31 16 -33 -46 -116 125 11 192 272 33 60 -17 91 -137
5959 -137 -103 -72 -180 149 -95 -307 88 -151 60 134 76 -186 22 13 -105 -100 27 -26 151 49 142 137 -2 93
5983 93 174 65 24 -82 56 -90 174 150 -62 4 40 -72 -98 96 146 115 255 -127 -8 150 -14 -43 13 150
6007 150 27 -100 -228 136 132 257 48 -108 196 342 -179 124 114 -271 175 190 174 173 54 127 -7 227 -150
6030 -150 69 -40 86 -77 -94 72 0 -322 33 230 -88 -21 35 -185 -151 161 124 116 46 103 -64 -67 31 -174
6054 -174 -88 -134 56 -81 -434 268 -74 138 7 140 -171 119 91 29 55 0 -16 43 22 -145 132 -293 421
6077 421 -276 236 -8 -126 -43 -93 111 54 -139 53 41 60 148 -213 46 65 -206 -76 113 75 134 45 121 127
6101 127 79 239 -28 -252 81 -172 40 44 -80 -313 -66 -124 192 4 236 -241 -210 -70 -142 42 -125 -261
6123 -261 196 213 -194 -33 -152 -75 -66 -178 62 -81 -219 -6 22 -224 254 -45 27 -71 -71 27 -11 -41 -32 -53 88
6148 88 99 57 -124 -63 248 -112 138 135 29 8 -145 154 -63 215 99 -28 1 -113 384 141 -307 -161 4
6171 4 -171 158 -111 114 -65 -46 -117 84 1 -153 16 -47 -192 -92 -74 87 -164 173 97 143 232 -194 -73
6194 -73 -34 -380 68 109 151 47 49 -235 27 -99 119 -148 -262 21 226 146 -121 263 -14 116 54 -211 164
6217 164 97 -456 -140 -69 -233 -169 -45 -122 64 -43 -129 290 -216 -241 -106 19 4 235 -9 -57 13 76 -26
6240 -26 -27 161 101 -179 -19 9 55 -4 -66 -20 75 33 -98 -203 -33 -249 70 35 -37 -224 -271 31 -169 212 21
6265 21 -5 -222 -118 210 96 -119 76 -108 -222 -182 -38 142 112 112 190 150 166 -86 -78 89 -177 314 -94 -82
6289 -82 175 -5 -93 74 -64 -143 -151 -246 -11 -361 -272 8 11 55 220 82 114 -63 -177 30 -64 169 -81 134
6313 134 -218 43 -21 -99 16 -70 -118 174 99 -4 -95 63 35 1 -80 -38 -94 385 -95 296 32 -11 -220 -11
6337 -11 115 -39 -49 35 -70 27 -110 -111 -165 178 -165 146 -117 -61 -73 -84 161 -35 121 161 -153 111 136 201
6361 201 46 -9 95 208 -79 -118 -9 36 20 -50 -135 -149 17 130 -44 -112 -46 24 -202 70 -13 -81 93 -52
6385 -52 73 213 10 -57 -140 -211 -20 52 -136 46 58 -298 -85 -20 -19 222 -49 137 182 -183 -25 -74 -25 -173
6409 -173 -10 204 -24 37 55 -48 -95 -24 -226 -130 -57 -208 -21 -57 -24 45 -32 -88 151 141 206 -29 -73 6 290
6434 290 -57 65 138 42 -93 136 92 -85 -126 -176 -65 75 122 1 -89 54 -98 21 82 -117 -46 -8 -118
6457 -118 59 46 13 -91 -51 120 -41 -110 20 5 57 280 -53 -117 -38 -3 -51 -35 -172 168 18 -50 28 319
6481 319 -147 33 200 -52 -15 118 -26 155 60 -142 -23 -139 158 -208 113 -64 54 92 165 -75 221
6502 221 12 55 247 298 -92 -69 95 119 -163 -90 -58 -158 202 -10 -86 106 15 -8 3 78 -33 152 -80 -305
6526 -305 113 -21 81 61 -84 18 27 -95 156 -20 -37 -45 64 -251 43 217 43 -45 -225 84 45 -281 225
6549 225 74 -143 55 98 139 19 -8 153 116 45 91 -124 -138 -125 -55 -108 -253 -130 41 72 44 136 51 216 275
6574 275 228 -153 -186 17 158 46 53 -202 118 195 82 -202 212 91 -273 28 -103 82 -236 98 28 259
6596 259 2 100 26 71 -152 50 -87 -204 -20 215 -225 110 -150 -7 -48 205 -39 -40 -41 -147 -96 -142 -33
6619 -33 22 85 249 374 37 -150 -21 -111 -104 -24 -105 205 -33 -132 -261 193 -201 159 42 -17 53 49 159 -47
6643 -47 18 -292 -112 -20 -171 -23 -121 -100 -130 -135 22 -52 42 -16 -391 49 -104 -101 -208 123 58 -41 11 130 74 -173
6669 -173 35 -33 101 52 98 -78 -46 248 -59 -248 -21 96 -155 -110 -330 -48 -41 176 -29 51 68 178 -9
6692 -9 114 147 327 74 77 27 15 -187 -212 -1 39 7 -6 72 -162 109 -122 -24 -46 -64 -220 12 -204 165 -27
6717 -27 -280 146 -23 -18 107 -222 -22 -153 -157 -7 -66 -143 -71 -117 -206 233 45 70 -236 -176 216 -136 150 -50
6741 -50 79 115 -167 -62 21 -258 99 -83 -21 27 -10 -158 -176 84 -18 -401 -35 -54 81 -89 -98 -193 70 -167
6765 -167 -263 131 110 -11 232 228 -151 -63 39 -301 141 226 171 129 -168 416 101 219 21 -147 148 -170 -26
6788 -26 -85 -49 154 77 -23 -158 -75 -21 -225 -71 -190 -294 -111 69 -90 -92 -52 458 206 -34 252 -2 432
6811 432 68 -20 35 31 -25 -74 -4 -66 20 48 126 -33 167 83 -4 129 -17 -150 -86 -104 -56 -26 -91 -23 -65 53 178
6838 178 -217 -210 187 -55 208 3 148 -17 240 -116 127 -207 61 52 -208 -24 -167 188 -22 -246 -181 27
6860 27 -126 73 -57 -86 49 3 154 78 117 -129 43 -192 -90 -100 -25 270 153 420 162 -117 -200 214 96
6883 96 114 199 133 -24 395 58 -230 -13 286 -106 38 -123 -83 -78 384 -177 -150 -95 -2 -162 -120 14 58 263
6907 263 170 123 -62 -77 -122 -187 -108 84 -91 -31 165 -71 327 -48 61 156 -380 114 8 -130 -21 6 -156
6930 -156 -173 66 66 -54 -89 -56 -78 -60 91 -321 -303 188 -150 195 316 5 26 77 195 42 -63 -98 -239 126
6954 126 -198 -66 -78 -48 24 -89 37 0 -52 -40 -99 -124 -18 -121 -63 31 -1 -37 -290 -90 159 -225 90 375
6978 375 114 53 7 -58 88 192 117 45 10 157 35 313 82 -9 80 64 1 164 196 -63 -47 98 9 0 -2 274
7004 274 92 25 -110 -107 99 -231 88 -102 -244 -87 254 176 -192 241 -183 84 -99 -149 89 21 19 -256 445
7027 445 110 15 -85 -276 72 -203 -62 40 183 -225 -123 -114 -226 58 -177 86 42 -47 -139 82 -63 -261
7049 -261 164 124 48 0 30 -18 31 -114 72 287 39 3 -267 -94 -8 87 129 -32 -27 52 142 47 -279 40 489
7074 489 73 -118 -162 40 -2 6 -40 -120 -1 -69 -92 205 19 -30 -24 -36 -8 68 48 -167 47 -46 35 24 -139 -67
7100 -67 -133 18 -152 -189 225 -106 -36 33 -151 90 -105 69 222 -183 185 -4 -218 -100 -32 -201 -68 -139
7122 -139 -10 -215 52 51 -134 -74 5 -51 133 240 -78 -56 -122 102 36 -164 -59 -47 68 -150 111 35 -26 57
7146 57 -35 -100 -24 48 311 283 -66 99 -45 -12 138 -93 -243 -200 203 -81 81 -137 -90 91 -212 -250 15
7169 15 166 109 -172 47 -85 -94 -69 121 -248 -106 33 61 261 87 60 87 102 94 128 151 -25 74 163 -37 19
7194 19 71 -286 -132 103 -215 -155 -48 -58 -64 254 14 -250 50 -127 -2 96 11 73 190 -17 -47 -49 35 -122
7218 -122 79 -83 -138 -79 -271 -39 30 278 -207 -109 57 273 -167 -63 -18 279 -250 -222 -29 383 206 13
7240 13 -23 266 179 -29 215 75 3 41 -263 110 36 203 58 -109 31 -57 -215 -220 -87 -6 121 -63 42
7263 42 -155 -25 49 195 93 -93 -37 119 -305 247 -16 -52 23 -11 19 -77 230 -198 -35 -525 117 -130 57
7286 57 -15 -127 -194 54 -154 -229 40 -3 -50 74 80 -203 -21 227 33 -145 13 198 177 11 161 -73 -157
7309 -157 -186 -103 120 27 47 -37 -111 -323 97 78 -246 149 169 58 4 -38 -169 59 -256 47 1 50 10 -301
7333 -301 -293 -23 -102 -106 -136 213 74 -205 -24 -95 -88 -3 228 -122 183 238 39 15 79 112 299 87 73 -47 25
7358 25 -284 -49 -197 -51 -12 -50 -58 -121 174 150 99 161 158 147 -32 87 301 -188 150 28 211 -110 -212 -99
7382 -99 8 75 0 -12 -101 115 20 2 -102 -27 -181 -72 -44 -58 -76 70 4 111 -21 -186 145 -75 23 -313
7406 -313 -131 185 -26 42 -12 103 -31 192 262 -9 -37 -196 -58 -26 107 35 -153 -75 27 143 267 -128
7428 -128 -178 -184 -90 128 -30 -254 -75 9 166 -17 349 213 -275 -26 5 -80 -9 -18 -124 59 178 47 164
7451 164 77 135 204 199 135 -17 157 -2 99 151 116 -181 5 44 -33 109 148 370 -9 18 -141 109 -91 -205
7475 -205 -331 -3 74 -207 -130 -3 -44 -182 -169 131 307 -111 -19 -282 -31 -102 -139 12 -11 98 139 -26 -204
7498 -204 -13 -7 62 -31 12 7 68 -1 -203 -11 -14 -37 137 -42 -28 96 -285 36 28 -26 -84 9 264 -96 -153 220
7524 220 -85 -5 182 78 191 183 -152 219 158 277 48 -186 -171 27 -49 -38 154 -101 405 53 -241 -79
7546 -79 -193 78 -103 113 -16 15 -37 -233 18 119 253 84 140 38 144 106 -47 -436 -62 -99 56 18
7568 18 105 132 53 218 5 -223 -177 -18 -240 12 115 146 -12 145 -201 -131 -202 -106 -112 122 -33 -121 151 -148
7592 -148 -17 -182 -19 -56 197 59 -187 -98 6 290 58 24 -132 -71 -79 39 108 -33 -57 193 -340 -91 12
7615 12 -2 74 -65 227 21 172 -4 -18 -43 -213 -152 -278 286 40 6 -115 -217 -33 56 274 -162 -105 -50
7638 -50 43 -85 120 -105 -91 -46 -146 177 -191 -84 -333 143 42 -469 52 -194 -57 -47 -221 174 13 -153
7660 -153 -3 26 54 -85 -6 114 54 63 -224 -193 -103 140 167 42 11 -148 -231 -154 64 176 -138 7 29 38 -209
7685 -209 -122 56 -115 62 83 246 -31 107 152 -206 114 -86 -17 -64 88 -20 -24 -121 -261 -89 -22 -14 31 169
7709 169 -68 9 55 282 455 23 67 109 20 -142 -220 178 62 -113 -42 130 6 -152 -34 -282 -13 -144
7731 -144 121 -109 2 90 300 18 260 69 -176 33 114 183 -26 -194 -225 16 131 -222 -207 20 -24 -77
7753 -77 183 -2 123 -124 -19 88 -148 -15 5 -88 -223 -121 79 24 -202 -71 34 168 224 24 66 -6
7775 -6 -71 168 21 18 44 60 -11 93 96 169 -98 -134 172 59 81 -102 -152 83 -208 -83 96 131 91 -3 206 -120
7801 -120 118 -110 -171 33 -123 173 -303 -59 89 -197 -269 4 -24 111 -85 -66 -99 -167 -53 17 -281 67
7823 67 -9 253 -167 509 21 -133 27 -3 -95 -39 42 172 111 69 196 -261 31 -47 146 -124 83 233 218
7846 218 -31 -389 56 2 -112 -37 -164 -250 143 -65 -7 186 -36 -120 418 90 349 286 -190 133 -66 279
7868 279 211 111 -23 119 -198 30 374 75 -160 45 -185 294 -112 78 145 95 -128 -49 -78 -15 43 31 19
7891 19 -32 -255 -93 204 225 -187 -97 3 -164 -218 -91 37 -177 103 -354 121 -80 -33 -66 -36 15 -190 -304
7914 -304 -199 -21 -56 87 73 -127 -112 -40 149 42 41 -269 -96 43 -151 55 71 -18 93 -136 162 97 -72
7937 -72 -36 15 -97 5 202 40 -144 -76 -1 -169 166 223 -286 -35 -12 -118 81 -104 39 -378 119 162 -102
7960 -102 0 155 12 184 -132 279 -26 -208 94 254 60 -3 -35 81 135 42 -121 -7 34 -28 84 -199
7982 -199 -68 25 -125 -123 -101 -25 -100 165 -119 -108 -4 -150 182 92 -85 -269 133 115 -161 74 -54 -62 109 192
8006 192 -253 158 -74 181 -79 67 -99 -194 -135 -32 -151 -4 -86 -76 63 -37 120 71 181 229 12 -161
8028 -161 -141 -100 62 56 -155 -58 239 86 50 -23 186 160 52 -8 -26 28 -46 -82 63 -38 -95 -1 -28 0 -56 -177
8054 -177 -27 0 -197 33 -164 -318 247 40 -63 190 137 -64 -51 118 -136 346 -162 -135 85 117 -43 138
8076 138 95 23 74 95 -175 -88 -74 17 -76 172 -43 103 -19 298 -122 69 8 -183 242 14 69 -61 -102 -128
8100 -128 42 -50 156 5 120 266 130 198 113 -50 -78 113 -277 -182 -18 5 13 -53 20 52 -198 -75 -152 -348
8124 -348 -130 69 -84 318 -66 -221 160 122 -147 40 90 52 -40 -46 -51 -356 -212 -289 26 60 101 -35 -278 -242
8148 -242 -31 208 38 -27 -332 -180 -316 -107 2 -233 -21 130 229 150 7 -109 346 -180 -47 82 -187
8169 -187 -2 -27 139 32 -150 -180 -73 -86 44 172 -134 76 -80 6 -126 44 -73 -65 34 -29 3 -339
8191c39
$$ Imaginary data points
##PAGE= N=2
##DATA TABLE= (X++(I..I)), XYDATA
0 0 0 0 0 0 0 0 0 0 0 0 0 0 0 0 8 -8 8 -8 8 -16 16 -20 24 -30 32 -40 48 -53 62 -72 80 -88 104 -118 132 -150
36 -150 168 -187 209 -233 261 -290 322 -357 395 -437 482 -532 586 -646 712 -785 866 -954
54 -954 1054 -1166 1293 -1439 1608 -1809 2046 -2335 2700 -3170 3807 -4723 6166 -8789 15140
69 15140 -67867 -16366 110221 41385 -30990 -31765 9954 -1323 -9483 15995 16663 -26272 -17872
82 -17872 18429 20783 -4610 -4409 22273 26215 -11509 -20738 -15549 -29265 -18496 28522 47991
95 47991 13314 -36120 -31219 2875 5845 6877 21028 -2343 -34553 -20072 28516 47696 12012
108 12012 -14600 -3831 -14396 -30411 -4719 21960 11400 -8814 176 21589 -4213 -40448
120 -40448 -9641 32836 13385 -25819 -20860 18102 23057 -8190 891 33669 15938 -27808 -42534
133 -42534 -18794 20410 34192 18762 -9844 -35332 -16775 23430 18179 -12665 -21201 -6571
145 -6571 7880 4129 3303 16621 9840 -3647 4756 4044 -14131 -24048 -7339 25189 26148 -2684
159 -2684 -13119 -11169 -12802 -472 13291 8081 -14089 -26720 -823 25589 15198 3956 5422
172 5422 -3241 -12902 -11975 3912 13930 -1049 -6489 10748 11255 -6318 -17363 -11210 7744 9252
186 9252 -6890 -12333 -8431 3757 20838 14650 -3299 -8082 -3927 892 -4001 -7502 10370 18334
200 18334 1161 -9398 -6896 -618 2228 -3917 -4672 -3115 -9356 -3169 9106 8108 4249 737 -1685
215 -1685 -224 -5551 -4336 5393 4478 3121 7936 4049 -3935 -9244 -5843 5818 1935 -10675 -7062
230 -7062 -537 2095 5227 4197 3759 -249 -8088 -3349 3306 1863 4453 4463 1796 3644 1107 -1183
246 -1183 -2569 -7328 -2650 4311 -2570 -6930 -2502 3683 8470 392 -6161 -1059 -664 -1968 2458
261 2458 2845 4581 5269 1445 1626 -1431 -4543 589 116 -4432 -1770 -1779 -1012 701 -702 2750 2031
278 2031 -5713 -3603 1503 2119 2899 1187 3118 6379 703 -2067 309 -2441 -1278 900 -1425 -1498
294 -1498 -2559 -1687 2925 182 -2838 -150 -2103 -2743 847 2188 4430 3020 -869 3002 3177 -1674
310 -1674 -769 -865 186 1266 -2847 -1894 845 -2068 -685 665 -2814 -1787 -1757 -741 2942 1160 1220
327 1220 4152 515 -233 2114 528 611 -164 -1319 1679 -401 -3111 -62 -588 -1356 -458 -3282 -1627
344 -1627 914 -577 1955 1838 -94 2388 1862 218 1420 -92 712 1964 -1560 -145 901 -2499
360 -2499 -1178 -860 -1773 -215 -1723 -2016 1444 -282 -147 2021 -28 1317 2304 523 1935 243
376 243 -1130 2316 1604 -788 -365 -2653 -1375 187 -1567 -598 -435 -2899 70 954 -595 507 310
393 310 1459 3007 175 57 1478 22 1719 1549 -1478 -918 -1977 -2175 1332 -50 -1449 -757 -3026
410 -3026 -2588 406 1296 2930 390 -2930 942 3205 2357 1856 -1412 49 2272 -207 -1298 -1426
426 -1426 -1983 1480 1195 -1847 -1710 -3110 -2276 1970 1990 1146 143 -2386 129 2781 2001 3240 1454
443 1454 -2128 -2020 -1384 1964 4444 -767 -4369 -2703 -698 1771 -542 -3522 -426 1451 915 1667
459 1667 -1024 -1779 1153 3027 5158 1825 -4981 -3612 1792 4713 3773 -2609 -5861 -2032 -546 281
475 281 2091 231 -1865 -3238 -2730 2991 4750 293 -1245 -1235 1448 4189 364 -1728 -38 564
491 564 2424 1655 -3217 -4456 -2879 1382 5921 839 -6170 -5352 -877 5235 5517 -402 -2622 -1467
507 -1467 -777 2547 3464 2376 627 -3884 -3702 2256 2632 -14 -2245 -3247 -10 575 -1795 -514
523 -514 -585 -729 1740 2299 1807 -1133 -4983 349 7922 5757 -2248 -7457 -4534 4061 5634 1351 -1737
540 -1737 -4992 -4065 135 1926 2544 738 -3743 -1882 1269 2460 2501 -401 -769 1720 657 631 403
557 403 -2184 -1066 1646 2490 2016 -3935 -8139 -2236 5238 5857 -194 -7126 -3836 3178 4164 3703 1643
574 1643 -2555 -3393 -1327 2867 5143 606 -2693 -697 10 -190 -1668 -2735 827 1063 -1440 -646
590 -646 -415 -372 520 773 2214 2821 -1645 -3325 -1504 1865 6292 4175 -2323 -4443 -3310 -299 2987
607 2987 1106 -1243 -2955 -3483 4 2918 1467 306 -337 -923 105 -879 225 3012 1330 546
623 546 911 261 -971 -2910 -2517 2435 2879 -1470 -3434 -3291 -228 3796 2990 622 -2452 -4800 -1099
640 -1099 3241 3717 2868 -43 -1979 95 309 545 56 -1497 -568 924 -1190 -1542 -460 1153 2313
657 2313 -169 -1986 -1224 -1678 -478 2756 3230 2652 -41 -2512 -1181 54 716 1880 -380 -3189
673 -3189 -2288 -645 1565 2041 -484 -929 -1329 -2892 -1557 989 2142 3036 841 -280 823 -294
689 -294 -398 748 -289 163 -127 -1446 -804 -412 701 2312 -371 -2926 -2462 -2019 -7 2787 2588
706 2588 1949 -530 -2045 406 1615 724 40 -1028 -881 220 -103 517 1173 -301 -247 -812 -2669 -1734
724 -1734 -355 1285 2833 1256 144 240 -1094 -435 1079 1033 488 -956 -1578 921 1288 801 839 -1041
742 -1041 -2179 -1973 -1863 -260 1060 857 1834 850 -550 137 547 284 498 -454 85 756 -414 179
760 179 1318 539 15 -1650 -2552 -1304 -1111 411 1517 1015 352 -315 -1091 487 941 155 349 -333
778 -333 -402 1222 1178 557 433 -682 -1144 -1188 -2249 -668 641 272 1506 625 -438 -186 -589 -29 1160
797 1160 279 147 565 -7 1115 1310 545 39 -1148 -2041 -1063 -1304 -336 881 466 281 -47 -1233 -136
816 -136 211 -346 738 401 -23 881 766 1320 1036 -66 -361 -978 -1859 -935 38 171 759 442 -408 -231
836 -231 -972 -458 693 249 381 368 -10 1412 1103 778 753 -684 -1241 -545 -1095 -41 1024 113 628
855 628 -14 -1072 -562 -387 -392 521 -13 -5 777 443 1155 1438 409 117 -842 -1419 -126 5 418 1046 -379
876 -379 -691 -139 -1321 -522 -232 -590 376 526 161 1136 375 813 1204 49 -740 -422 -997 480 908
895 908 112 451 -210 -1249 -178 -312 -441 159 -426 -81 521 285 1103 1097 28 335 -80 -197 196 -490
915 -490 -216 964 184 177 -554 -1293 -601 -218 -548 -116 -254 -501 380 744 1224 775 -657 -463 330 345 759
936 759 407 67 457 -305 -295 374 -784 -1351 -650 -395 307 453 -682 107 572 142 649 44 -539 196
956 196 -28 806 1240 -352 -373 -253 -116 455 -752 -1718 -668 35 283 555 -88 -71 30 -528 448 1287
976 1287 115 -390 -445 322 1514 795 -430 -212 -1147 -404 0 -504 -152 -535 -884 643 812 -371 -545
995 -545 -724 555 1451 81 -605 -274 -108 949 979 192 66 -1352 -1212 42 362 163 -290 -1004 -562
1014 -562 661 -75 227 -347 -427 394 271 427 941 -295 56 596 242 300 -950 -1597 240 940 301
1033 301 -353 -1183 -966 43 324 796 442 -897 -558 295 863 1210 363 -133 -208 -459 -100 720 -378
1052 -378 -269 -113 -717 -16 -177 -805 -40 270 441 808 -665 -949 285 866 1571 856 -588 -368 -359 -330
1072 -330 1379 854 -580 -1178 -1103 -148 522 -84 161 -89 -579 -69 422 213 673 42 130 975 -238 -310
1092 -310 -171 -484 802 483 -619 -653 -1085 -743 885 739 -70 -489 -1204 -60 925 754 387 -67 -523
1111 -523 512 395 349 718 9 -387 47 -415 -59 -141 -507 -205 -33 -379 -175 -560 -373 811 620 485
1131 485 261 -574 -110 390 841 990 -167 -1052 -354 -122 355 640 -213 -691 -467 -711 52 196 -83 183
1151 183 -144 -87 315 149 126 475 211 540 336 -492 -521 19 -9 649 -45 -736 -483 -852 73 799 6
1172 6 -313 -319 -345 592 819 446 456 -201 -316 97 205 19 267 -382 -182 -96 -289 -256 -123 -584 25 147 -268
1195 -268 -55 -223 247 1067 179 385 117 -392 76 149 174 155 -579 -586 -75 125 -86 -43 -409 -546 72 99
1217 99 481 48 260 478 412 207 247 39 127 236 -306 -9 -120 -797 -174 87 -130 -18 -514 -598 142 -164
1239 -164 302 671 148 -137 -45 77 480 115 37 433 -295 -195 338 -98 -58 -198 -444 186 -231 -224 -234 -27
1261 -27 -41 174 -25 -13 343 -3 455 585 247 91 4 3 242 -39 -133 104 -524 -528 26 -110 -235 -87 -416
1284 -416 0 -7 123 434 78 -58 232 -109 1 156 54 -40 -6 -134 225 -258 -461 -24 -210 -183 99 -345
1306 -345 306 256 -50 412 217 103 377 -32 -78 349 82 54 351 -254 -224 -2 -599 -330 39 -318 239
1327 239 -141 -183 311 39 319 215 -135 96 295 -48 318 235 -147 4 -121 -152 -10 -465 -192 10 -640
1348 -640 -185 -136 -121 475 33 -11 255 -153 53 314 366 277 354 -139 231 2 -289 84 33 -308 -87 -727
1370 -727 -228 134 -33 -193 104 7 156 114 -41 436 281 51 336 -2 -42 148 -413 92 -144 -285 37
1391 37 29 -148 331 -119 -17 65 -487 -70 394 265 558 521 134 214 -177 -84 172 -127 -308 -72 -57 -161 -227
1414 -227 -277 178 -24 -458 36 -114 -80 508 266 147 425 39 -67 48 -54 61 -124 -472 -85 -297 -141
1435 -141 167 -102 -102 -168 -313 -24 208 159 106 174 271 267 155 21 140 -142 -300 -34 -30 59 -202 -409 113 -29
1459 -29 -423 -256 -30 25 243 239 326 304 -160 297 508 367 59 -248 -111 231 -153 -223 105 -298 -195 11
1481 11 -448 164 16 -373 374 127 125 122 -9 141 403 -145 253 -182 -233 -89 149 -240 -168 -272 -746 -98
1503 -98 -470 137 73 -617 20 166 -115 354 -39 -193 149 -16 116 168 -41 -70 89 -50 166 47 -710
1524 -710 -256 -13 -135 205 -118 -73 368 32 190 36 47 -27 18 -52 749 334 -143 -117 117 14 56 -310
1546 -310 -128 97 -204 -167 -149 -156 -53 258 37 420 -57 111 348 98 48 213 -13 8 -363 -301 -104 -29 -147
1569 -147 -11 -401 -117 280 59 -42 -43 -260 49 95 381 371 122 -189 226 93 81 5 -476 -275 -137 -343
1591 -343 233 -153 -190 346 16 -52 103 -345 99 580 413 137 106 -54 -345 42 144 87 -168 -300 23
1612 23 -339 128 76 -202 -51 -405 -274 10 9 -62 61 -17 382 212 38 -42 266 247 50 -227 -217 -67 -43
1635 -43 186 343 -155 -172 -670 -254 127 378 110 183 -233 76 465 132 221 89 -154 77 345 137 95 118
1657 118 -298 25 -177 -196 -25 2 -70 225 -12 81 -26 -131 357 305 69 -134 -145 -119 111 202 34 -105 -354
1680 -354 -151 -167 -390 -107 8 -134 160 -39 56 92 75 -12 135 193 72 302 -70 -55 -208 -269 -99 -312 -334
1703 -334 -149 -24 -49 -151 -140 13 99 132 91 206 -170 238 -27 -80 353 -212 87 327 -411 -213 -62 -275
1725 -275 -94 -87 -424 55 -161 -316 210 -113 396 229 -68 34 170 -36 224 62 -169 -273 -131 -131 -68 -26
1747 -26 93 -206 -178 -348 55 -109 143 -76 -25 242 18 12 134 135 273 250 -185 93 -48 52 102 -279 -116
1770 -116 -202 -332 50 67 -175 -110 -65 -199 -287 233 98 242 -132 -95 16 -83 -38 51 -155 70 202 98 -310
1793 -310 -175 -90 -69 -195 90 46 -6 -178 320 150 -21 49 6 73 191 -36 -8 -87 -56 -36 65 -116 -295 -91
1817 -91 91 -11 -68 -67 147 9 -28 136 137 154 -91 79 162 18 30 36 -221 137 73 -134 287 -119 -62 12 -39
1842 -39 -78 -262 -141 206 120 -214 200 -109 133 286 99 100 89 -48 14 -191 -81 -159 -141 -166 146 42 -47 92
1866 92 72 205 247 65 -402 83 -63 224 -199 -9 -8 -135 216 -92 -277 -10 -226 -226 57 -26 -329 69 -39
1889 -39 -39 140 227 -320 -157 87 156 32 -64 202 -8 169 70 -321 -38 121 -239 -270 -263 -53 137 123 -144 167
1913 167 -70 -65 171 -100 -71 -56 -314 -208 -3 59 -71 91 -368 -24 -51 -106 -40 -255 -248 167 76 -59 285 -77
1937 -77 -173 187 36 146 -124 71 166 -289 -84 -6 -267 -228 -197 -395 -60 -55 -5 -15 310 -143 68 -129 -45 -23
1961 -23 74 453 217 122 137 -176 23 12 83 72 -292 -108 199 67 -12 -91 -127 184 -29 -40 157 -164 -266 23
1985 23 72 -168 -19 -28 -296 -44 94 184 147 -44 38 10 -84 -103 -59 44 -39 3 159 301 173 -122 245 389
2009 389 227 272 171 -29 22 -79 7 -162 -37 171 44 -207 17 -51 -127 93 310 -74 238 -363 -177 96
2031 96 120 209 -141 -70 123 -154 143 -114 -132 -127 -43 1 17 115 -41 -33 101 -65 -164 59 -23 147 -77 -168 275
2056 275 -54 87 380 71 310 -69 -148 -231 162 270 -29 154 33 -141 -141 17 32 243 15 31 -104 -81
2078 -81 36 -202 -18 10 -38 -140 39 23 -56 -52 254 223 -202 11 -313 214 -13 79 -34 -114 -78 -10 -167 189
2102 189 23 -248 4 -306 -135 -146 271 -59 -321 4 -179 -93 -12 28 -57 -42 120 -51 -86 -171 324 -18 -117
2125 -117 -27 -25 137 -15 92 -117 -152 -267 197 84 110 -64 -140 -74 25 -122 50 38 273 -125 -243 110 319
2148 319 -127 153 40 -72 -168 -59 -242 -125 120 20 -177 101 66 55 225 235 -27 87 157 -202 150 92
2170 92 -190 -88 -87 -313 -48 80 -88 30 -222 -31 -61 69 -47 247 -39 -171 -168 169 151 234 61 -103 142
2193 142 96 105 -241 -33 253 -260 -46 -167 37 231 320 -130 -210 54 115 232 339 130 97 410 266 -130
2215 -130 173 252 172 -93 170 -396 137 -10 -102 -186 14 -94 -73 168 275 100 35 79 51 32 182 34 -187
2238 -187 -99 18 -94 -51 -91 34 105 189 223 -233 136 112 56 71 72 235 320 13 -21 -125 -21 -237 -98 6
2262 6 -198 -291 -31 -81 -48 -144 72 164 71 62 208 206 81 85 -142 7 1 -26 -113 -103 7 216 232 -30 25 141 30
2289 30 285 -30 -176 -116 -36 -22 8 -156 177 197 -19 14 316 147 -168 15 34 -1 -143 -98 96 144 -57 -9
2313 -9 193 31 159 -231 397 34 134 -37 -117 80 132 -72 -6 -25 73 -23 -87 -74 -173 -88 -260 106 -161 -111
2337 -111 154 -233 136 -160 173 320 59 -47 -141 428 222 203 -128 54 -20 -121 38 -15 284 -10 74 -299
2359 -299 -7 -35 165 -78 143 423 109 251 194 -214 83 -98 -277 223 59 -354 235 -21 -12 234 25
2380 25 -26 70 -124 -219 49 180 69 68 226 132 110 16 -73 -116 28 -165 159 -234 -5 48 30 3 241 -32 17
2405 17 -104 -204 132 -43 7 -31 227 410 -106 124 -82 105 108 -13 32 -191 142 -231 -105 -15 27 48 -24
2428 -24 208 327 -26 1 68 -18 253 35 -10 -167 234 14 -117 202 49 153 -174 -159 147 8 169 -56
2450 -56 -107 -166 -75 -40 138 -96 46 271 -21 138 -58 165 -82 -10 113 -167 15 -102 3 60 -127 -332
2472 -332 36 -20 49 -228 -67 107 88 116 -70 29 224 40 -31 -7 51 82 -129 -57 241 235 -23 176 80 -99
2496 -99 -29 -165 191 48 192 88 -165 3 -44 -33 234 20 -131 -57 -94 -152 67 -363 -214 -117 260 -100 120
2519 120 -14 -3 82 -23 246 271 221 65 276 58 360 -47 264 -92 -141 30 -215 -187 250 -96 79 48
2541 48 -63 45 -99 140 189 -16 -119 24 182 -169 -85 155 -36 261 -44 -178 -95 209 67 -67 94
2562 94 -49 -19 80 54 -181 82 -2 -211 70 8 -242 135 -135 170 -82 -268 121 -89 -270 135 -155 194
2584 194 -151 -126 58 -233 -50 -65 20 59 277 105 84 -29 36 -61 242 -70 35 133 -188 165 -396 -127 -58
2607 -58 261 122 80 86 1 92 117 -54 59 -147 190 212 -125 132 -284 111 -106 -224 -147 189 53 -115 -50
2630 -50 307 162 -165 -68 63 13 -37 -33 173 118 80 -185 69 -110 57 186 101 92 48 -75 -168 84 -77 27
2654 27 -44 -43 61 228 150 202 127 206 -45 61 -29 76 -7 -223 -5 99 -37 -130 -201 50 85 227 -148 -93 71
2679 71 -239 -117 -221 285 -154 161 -287 289 4 114 44 -24 -177 -67 -96 156 199 -117 -60 -31 231 -65
2701 -65 -368 42 -33 -78 -214 -178 -156 4 102 -51 77 -147 6 -156 -76 -15 224 -125 218 109 40 9 -58 139
2725 139 183 73 -41 -78 -44 388 -105 -71 -73 8 -96 33 11 -101 190 -2 -315 -107 40 -75 -160 -54 251
2748 251 -14 79 141 78 285 -135 83 -135 124 218 -223 -37 118 -54 172 -64 -101 -193 113 43 132 212 -137
2771 -137 38 193 56 -63 -47 8 -11 282 -6 -191 59 -166 -25 -21 -23 -20 256 -79 184 -63 15 -150 18
2794 18 140 -49 -14 -69 -73 40 -63 30 180 -49 6 92 117 176 -360 -7 141 -27 -82 213 -44 15 283 300
2818 300 91 -6 76 -190 159 -181 -133 -14 -52 -39 -22 51 188 -265 89 86 -14 249 -5 80 -51 156 47
2841 47 -21 122 217 -147 -251 -23 82 -183 -20 -171 187 85 142 -81 225 -54 107 -25 -182 51 57 -5
2863 -5 118 151 127 54 -10 -162 32 28 61 20 -237 150 102 49 2 -9 227 99 102 -62 133 194 27 48 23 -45 226
2890 226 -334 141 -161 -79 -26 -206 -276 -8 185 -178 136 -95 -286 -26 -307 -64 -41 -49 114 94 22 38 101
2913 101 -115 55 103 53 -70 -376 -20 -250 -87 12 130 127 20 -144 -56 50 -81 -59 86 108 30 -233 -195
2936 -195 -196 -79 414 73 -19 141 -15 -201 2 365 -178 -232 -111 -101 151 46 -50 59 -191 254 -249 155
2958 155 -156 -91 -268 104 -110 -28 -100 -12 129 -64 -312 11 146 23 339 195 73 -108 2 -181 -223 34
2980 34 347 -205 -208 277 -109 -8 76 148 -82 -21 435 165 60 180 228 94 174 11 -92 -291 -111 -127 -287
3003 -287 -46 56 27 -329 -88 -107 61 28 -97 64 158 316 36 -13 356 -16 368 167 -123 278 216 91
3025 91 130 -186 72 61 -47 191 -102 -210 34 348 -98 -18 -195 37 168 -132 163 39 4 -255 52 13
3047 13 -72 134 34 272 -135 -35 258 -165 -32 -43 -93 164 -280 129 -9 -8 191 122 56 185 0 -136 -236
3070 -236 -47 137 213 160 -174 -229 58 230 -74 -149 17 271 84 38 84 58 -71 152 -80 168 84 87 -82
3093 -82 -244 -138 179 -180 -91 149 -97 344 246 215 -296 193 171 -118 -23 -48 116 -123 120 -18 33 76 -63
3116 -63 -67 86 15 163 -261 -301 -203 118 87 38 313 125 -119 31 16 43 65 240 -94 -93 80 -152 -617 -21
3140 -21 26 -7 186 109 -180 83 94 60 22 99 -143 74 302 -63 204 215 362 -29 -39 192 109 7 -54 281
3164 281 -30 -171 105 26 214 45 49 32 -142 125 -103 2 74 28 217 4 297 -28 -58 -43 118 -251 -40
3187 -40 -23 -202 85 -138 16 52 73 29 132 -58 195 -129 -24 -99 35 -48 77 233 74 11 -111 -121 84
3210 84 -184 158 223 8 25 -16 -232 268 -58 288 37 48 242 -176 -69 163 265 23 151 -122 -55 107
3232 107 -159 199 286 26 87 -60 -65 -74 -290 -400 -175 1 -28 13 9 -159 52 -97 -47 -70 -122 238 -193 -384
3256 -384 68 16 -353 -29 -56 -118 -33 164 -161 -212 -14 -279 384 -21 -31 -99 -204 47 121 4 -192 171 228
3279 228 -47 -183 -35 -42 -52 -21 342 -42 254 -31 -264 -82 80 -301 -117 -164 145 73 -46 16 119 9
3301 9 43 -232 -191 -202 -48 156 53 59 -18 -126 -1 76 -68 -32 -155 12 205 -165 11 -99 252 116 -239
3324 -239 -17 -19 -20 -326 -148 92 -221 256 -217 -26 -46 -8 -74 113 65 -294 -13 -103 81 26 -113 -119 170 -110
3348 -110 -51 125 59 450 -16 3 136 27 51 98 -252 -337 150 226 -76 126 -70 -38 106 -23 7 -183 0
3371 0 -15 -180 -34 -10 -84 -68 -133 -78 -70 -125 -91 -83 22 -74 30 -107 96 58 56 127 264 -157 258 268 193 155 281
3398 281 -97 213 -168 -10 189 -184 174 95 -94 100 -159 -139 -184 -259 103 114 -63 64 -104 153 194 265
3420 265 56 92 -105 62 39 301 -113 51 -104 -1 57 74 -35 9 119 -56 -4 -169 -59 -179 43 32
3442 32 -32 -107 78 -10 -65 -2 102 200 -59 -336 -137 189 355 120 -20 111 -279 -36 519 183 207 -193 -77
3465 -77 -260 -62 -220 -76 -5 160 130 65 -5 218 131 -114 -231 56 143 125 -48 -111 205 24 201 -26 137
3488 137 -66 -68 -64 138 225 -404 -9 52 35 29 -400 83 102 -47 -17 -102 -149 10 19 -114 86 -102 -18 188 -286
3513 -286 156 33 22 5 83 9 128 -16 62 -51 64 151 -58 -74 57 116 -92 -21 -71 335 -33 106 -123
3536 -123 221 166 122 97 -178 16 -155 -357 36 -188 180 -7 -72 6 -255 72 -78 -43 129 48 -12 202 85
3559 85 -69 42 304 78 -96 -35 -120 34 28 5 100 -70 7 -57 101 46 85 -112 -248 373 -25 -179 234 68
3583 68 14 305 42 -95 17 7 -30 113 397 123 136 188 47 -34 -14 -94 -10 350 225 209 35 -124 270 -38
3607 -38 137 161 -109 286 306 -220 257 256 -2 69 -210 -51 438 86 94 84 32 -28 -66 -43 80 233 -151 -185 -132
3632 -132 -190 29 222 -90 -157 -182 141 -73 -34 17 64 -197 -155 -77 -31 -63 151 13 -20 133 -242 -92 -158 138
3656 138 110 -30 77 -122 -137 -257 186 -83 -29 -74 138 -9 -164 -44 213 -148 -100 42 175 -67 -83 193
3678 193 -337 -261 -95 15 89 83 23 -91 7 84 61 29 -13 40 -40 166 -302 -36 -287 113 208 78 -111 -70 -109
3703 -109 67 -25 -33 -80 168 99 101 15 124 35 28 -110 226 6 142 246 108 25 -159 -94 -94 -39 -275 -35 -167
3728 -167 -256 87 112 172 -52 156 167 142 -64 167 -121 85 26 -188 86 -159 -206 -200 329 -85 232 -203 -407
3751 -407 69 -34 15 65 -180 143 29 -127 219 38 193 -84 135 211 -58 -29 19 -218 179 119 -35 166
3773 166 316 166 4 -137 -363 18 113 43 78 -33 -88 -288 -122 -92 160 45 -143 -147 199 -16 -54 -269 164
3796 164 8 -289 -130 106 -39 -110 148 45 135 79 169 -68 33 -91 87 -143 59 142 -65 28 228 -118
3818 -118 -198 145 340 138 -241 200 -158 -91 39 4 97 21 -43 24 -22 -45 88 56 -84 -196 -125 -75 -6 -24 -68
3843 -68 -1 56 261 215 29 117 217 50 -36 -47 41 285 254 68 -50 -127 -104 -105 61 104 178 -261 33 -366 -56
3868 -56 119 85 47 -120 28 -122 -318 28 367 -2 -128 -481 -64 -156 -189 137 198 -100 80 15 189 8
3890 8 151 -159 246 -16 149 38 -143 82 205 -201 -322 -196 14 -31 -261 -21 23 321 -359 -153 98
3911 98 -347 41 -125 -35 290 35 25 170 0 -160 -3 -96 250 -197 -95 -4 189 208 -415 224 -8 -36
3933 -36 37 2 62 -36 -18 -41 -9 76 204 38 46 84 -166 -154 -152 -170 -104 -75 -31 -224 283 224 -6 -101 -95 -43 104 57
3961 57 80 25 14 -248 330 105 114 -86 77 -122 33 -113 28 -40 -87 70 -86 49 21 105 185 41 37 -116
3985 -116 136 60 36 264 3 -31 -66 -196 -124 -164 -28 8 -87 91 -5 47 -237 158 28 -95 37 68 -37 316
4009 316 67 -86 -24 -53 289 -242 -1 -87 -37 83 -52 -56 126 64 -31 155 -119 -94 -69 30 -53 -77 -215 5
4033 5 -31 -122 -102 -5 -105 -218 -136 -47 -128 -12 69 59 38 -6 163 -88 -50 91 -36 -157 -130 -1 -81 77 -86
4058 -86 39 90 155 11 -180 8 158 -162 -122 87 245 -17 -2 30 32 16 51 136 82 -108 -75 361 -1 -65 -161
4083 -161 -33 -5 43 -17 40 192 57 -25 26 -50 -13 -259 86 88 162 152 -138 -217 87 -21 195 1 162 21
4107 21 -233 -96 -299 -153 -72 -202 78 163 47 29 -94 8 -3 -173 23 -295 225 -138 97 -209 237 -92
4129 -92 60 -66 -218 -111 142 -148 -51 69 47 87 133 33 -62 -97 -161 -42 -3 -32 64 -279 40 91 -131 11
4153 11 34 -112 14 -129 198 -99 303 66 379 -171 79 152 -8 30 44 -14 48 40 -288 -25 12 -66 -74 206
4177 206 56 -83 -172 -45 -57 215 100 -56 -50 164 129 125 68 189 -121 130 -4 61 -124 -240 -10 86 67 128
4201 128 -81 111 121 264 107 191 -112 -70 156 17 116 -36 35 21 -118 -22 63 62 132 53 -63 203 -89 -275
4225 -275 215 138 -67 -108 157 -36 63 198 16 -49 -201 -116 -145 22 -68 -267 -33 76 -140 -149 259 -113 321
4248 321 -88 124 51 -32 133 -128 -68 112 76 -61 -224 -115 171 -61 169 201 239 150 255 -77 13 157 36
4271 36 124 68 -115 127 134 -176 124 -100 159 -48 -176 30 12 101 -178 19 -93 -231 83 1 -63 -66 -25 150
4295 150 168 101 -207 302 -162 142 95 38 -25 -126 -26 -109 -37 25 102 -298 154 -31 -187 -132 -73 84 -57 68
4319 68 -34 192 4 125 230 352 -103 -132 -230 30 18 -24 -38 101 154 -17 -178 213 54 141 71 244 -259
4342 -259 235 37 -203 52 -287 -285 19 -69 -5 90 15 44 430 171 -6 299 94 192 -23 -221 2 -266 14
4365 14 179 229 -104 16 -221 -137 -372 -260 64 65 -164 139 -253 -102 105 -80 -2 -12 275 -20 -160 146
4387 146 131 -7 -31 -201 217 -55 0 -229 47 12 -3 84 -132 -92 -85 -125 -112 257 -113 322 92 130 77 26 67
4412 67 167 -211 -8 228 -113 63 92 -66 -152 37 61 -46 -98 280 25 139 89 -16 251 -58 92 49
4434 49 16 -254 -54 -62 -31 -153 -107 -283 145 -91 -27 50 87 90 125 157 -86 -133 -194 -122 143 -23 -16 50 -119 47
4460 47 -36 134 -9 -34 -328 -118 -120 -195 71 -15 -105 -47 116 -21 -205 -25 -118 -121 -180 144 -284 -200 -107 -61 209
4485 209 -32 -497 38 163 -368 242 -5 -49 152 -89 -78 108 27 112 -54 -14 302 77 160 259 -236 -166 55
4508 55 -66 -56 27 -32 201 -131 -266 105 69 4 -138 -31 -13 80 -6 -59 -60 131 35 -160 -166 77 -36 -60 111
4533 111 181 36 129 23 -120 -137 -34 -155 73 44 -130 -265 -85 7 120 92 -250 50 -151 4 93 -64
4555 -64 -64 -109 202 4 9 54 -41 38 317 255 217 74 -32 -108 164 -351 -44 -90 -150 -56 -144 -145 -90 84 93 257 -135
4582 -135 -31 -56 -46 43 -198 -87 185 186 -20 -207 71 -54 179 228 44 122 -352 -32 241 -165 46 302
4604 302 282 19 -7 43 268 391 25 51 126 -39 -21 -45 158 53 -103 -174 67 -43 -21 71 -325 78 -31
4627 -31 38 -8 -95 107 -41 216 50 -97 79 46 -70 225 59 168 -131 -180 -191 88 -14 -140 -21 -10 184
4650 184 304 -192 210 -122 -103 208 -37 63 -146 39 10 35 -9 -30 145 128 29 -41 -278 -20 89 -191 -25
4673 -25 -326 116 95 55 -103 155 30 23 254 33 -49 -309 -47 47 -223 187 -137 -113 -248 42 141 131 -81
4696 -81 -16 189 -214 167 -269 214 -68 -174 -91 -133 -39 -218 -48 18 -120 -78 -248 44 -76 -90 -20 -81 217
4719 217 99 139 110 -101 90 -73 381 -425 156 110 -44 -27 -110 -114 -21 -55 273 143 59 11 95 64 -58 45
4743 45 28 27 58 32 84 26 -424 181 -136 -149 67 -302 -136 -47 -50 1 97 -6 357 -269 -80 -50 -160 -87 293
4768 293 -215 32 127 -164 -191 -265 57 -126 -134 55 -174 126 -80 226 -65 63 -168 -7 117 158 264 -250
4790 -250 -167 -43 -135 -36 56 -114 97 261 -228 162 -232 -146 51 47 172 16 130 58 -28 97 23 68 202 -105
4814 -105 -22 -240 -257 -230 4 149 -121 -277 22 -224 24 8 -128 -69 7 91 -34 44 -124 -22 43 94 64 -265
4838 -265 -109 -267 -106 195 -75 -129 -11 -220 33 99 -3 -123 205 -83 -206 25 220 18 17 149 -250
4859 -250 112 -30 -114 177 3 -52 87 221 6 -219 -13 -114 193 -93 123 53 -83 222 -21 89 -29
4880 -29 88 98 -405 195 291 55 -70 65 63 -290 -51 67 214 59 112 -174 -386 -54 168 123 -23 28 78
4903 78 3 142 81 56 83 -305 71 -107 -153 37 -232 -140 -22 117 5 -264 58 194 -236 -137 -372 -96 153
4926 153 41 82 -115 -79 -165 -33 -82 -210 -215 11 33 -48 163 -13 51 -60 -320 281 -14 -6 4 -183 -8 -49
4950 -49 -64 -49 223 8 -96 -34 -6 106 367 -124 -130 349 76 43 -356 142 167 -139 11 -61 -3 -141 66 434
4974 434 -36 -233 13 35 -37 37 -26 132 122 -93 30 -65 333 119 164 89 240 41 188 -198 58 12 -129
4997 -129 219 19 -137 192 -15 27 -20 55 106 -39 48 229 -181 -42 291 -46 -71 193 5 165 52 56 -57
5020 -57 -33 136 -137 112 38 154 353 -23 204 159 163 256 75 -133 -23 271 269 -113 14 -26 -24 -41 -58 -229 -209
5045 -209 -146 229 -48 -49 95 -379 186 -85 89 -32 -125 134 90 112 -222 21 -146 293 -46 201 -40 -66
5067 -66 -41 -235 -60 115 26 71 -88 -202 -14 150 93 110 -94 -9 87 -152 -59 139 38 122 -81 -47 -90 -45
5091 -45 235 53 40 145 28 241 2 108 46 12 165 157 -103 -72 191 147 83 -74 11 222 33 -149 -37
5114 -37 163 104 227 93 169 -6 -189 -70 -131 -154 -157 418 52 19 282 -127 -71 14 80 -64 -29 -59 27 -57 131
5139 131 -27 -14 -30 -132 -39 -26 -49 58 199 -96 38 18 147 -166 -146 96 346 -59 324 -115 -47 39 -241
5162 -241 -148 146 26 -16 135 281 -55 -34 -62 164 -73 160 83 176 -73 1 73 -65 12 61 -169 38 86 229
5186 229 266 -34 -4 -52 84 -77 25 21 -166 -338 53 -97 -177 -91 -168 -131 56 -236 123 307 15 -124 -75
5209 -75 -220 27 203 -153 -198 -174 37 156 -65 113 234 -23 -90 8 -161 32 -153 -183 -22 -24 -128 100 -233
5232 -233 364 -260 39 262 -53 162 -39 48 171 94 -61 -1 74 -12 -148 -124 20 137 56 86 87 -61 2 -116
5256 -116 -61 133 34 90 -232 114 -52 -91 -132 88 114 70 -271 316 36 17 38 -63 49 118 -56 -4 170 206
5280 206 60 -49 -126 -79 -206 205 90 -46 5 203 -98 16 20 102 -60 19 -82 211 174 129 -58 116 50
5303 50 36 226 -283 -24 180 87 35 184 -25 244 43 87 -193 22 -139 -160 1 -5 153 230 -181 -113 -70 -67
5327 -67 95 -233 126 -234 -12 -6 240 285 -240 -177 34 132 39 187 -93 -68 60 51 -158 93 141 -102 81 -46
5351 -46 106 205 46 100 108 -23 -208 -102 60 99 -253 108 -15 107 -115 25 5 94 38 -88 78 -30 -87
5374 -87 102 43 -8 -82 -129 28 181 227 -11 112 120 151 118 4 -23 -133 210 -44 8 37 106 -207 -207 55 -189
5399 -189 -225 78 62 -32 58 42 69 -110 -164 22 -109 -20 -1 -126 200 -81 30 -77 -128 44 -160 -88 78 158
5423 158 -196 -75 184 -164 -50 -106 -181 71 -301 -181 -19 -82 -444 67 -120 105 -73 -118 140 6 71 -40
5445 -40 207 163 88 -32 -138 -22 -18 113 256 -196 78 -241 -144 174 24 101 -98 126 100 91 43 54 48 -152 -460
5470 -460 -30 81 -28 -78 101 -67 174 261 -43 29 206 -102 -101 91 71 -49 -18 156 -73 36 20 117 139
5493 139 -99 96 112 -54 156 -209 10 50 231 58 -73 -116 140 22 30 195 -57 155 3 -124 -28 -57
5515 -57 12 -71 11 -90 -78 23 106 -170 -85 5 -141 28 -75 66 148 36 -35 -199 73 -311 62 -255 -204 -122
5539 -122 168 -17 21 23 -76 171 -102 149 -8 236 120 -128 116 -60 121 3 31 104 7 -138 59 116 -95
5562 -95 -293 -67 132 51 -34 119 -132 -126 114 10 -6 136 50 -199 -61 86 -82 -61 86 25 168 19 -65
5585 -65 0 -363 -147 -152 -159 -57 -269 195 -29 143 -37 83 305 313 43 -147 2 84 152 -13 -30 -72 -80 193 -230
5610 -230 126 -275 185 -13 109 11 32 -34 299 156 48 370 -219 21 -110 14 -80 -81 78 -138 -49 -60 -102
5633 -102 -69 34 -11 -53 -136 20 286 246 -225 70 -241 -107 -36 36 221 103 108 -29 41 71 71 60 286 -195 -118
5658 -118 19 61 57 22 -72 -90 66 3 -69 141 -15 -77 -186 36 -101 -25 -13 -63 99 277 90 -32 318 83
5682 83 -125 -65 71 -40 74 41 -52 66 -41 -262 -7 103 -19 20 -77 -29 -115 305 -47 -47 -68 -49 -78 39
5706 39 -105 113 20 -96 239 67 22 180 88 151 15 -162 74 261 -104 -22 -194 119 161 35 -74 -16 -156
5729 -156 103 40 -40 82 -113 168 -37 15 258 -7 93 -64 329 56 53 -202 -236 12 66 -220 135 -54
5751 -54 5 5 -210 85 -95 -120 -7 28 66 -95 -196 367 40 115 38 -26 212 77 8 146 196 94 -231 216
5775 216 46 -65 -19 149 -165 -51 140 41 82 -67 -63 -24 1 -92 -21 176 -93 35 -136 -102 -190 71 -164 -158
5799 -158 219 -76 18 92 243 -241 -78 -200 -3 119 2 -22 -18 -198 239 172 -233 -219 171 12 46 -21 94
5822 94 93 -65 -15 -2 -19 59 67 209 -124 -102 -18 -51 -19 84 -51 54 64 -8 317 357 22 -128 -51 86 170 25
5848 25 -187 -57 -98 -62 49 18 58 178 90 -176 219 -98 -282 -135 194 149 155 -199 130 160 -34 76 237
5871 237 354 2 191 -3 58 -157 50 -20 44 122 -108 332 -64 -237 -4 183 -21 138 211 80 -148 -132
5893 -132 89 16 60 6 25 -206 42 -186 -165 -58 162 145 -10 50 -60 236 -66 -46 17 35 248 -69 -317
5916 -317 45 -43 106 140 15 62 119 14 114 -100 150 75 136 52 98 -22 191 111 140 64 -173 120 28 -300
5940 -300 -84 190 -137 178 76 36 163 -182 -156 290 137 -130 12 221 138 -130 68 -75 -36 -110 57 -158
5962 -158 32 56 30 -148 10 231 -48 189 73 150 -213 161 150 67 -200 -182 155 56 9 160 -103 62 -25
5985 -25 -69 120 103 364 -234 -264 19 103 -91 57 15 -75 -87 -322 81 18 -58 -30 -59 -12 -207 -88 10 -46 73
6010 73 141 294 106 20 116 -107 22 92 96 -4 77 173 13 37 178 223 253 -95 -269 -28 52 -60 14 -200 30
6035 30 -231 103 103 -129 -101 -293 -37 -103 -72 199 49 -18 -45 206 -208 188 85 -288 -211 -63 -167 78 196
6058 196 127 -27 34 286 180 52 58 248 33 -173 58 -230 26 -24 217 -107 47 46 120 -158 -191 7 -8
6081 -8 65 6 -39 98 179 -125 230 -55 -157 101 64 -57 -78 -256 63 -53 -236 -278 -67 -19 -154 -405 -108
6104 -108 83 278 439 -59 119 125 -98 115 126 57 -75 -145 -141 -55 -52 44 -28 -246 127 -134 -245 147 162 105 138
6129 138 -41 -219 266 79 26 -103 -85 -102 -162 96 245 40 -155 166 -50 192 147 78 92 68 153 -217 -9
6152 -9 40 -22 -53 27 304 -53 239 -68 34 172 -62 -188 -40 -232 86 20 -36 34 -200 -79 81 -55 -9
6175 -9 -34 -85 -160 104 -113 95 19 0 -31 34 111 -14 -84 -155 25 340 -225 -117 56 194 -70 -73 -93 -181 85
6200 85 73 286 -283 -105 -69 -181 25 -36 109 277 67 -63 124 -82 -20 -106 42 380 31 -170 -301 35
6222 35 70 234 72 53 58 249 108 355 275 -145 -71 -18 -95 129 183 65 65 60 -67 -192 -263 112 146 67 -135 39
6248 39 71 -439 4 38 27 166 -154 -52 -97 129 28 85 27 -152 129 -181 -64 -86 -239 -237 -395 -210 337
6271 337 -14 0 315 126 162 -186 142 -32 -90 18 27 120 12 -281 -18 27 129 -129 26 -268 31 165
6293 165 -35 -18 104 -36 -98 -170 21 -109 -43 178 -24 -91 -31 74 107 -32 116 -198 -315 107 186 85 -11
6316 -11 -48 43 87 -178 -55 -68 224 -82 157 -224 -170 -32 -86 191 160 -16 371 13 33 121 -139 -7 -65 -138
6340 -138 43 43 17 -167 141 -2 34 70 -29 -100 155 -101 -95 -404 12 134 -80 176 -42 96 -16 47 124 -147
6364 -147 -48 59 -128 17 27 -9 13 78 -23 32 -201 -194 114 -172 80 210 -195 27 -82 -149 -55 -20 -129 294
6388 294 -88 -52 -129 72 117 163 -70 125 -146 -34 136 -74 -291 -146 -117 96 -178 -210 -69 -225 162 -224
6410 -224 154 -86 154 98 41 -66 -140 -113 -148 50 282 245 1 91 78 56 -88 58 -62 -137 127 51 -63 -216
6434 -216 -238 69 35 -71 -192 126 -39 -57 5 112 12 -78 24 -308 18 74 271 119 385 171 251 92
6456 92 67 -43 -14 187 -40 45 -129 125 -49 171 69 105 186 64 -19 185 -65 370 210 75 12 -63 -129
6479 -129 -74 247 -114 -128 -149 -91 194 -29 -51 359 -11 -28 -140 -8 -144 185 -8 151 -68 155 3 128
6501 128 -57 4 -75 159 140 -165 50 185 169 -37 -82 -50 197 -41 -41 152 -339 44 65 -103 133 155 -328
6524 -328 -118 81 -97 -139 -253 -92 24 -77 -39 339 -106 7 273 -208 -33 -83 -2 -93 64 -85 20 152
6546 152 -124 304 -161 311 68 -141 -206 79 -108 -297 166 -253 145 11 -46 -245 -190 -61 233 209 -216
6567 -216 114 -273 153 123 450 -122 332 103 -237 -39 -102 -160 -84 -19 -56 -110 -152 75 0 -59 38 42 -95 50
6591 50 -244 8 -329 -144 -110 -158 51 226 99 -35 -87 27 34 -68 104 30 -2 -230 -121 -283 -141 -100 -296
6614 -296 60 -262 -99 -139 233 44 -66 117 54 273 139 54 -280 -106 -13 -77 173 266 -150 245 24 40
6636 40 -203 183 66 69 -202 -69 -107 65 46 -149 130 52 -126 240 -37 53 102 26 -118 71 -34 176 -17
6659 -17 45 -105 -368 14 43 121 3 -155 -129 13 -65 7 -53 -87 121 -36 55 -35 38 -295 -57 148 -91 -41
6683 -41 -139 212 91 -90 33 -8 -48 271 120 -144 -137 -129 -137 -90 5 -165 -278 -69 -98 -188 -325 -37 59 -187 -172
6708 -172 352 -19 -104 -18 -61 -152 66 179 69 -245 -184 102 37 30 358 -34 196 -86 153 126 -190 72 61
6731 61 -74 -65 -41 212 -90 265 57 32 29 134 194 -177 444 103 -181 77 114 -127 171 -168 -8 -135 -240
6754 -240 -96 81 137 -106 -176 -94 -54 78 -77 -89 -107 120 -144 64 112 54 275 -112 -142 -34 -129 -186 248 -117
6778 -117 -90 27 -89 179 -72 -318 401 117 235 127 -185 -280 -241 78 75 131 -6 76 -16 -141 106 -310 -96
6801 -96 71 -6 -37 106 -251 87 160 42 -203 80 38 155 -329 146 266 -100 18 122 -190 -118 -29 156
6823 156 -35 0 189 216 -144 232 -84 18 31 -106 48 -151 140 -313 -36 -157 -93 10 -89 -240 -34 97
6845 97 52 -18 156 207 60 27 -235 -39 19 47 86 128 -55 -40 40 -11 -117 -151 -35 267 -99 133 11 29 30
6870 30 -2 149 -102 -35 -278 204 -58 3 -24 -113 -78 136 -42 -250 59 -5 -124 18 -109 -313 16 124 2
6893 2 -58 -184 -265 -282 103 -369 65 -33 -13 126 105 82 77 -49 24 -198 192 -52 12 53 -111 -246 -145 19 13
6918 13 109 47 58 334 45 -38 18 58 162 -40 346 -72 17 73 297 -117 90 -31 -411 125 -185 -167 -15
6941 -15 138 19 62 121 54 -238 -241 97 30 -29 14 -137 -227 -21 -100 174 -77 -47 6 -82 -119 -66 -34 -283 -105 -182
6967 -182 99 -180 -346 15 -140 -12 33 157 49 -15 347 72 205 121 -41 -204 172 144 -74 -240 195
6988 195 53 -40 -37 -241 51 188 -109 -54 209 -184 53 -9 108 165 128 -105 194 95 75 3 47 167 179 52
7012 52 9 40 -250 66 38 146 70 15 -122 -186 -233 -422 62 -136 52 -176 -196 -212 164 234 -18 -54 -44 136
7036 136 168 12 131 -393 -52 25 -70 -253 -158 63 86 -305 87 -85 -305 65 20 57 -126 208 -265 -21
7058 -21 -154 15 -84 -140 -30 -154 -122 117 116 -157 -68 240 -172 49 -142 97 -260 145 -86 191 -149 96
7080 96 134 39 64 178 -27 -51 -11 -107 -89 -88 61 150 -89 14 -27 316 -48 82 -127 -125 -37 -173 -4 223 151
7105 151 -369 -94 -117 43 -60 -118 -292 -218 141 1 80 -267 -134 -65 -44 178 82 240 -27 -123 183 107 10
7128 10 -116 -54 131 83 -21 70 211 -123 394 218 33 -123 141 -1 47 -99 -184 -205 11 -133 70 -192
7150 -192 24 -122 95 178 59 148 76 -143 280 201 -167 34 -96 -177 9 -102 176 -224 69 25 101 -6
7172 -6 64 132 51 23 -77 307 38 -256 -93 -134 35 74 -121 55 213 -54 -97 199 -82 -86 -186 -24 281 -169
7196 -169 14 43 102 -66 -202 168 205 -119 -67 12 -101 -72 166 -151 -5 34 -50 107 63 -29 -31 -32 56 -42 195
7221 195 -58 0 -233 80 -3 -183 119 6 -186 57 34 -266 107 -90 97 -159 -199 24 -208 -192 -68 -37
7243 -37 11 -132 -109 135 -106 22 160 231 -96 119 -129 -101 258 53 240 50 165 21 -65 55 241 -140
7265 -140 190 -12 -86 273 122 6 298 -145 -49 68 -288 198 -10 -161 -214 13 49 -23 -75 -2 -99 103 142
7288 142 179 22 19 58 -197 -291 21 -111 192 100 -211 -171 56 9 -137 36 47 188 203 81 -4 117 174 155
7312 155 27 -43 99 240 82 127 113 -96 144 -89 -18 -108 -141 -50 202 -22 -65 -84 97 120 59 102 75 -130
7336 -130 -100 139 -171 88 -214 -36 -89 -36 -247 191 175 -62 -101 56 -75 110 -211 100 3 -32 70 132 57
7359 57 213 -8 -243 80 -283 373 197 -17 -12 -231 -70 71 -63 -14 -181 108 -245 126 -179 79 30 -90
7381 -90 -318 -212 -130 -10 23 129 18 262 188 -445 52 -415 4 -31 -24 214 -252 -1 -108 -105 -22 8 73 211
7405 211 -192 62 -253 -167 6 -38 -172 195 256 -135 -162 -33 114 179 -170 219 -94 -245 90 57 -248 82
7427 82 292 122 -307 163 -194 129 14 53 133 11 -15 -22 -153 139 -33 -118 -154 147 -2 41 -58 129 15
7450 15 -117 -70 -41 -48 -25 68 -150 -109 75 1 53 -202 -163 -188 151 -140 -54 -235 137 233 -130 346 20 -47 17
7475 17 239 -112 -26 69 273 199 30 -127 -87 -318 -182 -159 204 5 -15 413 -186 58 -59 -175 -96 102 23
7498 23 -22 136 115 -34 -107 63 242 83 -59 69 187 148 30 82 173 271 152 145 20 -330 -119 124 6
7521 6 24 65 -59 88 129 159 -71 -88 286 -44 146 187 118 287 265 -37 258 -188 101 30 -3 -319 289 235
7545 235 -88 115 61 -114 119 213 -70 132 -225 -106 -159 15 -148 77 -148 260 -35 120 368 26 126
7566 126 140 -212 158 255 -82 -149 -234 -24 -218 32 122 -361 -40 329 -89 14 232 -149 22 -30 112 37
7588 37 92 -185 31 93 11 65 60 -7 -131 147 70 202 -67 -269 -159 -123 255 -73 170 152 -67 163 -99 -243
7612 -243 44 -20 -203 -192 13 -117 -28 128 75 -79 104 -3 152 -119 -49 195 -117 261 147 55 121 -159
7634 -159 -19 257 -33 -59 117 107 -160 -122 -227 -140 48 -98 -52 -78 -131 211 -197 103 -407 -144 -92 106 -70
7657 -70 -179 -188 123 -253 -110 -123 158 179 332 -48 -18 -88 64 212 -195 61 -295 -233 -30 -60 -125 -36 -67 84
7681 84 86 -76 -114 164 132 -349 -137 162 170 148 158 -59 19 -6 -11 -72 260 -12 119 168 -192 -155 -282 -127 -139 -118
7707 -118 69 106 112 -2 32 24 306 -41 107 19 261 193 21 64 60 80 324 -24 27 124 89 -11 -161 113 -108
7732 -108 -83 -370 14 -143 76 -293 -25 494 -69 -61 15 -115 139 92 48 130 -72 70 77 56 -212 -290 -15 -46
7756 -46 197 20 -20 -151 80 -160 -10 -82 196 197 49 69 75 -160 -70 -313 -475 -118 -125 -199 132 -46 30 257
7780 257 132 -156 135 -12 -279 229 -224 171 164 142 -107 -88 77 -124 -57 -154 -263 45 174 -119 153 86
7802 86 5 29 -73 -7 -40 59 -87 -82 58 -147 38 50 247 -31 84 273 -59 10 -183 -84 104 96 -94 -229
7826 -229 -229 -123 149 -147 110 186 92 -128 -63 -28 -44 147 -11 -207 -137 172 -125 9 150 71 -207 59 -119
7849 -119 142 -60 -24 -262 -134 50 24 47 146 31 -120 63 -156 169 87 71 7 -106 -64 -141 -273 13 -444
7872 -444 -232 -32 -27 -77 -297 -21 -156 44 -160 97 -163 155 106 -196 -75 198 7 112 143 -162 -325 -244
7894 -244 323 -111 115 -291 167 -79 340 -128 78 15 -56 -13 -246 -139 -16 -124 -105 53 79 2 -92 -208
7916 -208 86 -91 17 116 51 95 -103 104 246 169 -314 -184 102 80 -21 3 2 -80 -95 212 -19 -113 270 7
7940 7 147 -227 186 101 -148 15 -187 177 -90 18 87 -60 89 184 29 -40 209 64 28 108 -17 -51 -86
7963 -86 166 10 108 -249 -83 -15 -70 -20 42 -97 -133 -180 73 47 273 -195 211 139 -115 -54 -10 31 -7 71 -39
7988 -39 -223 156 -22 -46 49 -210 184 160 60 3 -100 61 -14 -86 -65 137 104 163 62 -91 143 -11 -174
8011 -174 -94 86 144 -47 139 270 41 14 16 -25 197 -9 -170 -356 235 -144 -151 -61 -109 23 -61 -116 91 -385
8035 -385 55 228 -3 -24 38 -231 -48 57 95 -151 -207 30 -129 124 -26 -37 -49 280 328 66 -24 20 -230
8058 -230 11 113 34 -16 115 191 -78 -11 -164 -201 110 -5 60 76 187 61 -99 121 45 55 -32 -37 165 -7
8082 -7 -136 151 40 -77 140 -45 -23 -31 41 -27 -33 -327 -29 -194 -148 -72 101 153 -62 56 199 -29 7 -131
8106 -131 200 -136 -95 -48 -56 224 -151 86 -168 114 242 -27 -212 -47 -73 -108 236 216 -216 -88 91 121 44
8129 44 92 207 -4 -189 -67 -76 -198 48 184 -152 -48 -57 105 128 -169 4 -45 2 -63 -226 210 111 -138 -110
8153 -110 44 88 -140 18 -303 -106 -85 -27 112 94 215 51 -87 260 -149 -94 -5 36 112 44 207 19 32
8176 32 -117 108 26 44 271 -90 130 -30 27 -85 31 -149 -95 139 -315
8191c15
##END NTUPLES=NMR FID
##END=
