##TITLE=1H_Am 2326
 CDCl3, 8 sc, 
 2.9.2021
##JCAMPDX= 6.0         $$ Bruker NMR JCAMP-DX V2.0
##DATA TYPE= NMR FID
##DATA CLASS= NTUPLES
##ORIGIN= UXNMR, Bruker Analytische Messtechnik GmbH
##OWNER= root
$$ XWIN-NMR		Version 3.5
$$ Thu Sep  2 11:40:24 2021 Russian Standard Time (UT+4h)  she@DPX200
##.OBSERVE FREQUENCY= 200.1312
##.OBSERVE NUCLEUS= ^1H
##.DELAY= (6, 6)
##.ACQUISITION MODE= SIMULTANEOUS
##.ACQUISITION SCHEME= undefined
##.AVERAGES= 8
##.DIGITISER RES= 18
##SPECTROMETER/DATA SYSTEM= spect
##.PULSE SEQUENCE= zg30
##.SOLVENT NAME= CD2Cl2
##.SHIFT REFERENCE= (INTERNAL, CD2Cl2, 0, 15.7039)
##AUDIT TRAIL= $$ (NUMBER, WHEN, WHO, WHERE, WHAT)
$$ ##TITLE= Audit trail, XWIN-NMR		Version 3.5
$$ ##JCAMPDX= 5.01
$$ ##ORIGIN= Bruker BioSpin GmbH
$$ ##OWNER= she
$$ F:/spectra/data/she/nmr/H-F/1/audita.txt
$$ ##AUDIT TRAIL=  $$ (NUMBER, WHEN, WHO, WHERE, WHAT)
(   1,<2021-09-02 11:38:31.89 +0400>,<she>,<DPX200>,
      <created by zg, POWCHK disabled, PULCHK disabled
       configuration hash MD5:
       00 E9 B6 7A A2 85 ED C7 34 08 36 98 17 FE 4E 26
       data hash MD5: 16K
       49 6D 6F 4B FF 9D 1E 91 89 25 7B AA B7 83 EE A6>)
$$ ##END=
$$ 
$$ hash MD5
$$ 71 AE 0B B6 FD 57 1B F0 84 CB D6 05 D4 1F E0 CE
##$RELAX= 
##$RELAX= 
##$RELAX= 
##$RELAX= 
##$RELAX= 
##$RELAX= 
$$ Bruker specific parameters
$$ --------------------------
##$DU= <F:/spectra>
##$EXPNO= 1
##$NAME= <H-F>
##$PROCNO= 1
##$TYPE= <nmr>
##$USER= <she>
##$AMP= (0..31)
100 100 100 100 100 100 100 100 100 100 100 100 100 100 100 100 100 100 
100 100 100 100 100 100 100 100 100 100 100 100 100 100 
##$AQSEQ= 0
##$AQ_mod= 1
##$AUNM= <au_zg>
##$AUTOPOS= <>
##$BF1= 200.13
##$BF2= 200.13
##$BF3= 200.13
##$BF4= 200.13
##$BF5= 200.13
##$BF6= 200.13
##$BF7= 200.13
##$BF8= 200.13
##$BYTORDA= 1
##$CFDGTYP= 0
##$CFRGTYP= 5
##$CHEMSTR= <none>
##$CNST= (0..31)
1 1 145 1 1 1 1 1 1 1 1 1 1 1 1 1 1 1 1 1 1 1 1 1 1 1 1 1 1 1 1 1 
##$CPDPRG= <>
##$CPDPRG1= <>
##$CPDPRG2= <>
##$CPDPRG3= <>
##$CPDPRG4= <mlev>
##$CPDPRG5= <mlev>
##$CPDPRG6= <mlev>
##$CPDPRG7= <mlev>
##$CPDPRG8= <mlev>
##$CPDPRGB= <>
##$CPDPRGT= <>
##$D= (0..31)
0 1.2 0 0 0 0 0 0 0 0.06 0 0.03 0 0 0 0 0.0002 0 0 0 0 0 0 0 0 0 0 0 0 
0 0 0 
##$DATE= 1630568311
##$DBL= (0..7)
120 120 120 120 120 120 120 120 
##$DBP= (0..7)
150 150 150 150 150 150 150 150 
##$DBP07= 0
##$DBPNAM0= <>
##$DBPNAM1= <>
##$DBPNAM2= <>
##$DBPNAM3= <>
##$DBPNAM4= <>
##$DBPNAM5= <>
##$DBPNAM6= <>
##$DBPNAM7= <>
##$DBPOAL= (0..7)
0.5 0.5 0.5 0.5 0.5 0.5 0.5 0.5 
##$DBPOFFS= (0..7)
0 0 0 0 0 0 0 0 
##$DE= 6
##$DECBNUC= <off>
##$DECIM= 32
##$DECNUC= <off>
##$DECSTAT= 4
##$DIGMOD= 1
##$DIGTYP= 9
##$DL= (0..7)
0 120 120 120 120 120 120 120 
##$DP= (0..7)
150 150 150 150 150 150 150 150 
##$DP07= 0
##$DPNAME0= <>
##$DPNAME1= <>
##$DPNAME2= <>
##$DPNAME3= <>
##$DPNAME4= <>
##$DPNAME5= <>
##$DPNAME6= <>
##$DPNAME7= <>
##$DPOAL= (0..7)
0.5 0.5 0.5 0.5 0.5 0.5 0.5 0.5 
##$DPOFFS= (0..7)
0 0 0 0 0 0 0 0 
##$DQDMODE= 0
##$DR= 18
##$DS= 0
##$DSLIST= <SSSSSSSSSSSSSSS>
$$ [...]
##$SUBNAM2= <"">
##$SUBNAM3= <"">
##$SUBNAM4= <"">
##$SUBNAM5= <"">
##$SUBNAM6= <"">
##$SUBNAM7= <"">
##$SUBNAM8= <"">
##$SUBNAM9= <"">
##$SW= 20.0189188712717
##$SWIBOX= (0..15)
0 0 2 0 0 0 0 0 0 0 0 0 0 0 0 0 
##$SW_h= 4006.41025641026
##$TD= 16384
##$TD0= 1
##$TE= 0
##$TE2= 300
##$TE3= 300
##$TEG= 300
##$TL= (0..7)
0 120 120 120 120 120 120 120 
##$TP= (0..7)
150 150 150 150 150 150 150 150 
##$TP07= 0
##$TPNAME0= <>
##$TPNAME1= <>
##$TPNAME2= <>
##$TPNAME3= <>
##$TPNAME4= <>
##$TPNAME5= <>
##$TPNAME6= <>
##$TPNAME7= <>
##$TPOAL= (0..7)
0.5 0.5 0.5 0.5 0.5 0.5 0.5 0.5 
##$TPOFFS= (0..7)
0 0 0 0 0 0 0 0 
##$TUNHIN= 0
##$TUNHOUT= 0
##$TUNXOUT= 0
##$USERA1= <user>
##$USERA2= <user>
##$USERA3= <user>
##$USERA4= <user>
##$USERA5= <user>
##$V9= 5
##$VALIST= <valist>
##$VCLIST= <CCCCCCCCCCCCCCC>
##$VD= 0
##$VDLIST= <DDDDDDDDDDDDDDD>
##$VPLIST= <PPPPPPPPPPPPPPP>
##$VTLIST= <TTTTTTTTTTTTTTT>
##$WBST= 1024
##$WBSW= 4
##$XGAIN= (0..3)
0 0 0 0 
##$XL= 0
##$YL= 0
##$YMAX_a= 63012
##$YMIN_a= -107929
##$ZGOPTNS= <>
##$ZL1= 120
##$ZL2= 120
##$ZL3= 120
##$ZL4= 120
##$ABSF1= 10
##$ABSF2= 0
##$ABSG= 5
##$ABSL= 3
##$ALPHA= 0
##$AQORDER= 0
##$ASSFAC= 0
##$ASSFACI= 0
##$ASSFACX= 0
##$ASSWID= 0
##$AUNMP= <proc_1d>
##$AZFE= 0.1
##$AZFW= 0.1
##$BCFW= 1
##$BC_mod= 2
##$BYTORDP= 1
##$COROFFS= 0
##$CY= 11.3945322036743
##$DATMOD= 1
##$DC= 2
##$DFILT= <>
##$DTYPP= 0
##$F1P= 2.36226072786647
##$F2P= -0.459571619588291
##$FCOR= 0.5
##$FTSIZE= 0
##$FT_mod= 4
##$GAMMA= 1
##$GB= 0.15
##$INTBC= 1
##$INTSCL= 1
##$ISEN= 128
##$LB= 0.24
##$LEV0= 0
##$LPBIN= 0
##$MAXI= 10000
##$MC2= 0
##$MEAN= 0
##$ME_mod= 0
##$MI= 1.114404
##$NCOEF= 0
##$NC_proc= 0
##$NLEV= 6
##$NOISF1= 3.799351
##$NOISF2= 2.8
##$NSP= 1
##$NTH_PI= 0
##$NZP= 0
##$OFFSET= 15.70392
##$PC= 1
##$PHC0= -13353.98
##$PHC1= 6.000969
##$PH_mod= 1
##$PKNL= yes
##$PPARMOD= 0
##$PSCAL= 0
##$PSIGN= 0
##$REVERSE= no
##$SF= 200.130013532006
##$SI= 16384
##$SIGF1= 3
##$SIGF2= 2
##$SINO= 400
##$SIOLD= 16384
##$SREGLST= <1H.CDCl3>
##$SSB= 0
##$STSI= 0
##$STSR= 0
##$SW_p= 3612.71676300578
##$SYMM= 0
##$S_DEV= 0
##$TDeff= 0
##$TDoff= 0
##$TI= <>
##$TILT= no
##$TM1= 0
##$TM2= 0
##$TOPLEV= 0
##$USERP1= <user>
##$USERP2= <user>
##$USERP3= <user>
##$USERP4= <user>
##$USERP5= <user>
##$WDW= 1
##$XDIM= 8192
##$YMAX_p= 0
##$YMIN_p= 0
$$ End of Bruker specific parameters
$$ ---------------------------------
##NTUPLES= NMR FID
##VAR_NAME=  TIME,          FID/REAL,        FID/IMAG
##SYMBOL=    X,             R,               I
##VAR_TYPE=  INDEPENDENT,   DEPENDENT,       DEPENDENT
##VAR_FORM=  AFFN,          ASDF,            ASDF
##VAR_DIM=   8192,          8192,            8192
##UNITS=     SECONDS,       ARBITRARY UNITS, ARBITRARY UNITS
##FACTOR=    0.0002496,     1,               1
##FIRST=     0,             0,               0
##LAST=      2.0444736,     0,               0
##MIN=       0,             -107929,         0
##MAX=       2.0444736,     63012,           0
$$ Real data points
##PAGE= N=1
##DATA TABLE= (X++(R..R)), XYDATA
0@%%%%%%%%%%%%%%kJ0j6J6j6J6k4L2l4M2n0N8p2Q2r0J04j20J38j57J79k03K29
$$ 0 0 0 0 0 0 0 0 0 0 0 0 0 0 0 -2 8 -8 8 -8 8 -16 16 -18 24 -26 32 -40 42 -48 56 -64 74 -83 96 -107 122
36A22k60K92l25L63m04M49n00N55o14O77p49Q28r10J002j106J218j343J482j635
$$ 122 -138 154 -171 192 -212 237 -263 292 -322 355 -394 434 -476 526 -580 638 -705 777 -858
55h58J808k003K225k481K782l139L569m104M785n687O955q868J2130j9196O5822
$$ -858 950 -1053 1172 -1309 1473 -1666 1903 -2201 2584 -3103 3852 -5016 7114 -12082 53740
70E3740o4361n6850J30483j6488p8496J5183M3747m2419l481K5548k4908k9517
$$ 53740 -10621 -67471 63012 46524 -31972 -16789 26958 -15461 -18942 6606 -18302 -47819
82d7819L4671J7928k4088k0699J4380J4876L218j0697l263J6721J1264r534L988
$$ -47819 -13148 4780 -19308 -40007 -25627 -10751 -7533 -18230 -21493 -4772 6492 -3042 946
95I46K877o971J5430K3596j9865k2899K8271J7824l1579m366K4241q026j6121
$$ 946 3823 -3148 12282 35878 16013 -6886 21385 39209 7630 3264 27505 19479 3358
108C358J0518L25k1605j016J8331k276k0872j0879J6302J2817k3934j4511K5737
$$ 3358 13876 14201 -7404 -8420 9911 7635 -13237 -24116 -7814 5003 -18931 -33442 -7705
121g705Q283k2105K382J6338j3529j838K9700p239l1028K5382L2858l0245k4016
$$ -7705 578 -21527 -19145 -2807 -16336 -18174 11526 4287 -26741 -1359 31499 1254 -22762
134b2762L9218J8115l5749k858K7168o796j5565R829N233j2829m73R836o210j1768
$$ -22762 16456 34571 -1178 -4036 23132 16336 771 10600 15833 3004 2531 12367 6157 -5611
148e611K85J0570J036j6447n773J6137K702j6606l209J3639J261p868L115j35
$$ -5611 -5326 5244 6280 -10167 -15940 197 2899 -13707 -16916 -3277 -2016 -9884 -6769 -6904
162f904l146Q626N288r038m129J1634P000j0188k244Q302J295k629J864J381o609
$$ -6904 -10050 -1424 3864 -5174 -9303 2331 9331 -857 -3101 5201 6496 3867 5731 7112 503
177E03l1J0890R9j3545m219J5340N703j8920n804J5382J611j0821J588K529p601
$$ 503 472 11362 11461 -2084 -6303 9037 14740 -4180 -9984 5398 7009 -3812 -2224 305 -7296
192g296K580J3118q904j5821J0769J4991p506j5464M164J4101o97q510k634M152
$$ -7296 -4716 8402 -502 -16323 -5554 9437 1931 -13533 -9369 4732 4035 -4475 -7109 -2957
206b957M777J085j564n372o11R163L720p749o876P079R920n534q141L227M893
$$ -2957 1820 2905 1341 -4031 -4642 4521 8241 492 -6384 695 10615 5081 -3060 167 5060
221E060n3j389j628l159J579N855j978q065N44N616J638o132l641L803J043j466
$$ 5060 5007 3618 1990 -1169 410 6265 4287 -3778 -3234 2382 4020 -2112 -5753 -1950 -907 -2373
237b373j67o76k449J443N319k629o724M014O549j445m633J128M288l36R6J621
$$ -2373 -2540 -3216 -5665 -4222 1097 -1532 -8256 -4242 2307 862 -3771 -2643 1645 1309 1405 3026
253C026j857o04M013K075m521k819N956J852n323j723K768J386l571k072K621
$$ 3026 1169 565 4578 6653 2132 -687 5269 7121 1798 75 2843 4229 658 -1414 1207
268A207n67l150m07J802r36k851J435J360k322M89J351m69j244J273M028j332
$$ 1207 640 -2510 -2917 -1115 -2051 -4902 -3467 -2107 -4429 -3940 -2589 -3058 -4302 -3029 999 -333
284c33k854J810L714Q46k932O87K630L05P37j607j557J641K113l21m077j953L641
$$ -333 -3187 -1377 2337 3183 251 938 3568 3873 4610 3003 1446 3087 5200 4879 802 -1151 2490
301B490O23l116k435O64J551r86o68j775k058L113K422k452k845P96M916M06l013
$$ 2490 3113 -3 -2438 -1774 -223 -1209 -1877 -3652 -5710 -2597 -175 -2627 -5472 -4676 240 646 -2367
318b367r03K543L150mj480q56N88L585J332l522j910J772L327j276m386m31K313
$$ -2367 -3270 -727 2423 2419 939 83 671 4256 5588 2066 156 1928 5255 3979 -407 -838 1475
335A475J693k321l229l65R60K059m60m287n91L340J873k238k486J392K857J131
$$ 1475 3168 847 -2382 -2747 -1787 272 -188 -4475 -5066 -1726 147 -2091 -4577 -3185 -328 803
351H03j555j356J728J670J477m96k737J183L180R3j939j451J184J819r76j653
$$ 803 -752 -2108 -380 1290 2767 2271 -466 717 3897 3990 2051 600 1784 3603 2627 974
367I74j765O02J078l59j119k673O67K371j129j535j018J211K080m55r40p76J088
$$ 974 -791 -189 889 530 -589 -3262 -2595 -224 -1353 -2888 -3906 -2695 -615 -1070 -2010 -2786 -1698
384a698K242K40p76m28O07L066p07j431J21P78J401m91j420j010Q57J264j288
$$ -1698 544 784 8 -420 187 3253 2546 1115 1236 2014 3415 2924 1504 494 1351 2615 1327
401A327j641o66j33J776j021k141o8K82J299m80j598l97J496J724n78j134N28
$$ 1327 -314 -980 -1113 663 -358 -2499 -2567 -2285 -986 -1466 -3064 -3461 -1965 -241 -819 -1953 -1425
418a425Q78K152l34j601M56J933J395p23k403Q75J933L02j439j558O18Q9L73o70
$$ -1425 -547 1605 1271 -330 126 2059 3454 2731 328 1203 3136 3438 1999 441 1059 1148 1521 851
436H51k438k12J366P51j694k092J086J468j39j423p80J509P10P09l57j271R72
$$ 851 -1587 -1799 -433 318 -1376 -3468 -2382 -914 -1053 -2476 -3256 -1747 -1037 -328 -685 -1956 -984
453i84K286Q0p23j317J578J978n35p48o55M89R10qp00j789O93J275j149j318l60
$$ -984 1302 1382 659 -658 920 2898 2363 1615 960 1449 2359 2351 1651 -138 555 1830 681 -637 -997
472i97q3J121o94q86p07J25J348O45j593j373J770K495j339j447J222Q93J22M6
$$ -997 -1080 41 -653 -1539 -2246 -2121 -773 -128 -1721 -3094 -1324 1171 -168 -1615 -393 500 622 668
490F68R35j560k12K531O18k351j489K015K206k606j811J235Q93n13o21o9n79j160
$$ 668 1603 43 -169 2362 2980 629 -860 1155 3361 755 -1056 179 1072 559 -62 -131 -710 -1870
508a870K037O23k236j471K564J757k556j407K087P42j11J27j470k7J811J115j163
$$ -1870 167 790 -1446 -2917 -353 1404 -1152 -2559 -472 270 159 286 -1184 -1211 600 1715 552
525E52j726J163J390j8r69j415R09J223J09q28j679J52K087N49k172k212K835
$$ 552 -1174 -11 1379 1361 392 -1023 -114 1109 1218 390 -1289 -1137 950 1499 -673 -2885 -50
542e0K186k146j325J086L76n63J315M68l396N95M125o66l879N1L536k03k163l55
$$ -50 2136 -10 -1335 -249 127 -436 879 1347 -2049 -1454 2671 2005 -1874 -1823 1713 1510 -653 -1008
560a008Q63P59p85j15P25j463p62K812L76l214j216M287N72l475L59J991k53j12
$$ -1008 -145 614 -171 -286 439 -1024 -1786 1026 1402 -1812 -3028 1259 1831 -1644 -1285 706 453 341
578C41M64n68n37R57J464j229p40J87L61R72o46j641J34J226L02j406r87L90K91
$$ 341 805 237 -300 657 2121 892 152 339 700 1672 1026 -615 -481 745 1047 -359 -1346 -956 -665
597f65J060j777j405J852L78j090Q29J103j836l12L948q74l981K493L518j491
$$ -665 395 -1382 -2787 -935 -557 -1647 -818 285 -1551 -1863 2085 1211 -2770 -277 3241 1750
613A750k457J098K265j132l87R07o56n76j1J360m29k821k81K900j46m089n87L986
$$ 1750 -707 391 2656 1524 1137 2044 1388 812 801 2161 1732 -1089 -1370 1530 1384 -2705 -3292 694
631F94j074k664J189O26j584J047J608j464j346K185J409p44k25j13J162J747
$$ 694 -380 -3044 -1855 -1229 -2813 -1766 -158 -1622 -2968 -783 626 -118 -343 -456 706 2453
647B453o66j221O93J596Qj206M63j032P43O50j348j125J57K0p1l66p32k164J445
$$ 2453 1787 566 1259 2855 2863 1657 2120 1088 1831 2481 1133 8 165 185 114 -252 -984 -3148 -1703
666a703K297l021k221K584J430k216p9K123l66o58J955N73r42o8J355J838n85
$$ -1703 594 -2427 -4648 -2064 -634 -2850 -2929 -806 -1172 -1830 125 698 -244 -312 1043 2881 2296
683B296k190J120K650m76k302Q12J551k067m23J657j457k100J071J202j905k159
$$ 2296 106 1226 3876 3400 1098 1910 3461 1394 971 2628 1171 -929 142 1344 -561 -2720
699b720J279L97k56r81j094O16J158K64j569L89J374K58N62N00j028N97J994N29
$$ -2720 -1441 -1044 -1300 -2281 -3375 -2759 -1601 -1337 -2906 -2517 -1143 -885 -323 177 -851 -254 1740 2269
717B269r97k58O67J067O83j816j476K522J091k541j206J222l20r61L41m32k328
$$ 2269 1272 1014 1681 2748 3431 1615 139 2661 3752 1211 5 1227 907 -54 287 -145 -2473
734b473R56J547j033k360j4K365M15j863o86J370J664o8r47N84K11L28J434M3
$$ -2473 -1517 30 -1003 -3363 -3377 -1012 -597 -2460 -3146 -1776 -112 -180 -1127 -543 -332 -4 1430 1473
752A473j635J11K698O78k554l37J231R58p88q65q06M53J077r82j834L25O73l15
$$ 1473 -162 -51 2647 3325 771 434 1665 2623 1835 970 164 617 1694 712 -1122 -797 -124 -439
770d39n2r01m48O08Q07k53j206k58J586O25p95j047J316J522p58r13N97R10l99
$$ -439 -491 -1392 -1840 -1232 -425 -678 -1884 -2142 -556 69 -726 -1773 -457 1065 307 -606 -9 901 502
789E02j46J266r61j083J504Q22j074j241J033R21j508l35N55K81m95l52J73L99
$$ 502 356 1622 661 -422 1082 1904 830 -411 622 1543 35 -300 255 536 41 -311 -138 261
807B61j054K40N64m4o57J27L93J06m36L10m44J33O03L34p20p70Q04N84j46l61
$$ 261 -793 -553 11 -33 -690 -563 -170 -64 -500 -190 -634 -501 102 436 -284 -1054 -250 334 188 -173
827a73n11r6J236L30j102j065J466J023n75j223M17R35L16n85j95n4M69Q46l87
$$ -173 -684 -780 456 786 -316 -1381 85 1108 533 -690 -273 662 978 393 198 144 613 1459 1072
846A072j264p47J597J388k259j185J021R99j17j676j4M08L60O48j119r52K83J708
$$ 1072 -192 -939 658 2046 -213 -1398 -377 622 505 -1171 -1185 -777 -417 231 -888 -1840 -1557 151
864A51L90j949m82J795J106k71j403N3J619P02m87o37n41J423R11p96j462j96
$$ 151 541 -1408 -1890 -95 1011 740 -663 -610 1009 1711 1224 587 46 1469 2380 1584 122 -74
882g4J832j93j281q35K84R12k63j083j034K75J285j96j311p90J164J325q80j026
$$ -74 1758 1565 284 -551 -267 645 382 -701 -1735 -1460 -175 -371 -1682 -2472 -1308 17 -863 -1889
900a889L14Q27Q95j6m86j27N49J534k77j113N14R46O47j166l48P31j37k09j53
$$ -1889 -1575 -748 147 131 -355 -482 67 1601 1324 211 725 1671 2318 1152 804 1535 1398 1189 1036
919A036p62k19K78j14o28r01N12J22j92p56J78M02l55K2J71j6M57K24K86M18l18
$$ 1036 274 55 333 219 -409 -1310 -798 -676 -868 -1624 -1446 -1044 -1399 -1377 -1206 -1222 -765 -541 -255 163 -155
940a55N11N59k21K21J28K42l32J67O98m22l84n1J68k46m75n82P1L8R7p18o45k18
$$ -155 356 915 694 915 1043 1285 953 1120 1818 1396 1012 961 1129 883 408 -174 -103 -65 32 -686 -1331 -1549
962a549R25J01q58q58J004Q71j18l20k35N51Q04K93p78Q2P42R73K12j297j12J158
$$ -1549 -624 -523 -1381 -2239 -1235 -364 -482 -802 -1037 -486 318 611 -167 -85 657 1630 1842 545 433 1591
982A591M10o95j034J17O44J17n77q86l72P44P0m62j433J41J187r8j101j75M24
$$ 1591 2001 1306 272 389 1033 1150 573 -313 -685 59 129 -333 -1766 -1625 -438 -536 -1637 -1812 -1388
1001a388J208K1p80j00O06J297J00r14j75O11J110j28j315M75N68M75n42j196
$$ -1388 -180 -159 -939 -1039 -433 864 964 50 -125 486 1596 1468 153 628 1196 1671 1129 -67
1019f7K07M47N47p00j425L71Q14R8r25j013N04Q51j27o88n32N12N81M18k86n00
$$ -67 140 587 1134 434 -991 -620 194 292 -633 -1646 -1142 -291 -418 -1106 -1638 -1126 -545 -127 -413 -913
1039i13L45J165L28p34m49J001M09o44K53j07j88L83J25l78p41N15O82o89p13
$$ -913 -568 597 925 191 -258 743 1152 508 761 654 466 849 974 596 -145 370 1052 363 -350
1058c50j33M63l03m51J96j16m68M33R8m5l76L11P76k28n1j06J45O18J73r6p5j92
$$ -350 -483 -20 -323 -774 -578 -694 -1162 -729 -631 -676 -1052 -741 35 -193 -244 -350 -205 413 586 490 415 223
1080B23O43P8o17N0R5K50j76J28l25n74L46L93q16o04M88N47n64m81L54M4L22
$$ 223 866 944 327 377 472 722 546 674 349 -225 121 514 -302 -906 -418 129 -435 -916 -562 -518 -196
1101a96l92j72M98m09L67N08j79o16N16J288o00j253P27O29j75l03m1P6n80Q93
$$ -196 -588 -760 -262 -671 -304 204 25 -591 -75 1213 613 -640 87 716 541 238 197 273 -307 586
1121E86%q66o4K81P58o69q27J43J074n9m53p51O69J04R9j3m66j3P19J53m74k5
$$ 586 586 -280 -344 -63 695 26 -801 -658 416 357 -96 -847 -178 -74 25 12 -454 -467 252 405 -69 -94
1143i4J97K64PN1o44j6Q58k17o31m45O62P92j021k36j09L89L26k61M66o55j95
$$ -94 103 367 374 425 -219 -235 623 406 -225 -670 -8 784 -237 -473 -582 -193 133 -128 338 -317 -512
1164e12R16J52o55o66J189R73j483k90J050rl94J42M9p01J12Q66m31o04m73K55
$$ -512 404 556 -99 -765 424 1397 -86 -376 674 665 271 413 462 -239 -127 739 308 -296 -769 -514
1184e14J009p78r34M86O82k92m05J14L69p31J194j10m99K70M91O89p43L4M19q9
$$ -514 495 -283 -1217 -731 -49 -341 -746 -632 -263 -994 200 90 -409 -139 352 1041 298 332 751 662
1204F62K91K90j534N91Q56l79j203K41N98k67k24j37m58j05K33J6q8n71J43O98
$$ 662 953 1243 -291 300 1156 777 -426 -185 413 146 -78 -215 -673 -778 -545 -529 -617 -1188 -1045 -347
1224c47J56q42l31J539K86j080M52N46k5k86R22O2r42N36R49l90r08J3O66J71
$$ -347 -191 -1033 -1364 175 461 -619 -167 379 354 68 990 1052 110 646 1595 1205 297 310 976 1147
1244A147q27o63K79N01n89n29L28m52O4J37m0q33N52P5J68J00m35L35J18Q76n48
$$ 1147 320 -343 -64 437 -152 -681 -353 -805 -741 -604 -644 -1477 -925 -850 -682 -582 -1017 -682 -564 312 -236
1265b36j89P91M56k32l0O62l33m48R92l61k60k00M9O21r89m83K07L24k10r64L38
$$ -236 -425 366 822 590 560 1222 889 441 1433 1072 812 612 661 1282 293 -190 17 341 131 -833 -495
1286d95J12n69k2K07Q3q69M22J295n73o64M06Q49q4l58K8M37L61K32j5l16M68
$$ -495 -383 -952 -974 -767 -684 -1553 -1131 164 -409 -1073 -667 182 98 -260 -232 205 566 798 783 467 935
1307I35q1N38l10p52K19M63K3q63m56L12K12k52n85k95L05l9Q4m56l08N29N6J96
$$ 935 854 1392 1082 330 549 1012 1035 172 -284 28 240 -12 -597 -892 -587 -626 -542 -998 -1306 -777 -721 -525
1329e25q7n06K79J382l26r00L05Q96N38o42j83K99N66l2m46Q6j61K09J34p6r41
$$ -525 -612 -1118 -839 543 217 -683 -378 518 1056 414 231 530 1096 1064 618 704 543 752 886 810 -131
1350a31k86N04M00j004j39P3K96L5r31N68k7K85J51p16L68M41Q8lQ2l66M08N34
$$ -131 -417 87 487 -517 -656 -583 -287 -252 -1183 -615 -642 -357 -206 -922 -554 -113 -25 -28 54 -312 96 630
1372F30l68j11K40J04K37n01N4J11M35l99k83m9j75M42l18j55j86P1nO5m8n14
$$ 630 262 151 391 495 732 231 285 396 831 432 149 100 -75 367 49 -106 -292 -221 -226 -161 -209 -723
1394g23L70K7K51k18M4j34R8K62K45k30k74K53L56k51k18N6K41K80l13j41J02
$$ -723 -353 -326 -75 -293 -249 -383 -285 -23 222 -8 -282 -29 327 76 -142 -86 155 435 122 -19 83
1415H3l8j04K04O3j38j05J48P5m9n59M25M12k29r4k04K40j3k99j16K80J94O8k97
$$ 83 45 -59 145 208 70 -35 113 188 139 -420 5 417 188 94 -110 130 117 -182 -298 -18 176 244 -53
1438e3k99K8N36j76r5m66Q5L72M20o17j57j15P34j0n69L95k34L79J24p0l75L75
$$ -53 -352 -324 212 36 -59 -525 -440 -68 352 -265 -422 -537 197 187 -382 13 -221 158 282 212 -163 212
1460B12K60K14k53m87K26N93m76j89p3K20K20j18n01r5L20k97Q8o96M09M8P1k84
$$ 212 472 686 433 -54 172 765 289 100 27 247 467 349 -152 -247 73 -224 -136 -832 -423 -375 -304 -588
1482e88q8k71P55j69M6j00k2P32k60r0K61J60K33k3j15mj08L43Q2k78m91L19K65
$$ -588 -676 -947 -192 -361 -315 -415 -437 295 35 -55 206 366 599 576 461 457 349 692 774 496 5 324 589
1505E89l19l02jj29o3L00q21J45K2p2K80m89K19J84O6J27p26Q98k37M62J52j86
$$ 589 270 -32 -33 -162 -225 75 -746 -601 -579 -651 -371 -860 -641 -457 -391 -264 -990 -92 -329 133 285 99
1527I9M7M42o2L45n07J77K1J03J60j61m58M12p9j05m93k63M8j34K01o43K55J42
$$ 99 146 588 526 871 364 541 562 665 825 664 206 618 539 434 -59 -322 -274 -408 -207 -850 -595 -453
1549d53j35Q8j94r6M18J09M8l82K37K66L02J88k14Q4N73J39j86k14k63O01Kj29
$$ -453 -588 -500 -694 -790 -372 -263 -215 -597 -360 -94 208 396 182 266 839 978 792 578 315 916 918 789
1571G89m10M7M3j21o71J61k72K63j90j88R6l25K50o8l5l4r3K27K23r2L17q1J09
$$ 789 379 426 469 348 -323 -162 -434 -171 -361 -549 -453 -778 -528 -596 -631 -665 -758 -531 -308 -400 -83 -164 -55
1594e5K49kJ62m1M82l20J57l2J75n9j26j46j85j33J78J17n57j60Ml7k0m34L78
$$ -55 194 192 354 313 795 475 632 600 775 716 590 444 259 126 304 421 -136 -296 -292 -329 -349 -783 -405
1617d05o9L7%J0j32M10J12j49j08K37Q3N79j43k47K13K0M48j09n56r1L05k97K61
$$ -405 -474 -437 -437 -427 -559 -149 -37 -186 -294 -57 26 605 462 215 428 448 896 787 231 140 445 148 409
1640D09k95j34J35j86o6l67mP7J63Rk90k27L38J80j00k98Q5M82Q6J12l37K60L95
$$ 409 114 -20 115 -71 -137 -504 -508 -431 -268 -259 -549 -776 -438 -258 -358 -656 -571 -89 -3 109 -228 32 427
1663D27Q2j25j83lO26j03p04J71K35K57l41l58j14J22K50l26k78l09M71K62q8
$$ 427 509 384 201 198 824 721 17 188 423 680 339 -19 -133 -11 239 -87 -365 -674 -203 59 -29
1684b9m08q8J13L65q0k18m2l4M91l9n23L12N88j67j11K9o4J75J20k71K0q4q6L91
$$ -29 -437 -525 -412 -47 -127 -345 -387 -421 70 31 -492 -180 408 241 130 159 95 270 390 119 139 55 -31 360
1708C60j18n50N08l7J5l54k63N89l45J93J48p28M32p4K68k70o8K68M32j75m12
$$ 360 242 -308 200 163 178 -176 -439 150 -195 -2 146 -582 -150 -224 44 -226 -294 -26 406 231 -181
1729a81j39N53N9m43K71K69l36O1j35P4l79K03J80k59n6J24J9q3QL15j46j87K15
$$ -181 -320 233 292 -151 120 389 53 114 -21 53 -326 -123 57 -202 -258 -134 -115 -198 -190 125 -21 -208 7
1752Gk7O1Np5J69P3j03P2n00M77J92l03m02K72M26k49m86N22k18j09K98rl40k75
$$ 7 -20 41 46 -29 140 213 110 182 -318 159 351 48 -354 -82 344 95 -391 131 -87 -196 102 93 -247 -522
1776e22N85L8k61m99L63Q40o03o7L7M71j34l65N12j14l03m1N85l64l72N97J43
$$ -522 63 101 -160 -659 -296 544 -59 -126 -89 382 248 -117 395 281 -22 -63 522 158 -214 383 526
1797E26l05l85J44j25N8R3l38p7R6N24o43l1K80k75M80l26j43K29J70J74j52k8
$$ 526 221 -164 -20 -145 -87 6 -332 -409 -313 211 -432 -463 -183 -458 22 -304 -447 -218 -48 126 -26 -54
1819e4K14L56n7k91k57N98J69n25p5K68P0l86j6K15n89J84M08l32m15m9N32kn57
$$ -54 160 516 459 168 -89 509 678 153 78 346 416 30 14 229 -360 -176 232 -100 -515 -564 -32 -34 -591
1842e91n8N7K74k7K37l01L19k52O84r3k76J05M49j71l88M61L87o4k23j11j35l81
$$ -591 -649 -592 -318 -345 -108 -409 -90 -342 342 249 -27 78 527 356 -32 429 816 752 529 418 283 -98
1864i8Q21m41j17J6J25o24j66K21j57j33J69K66n17K51l01K99P8r6K06K68l79
$$ -98 723 282 165 181 306 -318 -484 -263 -420 -553 -384 -118 -635 -384 -685 -386 -308 -404 -198 70 -309
1885c09K37Q9R7L6NM83k87k30L22L41k18k67j50O7Q4j76l54K89m5k09K12p6l13
$$ -309 -72 17 114 150 155 638 351 121 443 784 566 299 149 216 300 124 -230 59 14 -195 17 -59 -372
1908c72l1L98n09k31j5L81j92M10l8k96M21J02K78r1j49j15M56l68L82p9m5J46
$$ -372 -403 -5 -514 -745 -760 -379 -571 -161 -199 -495 -74 28 306 215 66 -49 407 39 421 342 297 443
1930D43r7j69M1j75M36l38k91L2J6J47r6j87j68r7L83j19r2m09O20j08j47J28
$$ 443 346 177 218 43 479 141 -150 -118 -102 45 -51 -238 -406 -503 -120 -239 -331 -740 -120 -228 -375 -247
1952b47K37L6K00j76J1L50n15M63k04J40l21J56N78k66n18Q5J33J14l69K61l46
$$ -247 -10 26 226 50 61 411 -104 359 155 295 -26 130 708 442 -76 9 142 256 -113 148 -198
1973a98J20O0k10j15L15Q0l82j67J08M75o4j06J8j07L00q6K7r2j10M48j25j5j00
$$ -198 -78 -18 -228 -343 -28 52 -330 -497 -389 86 22 -84 -66 -173 127 41 68 -24 -134 314 189 174 74
1996G4k55M18n9Q7k39l96N82k40l9l26K01J45J05l88r4M33j17J30l28L60j38N4
$$ 74 -181 237 178 265 26 -370 212 -28 -67 -393 -192 -47 58 -330 -424 9 -108 22 -306 54 -84 -30
2018c0n4K89r2l47L75J80l25K59N1k55J94k41J54l68K80J96k85j57k6J27J78k94
$$ -30 -84 205 113 -234 141 321 -4 255 306 51 245 4 158 -210 70 266 -19 -176 -202 -75 103 -191
2040a91k33M08K0R6j71k2J77o0J27m38L91m8J09O1k1j12L8l36N35m13L0j18K19
$$ -191 -424 -16 4 100 -71 -93 84 24 151 -287 104 56 165 226 205 93 131 -205 330 -83 -53 -171 48
2063D8o5M9o1n0J50N1l98J1k19M82p2O0k77J07K14J33j24l2O2M8L3J23K7r3L37
$$ 48 -17 32 -29 -79 71 122 -276 -265 -484 -2 -74 -14 -291 -184 30 163 39 7 69 117 150 273 300 207 544
2088E44n07K78m44M03K8n9n55K19qQ1k5j35k08K90o0k28J07Q2P2j57L2r7L40K32
$$ 544 37 315 -129 274 302 243 -312 -93 -101 -20 -45 -180 -388 -98 -158 -386 -279 -197 -125 -282 -250 -347 -7 225
2112B25j7j91J91j61J8L46m1j95j06J25N2m3o8P1k37J74k99P8nj02j70J05j7m60
$$ 225 208 17 208 47 65 411 370 175 69 194 246 203 135 206 -31 143 -156 -78 -83 -185 -355 -250 -267 -727
2136g27M67N7j58m4L20J35l54J00J57K1l5M23m57L03J96Qk05j9j03J41K34q8k81
$$ -727 -260 -203 -361 -405 -85 50 -304 -204 -47 -26 -61 362 -95 208 404 412 207 188 85 226 460 372 91
2159I1J30M7j91Q8m91N1M60l87J23k14R1K38k93k83P2M73m07O82n34N15m76j4
$$ 91 221 268 77 165 -326 -275 185 -202 -79 -293 -202 36 -257 -540 -468 5 -402 280 -254 261 -215 -229
2181b29M77o7M5J03K8J71k35J97k1m22J78q0L0p2L8q4n9o2k83K27O1n10J04K77
$$ -229 248 181 226 329 357 528 293 490 469 47 225 145 175 103 141 57 -2 -64 -347 -120 -59 -569 -465 -188
2205a88j29J78j25j37J37J15L03O5k58P2O6L4R9J26q5j60L29k9l66K58j39P3k99
$$ -188 -317 -139 -264 -401 -264 -149 154 219 -39 33 99 133 232 358 273 113 442 413 47 305 166 239 -60
2228f0M8O8j52K32o45L10Mnk28J78J13k28K60P0j80J07K12N7J02j78j69K63K3
$$ -60 -12 56 -96 136 -509 -199 -195 -200 -428 -250 -137 -365 -105 -35 -215 -108 104 161 263 85 -84 179 202
2251B02J14j49J91J58k25j69m2N5L4j78M8J7M1j94L05k33l40R8J43m6j17M1N4
$$ 202 316 167 358 516 291 122 80 135 169 -9 39 56 97 -97 208 -25 -365 -267 -124 -170 -287 -246 -192
2274a92o4K78Q1k19K03p0K01k21J32o6J48l7L05l13J21j09j70nj43N34n01J16
$$ -192 -256 22 103 -116 87 17 218 -3 129 63 211 174 479 166 287 178 8 3 -140 394 -107 9
2296Io2J49l72L43k95K49j86j16L23J22l33J86l47L02Q6r6JP0K63k34R7O4l0p8
$$ 9 -53 96 -276 67 -228 21 -165 -281 42 164 -169 17 -330 -28 58 -38 -37 33 296 62 159 223 193 115
2320A15O8k4j71MJ97k79Q0J08J45k45j07j2N3l51L06J80k78l3K04j40P0J01L0
$$ 115 183 159 -12 -8 189 -90 -10 98 243 -2 -109 -121 -68 -419 -113 67 -211 -244 -40 -180 -110 -9 21
2343B1R1lk85M20l95M04k49n2K33k36K85k50l8k56M87j88k95K93r8j77R3j09J97
$$ 21 112 109 -176 244 -151 253 4 -48 185 -51 234 -16 -54 -310 177 -11 -306 -13 -111 -288 -195 -304 -107
2366a07J21o0q1QK5J15M7o8L14k43m4l8K83J29k03m05O32Q1l16j59l79M69M8k22
$$ -107 14 -46 -127 -119 -94 21 68 0 314 71 27 -11 272 401 198 -207 425 506 190 31 -348 121 169 -53
2390e3j67Q8p2J71o7k40K79n0Q8o3j23J00N7K9J0l2N2M6R4K33n31J52K9K60j97
$$ -53 -220 -132 -204 -33 -100 -340 -61 -111 -23 -86 -209 -109 -52 -23 -13 -45 7 53 147 380 -151 1 30 290 93
2415I3j7j36J86o7r4L93m47R4l2m2np0Q6j70N7r5k5K7J38J94q2k9p8L08j58L04
$$ 93 76 -60 126 59 -35 358 -89 5 -27 -69 -74 -144 -58 -228 -171 -266 -291 -264 -126 68 -14 -43 -121 187 29 333
2441C33n85M15k3M2o7l8K24q8l74L00mJ35k69j44K97n16K31q8J30j53Q8mj00o0
$$ 333 -252 163 140 182 115 77 301 213 -161 139 135 270 1 -143 154 -362 -131 -219 -89 -242 -154 -158 -258 -318
2465c18j5q3L91K7j64r6L47J31k23K27o2Rk45K32j21K45j08J4k38N22n63L3j4
$$ -318 -333 -416 -25 2 -162 -258 89 220 -3 224 162 171 -74 158 37 282 174 188 -50 472 -91 -58 -72
2488g2o4J39N0j07p2j45J64k13J66O6q6M3k62M9L76j59K8K04J40j46m90K82L92
$$ -72 -136 3 53 -54 -126 -271 -107 -320 -154 -88 -174 -131 -393 -344 32 -127 -99 105 245 99 -391 -109 283
2511B83l36L32K5p5J7O0Mk76J33k25k7M07k68k64L30m12o5O1J78K0o1L5K5M8j11
$$ 283 -53 279 304 229 246 306 310 34 167 -58 -85 322 54 -210 120 -292 -357 -296 -118 -98 -159 -124 -99 -51 -162
2536a62J4K39k67J43r6K83O7Q6j81K1L11m42K00j26l0J56o5k67K33q6Mj56N2j87
$$ -162 -148 91 -176 -33 -129 154 221 307 126 147 458 16 216 90 60 216 151 -116 117 31 35 -121 -69 -256
2560b56K96k08j69j0J07n5K86r8l66L90P6J06j66J89o9L3P3j42J7PJ46P9qj33
$$ -256 40 -168 -337 -347 -240 -295 -9 -107 -473 -83 -7 99 -67 122 53 86 159 17 34 41 187 266 258 125
2584A25J0J12k25J11k48K05K37l62k67L54p9N1k13N7j46N8m5M69k61%O9j85J13
$$ 125 135 247 22 133 -115 90 327 -35 -302 52 -27 24 -189 -132 -278 -220 -265 204 -57 -57 12 -173 -60
2607f0J10K8o4K40J31j99j99K96k4j79k50L05j13j16j40J29J24K10Q6n94O2J07
$$ -60 50 78 14 254 385 186 -13 283 259 80 -170 135 22 -94 -234 -105 19 229 315 -279 -217 -110
2629a10k1M11l91j44j9J47J5j0J43L1j98J5K40o5j91r9K01p1L8R6J27l08R3j04
$$ -110 -131 280 -111 -255 -274 -127 -112 -122 21 52 -146 -131 109 44 -147 -246 -45 -116 -78 18 145 -163 -70 -174
2653a74p2L6K23j55K88j72L9j77M8J53J57j18K08k49j69J11j30J22L51k88K48
$$ -174 -246 -210 13 -142 146 -26 13 -164 -116 37 194 76 284 35 -134 -23 -153 -31 320 32 280
2674B80l24O3J28j65j53K44P0j79q4J58J49j40k3k38p9j85K48L2k8O3L5j35j2
$$ 280 -44 19 147 -18 -171 73 143 -36 -120 38 187 47 24 -214 -293 -478 -230 -198 -226 -163 -128 -263 -275
2697b75J23P8Q2R7L0j87j15L82l32K73k26K80J44l88N5Q8K32k35j56k0K86j91
$$ -275 -152 -74 8 105 135 -52 -167 215 -117 156 -70 210 354 -34 21 109 341 106 -50 -70 216 25
2719B5Qk05j39J54j05L49J8j11j39J7r5K26j34j30M87k52N4J02k4J78j15j44R3
$$ 25 33 -172 -311 -157 -262 87 105 -6 -145 -128 -223 3 -131 -261 226 -26 28 130 106 284 169 25 118
2742A18J6J51K6m83J05L25l73k54K42j12K54j54J49k82J87j09k2M09o45N23k12
$$ 118 134 285 311 -172 -67 258 -115 -369 -127 -239 15 -139 10 -272 -85 -194 -216 193 -452 71 -141
2763a41K16k89M87k89K64r3n8P9J31P5o8l52R1M33k49J4k86J4R6j07qK41p7j30
$$ -141 75 -214 273 -16 248 155 97 176 307 382 314 -38 53 486 237 251 -35 -21 75 -32 -40 201 124 -6
2787fp8L1k43M95k99J84l49K16o5N9p5K38J85m20O2p6K07J5j03K47l13J07J66
$$ -6 -84 -53 -296 199 -100 84 -265 -49 -114 -55 -130 108 293 -127 -65 -141 66 81 -22 225 -88 19 185
2810A85k5p0J9R3k14J55M1l23J50j66K49j61j11N2m4K9j11j59L56r1J13p7p9m
$$ 185 160 90 109 202 -12 143 184 -139 11 -155 94 -67 -178 -126 -170 -141 -252 -411 -55 -146 -33 -110 -189 -193
2834a93K23j37J68Q5k85K74k38J78p5j13J27K46k24J20j74P2o6r3J46K00l02l07
$$ -193 30 -107 61 146 -139 135 -103 75 0 -113 14 260 36 156 -18 54 -12 -105 41 241 -61 -368
2856c68L11j9l8N9J8m9P2j42J10L5J27j42P7l2J8k1N0R5J17l05R4J59p9p1m5J63
$$ -368 -57 -76 -114 -55 -37 -86 -14 -156 -46 -11 116 -26 51 19 37 16 66 161 278 -27 67 226 147 76 31 194
2882A94k63J41r4K86j01l70J04M3j25J92P0j49j31J53o6J64j26q4K69N1j88r3
$$ 194 -69 72 -22 264 163 -207 -103 -60 -185 7 77 -72 -203 -50 -116 48 -78 -162 107 158 -30 -123
2904a23K80J0J01j72kMk02K71j50M03k48k10j95L03k89J55K54k65q4K8J34Q3l25
$$ -123 157 167 268 96 94 98 -104 167 17 420 172 -38 -233 70 -219 -64 190 -75 -159 -131 3 86 -239
2927b39N4k05M23L0J07j77O7j14J71l7M4k46K69k79J30K09j2L1k89J5K06j55j93
$$ -239 -185 -390 33 63 170 -7 60 -54 117 80 124 -122 147 -132 -2 207 195 226 -63 -48 158 3 -190
2950a90K03K31J7k67M7k78L0K31j03j95L66r1j6l36M17n4k56K42k1k7p6J71J04
$$ -190 13 244 261 -6 41 -237 -207 24 -79 -274 92 1 -15 -351 66 12 -244 -2 -23 -50 -126 45 149
2973A49l66K62O4k54r5k9L78j04k42K94o9pN8r6K29k24o8J46K19j97O0J3n4J47
$$ 149 -217 45 109 -145 -240 -269 109 5 -237 57 -12 -19 39 -57 172 -52 -120 26 245 48 108 121 67 214
2997B14k52j14M37j75K1k38J83j26J30O9l79K30j6J98k18j58J74k09j31K77j28
$$ 214 -38 -152 285 110 131 -107 76 -50 80 149 -230 0 -16 182 -36 -194 -20 -229 -360 -83 -211
3018b11J26P4l0qJ30K1j16K58j52o6l5p8J10O7M9J95J3l31N1l08L76J40r4j60
$$ -211 -85 -11 -41 -49 81 102 -14 244 92 26 -9 -87 23 90 139 334 347 16 67 -241 135 275 181 21
3042B1j63K16j29j17J76K03m23N4m2J11P4k70J99m2j6Q2Jj44j35M15N2k71K58
$$ 21 -142 74 -55 -172 4 207 -216 -162 -204 -93 -19 -289 -90 -132 -148 -66 -65 -209 -344 71 123 -148 110
3065A10k52n5K18j3J77l1l52K08r7L02o8j82K25n36L18Lj67R1r0J35o9l3K42O7
$$ 110 -142 -197 21 8 185 154 -198 10 -87 215 147 -35 190 -346 -28 -25 -192 -101 -191 -56 -125 -158 84 151
3089A51l31J33K4J94k39J60N6j8r5K80j68nQ2M9j48j27R2j57J23j8J74j3q3j92
$$ 151 -180 -47 -23 171 -68 92 148 130 35 315 147 142 224 273 125 -2 90 -67 56 38 212 199 116 -76
3113g6k3J58l16Q6Q4P7J0j68J34j95L16L9r7p2L6j2j03K12J24o9n0K7m3OL06j27
$$ -76 -99 59 -257 -171 -87 -10 0 -168 -34 -229 87 126 29 -43 -7 -19 -122 90 214 145 95 122 79 85 391 264
3139B64j69j11J2J09J85m11K5J3j11q6J88J11J69l09r6L2J95k5J01K42k95j14
$$ 264 95 -16 -4 105 290 -121 -96 -83 -194 -280 -92 19 188 -121 -217 -185 10 -15 86 328 33 -81
3161h1Kj14L24m0K04k82l5K46j60n4J42l40K01L68l70o2J5J4n6mJ50j63J99m3
$$ -81 -79 -193 131 91 295 13 -22 224 64 10 152 -188 13 381 11 -51 -36 -22 -78 -82 68 -95 104 61
3185F1l29J17Q6J4r9J80j9J39r4L0K8J6pk51M33m51L59l66K52J95l70J61j58J07
$$ 61 -268 -151 -65 -51 -150 30 11 150 56 86 114 130 123 -128 305 -146 213 -153 99 294 -76 85 -73 34
3209C4oO3j67L03l24k87K83J69J11l53J81K6o1J4j40J59Rl6O7No7K60k21j40K24
$$ 34 28 91 -76 227 -97 -384 -101 68 179 -174 7 33 -28 -14 -154 5 14 -22 45 50 -17 243 22 -118 106
3234A06J35l0m89L9L24q6j59K70n5j27N6J33k42n9L26L6k20L0j51o7J27L87j71
$$ 106 241 211 -278 -239 85 -1 -160 110 55 -72 -16 117 -125 -184 142 178 -42 -12 -163 -230 -103 284 113
3257A13n4J90k55J60r5m2Q2k34O1J0K3j1j62L31j44P7K7k64k8K65l65L70j49J36
$$ 113 59 249 -6 154 59 17 99 -135 -74 -64 -41 -52 -214 117 -27 50 77 -187 -215 50 -315 55 -94 42
3281D2j66K52j94j63L01N0l37N5K28J7n1k39M68p3q4P3k39J45j81L92k90k07M32
$$ 42 -124 128 -66 -229 72 122 -215 -160 68 85 34 -205 263 190 106 179 -60 85 -96 296 6 -201 231
3304B31p9j25k41K16k12J55K7n8p6p6J45j9M5n0N4R3o8J58N1k72m3L49r3Mj08
$$ 231 152 27 -214 2 -210 -55 -28 -86 -162 -238 -93 -112 -67 -117 -63 30 -38 120 171 -101 -144 205 112 116 8
3329Hk9K5J10r2J54j46J73j49n5J72k79L17l59J12J16n0l50M18k29L42k24N6j74
$$ 8 -21 4 114 22 176 30 203 54 -1 171 -108 209 -150 -38 78 28 -322 96 -133 209 -15 41 -133
3352a33j4j4M41m23k1K33j03K42j90n2O2J0k8J59K03j87j64K16l76K79j54J32
$$ -133 -147 -161 280 -143 -164 69 -34 208 18 -34 28 38 10 169 372 185 21 237 -139 140 -14 118
3374A18n11J60J41N5l6L03k47Q3k48J81m0Q5O1l61L07k1P7O3k08R0k33%K40J82
$$ 118 -393 -233 -92 -37 -73 230 -17 66 -182 -1 -41 44 105 -256 51 30 107 170 -38 52 -181 -181 59 241
3398B41o5j0l26L12p3J7j47P4k2Rj97J25q3m6K53j78R0l73M98l5l68M45j35l1
$$ 241 176 166 -160 152 79 96 -51 23 1 10 -187 -62 -145 -191 62 -116 -26 -399 99 64 -304 141 6 -25
3422b5J22m8k4o0r5J65K03k61l5O4j25J62o0J79j88Ol3R5j81J17l2J72J20j98
$$ -25 97 49 25 -35 -130 35 238 -23 -58 6 -119 43 -17 162 -26 -20 -53 42 -139 -22 -54 118 238 40
3446D0q0k8MO1j76K08rr2K49j1k87L4r8M19j07j14K09j25J33k84P4L5J03k20q6
$$ 40 -40 -68 -64 -3 -179 29 20 -72 177 166 -121 -87 -185 234 127 13 222 97 230 -54 20 55 158 -62 -148
3471a48P3K40k84r6J71P2k19J11N4J31m13K15L08m60R6K22j23J34J99j84l0QJ59
$$ -148 -75 165 -119 -215 -44 28 -191 -80 -26 105 -308 -93 215 -245 -149 73 -50 84 283 99 69 77 236
3494B36l35L5J90j28K31k92J64j84J83K6j70l7k43K76J09K2p1l4J03k37R7J79
$$ 236 -99 -64 126 -2 229 -63 101 -83 100 126 -44 -81 -324 -48 61 83 12 -22 81 -156 -59 120
3516A20j32o8n2J19L22k72l3M0R5j64J37Nj3Q9m72K49J7j12K01K3N6q9R0n01K16
$$ 120 -12 -80 -132 -13 309 37 4 44 139 -25 112 117 104 193 -279 -30 -13 -125 76 99 155 66 156 -345 -129
3541a29mM9J62k2n0J14k06K1m6J18L0r2k82M37Q1j52M7lk47R2K17o4k9R5K3m96
$$ -129 -133 -84 78 56 6 120 -86 -65 -111 7 37 -55 -337 100 181 29 76 73 -174 -82 135 71 42 137 160 -336
3567c36K15k1K5K12j21r3j14N35k28k34R0Q6L04n36K54J7j77J25j24K4R2J97r6
$$ -336 -121 -142 -117 95 -26 -119 -233 302 74 -160 -70 16 320 -216 38 55 -122 3 -121 -97 -5 192 96
3590I6J47l76L55j78j7k26N1J11K78j92j07Nj74J04J98m8k7j32J34k1n2K32m62
$$ 96 243 -133 222 44 27 -199 -148 -37 241 49 -58 -53 -227 -123 75 27 0 -132 2 -19 -71 161 -301
3613c01L21R6j42j10J32J48k43J76O3p3p9J96j72N7o5J7P8Q7j87k38Q1J85k8j29
$$ -301 20 116 -26 -136 -4 144 -99 77 140 67 -12 184 12 69 4 21 99 186 -1 -239 -158 27 -1 -130
3637a30j36L15J21k61r0o6J27K78k44M3L00m19K40N0J42j79q5K72J92o10K43P1
$$ -130 -266 49 170 -91 -181 -247 -120 158 -86 -43 257 -162 78 128 270 91 6 278 470 -140 103 174
3659A74j19M6J24j53j72K30q6j79K14l53O3K62M4J09l77Q6q4J06O9l36K96p0K48
$$ 174 55 101 225 72 -100 130 44 -135 79 -274 -211 51 95 204 -173 -87 -171 -65 4 -332 -36 -106 142
3682A42m6p0k27J35K30j55P2Oq2K31j22j64K10j23K6r9P8j70Q6j39K01m33L35
$$ 142 96 26 -201 -66 164 9 81 87 5 236 114 -50 160 37 63 -36 42 -128 -42 -181 20 -413 -78
3705g8L0K19l82R2j47M33j25l3j39J46J08p4j77O2o1nJ09L23l56K28k01J40j8
$$ -78 -48 171 -211 -119 -266 167 42 9 -130 16 124 50 -127 -65 -126 -131 -22 301 -55 173 -28 112 94
3728I4m2j75K19J12l31J34J84l8j67j63L62j2j65n3kk52K16J79k53R5K33o2M9
$$ 94 52 -123 96 208 -123 11 195 157 -10 -173 189 177 12 -41 -43 -295 -79 100 -153 -58 175 113 162
3751A62qJ75l53k63N3K15P7J09J5l46K24J77m43L6J21j27M09l28M1k49L82J36
$$ 162 154 329 -24 -287 -234 -19 58 167 182 -164 60 237 -206 -170 -49 -176 233 -95 -54 -303 79 215
3773B15l73K93l02J48qJ02k82J19J43k85L76j60K15k38K65q8J40j33%j9j84L1
$$ 215 -158 135 -167 -19 -27 75 -207 -88 55 -230 146 -14 201 -37 228 140 280 147 147 128 -56 -25
3795b5L2j8j2o5K84k69Lj55M64k83J14J92l42J49j48J88k17J37J49k00n4K58k07
$$ -25 7 -11 -23 -88 196 -73 -70 -225 239 -44 70 262 -80 69 -79 109 -108 29 178 -22 -76 182 -25
3818b5K64p3q7k2l1m6J86J98l57Q5o4p9N3o1pK24j11k80J24j58L05j16J30J09
$$ -25 239 166 79 57 26 -20 166 364 7 92 28 -51 2 -59 -66 158 47 -233 -109 -267 38 -78 52 161
3842A61k75J1p6M0J54J26p8q8L88m94M2K25j37j76K47j2l08R0P8mJ39M3j97L49
$$ 161 -114 -103 -179 -139 15 141 63 -25 363 -131 -89 136 -1 -177 70 58 -250 -160 -82 -86 53 96 -101 248
3866B48k54R4k66K36k91J89J21k0j46ljJ02jJ47k6p9nK24l44Q5J07k14J19j70
$$ 248 -6 88 -178 58 -233 -44 77 57 -89 -92 -93 9 8 155 129 50 45 269 -75 10 117 -97 22 -148
3890a48L10p0m1j63J14k52R6J74j40J98l49K41m0j40J39O4k91K07J14O%K2j83
$$ -148 162 92 51 -112 2 -250 -154 20 -120 78 -271 -30 -70 -210 -71 -7 -298 -91 23 29 29 51 -132
3913a32N5q1j44N35l42L75j74M5L7l1J20q3j12k14J92n4j66l0J93o8K35p4j85
$$ -132 -77 -158 -302 233 -109 266 92 137 174 143 263 180 68 -146 46 -8 -174 -204 -11 -79 156 82 -103
3936a03o5L58o3j43k87k7M69J33k22r3J22n1q0J8R6j00m9M9Mq5L05J0k26R8j79
$$ -103 -168 190 127 -16 -303 -330 139 272 50 -43 79 28 -52 -34 62 -38 -87 -38 -34 -119 186 196 -30 68 -111
3961a11l6J88J64l41j5J05r1J98J23k08q1R8J20J6k01L7k56L30J34j46Q4j85P8
$$ -111 -147 41 205 -136 -151 -46 -137 61 184 -24 -105 -7 113 129 -72 -35 -291 39 173 27 111 -74 4
3984DK29k30j10M6J24P6J09j78j36K0j53K81l3p0j46L13r0k90Q4O1r9K4Q6o3K60
$$ 4 233 3 -107 -61 63 139 248 70 -66 -46 -199 82 49 -21 -167 146 56 -234 -150 -89 -188 -164 -78 -141 119
4009A19k44l0M01K6m77O62m94OK25r1R0Q9j17pk1o6J44k29r5L0m2K98l39J3K38
$$ 119 -125 -155 246 272 -205 457 -37 -31 194 103 193 282 165 158 137 71 215 -14 -109 -79 -121 177 -162 -149 89
4034H9J22l13nK67j99J08n3L7QM2k40L08j90j7Q3K04j45k56J97J22r4J51k17J30
$$ 89 211 -102 -107 160 -39 69 16 53 61 103 -137 171 -19 -36 47 251 106 -150 47 169 75 226 9 139
4058A39j60R4p9R3j89J88j65J43j90J6m0L32j49R1m4J0j15J20k79K65J01m21O02
$$ 139 -21 73 -6 87 -102 86 -79 64 -126 -110 -150 182 33 124 80 90 -25 95 -184 81 182 -239 363
4081C63n24J75p5OJ86j20P9j2r6K11j89Pj18Q0LJ03k69K67O7m52K62j5k46K54
$$ 363 -161 14 -61 -55 131 11 90 78 -18 193 4 11 -107 -27 -24 79 -190 77 144 -308 -46 -61 -307 -53
4105e3K1j08L33r8l09K32K36k33l40M19j77J66j29J74O7j34n3J06j97L8K8RJ73
$$ -53 -32 -140 193 95 -214 18 254 21 -319 100 -77 89 -40 134 201 67 14 120 -77 -39 -11 -2 171
4128A71p6j74j36L93k88o5J66k63K55j75L95l82M0J49K52kk12J01j23J5J93N2
$$ 171 95 -79 -215 178 -110 -175 -9 -272 -17 -192 203 -179 -139 10 262 260 48 149 26 41 234 286
4150B86k43q3m1K20l67m6L99l73M27m13J39L11m33K56J43j31l25N4nJ56l1K82
$$ 286 43 -40 -81 139 -228 -274 125 -248 179 -234 -95 216 -217 39 182 51 -274 -220 -225 -69 -100 182
4172A82j14L7N5kj97K3j28J09Mn4K09p8K4j64K91j79J06m13L16J65m03r5K22j7
$$ 182 68 105 160 158 -39 -16 -144 -35 -31 -85 124 46 70 -94 197 18 124 -289 27 192 -211 -306 -84 -101
4196a01KQ6J80k16p6P0J18j40L34j10k40K80O8p8j14J0j35K25j30K15k48P9n1
$$ -101 -99 -13 167 -49 -125 -55 63 -77 257 147 -93 187 255 177 63 73 -62 163 33 248 0 79 28
4219B8N7j27J61j61L0OJ71m35J79P6r3n1J55J33j9kOk28N2O2Q0k34l0L27K6j25
$$ 28 85 -42 119 -42 -12 -6 165 -270 -91 -15 -108 -159 -4 129 110 108 114 -114 -62 0 80 -154 -184 143 169 44
4245D4o3J65k72N2N4r5J99k62J00R9q7q1K47j09J18j71J08k44j75J48K93j63P5
$$ 44 -19 146 -126 -74 -20 -115 84 -178 -78 21 -66 -147 100 -9 109 -62 46 -198 -373 -225 68 -95 -20
4268b0K10l79O5L94k92K41N1k29J5j0Lj2nj06L84j97J38k51J22M3j59j39rk08
$$ -20 190 -189 -124 270 -22 219 270 41 56 46 49 37 32 -74 310 113 251 0 122 165 6 -133 -142 -350
4292c50O2J67P1M5R2k60J56P0q6j15L83n32J62L08R2R2k67j09j12J03L8Kq9%j12
$$ -350 -288 -121 -50 -5 87 -173 -17 53 -33 -148 235 -297 -135 173 265 357 90 -19 -131 -28 10 12 -77 -77 -189
4317a89K66J5O3k47J64K4j85j49l8R1J49J47k16j49L28l23Pj82L15K13q4J07p4
$$ -189 77 92 155 -92 72 96 -89 -238 -276 -185 -36 111 -105 -254 74 -249 -242 -424 -109 104 20 127 53
4340E3r4J42J6k33R6Q4J4n4L8m1n0k12J95M8P3J46l53N4K65l96K28J9J6l4k16
$$ 53 -41 101 117 -116 -20 64 78 24 62 21 -29 -241 -46 2 75 221 -132 -78 187 -209 19 38 54 20 -196
4365a96P8M5J16N5j2j89J62J43l08R0Pj08K08M8j57J89j02j01J71Lj46l14K12
$$ -196 -118 -73 43 98 86 -103 59 202 -106 -16 -9 -117 91 139 -18 171 69 -32 139 142 -4 -318 -106
4388a06J2M2n3M3j92K21P8j2k62L44p2R9k60m9J78j1O4j5j0J22j91k7L7K54l00
$$ -106 -94 -52 -105 -62 -254 -33 45 33 -229 115 43 142 -118 -167 11 0 64 49 39 161 -30 -57 -20 234 -66
4413f6n6J85j9k03K19q4l5l4J73k03K9L5K3J24l9j20R5K5N9R2J00l60J0P7%j18
$$ -66 -122 63 44 -159 60 -24 -59 -93 80 -123 -94 -59 -36 88 49 -71 24 49 108 200 300 -60 -50 27 27 -91
4439i1L49J16n11K42O7J79n12J77k5J88L1k17q9K88j08k11R8l25M37Rj47j6p6
$$ -91 258 374 -137 105 172 351 -161 16 -9 179 210 -7 -96 192 84 -127 -29 -354 83 92 -55 -71 -147
4462a47lL65k14l7J7J73M2j93M8j45LK41O1rl83K72j88J83j93m2J79J82p0j12
$$ -147 -150 215 1 -36 -19 154 196 3 51 -94 -91 150 211 202 -181 91 -97 86 -107 -149 30 212 142 30
4486C0j88K78j70l0n6j90n2O67m09K31k35J28k58J40K01N4j31R0j1j28n0m9J33
$$ 30 -158 120 -50 -80 -136 -326 -378 289 -120 111 -124 4 -254 -114 87 141 10 100 89 -39 -89 -138 -5
4509eL9J41l87L76k81L08m20K51o7k11J64n0J31j3J61NJ6j60N4k12O3k03P5J78
$$ -5 34 175 -212 164 -117 191 -229 22 -45 -256 -92 -142 -11 -24 137 142 158 -2 52 -160 -97 -300 -225 -47
4533d7J14K1p5K3k6K23k85K17k67K50k93J38m08M54K99o30K06M6P7j38J75k9M9
$$ -47 67 88 13 36 10 233 -52 165 -102 148 -145 -7 -415 39 338 -292 -86 -40 37 -101 74 45 94
4556I4l15R1J82l1j69K25p1J05J81k15M5k0j71j42J78M5K4n6O6k51J29k31L09
$$ 94 -221 -130 52 21 -148 77 6 111 292 77 122 102 -69 -211 -33 12 36 -20 46 -205 -76 -307 2
4579BJ10j39J30J23Q2n21n8L46k13Q2j50O2J03J58J38k34J60l2l5k19K67m23J82
$$ 2 112 -27 103 226 308 -213 -271 75 -138 -56 -206 -144 -41 117 255 21 181 149 114 -105 162 -261 -79
4602g9n9K2j41L28K07m01K78k03J80r8j25J64l3pR6j30k88M81k32q6J21K1n0l7
$$ -79 -138 -116 -257 71 278 -123 155 -48 132 34 -91 73 40 33 129 -1 -289 192 -40 -126 -5 16 -34 -71
4626g1k83M31J36M2l56k4P5r9P2J76q6n1j62K80J40l13J31k29K0L55k33O9j89
$$ -71 -354 77 213 255 -101 -125 -50 -149 -77 99 13 -38 -200 80 220 -93 38 -191 -171 184 -49 20 -169
4649a69J68J94l79L6J33Q0k31O9L13j40k00K37k47J27J13K4R9j07l7q2J87m5k11
$$ -169 -1 193 -186 -150 -17 63 -168 -99 214 74 -126 111 -136 -9 104 128 227 120 83 1 188 143 -68
4672f8K11k02K1R8O0j20o6p9n6L73k64K08l91L84k6k45J75j66M2O3k20L00r6K13
$$ -68 143 -59 -38 60 120 0 -66 -145 -201 172 -92 116 -275 109 83 -162 13 -153 -111 -48 -268 32 -64 149
4696A49j30k13K29r8L22j24k21j6J07J8K17k16m9N0j83K03P4k94L44n24J23L58
$$ 149 19 -194 35 -63 259 135 -86 -102 5 23 240 24 -25 25 -158 45 119 -175 169 -355 -232 126
4718A26k87RJ62k0j81J88j6j12J18j63p3L50N1j45M6j46J77n1J25l05K2K50j94
$$ 126 -161 -152 10 -10 -191 -3 -19 -131 -13 -176 -249 101 152 7 53 -93 84 33 158 -147 -125 125 -69
4741f9P9k3j37N5M8K5nj38Q6K82k10n2r7O9PK58k18J3OP1M8J46m72K86N9p9J32
$$ -69 10 -13 -150 -95 -47 -22 -27 -165 -79 203 -7 -59 -156 -87 -80 178 -40 -27 -21 50 98 244 -228 58 117 38 170
4768A70j12J49j99J4qJ57j33q2L50l58j55K18k28L6K84k44O4L30l41P7P1o0L5
$$ 170 58 207 8 22 14 171 38 -44 306 -52 -207 11 -217 -181 103 -141 -77 253 -88 -11 60 0 35
4791C5k4N6j34K74m11K76P3k87L28k12J33j59n4K43n2k65K01n4j10O9r5J10n6
$$ 35 11 67 -67 207 -204 72 145 -142 186 -26 107 -52 -106 137 85 -180 21 -33 -143 -74 -169 -59 -115
4814a15J05k0l2J65k17J6K0J32j06K52r7j06k28J88J34j84L7K11M3j09L40l79
$$ -115 -10 -30 -62 103 -114 -98 -78 54 -52 200 103 -3 -231 -43 91 -93 -56 155 198 89 429 50
4836E0Rk71K83j52J46L2M6j04m0R0o5L7j06j11J49j6M1o1L7M7j0l3Q6J8j40R7
$$ 50 59 -212 71 -81 65 97 143 39 -1 89 24 61 -45 -156 -7 -23 18 -43 -6 41 31 -2 84 102 -38 59
4862E9K50l87K24k4M7Qj8K2j68Q3j56R2l9P3J97l25J66l45K97J34l09Q4N1l6q2
$$ 59 309 -78 146 122 169 177 159 181 13 96 -60 32 -7 66 263 -62 104 -241 56 190 -119 -35 16 -20 -102
4887a02J36k9l6JJ17k35K05K79m36N5J38r3K20j81rP5j05k35N45m31J94k19K17
$$ -102 34 5 -31 -30 87 -148 57 336 -100 -45 93 0 220 39 30 105 0 -235 310 -121 73 -146 71
4910G1m39L5N49m41J99N4q9M8O8j56K52k54J49j20k9J68Pj5l1R4M1k21J70n4j15
$$ 71 -368 -333 216 -225 -26 28 -61 -13 55 -101 151 -103 46 -74 -103 65 72 57 26 120 161 -60 110 56 -59
4935e9J29P1m03L60j21K6j30L4Q1k59P3J48J87k61K3K00j60m0K21J54k96P9k80
$$ -59 70 141 -262 98 -23 3 -127 -93 -12 -271 -198 -50 137 -124 -101 99 -61 -101 120 274 -22 57 -223
4958b23L34K1j5j44J47m0J42J7j71o4M9K2l9o8k1K21j42O0M3j72j78L4M0L6J03
$$ -223 111 132 117 -27 120 80 222 239 68 4 53 75 36 -32 -53 168 26 86 129 -43 -221 -187 -147 -111 -8
4983hNr9j73K87j65K14j75L0N4j27n6M51m8k88j50K94j33J45j84J24J47P1Q4k23
$$ -8 -3 -102 -275 12 -153 61 -114 -84 -30 -157 -213 238 190 -98 -248 46 -87 58 -126 -2 145 216 300 77
5007G7J5n0K47n98L32m5J5j53M04k45J85q3j21j8q4J05k41L02J0m5m2P9L5j11
$$ 77 92 42 289 -309 23 -22 -7 -160 244 -1 184 101 -20 -38 -122 -17 -258 44 54 9 -33 46 81 -30
5031c0k7K51m04L55Oj14J76l23M68l33J44l17%K11k71K09J16J0m02M47m3j08L1
$$ -30 -57 194 -210 145 151 37 213 -110 358 25 169 -148 -148 63 -208 1 117 127 -275 172 129 21 52
5054E2k2N6l7K23q1l99M5M27k94rm8m5O8J98J0k68K61j70n9P1J23l86L18KO8k
$$ 52 30 86 49 272 191 -208 -163 264 -30 -39 -87 -132 -64 134 144 -124 137 -33 -92 -21 102 -284 34 36 104 102
5080A02j24J60j3l22N05m66J86N3k39J20k10K73j63j25J10N12l23Lj14K8L8l3
$$ 102 -22 138 125 -197 308 -158 28 81 -158 -38 -248 25 -138 -263 -153 359 36 39 -75 -47 -9 -42
5102d2p0M03m11J13Q2K5k69K94j94K75k44j12K57l76L67l20L36L2J36l41J45k08
$$ -42 -112 291 -120 -7 75 100 -169 125 -69 206 -38 -150 107 -269 98 -222 114 146 282 -59 86 -122
5124a22l4J44j9o2J36J2k10J39J05l63L16N1k31Q7J67j36p2L09k41j78K91j23
$$ -122 -156 -12 -31 -93 43 55 -155 -16 89 -274 42 93 -138 -51 116 -20 -92 217 -24 -202 89 -34
5146c4K39k44j58J0K51k6j91L08j0j08R2o8J63k84J4k3qOK70l86K44j24n0J84
$$ -34 205 -39 -197 -187 64 38 -153 155 145 37 129 61 224 -60 -46 -69 -77 -71 199 -187 57 -67 -117 67
5170F7M6P6l37m2K7J41L1Q1j54O4J8j07K35J00j47q4j8J9K25j3j87k35M27j10
$$ 67 113 189 -148 -190 -163 -22 9 90 -64 0 18 -89 146 246 99 15 -3 16 241 228 41 -194 233 123
5194A23r5J63K7j90N7J37n04M80Kl38J78qk96K28k16J27K87o0j00K65k70k04j14
$$ 123 28 191 218 28 85 222 -282 198 200 -138 40 32 -264 -36 -252 -125 162 102 2 267 -3 -207 -321
5217c21M08n7o2J36l7J70j69K4k22K47j20N7K7q2n1o7J21j21r6J24Nk2Rj13L54
$$ -321 87 30 -32 104 67 237 68 92 -130 117 -3 54 81 -1 -52 -119 2 -119 -215 -91 -86 -108 -99 -212 142
5242A42j55j30J99P2k37J25K12l72K80J42l64L01k09r9q6K38m8n1J58k19N05j34
$$ 142 -13 -143 56 128 -109 16 228 -144 136 278 -86 215 6 -93 -179 59 11 -40 118 -101 404 270
5264B70m05J07j69J73O7m57M69r2Nm5q8L06k54j16J92J27kj78J21O8p1R9k94P3
$$ 270 -135 -28 -197 -24 43 -414 55 -37 -32 -77 -165 141 -113 -229 -37 90 88 -90 31 99 28 127 -167 -94
5288i4J59J2N3j89O0j19k6M22j52J7k5j58r4M9K08k66J95k75o1L63M6n8p9k58
$$ -94 65 77 130 -59 1 -118 -144 278 126 143 118 -40 -134 -85 123 -143 52 -223 -284 79 125 67 -12 -270
5312b70K74j88M96l22K2J32k43L92k91J24k9j79J64J44j67l6J1k0J14j36p4O1
$$ -270 4 -184 312 -10 12 144 -99 293 2 126 97 -82 82 226 59 23 34 14 128 -8 -82 -21
5334b1m7K21k58M6l21O09k50m4Q8j56Q1LN1k4J42j22r2q9J64p8J38l4k42K19j57
$$ -21 -68 153 -105 -59 -380 229 -21 -65 23 -133 -52 -49 2 -22 120 -2 -94 -183 -19 -97 41 7 -235 -16 -173
5359a73K33j10p1O9k2J50l8k19q1M07j09l62L11j99l0J25K51k3n2J15n0j90Q8
$$ -173 60 -50 -121 -52 -74 76 38 -181 -262 145 36 -326 -15 -214 -244 -119 132 109 57 172 122 -68 20
5382B0K8Q5p6l7J76k37J91r9j08l2K59l80K65M1J31m00K26k40o1K81l4k85K16
$$ 20 48 133 57 20 196 -41 150 51 -57 -89 170 -210 55 96 227 -173 53 -187 -248 33 -1 -286 -70
5405g0K32l76j30J86N55j21r9p5j21Q2K0Q4J7Mm21L88J87l79L4lJ6r1K17lM1J10
$$ -70 162 -214 -344 -158 397 276 177 102 -19 63 83 167 184 188 -233 155 342 -37 -3 -6 10 -81 136 133 174 284
5431B84k75J99K8m70L31p2J60j55L83n25L9j82O09k05P9j97nJ67J8k20q2L32j65
$$ 284 9 208 236 -234 97 25 185 30 413 -112 -73 -255 354 149 228 31 26 193 211 -9 -91 241 76
5454G6K86j73l08J0K43l81J62P7j3k26N7k84K42K53j10N2rp7l1L36r5k3o4j02
$$ 76 362 189 -119 -109 134 -247 -85 -8 -21 -247 -190 -474 -232 21 -89 -37 -46 -123 -154 182 87 64 0 -102
5478a02N7L07k92Q8j9k26L68P7p7m32L51k0n1j0O1k09J73j59Q2J67k80N2N8J65
$$ -102 -45 262 -30 58 39 -187 181 258 181 -251 100 80 29 19 80 -129 44 -115 -33 134 -146 -94 -36 129
5502A29j55m9O8k9n3K70k73M9K77l52l2L92l83K73k64K30Q8j87j71M48j63k06
$$ 129 -26 -75 -7 -36 -89 181 -92 -43 234 -118 -150 242 -141 132 -132 98 186 -1 -172 276 113 -93
5524i3P5J01Q8j68J37n48N84k38L2j28J35j51L18O6q9m21K41J40j02Q8O2j54J48
$$ -93 -18 83 171 3 140 -408 176 -62 -30 -158 -23 -174 144 210 121 -300 -59 81 -21 67 129 -25 123
5547A23j30j83K52R6ml26K08k63L36k18L53k01j16k08K28N0j21o8K08J90k03j42
$$ 123 -7 -190 62 158 154 -172 36 -227 109 -109 244 43 -73 -281 -53 -3 -124 -192 16 206 3 -139
5569a39K7K33l79L99j23P4k76J76K46j81J9j01Q5J4j38J79j9r2Mk1p4j52L22j01
$$ -139 -112 121 -258 141 18 92 -184 -8 238 57 76 -25 60 74 -64 115 96 4 8 -13 -87 -239 83 -18
5593a8j3jl5p4j07J61Q1J4j8k48J75R7K7j43K13k0P5m4M4k79j5Q2j3nr2J66L69
$$ -18 -31 -32 -67 -141 -248 -87 -6 8 -10 -258 -83 14 41 -102 111 91 166 122 166 -113 -128 -46 -59 -64 -156 10 379
5620C79j80l34J45l88M43K44j48j39k33J09j5K67J2q3k67K70k38K14rj81K08R7
$$ 379 199 -135 10 -378 65 309 161 22 -211 -102 -117 150 162 79 -188 82 -156 58 49 -132 76 173
5642A73J34l03j78J04J2M8J11N8m4Ol0j05n4J57k65J08J96R5m23K98l14RJRk5
$$ 173 307 4 -174 -70 -58 -10 101 159 115 121 91 -14 -68 89 -176 -68 128 223 -200 98 -216 -207 -206 -197 -222
5667b22J84N0j00K01j26K86l12R5J42j62J99m5j0j38J1N5o8j84K44n0k65L4P8
$$ -222 -38 12 -88 113 -13 273 -39 56 198 36 235 190 180 42 53 108 40 -144 100 50 -215 -181 -103
5690a03PJ7j29J49PJ08m7mL3M6Pj40J01p8j59P0j52J47J16l26L5M14%k12L0j31
$$ -103 -96 -79 -208 -59 -52 56 9 5 38 84 91 -49 52 -26 -185 -115 -267 -120 -4 -330 -295 119 119 -93 -63 -194
5716a94L43k20j03K6J44q5K50j17j10K10j84m4J34N3k6k66J52J7K47j52j40J76
$$ -194 149 -71 -174 -148 -4 -89 161 44 -66 144 -40 -84 50 103 77 -189 -37 -20 227 75 -65 111
5738A11k19J9Q4P5j46o5J42O9L8%P4r1k66N4K15k72R6K55j88o3l92M97l0P0o8
$$ 111 -108 -89 -5 70 -76 -141 1 70 108 108 182 91 -175 -121 94 -178 -82 173 -15 -78 -470 27 -3 67 -1
5763an3J16l12K98O2k47o3L77m1l8n8j41J32J4L36l93mJ95l44K31J16k31L7p6
$$ -1 -54 62 -250 48 110 -137 -200 177 136 98 40 -101 31 45 381 -12 -16 179 -165 66 182 -49 -12 -88
5787h8q8j62K91Qj56J25l7n3Q1o2QJ08L9KJJ34k06o4M70m14J09P5K49m04K43j1
$$ -88 -176 -338 -47 -39 -195 -70 -107 -160 -79 -141 -133 -25 14 16 17 151 -55 -119 351 -63 46 121 370 -34 209 198
5813A98k58J03J07j92K17j75k46M57k11O9j54j20J52Q3r4M8k32M5M7L2l74M39
$$ 198 -60 43 150 -42 175 0 -246 211 0 69 -85 -205 -53 30 -64 -16 -248 -203 -156 -124 -498 -59
5835e9Q3r4J49k25J62lJ82j12k7R7j4j67K17lk71j33K56j8l43K48J00o8P2K1j35
$$ -59 24 -70 79 -146 16 13 195 83 56 153 139 -28 189 186 -85 -218 38 20 -323 -75 25 -43 29 50 -85
5860h5J17QL1m9r8pj55K15j18J24p8J21J04%N3j97J49j1k98L65j30o3L9J77l21
$$ -85 32 40 71 22 -76 -83 -238 -23 -141 -17 -95 26 130 130 183 -14 135 124 -174 191 61 -2 37 214 -107
5885a07J71j35K21j43j71J5q2J75j78K78N4k04K01l64L39O8j65J67j71K32k34
$$ -107 64 -71 150 7 -164 -149 -231 -56 -234 44 98 -106 95 -269 70 138 -27 140 -31 201 -33
5906c3K87j54M2j44M5p2R7l1r1M8Q6N7o7j6k08l7K88N1k08j7J63N6r5m1n6J85
$$ -33 254 100 142 -2 43 -29 68 37 -54 -6 80 137 70 54 -154 -191 97 148 -60 -77 86 142 47 6 -50 135
5932A35m2n4k9k18K38j13j8J00J11mkJ8l1J1O8p0n9NrJ05k03J06j08JJ96J34k45
$$ 135 93 39 10 -208 30 -83 -101 -1 110 106 104 122 91 102 170 100 41 46 37 142 -61 45 -63 -62 134 268 23
5959B3N1L73o05L32l58J44N2j12J50J74l38q0L78k35J15J64k15J03j77K2j67o3
$$ 23 74 447 -158 174 -184 -40 12 -100 50 224 -114 -194 184 -51 64 228 13 116 -61 -39 -206 -269
5981b69J92k14L33k48L13q5LJ88m31K54J92k76l7J05l9P8J34p4j09J0L25m08K98
$$ -269 -77 -291 42 -206 107 22 25 213 -218 36 228 -48 -85 20 -19 59 193 119 10 20 345 -63 235
6004B35j41j71K41r9p4M2k3J12M9j50Q0j31j6k56J53M6K5J35j01j11K82k08K47
$$ 235 94 -77 164 65 -9 33 10 122 171 21 101 -30 -46 -302 -149 -103 -78 57 -44 -155 127 -81 166
6027A66k16jL1JJ57k85K08L80m63M0MP8l09J15M5P3j9O6R7k05Q3p5N6K5J27j36
$$ 166 -50 -51 -20 -19 138 -147 61 441 -22 18 22 100 -209 -94 -49 24 5 71 168 -37 46 -29 27 52 179 43
6053D3rJ34o0Q6k16k4M3qj25oP0J71K6l33M11n5j61K7J47j09J75k39J16j98j16
$$ 43 34 168 108 194 -22 -46 -3 -11 -136 -142 -72 99 125 -208 203 148 -13 14 161 52 227 -12 104 -94 -210
6078b10K87k25L87j50L3l77K04K02k45K57p0k49N3n4J49K70m11j98M25J11P8k12
$$ -210 77 -148 239 89 122 -255 -51 151 -94 163 93 -156 -103 -157 -8 262 -149 -347 78 189 267 55
6100E5L1k52K43j93N1J32k8J38k42K05q1J68k17K5j95K53Rk00J74Q0m31R4K85
$$ 55 86 -166 77 -116 -65 67 39 177 -65 140 59 227 10 35 -160 93 102 -98 76 156 -275 -181 104
6123A04R3j95p4J09L67j78j70K14k52o8J94n2j10j22j85K17J99j05J12k34K30
$$ 104 197 2 -72 37 404 226 56 270 18 -50 144 92 -18 -140 -325 -108 91 -14 98 -136 94
6144I4o8m3o3R4j25J37n4k71K25L14j47l23N0RJ97J8R1J44k86MK65k62k34oK46
$$ 94 26 -17 -80 14 -111 26 -28 -299 -74 240 93 -230 -180 -171 26 44 135 279 -7 -3 262 0 -234 -240 6
6169Fl9J22j81J89j3J46k23j21rj59N29j11o2kp9L7Q7k54K60k14p3J26K92o7j84
$$ 6 -33 89 -92 97 84 230 7 -114 -123 -282 247 136 74 72 -7 30 117 -137 123 -91 -164 -38 254 187 3
6194CJ69j29l1j70K41k27L49k04K52N4j24J84n62J17J39j88K04m40L77m5Q7J00
$$ 3 172 43 12 -158 83 -144 205 1 253 307 183 367 -195 -78 61 -127 77 -363 14 -31 56 156
6216A56k30j54K94o5K6j42K55j9l07L98j68J62j85L35k27j04j30K50J72k55Q4
$$ 156 -74 -228 66 1 27 -115 140 121 -186 212 44 206 21 356 129 25 -105 145 317 62 146
6237A46K9l11K53j70P3j26L06m26M74l56l2K31o8L4K25j81J65l31Qp4M7J12K94
$$ 146 175 -136 117 -53 20 -106 200 -226 248 -108 -140 91 23 57 282 101 266 -65 -57 -131 -84 28 322
6260C22j95l78K48L5k62K01M0J5j13p8J66oj47K67j79n2K04n9k67L57L2l82K71
$$ 322 127 -251 -3 32 -230 -29 11 26 -87 -165 1 -5 -152 115 -64 -116 88 29 -238 119 151 -231 40
6283D0Jn3M7J61j30j69K96n0J42j87K67m62p9K90j18j19kL46l40J52j11J47l83
$$ 40 41 -12 35 196 66 -103 193 143 285 98 365 -97 -176 114 -4 -123 -125 221 -119 33 -78 69 -314
6306c14L41M7j34j26K27j5m31K46K91j79O5k65l5O3K03J12J58k72o1J29K72l70
$$ -314 27 74 -60 -186 41 26 -405 -159 132 -47 18 -247 -282 -219 -16 96 254 -18 -79 50 322 -48
6328d8J4L4j47M33l98K53k10J45j32J83Ll4r5j22K22k66P0K24m1m6k15o7M17k17
$$ -48 -34 0 -147 286 -112 141 -69 76 -56 127 130 96 1 -121 101 -165 -95 129 88 42 -173 -240 177 -40
6352d0K51R0l70J63j23J58p7l60L87J02J80m00K30l79j16M04j10R9p1j69J29P4
$$ -40 211 301 -69 94 -29 129 52 -308 79 181 361 -39 191 -188 -304 100 -10 89 18 -151 -22 52
6374E2o0o7k7J80q9K71l82J44J91l10j7N8j31L32K6j59J96j49n4L8MK60n56K58
$$ 52 -8 -75 -102 78 -11 260 -122 22 213 -97 -114 -56 -187 145 171 12 208 59 5 43 47 307 -249 9
6398Ik1j54K69j44M6Qj90n8L67j69L3J34J97l28KJ4j88J47j0Q1j24J72j65k67
$$ 9 -12 -166 103 -41 5 13 -177 -235 132 -37 -4 130 327 -1 1 15 -173 -26 -36 45 -79 93 -72 -339
6422c39L37j07J66Q4r5j92M14l10J70k14J97j47j1J01k5q1J89l00Q4J35j15J61
$$ -339 -2 -109 57 141 46 -146 268 -42 128 -86 111 -36 -47 54 29 -52 137 -163 -79 56 -59 102
6444A02l07M08j38p1j55L17j25j47q6K17n8J80k80M5L38j50q4j02K30l18m6M30
$$ 102 -205 203 65 -6 -161 156 31 -116 -202 15 -43 137 -143 -98 240 90 6 -96 134 -184 -230 200
6466B00l09K11l51M94j34k40K7J11Rl6J8%R2k09M8K75k84K3L9L7k46J54JJ84m7
$$ 200 -109 102 -249 245 111 -129 -102 9 18 -18 0 0 92 -117 -69 206 -78 -55 -16 21 -225 -71 -70 114 67
6491F7j14n1o9K29r8R3k25K45j28n0K14l57L82k50K26l12K26l06K18K4k0j23L53
$$ 67 -47 -98 -167 62 -36 57 -168 77 -51 -101 113 -244 138 -112 114 -198 28 -278 -60 -36 -56 -179 174
6514A74k87R2Ln1J44j15N2m1k35J41J45j18M13K7l52j6K0J22j4r3lj47j20L93
$$ 174 -113 -21 -18 -69 75 -40 12 -29 -264 -123 22 -96 317 344 -8 -24 -4 118 104 11 8 -139 -259 134
6538A34j66M8j08K05n6L0J69k84m3n8J52M6r1J63q9L0q6p5J79j47M8J58k20n3
$$ 134 -32 16 -92 113 57 87 256 -28 -71 -129 23 69 -22 141 52 82 -4 -79 100 -47 1 159 -61 -114
6562a14K60k03N1p9J93K39k68m5l99K28KK61l00j4P8l5K76m8j40NL33O8k92j09
$$ -114 146 -57 -6 -85 108 347 79 34 -365 -137 -135 126 -174 -188 -110 -145 131 83 -57 -52 281 349 57 -52
6586e2J29j05K58m42M36k82q5K78k75J36L11l61J47j49J47k24J27M6o7L5k6K1
$$ -52 77 -28 230 -212 224 -58 -143 135 -140 -4 307 -54 93 -56 91 -133 -6 40 -27 8 -18 3
6608Clr1K20R1m46K75p2j7L36n9j45j41M3r4K34k81J76j06J2r0L17k07N7K3k08
$$ 3 0 -91 129 220 -226 49 -23 -40 296 237 92 -49 -6 -100 134 -147 29 -77 -65 -155 162 -45 12 35 -173
6633a73J14J99k99J47nk97J66j00J63R4j01K8L95l63r5K65j69O5kj72J16K75l24
$$ -173 -59 140 -159 -12 -17 -314 -148 -248 -85 9 -92 -64 331 -32 -127 138 -31 34 32 -140 -24 251 -73
6656g3L6J22o7r3M7J34k74N2M53k43j8k94j9M15m47J54K93j71j6J50k6j25n5J51
$$ -73 -37 85 18 -75 -28 106 -168 -116 337 94 76 -218 -237 178 -269 -115 178 7 -9 141 115 -10 -65 86
6680H6m9m3J33q9L7J52R1j77l07L45J39l84N0M0j0n4J07J67j00j46j21N48m23
$$ 86 37 -6 127 38 75 227 318 141 -166 179 318 -66 -16 24 14 -40 67 234 134 -12 -133 415 -8
6703hK67k38j87K78j23k7L01pj84l5j80K38rK6k30K54J5K45n58k3J49r3K02Qj87
$$ -8 259 21 -166 112 -11 -38 263 256 72 37 -143 95 86 112 -118 136 151 396 -162 -185 -36 -129 73 81 -106
6728a06J93P6l46rJ90mJ27j01o3k7Q1j72RK53pk00L1J23L3k43k6L19Q8j48j44
$$ -106 87 163 -183 -192 -2 -6 121 20 -43 -70 11 -161 -152 101 94 -106 -75 48 81 -162 -188 131 219 71 -73
6753g3J59p5P6k42L30P7k08j33J98J01q4q6k6J94l09j00J04J4J47k28l0N60n89
$$ -73 86 11 87 -155 175 252 44 -89 109 210 126 40 14 208 -101 -201 -97 -83 64 -164 -194 366 -223
6776b23lL74k59r9o6K27nJ6J01N1q8R3j58Q4M6K4j87L24l82k4K82k04j10K11M0
$$ -223 -226 148 -111 -210 -276 -49 -54 -38 63 114 26 119 -39 45 91 115 -72 252 -130 -154 128 -76 -186 25 65
6801F5k40k5L25J18l10J29O9k03K69q7J19r4j15j95K17j32K52j12K54p9k08m2
$$ 65 -175 -200 125 243 -67 62 131 -72 197 110 229 135 20 -175 42 -90 162 50 304 225 17 -25
6823b5K38j92o0l9O9K0Rk28J23O9L9l21K80K43j44k62K16l5R3J00j57J1J31l59
$$ -25 213 21 -39 -78 -9 11 20 -208 -85 -16 23 -298 -18 225 81 -181 35 0 93 193 36 47 178 -181
6847a81Q2J9J42q3J70j86k2R3KJ3R2p9m2oJ9k17j24K99n0j0J45L3k94J2O5K15
$$ -181 -99 -80 62 -21 149 -37 -59 34 36 49 141 62 20 14 33 -184 -308 -9 -59 -69 76 109 -185 -173 -108 107
6873A07j00P5k6o7M0L3j21j33K10J60j55L7j6j24K41r9P4l48J02m9Q3L93k36j7
$$ 107 7 82 56 -11 29 62 -59 -192 18 178 23 60 44 -80 161 62 136 -212 -110 -159 -76 317 81 64
6897F4m5j96K23j15L74k35k20j67J92K46k39K19k56J34J85l53K13K0k61K5J73
$$ 64 19 -177 46 -69 305 70 -150 -317 -125 121 -118 101 -155 -21 164 -189 24 44 -217 -192 -19
6918a9J61K62m80L9j6m0J84j42QnL7j19L66l43K4o4K33n6N5J06j09J23o30M22
$$ -19 142 404 -76 -37 -53 -93 91 -51 -43 -48 -11 -130 236 -107 -83 -147 86 30 85 191 82 205 -425 -3
6942cN8r1j77K89k64J19o9K5J18j4j76J05L09l49K08k31K87j73j07K05m7k22L45
$$ -3 55 -36 -213 76 -188 -69 -138 -113 5 -9 -185 -80 229 -120 88 -143 144 -29 -136 69 22 -200 145
6965A45N9k22j33N4J79l6q4J06O7P4j66r8P1oJ94o0j46O1K40m43M03k46r0K97
$$ 145 204 -18 -151 -97 82 46 -38 68 135 209 43 -55 16 10 204 144 -2 59 299 -144 259 13 -77 220
6989B20j95q1K54j36j83J41r3K16O7k03j47J27J1ro6J40k85M9K25j21J87P9p1
$$ 220 25 -56 198 62 -121 20 -73 143 210 7 -140 -13 -2 -11 -77 63 -222 -173 52 -69 118 197 126
7012A26m40J52J33J89l63J17j29J87o0J99j15l23R9K30j34J16M5j29ll0J66J30
$$ 126 -314 -162 -29 160 -203 -86 -215 -28 -88 111 -4 -327 -228 2 -132 -16 29 -100 -103 -133 33 163
7034A63j14o5J07k08J78j30j90M32j95jJ10l2j4q6j25J65J25j94K0J62j0k11K52
$$ 163 49 -16 91 -117 61 -69 -259 173 -22 -23 87 55 41 -45 -170 -5 120 -74 -54 108 98 -113 139
7057A39j17M89p62J34q4J39P7QK9j3m63N73l12L9J2M3J08n5J65j96o7j0O8M7r4
$$ 139 22 511 -251 -117 -201 -62 15 23 52 39 -424 149 -163 -124 -112 -69 39 -16 149 -47 -114 -124 -56 -9 -103
7082a03K6J30J93j15m0k41J72m9o3K42Mj46k36L02r8J21j26R0J5j63q5l9K15N4
$$ -103 -77 53 246 131 91 -150 22 -27 -90 152 156 10 -226 76 -22 99 -27 63 78 -85 -170 -209 6 60
7106F0m6m3R8j01p1J39j14J42j40K6K82j95r5J06j57O5o9j8R0K7R3j4k18N3O5
$$ 60 14 -29 69 -32 -103 36 -78 64 -76 -50 232 37 -58 48 -109 -44 -113 -131 -41 -14 79 65 -153 -100 -35
7131c5ON8L1N0K96l42n7r1qJ04mk50L13k4k23N90j10n26K18m5L09l12k14R1K06
$$ -35 -29 29 60 110 406 64 7 -84 -92 12 8 -242 71 47 -176 414 304 -222 -4 -49 260 -52 -266 -175 31
7156C1j24K20j26K83k11l8jj85L37m31j10M65o3j38L99l26J35J04m09N12n03K97
$$ 31 -93 127 1 284 73 35 34 -151 186 -245 -355 110 47 -91 308 -18 117 221 -188 324 -179 118
7178A18j15J36j6l12L00j79O5p6r4QK30q8J17l12R3K1q7L3K02k8l4k69K84K8J4
$$ 118 3 139 123 -189 111 -68 -3 -79 -173 -165 65 -23 94 -218 -125 -104 -191 -158 44 16 -18 -287 -3 25 39
7203C9j60J72J5n2J47j19K93k80Pk03Q4MJ70l81L64q8J38q9R3l32K01j34J28J08
$$ 39 -121 51 66 14 161 42 335 55 62 -141 -57 -53 117 -264 100 12 150 61 154 -178 23 -111 17 125
7227A25n9j21p1K18L5m8p8L0J86m51J19L41j28k16J54l7Ro8J69J10j46J36l2r9
$$ 125 66 -55 -126 92 127 79 1 31 217 -234 -115 226 98 -118 36 -1 8 -60 109 219 73 209 177 78
7251G8m73M1N74k49n2m0L0kp5kO0p4M19j86k1k3j23K65j28Q0j10P4j25K9L60j85
$$ 78 -395 -354 220 -29 -81 -121 -91 -93 -168 -170 -110 -184 235 49 28 5 -118 147 19 99 -11 63 -62 -33 327 142
7277A42k32J73j9j66k1J47k75o6K56j12L32J66k77k89L1J54J8J9J52l32P4J18
$$ 142 -90 83 64 -102 -123 24 -251 -317 -61 -173 159 325 48 -241 -210 -56 -38 -19 133 -199 -125 -7
7299gQ7k92K48J25k36M9N1p0P7O8n2J2J10M2j32q6j43J96j07J14j04L9N0K1K77
$$ -7 80 -212 36 161 -75 -26 25 -45 32 100 48 60 170 212 80 -6 -149 47 -60 54 -50 -11 39 60 337
7324C37l74o4J86k0k12Q8J35j94J79MMrJ25j39n1J65o7R8k1l23L22k00J72k63
$$ 337 -37 -101 85 65 -147 -59 76 -118 61 65 69 60 185 46 -5 160 93 191 170 -153 169 -31 141 -122
7348a22L6L38l93n1J91j15o7j89L67j75J17j4K28q5j33J4J05K0m4M7J23P8k12
$$ -122 -86 252 -141 -192 -1 -116 -183 -372 -5 -180 -63 -77 151 66 -67 -53 52 72 28 75 198 276 64
7371F4n4K29j98j59j27Q9K96l42K43k01K04k13K14J6J28k01lk3j34L9J43N5J59
$$ 64 10 239 41 -118 -245 -156 140 -202 41 -160 44 -169 45 61 189 -12 -15 -38 -172 -133 10 65 224
7394B24j13k45K56l32O7R1J02L2k29J16J3m6L22k03o7K66j88l24K35r6L11l19
$$ 224 111 -134 122 -210 -143 -52 50 82 -147 -31 -18 -64 258 55 -12 254 66 -258 -23 -119 192 -127
7416a27J90M1j07Oj51K57R7k26J36j24K3j65L05j17k4o7N6j24N1m5p6K50j63O4
$$ -127 63 104 -3 3 -148 109 206 -20 116 -8 15 -150 155 38 14 -53 3 -121 -70 -115 -191 59 -104 -40
7440d0l12L17K32j53j46O4o9L8q4k3J51p7j96M34k81L11j89N0j2j29P4o7N0P1
$$ -40 -352 -35 197 44 -102 -38 -107 -69 -153 -176 -25 -102 -298 136 -145 166 -23 27 15 -114 -40 -107 -57 14
7464A4k80M13k77K21k64P2L08l38M7J04R0r9l4Q7j24N8j04M7N3K9m8J97m01L87
$$ 14 -266 147 -130 91 -173 -101 207 -131 -84 20 110 11 -23 64 -60 -2 -106 -59 -6 23 -25 172 -229 158
7488A58j62Mn5q7L28k51K43k50m6K20k75L22J37j55j38r3j73K32J76k82L4J33
$$ 158 -4 0 -55 -142 186 -65 178 -72 -118 102 -173 149 286 131 -7 -100 -273 -41 135 -147 -113 20
7510B0K3p5o9K07k26j24L33J51n22j00K45P7J72j54K4K61n5k97K24m30O67k95
$$ 20 43 -32 -101 106 -120 -244 89 240 -282 -382 -137 -60 112 -42 -18 243 188 -109 115 -315 352 57
7532E7K9j76L52l46L7P1k05j00K40L12k58N5o4j97j41M57k90K67k72J87R2q9j68
$$ 57 86 -90 262 -84 -47 24 -181 -281 -41 271 13 68 4 -193 -334 123 -167 100 -172 15 107 18 -150
7555a50K99k59J74j86k4P4p2m7M01p0k75Q7Q3q0N5j82J09J26J61m40r7L10J34
$$ -150 149 -110 64 -122 -146 -72 -144 -191 210 140 -135 -48 35 -45 10 -172 -63 63 224 -216 -313 -3 131
7578A31l85K76%j79N22k56j2o0j14j1n0m6J34j23L21j29O2k75L81j69J19P0k98
$$ 131 -254 22 22 -157 365 109 97 37 -77 -88 -138 -184 -50 -173 148 19 81 -194 187 18 137 207 -91
7601i1J04Q0r3Q3Q6l08J92m6q4K62k29J45k83K71r1j59J54M31l34j67n0J88j18
$$ -91 13 93 0 83 169 -139 53 7 -77 185 -44 101 -182 89 -2 -161 -7 424 90 -77 -127 61 -57
7624e7lr7J40L9j16J11K05k30K25k08K04k57k16J55K23l7pr6j79J95J93l04J16
$$ -57 -60 -157 -17 22 -94 17 222 -8 217 9 213 -44 -260 -105 118 81 74 -22 -201 -6 187 -117 -1
7647aJ45j32o9J94r2o2q9P4J46J90l50K84j89q1P1k06n3K67J9l6p8K43p6j81m4
$$ -1 144 12 -57 137 45 -17 -106 -32 114 304 -46 238 49 -32 39 -167 -220 47 66 30 -48 195 119 -62 -106
7672a06l9J11RJ80k91J76q0m1J45q7J01k49P3J74j47l09K91j05L28j60j80M80
$$ -106 -145 -34 -25 155 -136 40 -40 -81 64 -23 78 -171 -98 76 -71 -380 -89 -194 134 -26 -206 274
7694B74l24K27j13r3j65N36m18o7K86J93k18O5l56O1O0m6O6p4M64o14L9K85j61
$$ 274 -50 177 64 -29 -194 342 -76 -143 143 336 118 183 -173 -112 -52 -98 -32 -106 358 -256 -217 68 -93
7717i3J74l15J23n5J71K33k27j15J37K00j47j83J24l8J45j56O0QJ42k81J22r1
$$ -93 81 -234 -111 -166 5 238 11 -104 33 233 86 -97 27 -11 134 -22 38 46 188 -93 29 -62
7739f2K33j70qJ66j27J71j29j23j34J72M1J23l0j86J24j31J42q9j01Q4N4o7Q9
$$ -62 171 1 -7 159 32 203 74 -49 -183 -11 30 153 123 -63 61 -70 72 -17 -118 -34 20 -47 42
7762D2q4M3k0o2K03k18O5L1j51L1L58l08pJ52k68L10j57K4J37L8P8m16J57L7r5
$$ 42 -42 1 -19 -81 122 -96 -31 0 -151 -120 238 -70 -77 75 -193 117 -40 -16 121 159 237 -179 -22 15 -80
7787h0J29O2k82J84J00l8j67jJ07l52L21R1j65K17k5m72M19r7o2P0Q5j04K86m14
$$ -80 49 111 -171 13 113 75 -92 -93 14 -338 -17 74 -91 126 101 -371 48 -49 -111 -41 44 -60 226 -188
7811a88J94N7k08M13j19l90J20N8J41j64J32J20k68o2K16J11n0j36J63n04K96
$$ -188 6 63 -145 268 149 -241 -121 -63 78 -86 46 166 -102 -164 52 163 113 -23 140 -364 -68
7832f8J64j15m7J3J97j53k02J8L20k17K14j26L52k78j44l16N74k12L88l63J17
$$ -68 96 -19 -66 -53 144 -9 -211 -193 127 -90 124 -2 350 72 -72 -388 186 -26 362 -1 116
7853A16K7J51k40j13J26R3j15J08J53m60r2J17O7j72M68j98J79j40mk07L00k20
$$ 116 143 294 54 -59 67 160 45 153 306 -154 -246 -129 -62 -234 234 36 215 75 71 -136 164 -56
7875e6n3J33j87R6J34o7J46L9j22j70K81k56P2P3K45j6l30J15L0m2J80m18n8L20
$$ -56 -109 24 -163 -67 67 0 146 185 63 -107 174 -82 -10 63 308 292 -38 77 107 65 245 -173 -231 89
7899H9n8l77L28k9P4L5j39J17j01Q4j47K66Nml92L12o7j46L51k25pJ86k21K01
$$ 89 31 -346 -18 -47 27 62 -77 40 -61 23 -124 142 147 143 -249 63 -4 -150 201 -24 -31 155 -66 135
7923A35l94L77J90k55j14J52q2j76K42k34J29L50m13K39k84R6k28J09J09J94k45
$$ 135 -259 118 308 53 -61 91 9 -167 75 -159 -30 320 -93 146 -138 -42 -270 -161 -52 142 -103
7944a03K2J24j40j3j08L70rL05l03o5j45J32mk27L39L0r5q9O9P8j06k9j18K33
$$ -103 -81 43 -97 -110 -218 152 143 448 145 80 -65 67 63 -164 175 205 110 21 90 168 62 33 -85 148
7968A48j21J07l2k78J90m3m01M90m7J84l58J38K19k86N8j0r1j1M12j21k97J61
$$ 148 27 134 102 -176 14 -29 -430 60 13 197 -161 -23 196 -90 -32 -42 -133 -144 268 147 -150 11
7990A1K2j82J71k08L59k40j6J42j27R8M6k06N39l87j03n9l1P5N2O9J5k34K65N3
$$ 11 33 -149 22 -186 173 -67 -83 59 -68 30 76 -130 409 22 -81 -140 -171 -96 -44 25 40 -194 71 124
8014A24O3k59J40J75k32R8M8k27p6q1K11K8LJ56k69J10K7J64n29K96q3J11k86
$$ 124 187 -72 68 243 11 109 157 -70 -146 -227 -16 12 15 171 -98 12 39 203 -326 -30 -113 -2 -288
8037b88K32K23q9l3j05q9K94k59J81L4m4J72j20K9j07J12j03j00P4P1j05J49k74
$$ -288 -56 167 78 45 -60 -149 145 -114 67 101 57 229 109 138 31 143 40 -60 14 85 -20 129 -145
8060a45LL4j76L73r2J99j56l6l3q6K23J9j59QQ3qM4j68n6M2q7L50j76jj08J00
$$ -145 -142 -108 -284 89 -3 196 40 4 -29 -115 108 127 -32 -24 59 51 95 -73 -129 -87 -174 176 0 -1 -109 -9
8086ijP3J33M9k4j31j4P1nl46J58R6n9j61J40p5r9M90j52l37j7K99j55K2J91k83
$$ -9 -10 63 196 245 221 90 76 147 142 -204 -46 50 -9 -170 -30 -105 -204 286 134 -203 -220 79 -76 -54 137 -146
8112a46n7J74k67K20J60l17K1L06r7J06k08L6J42K3o3n2l79N09n7j13oJ94J07
$$ -146 -203 -29 -296 -76 84 -233 -212 94 -3 103 -105 -69 73 96 33 -19 -398 111 54 -59 -65 129 236
8135B36k67l5J43m7j24j57L43Q1l37R0j41M66m08J76K0m8P2L4j79k7L4M5K11k6
$$ 236 -31 -66 77 30 -94 -251 92 173 -164 -74 -215 251 -157 19 39 -9 63 97 -82 -109 -75 -30 181 155
8159A55l9%J2l12J58q7j10J8pN30m93K72l72M14M0n7l15J3K27R0o20M03Q2j0j6
$$ 155 116 116 128 -184 -26 -113 -223 -205 -212 318 -175 97 -275 139 179 122 -193 -180 47 137 -483 -80 2 -8 -24
8184b4J60m1j91K26k24J3q1
$$ -24 136 95 -96 130 -94 -81 -162
8191a62
$$ Imaginary data points
##PAGE= N=2
##DATA TABLE= (X++(I..I)), XYDATA
0@%%%%%%%%%%%%%%%%Lj1J6j6J6j6J7k5L2l2L9m7N2o0P1q0Q8j02J15j27J42j60
$$ 0 0 0 0 0 0 0 0 0 0 0 0 0 0 0 0 0 3 -8 8 -8 8 -8 9 -16 16 -16 23 -24 28 -32 39 -41 47 -55 60 -67 75 -85
38h5J81k02K24k48K76l07L39l73M11m53M98n49O05o68P36q12R00r95J104j231
$$ -85 96 -106 118 -130 146 -161 178 -195 216 -237 261 -288 317 -351 385 -427 473 -522 582 -649
58f49J378j553J764k021K346k775L364m224N601q147J4342n6894o0461J40800
$$ -649 729 -824 940 -1081 1265 -1510 1854 -2370 3231 -4916 9426 -47468 -107929 32871
72C2871N902r9692J0520O3609l4432j9625L4619q314k6418L7238K4169k6852j7455
$$ 32871 38773 -60919 -50399 13210 -21222 -40847 -6228 -14542 -40960 -3722 20447 -6405 -23860
85b3860K2539J9609j575r984j114J4813J0413j4093m080O469n626N117J4116k0088
$$ -23860 -1321 18288 16713 6729 5615 20428 30841 16748 12668 19137 13511 18628 32744 12656
99A2656k6155K1767J9250l3670j3610K6440m724k2598P756O118j7443m89K0663
$$ 12656 -13499 8268 27518 -6152 -19762 6678 1954 -20644 -12888 -6770 -24213 -24702 -4039
112d039j232j9511l104J8838J4370j8142j2646K7984J3663k2370j311K1100n591
$$ -4039 -5271 -24782 -27886 -9048 5322 -12820 -25466 2518 16181 -6189 -7500 13600 8009
125H009q169K3641j410l1190J7011L1840k8282k9323L4418K0656l9933j2116L0477
$$ 8009 -160 23481 22071 -9119 7892 39732 11450 -17873 16545 37201 -2732 -14848 15629
138A5629m585k2510P505Q970j3141m063J0887m464j1352M342J0446N68j2752l354
$$ 15629 11044 -11466 -3961 5009 -8132 -12195 -1308 -5772 -17124 -12782 -2336 -1768 -14520 -17874
152a7874J6989N433j5691k010J6610L489r917J741M770k162N754M636r056m302
$$ -17874 -885 4548 -11143 -13153 3457 6946 -2971 -1230 3540 1378 7132 11768 2712 -1590
166a590J0578O236j1742n022R087J335o001n60J328m736j135P788m47j3706k092
$$ -1590 8988 15224 3482 -1540 7547 8882 2881 2321 3649 -1087 -2222 5566 5119 -8587 -10679
181a0679J4207M370j7216o531J7422L598j3012K05O520m488P64J0384n612j3979
$$ -10679 3528 7898 -9318 -15849 1573 5171 -7841 -7636 -1116 -5604 -4840 5544 -68 -14047
195a4047J0651J5808q813j4799O030J5518k433j1198r35O388M434j096l491l278
$$ -14047 -3396 12412 3599 -11200 -5170 10348 7915 -3283 -4218 2170 6604 5508 2017 -1261
209a261M00P468K237q934n193P122Q495o759j0056M229O601j782l855j629o27
$$ -1261 -861 6607 8844 -90 -5283 1839 10334 3575 -6481 -2252 4349 2567 -1288 -2917 -3544
224c544Q64M746k490p568J510O899P63n667l154N171K812k228l18M05l00J885
$$ -3544 -2680 2066 -424 -7992 -6482 417 1180 -4487 -7641 -2470 342 -1886 -2204 -1799 -2099 -214
240b14L986j582n813L820P029k546m849Q60M851l06k441J052j463j341K412Q23
$$ -214 3772 2190 -3623 197 7226 4680 -169 691 5542 5236 2795 3847 2384 1043 3455 4278
256D278m128l392M840J956o463k193L774R85l210j943L050L77l346P12K740M3
$$ 4278 150 -3242 1598 3554 -2909 -5102 -1328 -343 -3553 -5496 -2446 -2069 -5415 -4703 -1963 -1920
272a920k179J899K826j616K31K132J2q52J339K777l85l696K079L014n64l617l66
$$ -1920 -4099 -2200 626 -990 -759 1373 1385 533 1872 4649 4264 568 2647 5661 5097 1480 1114
289A114K782p95j399j342j790J208J442j587l608r47L582Q01l608j380J661K524
$$ 1114 3896 3101 1702 360 -1430 -222 1220 -367 -3975 -4922 -1340 -539 -4147 -5527 -3866 -1342
305a342m83q34N6n95K502L010k102k074J594M322O14l918l40K978J730q90k704
$$ -1342 -1825 -2659 -2603 -3198 -696 2314 212 -1862 -268 4054 4668 750 410 3388 5118 4228 1524
322A524m45O11J614M88m242k169K164K361j634m608K33K844R78k270j993N24K166
$$ 1524 1079 1690 3304 3792 -450 -2619 -455 1906 272 -4336 -4103 -1259 -281 -2551 -4544 -4020 -1854
339a854J466m99l150O99M638J131k438k004K437L520o34j708r46J506J373k18
$$ -1854 -388 -887 -4037 -3338 1300 2431 -7 -2011 426 3946 3312 1604 658 2164 3537 3319
355C319j033k353M83K768j010l140j290J403J809j481k045j053J023K075p71j506
$$ 3319 2286 -67 416 3184 2174 -966 -2256 -853 956 -525 -2570 -3623 -2600 -525 -1296 -2802
371b802n98N06L211p62j726N78J641K129p16j081L13J033J812n89j409k07M35
$$ -2802 -3400 -2894 317 -445 -2171 -1593 48 2177 1461 380 693 1726 3538 2949 1540 1333 1768
388A768K019j483k452M51P11M96j106j886n53M52J175q16j784l26R41J471m57
$$ 1768 3787 2304 -148 303 1014 1510 404 -1482 -2035 -1583 -408 -1224 -3008 -3334 -2393 -922 -1379
405a379k077J064J507J328m26j752R09K069J149n12j463R44J079P91r3k341K90
$$ -1379 -3456 -2392 -885 443 17 -1735 -826 1243 2392 1880 417 1361 2440 3231 3138 797 1087
422A087J759K48j555k413M24J876l95k293j306P61P99k51k96k078O44K358N3j248
$$ 1087 2846 3094 1539 -874 -450 1426 1031 -1262 -2568 -1807 -1008 -1259 -1555 -3633 -2989 -631 -578 -1826
440a826j336J301K548k69j336m1J635J529m53l13o64P15J523r8j647p37J200J030
$$ -1826 -3162 -1861 687 418 -918 -959 676 2205 1752 1439 775 1490 3013 2915 1268 531 1731 2761
458B761j327j194n93M74N37m36j359j119N09J646j362j340P18K85J233o24m98
$$ 2761 1434 240 -353 121 658 222 -1137 -2256 -1747 -101 -1463 -2803 -2085 -1800 -567 -1191 -1689
475a689L42K94J655J69r24q48J799K199j549k054J987Q12n85m21q7n25r74K041
$$ -1689 -1347 -1053 602 771 -153 -1001 798 2997 1448 -606 1381 2193 1608 1187 1100 575 -399 1642
493A642L19k827j110K291J375k319j992J495J548j257p83J34J82l48J379J097
$$ 1642 1961 -866 -1976 315 1690 -629 -2621 -1126 422 -835 -1618 -1484 -1302 -1650 -271 826
509H26k528l88K593J836k128k401K848J236o84m78p76lJ163R64j623j706J147
$$ 826 -1702 -2090 503 2339 211 -2190 658 1894 1210 732 -44 -47 1116 2080 457 -1249 -102
526a02J552o39j367j085R94J511m66r64r66N31J929K26k079j663K930J693k293
$$ -102 1450 811 -556 -1641 -647 864 398 -566 -1532 -1001 928 1154 -925 -2588 342 2035 -258
543b58j600J848J105j175P23N94k527k73M280r55m234P53L185o8k809k25J835
$$ -258 -1858 -10 1095 -80 643 1237 -1290 -1563 2717 1762 -2472 -1719 1466 1398 -1411 -1636 199
560A99N6k14q67J121j121p01K793L24l186m89M182O37l602n14K975m07r65N22
$$ 199 255 41 -826 295 -826 -1527 1266 1590 -1596 -2085 2097 2734 -868 -1382 1593 1186 221 743
578G43k13q93Q23R76j557r79R24J86K07p18j470O69J306j90j334o22J253M26O61
$$ 743 530 -363 460 1436 -121 -1100 -176 10 217 -501 -1971 -1302 4 -186 -1520 -2142 -889 -463 198
597A98r71j210K243J072j800L14J679j329j64K867m13m076K012L818k459k856
$$ 198 -773 -1983 260 1332 -468 -154 1525 196 32 2899 2486 -1590 422 4240 1781 -1075
613a075J215K312j397j883R08l98p42K21N56m55k049o7K862k28l280o4M030L09
$$ -1075 140 2452 1055 -828 80 -318 -1060 -839 -283 -738 -2787 -2854 8 -220 -3500 -3564 466 775
631G75l533J427J851r03N24J600q58j386K323J520j768l35P55Q2J129j139j675
$$ 775 -2758 -1331 520 -383 141 1741 883 -503 1820 3340 1572 1237 1992 2074 3203 2064 389
648C89L02J386q55j858j30j56j41Q04j389j140N20O46m56Rj3j221J298K516j565
$$ 389 691 2077 1222 -636 -766 -922 -1063 -259 -1648 -2788 -2268 -1622 -2078 -2069 -2082 -3303 -2005 511 -1054
667a054k055L297K088j829p98K372M39j566J501P21j391l4J058O19j178k220J068
$$ -1054 -3109 188 2276 447 -351 2021 2460 894 2395 3116 1725 1691 2749 3368 2190 -30 1038
684A038J535r69k974M80J762j990j213J425j004j719J168J812k083j342K158J022
$$ 1038 2573 1604 -1370 -890 872 -1118 -2331 -906 -1910 -3629 -2461 -649 -2732 -4074 -1916 -894
700h94l50l50j44J373J574k50p83K99J812n2j31M87j055K52J508m29j279r53N85
$$ -894 -1244 -1594 -1738 -365 1209 959 176 475 2287 2235 2104 2591 1536 1788 3296 2867 1588 635 1220
719A220P06m78j930j683K211J048l081j191J799J80q93l14O20j230R13K240q25
$$ 1220 1926 1448 -482 -2165 46 1094 -1987 -3178 -1379 -1199 -2092 -2406 -1786 -3016 -2103 137 -688
736f88k104J044K378J091k126m36K050J313q12q59M21J058l36O48m85j574m2J681
$$ -688 -2792 -1748 630 1721 -405 -841 1209 2522 1710 851 1272 2330 1994 2642 2157 583 541 2222
754B222l8k631o60J887k07r21j296j33Q39N28r00j477Q19J355m64jn7l77J411
$$ 2222 2184 -447 -1107 780 573 -348 -1644 -1777 -938 -410 -1310 -2787 -1968 -613 -1077 -1078 -1135 -1512 -101
773a01J28L75j057J18J944L8p04q47P62J738j163j135M66R16n14n84L93l1j279
$$ -101 27 402 -655 -537 1407 1445 741 -106 656 2394 1231 96 562 1478 964 380 773 742 -537
792e37P99P33j263q03O71P99p64r78R29j8n00o4P61L17p49l15J219j20n61k62
$$ -537 262 995 -268 -1071 -400 399 -365 -1343 -414 -432 -932 -996 -235 82 -667 -982 237 117 -444 -706
812g06R81k06k68L72m38K10N63l89j24m32M89Q97o84J53o53J65J095p7r75o41
$$ -706 275 69 -199 173 -265 -55 508 119 -5 -437 52 949 265 418 -235 -70 1025 948 -27 -668
832f68R28J491j337j093O92P56J71r40m91L36R2O64p64j158P6J379N51j572j378
$$ -668 260 1751 414 -679 13 769 940 0 -491 -155 -63 601 -163 -1321 -1245 134 685 -887 -2265
851b265J315J559l24j685l93J568K56M04q07n69R92J319J7j732n03K215O83p05
$$ -2265 -950 609 285 -1400 -1793 -225 31 435 -372 -941 51 1370 1387 -345 -848 1367 2050 1345
869A345j345M53J311j3j016o17o79J423K24j077j349OJ849n23j450n15N42J166
$$ 1345 0 453 1764 1751 735 118 -561 862 1086 9 -1340 -1334 515 -8 -1458 -1973 -1431 -265
887b65k09j365j06J42J885J30j363j44J175J277n21p10L67Q81M94l85m98qO04
$$ -265 -474 -1839 -1945 -1803 82 212 -1151 -1295 -120 1157 636 -74 293 1174 1668 1283 785 777 1381
906A381Q33m89j375K22M88q1r91q03N39R4l24p01m10l5M52R9k01n36O13O58k0
$$ 1381 2214 1725 350 572 1060 979 -12 -815 -276 -182 -506 -1207 -1617 -1652 -1200 -1101 -1302 -1838 -1225 -567 -587
927e87l88L3J097J57r7P32k89k6M11J60J48l12O0L98m26J2M8l41k17p37O89o64
$$ -587 -975 -942 155 312 215 947 658 632 1043 1203 1351 1039 1099 1497 1071 1083 1131 790 573 -164 525 -139
949a39p85O0J51Om92m95K56J68L13j49n55O25P08K73m61l36J261O33k14l00j65
$$ -139 -924 -864 -713 -707 -1199 -1694 -1438 -1270 -957 -1106 -1661 -1036 -328 -55 -516 -852 409 1042 828 528 363
970C63J024R9Jn07n76P57N52n22j322n1O30K29r85q92K58N93L3r38n36J14R08
$$ 363 1387 1486 1487 980 404 1161 1713 1191 -131 -182 448 677 -308 -1200 -942 -349 -316 -1254 -1790 -1676 -768
991g68L96o72p10P21J370J92j353J54R79P27J16q76j26P28R73j81j277j86J028
$$ -768 -372 -1044 -1754 -1033 337 529 -824 -670 309 1036 1152 276 150 878 1851 1670 393 207 1235
1010A235O67p52j716L67J034m47o66q66J17O54L46q59r46Q05O52R6q88m12O51
$$ 1235 1902 1150 -566 -199 835 388 -278 -1144 -1027 -373 -27 -886 -1832 -1027 -375 -279 -1167 -1579 -928
1029i28J297o73L7J7O60N81l3l63l42L83J157m34p54m17R83O4r89n2J42n13L26
$$ -928 369 -304 -267 -250 410 991 958 595 253 636 1793 1359 605 188 1171 1235 246 194 336 -177 149
1050A49k84m08m91N7N73k74n05R1Q78l66k41L18M00j20R0N35l31j25J56R44j46
$$ 149 -135 -543 -1034 -977 -404 -678 -1183 -1092 -214 -580 -821 -503 -103 -223 -133 402 71 -54 102 1046 900
1071I00n49N59k78M39k28l51rk32L47J19r66K8K02J21q10J57K63l59L71l0l38
$$ 900 351 910 632 1071 843 492 483 251 598 717 -249 -221 -19 102 -708 -551 -288 -647 -276 -306 -644
1092f44k31R8Q72N4r36N27O60O5k32l33P23k91J33M10l22p00L70J001n94j560
$$ -644 -875 -777 95 149 -787 -260 400 465 233 -100 623 332 465 875 553 -147 223 1224 630 -930
1112i30P07J152m72r98J83K99j24M27j83p77L44M41M8k4p37J52P64P4q58P3O54
$$ -930 -223 929 457 -541 -358 -59 -183 244 61 -716 -372 69 117 93 -644 -492 272 346 -512 -439 215
1133B15P8nJ12k99m48J280n96m68q3K72L94k58k29m23R0P90j67q80l81J297J1
$$ 215 293 288 400 101 -347 933 337 -131 -214 58 452 194 -35 -458 -368 422 255 -625 -1006 291 302
1154C02o25J00L63l10M39l43J97k3k67P44M4m73r41R70J069j465o07Q37L26o89
$$ 302 -323 -223 140 -170 269 -74 123 100 -167 577 621 148 -793 177 1246 -219 -826 11 337 -352
1174c52l6L68p09j18Q05M5j011K91N20L05k52q99O65Q03o7n89%Q38m15O09k2n99
$$ -352 -388 -20 -729 -847 -42 3 -1008 -717 -197 108 -144 -1043 -378 425 358 -231 -231 607 192 801 779 180
1196A80O4N41j57k58k51J20J27L0j48q73K45J009p06j195L54M08Q8l61J11K06
$$ 180 244 785 628 370 119 239 366 396 248 -625 -380 629 -77 -1272 -918 -510 -422 -783 -672 -466
1216d66l43O13LO2n92N42J002k9q62j98J542J45j173m2Q86k27j63K17k37o41L92
$$ -466 -809 -196 -193 -131 -723 -181 821 792 -70 -268 1274 1419 246 204 1090 863 700 917 680 39 431
1237D31L99o98o08J46J82n8r48J3K04M26l23l77M81M5j17M63M5k75K11O29J47
$$ 431 830 132 -476 -330 -148 -206 -1154 -1141 -937 -511 -834 -1211 -730 -685 -802 -339 -294 -569 -358 271 418
1258D18j77N9M25K2M82l07l73N79J25n29l33M54J13r88L45j72o35k17j39N94m30
$$ 418 241 300 725 747 1229 922 549 1128 1253 724 391 845 958 -30 315 143 -492 -709 -848 -254 -684
1279f84o59J22M74K28o41J4P00l71k07R56k35n0L13J057l94p08N60J145p27k82
$$ -684 -1343 -1221 -747 -519 -1160 -1146 -446 -817 -1024 -68 -303 -353 -40 1017 623 -85 475 1620 893 611
1299F11p7M33L03n15J03l12k29P9j26j96o90q9Q37m50q32l20O59L28n18j48n3
$$ 611 534 967 1270 755 858 546 317 396 270 74 -616 -705 132 -318 -1150 -1470 -811 -483 -1001 -1149 -1202
1320a202N47R07p37j88L77O96J13l19J33L22K8O09n19k91Q5O96O4q13n67N16J26
$$ -1202 -655 252 -485 -673 -296 400 513 194 327 649 677 1286 767 476 561 1257 1321 508 -59 457 583
1341E83j60p95O5n7j33L35l03p46L56K24O07r15j37Q98J92m22l34P76J6K84l03
$$ 583 423 -372 -307 -364 -497 -162 -465 -1211 -855 -631 -24 -939 -1076 -178 14 -408 -742 34 50 334 31
1362C1J65j02N38o3J60m36j47P92m6n43k17K50K66j36m36j66l46K83M3l84K07
$$ 31 196 94 632 569 729 293 146 938 892 349 132 382 648 512 76 -90 -436 -153 -110 -494 -287
1383b87j44J96o5m7p8l47K99M97j70j20L28K24j12m68N56k83J94J15J6J90m13
$$ -287 -431 -235 -300 -347 -425 -772 -473 24 -146 -266 62 286 174 -294 262 -21 173 288 304 494 81
1404H1J55L72l43k71j72N31L4n23Q0P7P6K0l79K48k53kL71J17l14k84K12N44l24
$$ 81 236 608 265 -6 -178 353 387 -136 -56 21 97 117 -262 -14 -267 -269 102 219 -95 -379 -167 377 53
1427E3l73k6M99J23l81m17L68K7O3l81R6J61K02L13l66k33l2L42J28m59K83J78
$$ 53 -320 -346 153 276 -105 -522 -154 -127 -64 -445 -349 -188 14 327 -39 -272 -304 38 166 -293 -10 168
1449A68J06K81n42j28M47J69K46m78o14L53N63l25l46j70J90K03J53m15l56M97
$$ 168 274 555 13 -115 332 501 747 269 -345 8 571 246 -100 -270 -80 123 276 -139 -495 2
1469Bj21j10k37J2J15L52k07l06m42P62J06n7l09L75Q40j10k55J0J28K90k52m78
$$ 2 -119 -229 -466 -454 -339 13 -194 -500 -942 -180 -74 -131 -440 -65 775 665 410 420 548 838 586 108
1491A08P8K24K70j46n47oO5k28L74l75j87n5M07m32l43J97k62K91J89k71J38J73
$$ 108 186 410 680 534 -13 -19 46 -182 192 -183 -370 -425 -18 -450 -793 -596 -858 -567 -378 -649 -511 -338
1513c38J80L6l71M66K37J88Q0k43K58p5M11P7r3k04J47l38R4l15l75L48p0r1o99
$$ -338 -158 -122 -493 -27 210 398 478 235 493 418 829 906 813 609 756 418 512 197 -178 170 100 9 -690
1536f90K48J44r3l98j52o2O74k09k33L14J3J17K52L5j00K06L51J35Mj90P6M25
$$ -690 -442 -298 -391 -789 -941 -1003 -329 -538 -771 -457 -444 -327 -75 -40 -140 66 417 552 556 366 442 867
1558H67j7k43n04L35M01l56m34L3N5N4j93l36j92l54M16J97p77K01K40O5R2j90
$$ 867 850 607 103 438 839 483 49 82 137 191 -2 -338 -530 -884 -468 -271 -1048 -847 -607 -542 -450 -640
1580f40J83K9K35K62k90L44m1M64l6l14L29KK48l4k42J23m37M47l24l99L82n63
$$ -640 -457 -428 -193 69 -221 123 82 546 510 196 525 527 775 741 499 622 185 632 308 -91 291 -272
1602b72L36j55m12J3j07K69j85j88J41J76j45J55j13K10K12J68j70Q7o6P24N1
$$ -272 64 -91 -503 -490 -597 -328 -513 -701 -560 -384 -529 -374 -487 -277 -65 103 -67 20 -46 678 729
1623G29q0q3M4k0N5J28j72k19L6K72j95o33o2J49k2l30l32K66L87l01q6m11J52
$$ 729 649 566 610 590 645 773 601 382 418 690 495 -138 -200 -51 -73 -403 -735 -469 -82 -383 -469 -880 -728
1646g28O25k62j4M3n4L58L04k25k51M31M48k40j40k56K36N47j70m14k46J73J49
$$ -728 -103 -365 -379 -336 -390 -32 272 47 -204 227 675 435 295 39 275 822 652 238 -8 165 314
1667C14K09m71m82L27L11m05m90L9K80P9O5l62J79J89K92j64l60K09J47J16K52
$$ 314 523 52 -430 -103 208 -197 -687 -648 -368 -289 -224 -586 -407 -218 74 -90 -450 -241 -94 22 274
1688B74l76QM94J42j26k01J22Pq6j37q5K63P1k97K12n46J05Q6L02k28o77M28K67
$$ 274 -102 -94 400 542 416 215 337 344 258 121 36 299 370 73 285 -261 -156 -70 232 4 -673 -245 22
1711B2l98j2N1L32p7J1J28M8M4kj41o0n3M3N45m20n4k09N48k81j16J31l62J29
$$ 22 -376 -388 -337 -5 -82 -71 57 105 149 147 6 -54 -107 -64 481 61 7 -202 346 65 -51 80 -282 -153
1735a53M7O7N1m90K46L07m65M21k91jL18l4N8Ml4J51r3j18k54M06m3MN5j27j06
$$ -153 -106 -39 12 -478 -232 75 -390 31 -260 -261 57 23 81 85 51 202 109 -9 -263 143 100 104 159 32 -74
1760g4k3M81m83j27J32M48l73l36N6J44j66L64j03j4j82N29K17o68L17l2L78j20
$$ -74 -97 384 -99 -226 -94 354 -19 -355 -299 -155 -321 43 -60 -74 -256 273 490 -178 139 107 485 365
1782C65l78J40J85k62l3Ql10O21o8K1n26j24K66J92k52m28K01M78o36ok06L78
$$ 365 -13 127 312 50 17 25 -285 336 268 289 -237 -361 -95 97 -155 -583 -382 96 -540 -546 -752 -374
1804c74P31j92n10Q7L39K13k74l2K94o0M04r8M7k32%K25l90m9j86M84j6m77R7
$$ -374 357 165 -345 -258 81 294 20 -12 282 222 626 528 575 343 343 568 178 129 -57 427 411 -66 31
1827C1j58K10l11k16L8j30k28N90k56l41L02K23M45m68m07O26J69j50J45K73J12
$$ 31 -127 83 -228 -444 -406 -536 -764 -174 -430 -771 -469 -246 199 -269 -676 -50 119 -31 114 387 499
1848D99j30J49km15K95Q7L38o70l8L64j68j54l89P2k03L8j27J10k26J19O2K3p1
$$ 499 369 518 516 101 396 483 821 151 113 477 309 155 -234 -162 -365 -327 -454 -344 -570 -451 -389 -366 -437
1871d37m3q1L97O8K3k45N8N90j17K41o1j90P1K9L50k28j89K64J54k95l28j4K20
$$ -437 -480 -561 -164 -96 -73 -318 -260 330 213 454 393 203 274 303 653 425 236 500 654 359 31 17 237
1894B37l8l83j52K86k40l48J66K8l68J48L41j18k31K10L67N1k67K28L01K73m96
$$ 237 199 -184 -336 -50 -290 -638 -472 -444 -812 -664 -323 -441 -672 -462 -95 -44 -311 -83 218 491 -5
1915eL81k36K13J65j39L51k31k04J59n8k94J9k40M97l99l41l6R1L1j20J99k32
$$ -5 376 140 353 518 379 730 499 295 454 396 102 121 -119 378 -21 -362 -398 -307 -276 -396 -197 -429
1937d29J08K48k56K06j03o9K36J70j08n4K79L37m21l26K00M16L8k45j3R0k99M4
$$ -429 -321 -73 -329 -123 -226 -295 -59 111 3 -51 228 565 144 -182 18 434 472 227 214 304 5 49
1959D9J99l11o8J39J00j71n92L25J47J46k79j06J48Q7K17n9j05L8J29J8J56j36
$$ 49 248 -63 -131 8 108 -63 -655 -330 -183 -37 -316 -422 -274 -187 30 -29 -134 -96 33 51 207 71
1981G1m3Q4J38l59N1K06L11m2l49p1Q7K98m32J82k44J30P7n9K3p42N27L8J36K4
$$ 71 28 112 250 -109 -58 148 459 417 68 -3 84 382 -50 132 -112 18 95 36 59 -683 -156 -118 18 42
2005D2m39M35j04j82k5K74j08K83j61J1J8L1K3j84j12L06l0J68k15l84J24K12
$$ 42 -397 38 -66 -248 -273 1 -107 176 15 26 44 75 98 -86 -198 108 78 246 31 -353 -229 -17
2027a7J9k06O3mJ16j10k03N7L59J7l2p3L1K75oj74m7r0J22J55j86J30m39L90J73
$$ -17 2 -204 -141 -145 -29 -139 -342 -285 74 91 59 -14 17 292 286 112 65 -25 97 252 66 196 -243 147 320
2052C20P9po69K58p9K47n89l3K45n5J69j2N1m76L47K52m3oo0J26j50J22J39Q4
$$ 320 399 392 -277 -19 -98 149 -440 -473 -228 -283 -114 -126 -75 -551 -204 48 5 -1 -61 65 -85 37 176 260
2076B60r4p6K40l75L71j84j05lJ73p2j6j82m8p4L55k31K02k55Nk8m9j99K93N9
$$ 260 166 90 330 -45 326 142 37 34 207 135 119 -63 -111 -185 170 -61 141 -114 -109 -137 -186 -385 -92 -33
2100c3k7j00k96N73j20K35j18J07k30L57j30M31l99P0k90R7J22l45j16K03J01
$$ -33 -60 -160 -456 117 -3 232 114 221 -9 348 218 649 250 320 30 127 249 -96 -212 -9 92
2121I2J7N0l63m0L6J97l26r7K44J86j53k29L88k04L16j29o9J74K97K71l95J17
$$ 92 109 159 -204 -244 -208 -11 -337 -434 -190 -4 -157 -386 2 -202 114 -15 -84 90 387 658 263 380
2143C80l60K04J2J2M6j97K05j44k99J31j50K32l32j20J48k1K33J28k83p9j92N46
$$ 380 20 224 236 248 294 97 302 158 -141 -10 -160 72 -260 -380 -232 -253 -20 108 -175 -254 -446 100
2165A00k95J29j95r4L18J1n7L6J69P7L52n54J17J23J83n2l2Rm2j04J12n65K18
$$ 100 -195 -66 -261 -355 -37 -26 -83 -47 122 199 551 -3 114 237 420 368 336 345 303 199 311 -254 -36
2188c6M5R9l6k71N4j97L28j49j29mJ44j03q0M9J12j31L76k0N2l5K25K20j83N9
$$ -36 9 108 72 -199 -145 -342 -14 -163 -292 -296 -152 -255 -335 -286 -174 -305 71 51 103 68 293 513 330 389
2212C89K8P0o2j94M3j06j97L96k19k81K76j50j8j81j66o4K28j88K02p6O7J65l62
$$ 389 417 487 425 231 274 168 -29 367 148 -133 143 -7 -25 -206 -372 -436 -208 -396 -194 -270 -203 -38 -400
2235d00N04j23P9J98l58P9J60J60j52J40J1k03J5R2L30l54k76J24L33k65r7k30
$$ -400 104 -19 60 258 -100 -21 139 299 147 287 298 95 110 202 532 178 -98 26 359 94 -3 -233
2257b33n1L46j42j67K2m4L07j5k47j28M5L00Qk36L37k59N2N52n30l6J72L8K04
$$ -233 -284 62 -80 -247 -225 -269 38 23 -224 -352 -307 -7 1 -235 102 -157 -105 447 -83 -119 53 91 295
2280B95l64J48Q8j10P5l71L46r6L0m08L18k4j64J05K58j60l5n3L22l23j52P8J85
$$ 295 -69 79 167 57 132 -239 107 11 41 -367 -49 -73 -237 -132 126 -34 -69 -122 200 -123 -275 -197 -12
2303a2j58M6K54k43L02k54K99j33q6J64k73J83Q8o8r7k37L50l74J06J41J05N6
$$ -12 -170 -124 130 -113 189 -65 234 101 15 179 -94 89 177 109 12 -225 125 -249 -143 -2 103 159
2325A59l11L33p1r3j85L00k30j8N9J27j76J3K46J39k76J8J79j05m5M6j39K93p6
$$ 159 -152 181 110 17 -168 132 -98 -116 -57 70 -106 -93 153 292 16 34 213 108 63 109 -30 263 187
2348A87j34j15O6Q3k58K47k86o5L31j9J40p9k34o8L23j19m2JL1QJ18J07k40J38
$$ 187 53 -62 4 87 -171 76 -210 -275 56 37 177 98 -136 -204 119 0 -42 -41 -10 -2 116 223 -17 121
2372A21j4J15k85K6K81m16K5K7Q5J79j17M4Jk56J33o9J60rl71J08K75P7k34j28
$$ 121 107 222 -63 -37 244 -172 -147 -120 -35 144 27 71 72 -184 -51 -120 40 31 -340 -232 43 120 -114 -242
2396b42L50q2J92j84k17M77k18J21k47K73q6Q0J65l32k10J42J55j26j11L20j04
$$ -242 108 26 218 34 -183 294 76 197 -50 223 137 217 382 50 -160 -18 137 11 -100 220 116
2417A16k72q7J63J19p3k37O7k94K97K21k94K28M9r3J00l6j55M44o0j70K86k18
$$ 116 -156 -243 -80 39 -34 -271 -204 -498 -201 20 -274 -46 3 -90 10 -26 -181 263 203 33 319 101
2439A01J39r5J65j24p0m7K1J43L9n07Q2K93k6k65k40M11m21L23p9p3j89K52J68
$$ 101 240 145 310 186 116 69 90 233 272 -235 -153 140 114 -151 -391 20 -401 -78 -157 -230 -419 -167 1
2462Aj38J04j48K46L20m61p3N81k17k98L20j42R9M4j90r4K62J25j39k13j96M6
$$ 1 -137 -33 -181 65 385 -76 -149 432 215 -83 237 95 194 238 48 -46 216 341 202 -11 -207 -161
2484a61j27J78j74J07j33j33L74o5k12N69m18J58Q3N5J07r6j1J09m4OK75j82j99
$$ -161 -288 -110 -284 -177 -310 -443 -69 -134 -346 223 -195 -37 46 101 208 112 101 210 166 172 447 265 66
2507F6K65m43J61j91N8M50k27k82J13j57N51m81J1K8j1j17O5P8l3j6j7M05k52
$$ 66 331 -112 49 -142 -84 366 139 -143 -30 -187 364 -117 -106 -78 -89 -206 -141 -63 -96 -112 -129 276 24
2530B4J66l91K07J07j39J88J04j02J30k21oK15j39j07J87Q6m37k2L99k95P5k71
$$ 24 190 -201 6 113 -26 162 266 164 294 73 67 282 143 36 223 309 -128 -150 249 -46 29 -242
2552b42M4q7j71O3J94k63M17k55M84k77K8J56j87p3J86Q9K82p6K41m39J11q1J0
$$ -242 -198 -285 -456 -393 -199 -462 -45 -300 184 -93 -65 91 -96 -169 17 106 388 312 553 114 225 144 154
2575A54K07p9n01J79q2l9k4L0J86r8j48M4J05k54J20J06j60J92k98L03J5J80n7
$$ 154 361 282 -219 -40 -122 -161 -185 -155 31 -67 -215 -171 -66 -320 -200 -94 -254 -62 -360 -57 -42 138 81
2598H1J93k60N8%j76J24k0O3J45p0j30j9O5K7J7j32J34Q7k98J25j73o5J14O9l74
$$ 81 274 14 72 72 -104 20 0 63 208 138 8 -11 54 81 98 -34 100 187 -111 14 -159 -224 -110 -41 -415
2623d15M37j8r6J37k17k2L59q4k62L67k98K7J23j51L07m56K58L5Qq3j80K63J14
$$ -415 22 4 -92 45 -172 -194 165 81 -181 186 -112 -85 38 -113 194 -262 -4 31 39 -44 -224 39 153
2646A53l0j61p1j10J00J94k7k37J22M3J71J02l62o6Q6R4n6J92j62J38O6m75M47
$$ 153 123 -38 -109 -219 -119 75 48 -189 -67 -24 147 249 -113 -179 -93 1 -55 137 -25 113 179 -296 151
2669A51Q2j1j98K1r0N8k07J00q6l02L05K81j71O9k25L48M0m96O8K60JJ25o5j62
$$ 151 233 222 24 45 -45 13 -194 -94 -180 -482 -177 104 -67 2 -223 125 165 -331 -263 -3 -2 123 58 -104
2693a04l1L67P7l26Q8J46j50j32J85j60M33k71j90j10M0J45j78n6J7m3J95j25
$$ -104 -135 232 309 -17 71 217 67 -65 120 -40 393 122 -68 -178 -138 7 -171 -227 -210 -253 -58 -183
2715a83K28j31J72j39k21P4J50pQ9k2N9J03j45L7r1K74k32K53k72K23r4R5k72
$$ -183 45 -86 86 -53 -274 -200 -50 -57 32 10 69 172 27 64 -27 247 15 268 -4 219 125 220 -52
2738e2r1K85k29M1j75P4J68J7Q4l7j92lj13L51j98Qj80K52l64K62K69l0j08j51
$$ -52 -143 142 -87 -46 -221 -147 21 38 122 85 -107 -110 -223 128 -70 -62 -242 10 -354 -92 177 147 39 -112
2762a12N41j80l49K3K00K33k65P1j9J62q4j72l31N09j92l58K71k37K97R3L4Q2
$$ -112 429 249 -100 -77 123 356 91 162 143 305 221 49 -282 227 35 -323 -52 -289 8 101 135 217
2784B17k48k21L99J53k53k53K90o8J01oq4P3J22j30Oj06j14K05M6Q5j40O0J14
$$ 217 -31 -252 147 300 47 -206 84 16 117 111 27 100 222 92 98 -8 -122 83 129 214 74 134 248
2807B48q0j56k18o1J54L5k73J82j21L13m3j92L15j43j24k8k64L9K11J55M17j27
$$ 248 168 12 -206 -267 -113 -78 -351 -169 -290 23 -20 -212 103 -40 -164 -192 -456 -417 -206 -51 366 239
2829B39q7qJ92j98K8k29L14m0k60R5j84K01o4k17M0O2L00k2k08j91K85k10n0K4
$$ 239 152 144 336 138 166 -63 251 211 -49 46 -138 63 -1 -218 -178 -116 184 162 -46 -237 48 -162 -212 -188
2853a88J88p7J91j32K8K23m12L43K58m55L08j34J80l53K4j47J37J10M1j89j57
$$ -188 0 -77 114 -18 10 233 -179 164 422 -33 275 141 321 -32 -8 -155 -18 92 133 -56 -213
2874b13K55k65k0K99O7k69R2R6k60J01k40J74J37k7j12J34L51k12K57m39j32J05
$$ -213 42 -223 -243 56 123 -146 -54 42 -218 -117 -357 -183 -46 -73 -185 -51 300 88 345 -94 -226 -121
2896a21L19k00J57j54l38M67J05l30O7K37k61M5K78k84j67K81P7k37J80Nj31p
$$ -121 198 -2 155 1 -337 130 235 -95 -28 209 -52 -7 271 -13 -180 101 178 -59 121 126 -5 -12
2918a2j54J78N4Q8j58j5J18l11L03P3q9Q2j52n1L3K32O2J76o23J78Q5Lr8J42j67
$$ -12 -166 12 66 154 -4 -19 99 -212 91 164 75 157 5 -46 -13 219 281 457 -166 12 97 100 2 144 -23
2943b3r8K08j03Q9r7j10l8J54M1j43k34M79p9J4j77n7J42Mo7R3M7K01j9j13j85
$$ -23 -121 87 -16 73 -24 -134 -172 -18 23 -120 -354 125 46 60 -117 -174 -32 -28 -95 -2 45 246 227 114 -71
2968g1J02j31J42k06J32Kp1J05j6j40q2L35p7j68J61P8k05j50L69K4j29J58J25
$$ -71 31 -100 42 -164 -32 -30 -101 4 -12 -152 -234 101 24 -144 17 95 -110 -260 109 133 4 162 287
2991B87j34k5l3J2J05j32q2J54n0k17K81l15N7k9k5K72k27j21J04J51j43K3M6
$$ 287 153 128 95 107 212 80 -2 152 102 -115 166 -149 -92 -121 -146 126 -101 -222 -118 33 -110 -87 -41
3014d1J7J46k24l0Q9J3j05K08L6K08j94J8l85K68M82l58k47P0n9L66k64N9j04
$$ -41 -24 122 -102 -132 -43 -30 -135 73 109 317 123 141 -244 24 506 148 -99 -29 -88 278 14 73 -31
3037c1l62L43j09J89k49M81l63J69k41JO8J16j66j28L07j34M0J09K9j22kK27j22
$$ -31 -393 -50 -159 30 -219 262 -101 68 -173 -172 -104 12 -154 -282 25 -109 -69 40 69 -53 -55 172 50
3060E0k7J35P3J15l59P0k37L04L8n05K18K0N8J1O6M9j3n0l73L89l00O3J89j0j16
$$ 50 23 158 231 346 -13 57 -180 124 162 -343 -125 -105 -47 -36 30 79 66 16 -357 32 -268 -205 -16 -26 -142
3085a42J71K8L2o9J53j76L94r3l02J14j29K80j58j20K27j95j51J38k67R2L41p9
$$ -142 29 57 89 20 173 -3 391 298 -4 110 -19 261 103 -17 210 15 -136 2 -265 -173 168 89
3107H9n2p9J26k33K29k47K29j70K14qn7K46l75J39L8L4j66L63k23j8J31k41N87
$$ 89 37 -42 84 -149 80 -167 62 -108 106 98 41 287 -88 51 89 123 -43 320 97 79 210 -31 556
3130E56n48Mq2KQ0N9m6J03r7l4J41m55M8K71j18P4J48k41k5J67n2J68l1K56k84
$$ 556 8 12 -70 -68 12 71 25 128 31 -3 138 -317 -269 2 -116 -42 106 -135 -160 7 -45 123 92 348 64
3155F4K6L5kl1L03l29j83L37j35J8J65P2k77K68m65N4J26k43K90j13O8k04R4j67
$$ 64 90 125 123 92 395 66 -117 220 85 103 268 340 63 331 -134 -80 46 -197 93 -20 48 -156 -62 -229
3179b29K13K71k84L4j68K40j90L70l44J28Q8j34n7O9O7K23l34J39P2m20L00P8
$$ -229 -16 255 -29 5 -163 77 -113 257 -87 41 129 -5 -62 7 74 297 -37 102 174 -246 54 132
3201A32j62J1K0r1p4K33n9n7r7O8J29q5J65j15j2k27J23K59k47q3M03k22J40M6
$$ 132 -30 -19 1 -90 -164 69 10 -47 -144 -76 53 -32 133 18 6 -221 -98 161 -86 -169 234 12 152 198
3225A98J5p2j09qK12k29m8J38J37j61l06R9J81K07l00O9r7K00k05j2j0q4J76k29
$$ 198 213 141 32 24 236 7 -41 97 234 73 -233 -134 47 254 -46 23 -74 126 -79 -91 -101 -185 -9 -238
3249b38K43p3J55J17k06J5q5K41j10k6Q7Q7k51K16q4j28K0j21K59j07m8k07K4
$$ -238 5 -68 87 204 -2 13 -72 169 59 33 120 207 -44 172 88 -40 -20 -141 118 11 -37 -244 -220
3272b20K67k18Q5o6J7Nj01N3K66j98j35K27O5j6O9k0K03m01J71kL7k5J60l16n
$$ -220 47 -171 -86 -152 -135 -130 -231 -178 88 -110 -245 -18 47 31 100 80 283 -118 53 51 88 63 223 -93 -98
3297i8J6l73M99j25P6Q7n6L8j81n4K07l74M80k28j2O7J32J38k38J57m2K64m50
$$ -98 -82 -455 44 -81 -5 82 26 64 -117 -171 36 -338 142 -86 -98 -31 101 239 1 158 116 380 -70
3320g0M0L01j17k62L8K51l52L00p7n3K15q2j82L22m0k59M9p0k39L80j92k68N20
$$ -70 -30 271 154 -108 -70 181 -171 129 52 -1 214 132 -50 272 232 -27 22 -48 -287 93 -99 -367 153
3343A53j51J29lk60QL28l43L68q2j07J2R7k47J98o5k75M62k2l12J58O3r9k55K00
$$ 153 2 131 128 -132 -124 204 -139 229 147 40 52 149 -98 100 35 -240 222 200 -112 46 109 10 -245 -45
3367d5l02J73K56j4j65k52L87k10Q8p9K17N9oj02l3j69K54J31j88J89k22j16Q2
$$ -45 -347 -174 82 68 -97 -349 38 -172 -84 -163 54 113 107 5 -28 -197 57 188 0 189 -33 -149 -67
3390f7J99k19M32l65J06O8l80Q8M76m00k9J82k53l4J49J15k70L9K02m3J39L4K7
$$ -67 132 -87 345 -20 86 154 -226 -138 338 -62 -91 91 -162 -196 -47 68 -202 -163 39 -4 135 169 196
3413A96Pl50J19j2j34l1K17J2l52M79L5J11m01Q4q9j85M63j57j06o0k52K90K01
$$ 196 203 -147 -28 -40 -174 -205 12 24 -328 151 186 297 -104 -20 -109 -294 169 12 -94 -154 -406 -116 85
3436H5l18J35K55j24k47K09R7k43P6m7j47L38Q1k44L38J38m08K41l38J26K20j91
$$ 85 -233 -98 157 33 -214 -5 92 -151 -75 -122 -269 69 150 -94 244 382 -26 215 -123 3 223 32
3458C2J54j45l86L95j31K65L4k8j91NJ68k75m0K04k64J97J36k63j29K76J67L1
$$ 32 186 41 -345 50 -81 184 218 190 -1 4 172 -103 -143 61 -203 -6 130 -133 -262 14 181 212
3480B12j11M0k71J71K23k16R1K3j44j45M34l81J01M0l70K64O7j13M5Ljj44j8K69
$$ 212 101 141 -130 41 264 48 139 162 18 -127 307 -74 27 67 -303 -39 28 -85 -40 -37 -38 -182 -200 69
3504F9p8k45L80r6l30K80K24j38M0l69L28j80K25j53J5j19K1K79q1j78m7O5n02
$$ 69 -9 -254 126 30 -300 -20 204 66 106 -263 65 -115 110 -43 -28 -147 -126 153 72 -106 -153 -88 -590
3527e90O14o4J46j19l15N08o6k67O8J04p9M1J51l15J23J71j24K40k74J82n1k15
$$ -590 24 -40 106 -13 -328 180 114 -153 -85 19 -60 -19 132 -183 -60 111 -13 227 -47 135 84 -131
3549a31O4J34j4Nj26K63j94p0K0j22J42O9O3o6j66K89l46J99L6k8j54L22j7l3
$$ -131 -67 67 53 58 -68 195 1 -69 -49 -171 -29 40 103 37 -129 160 -186 13 49 21 -133 189 172 139
3573A39k77o8L03l99N25l02o4Q1R7m1O0k2k05L00j09J60k57J51J93k49P3j69K61
$$ 139 -138 -206 97 -302 223 -79 -143 -62 35 -6 54 32 -173 127 18 178 -79 72 265 16 89 -80 181
3596A81n00K71j01N5q8K91k03j1K57j72J62j12j25R2O9J27j02m6LL5p6m9L4j89
$$ 181 -319 -48 -149 -94 -182 109 -94 -105 152 -20 142 30 -95 -3 66 193 91 45 48 83 7 -42 -8 -197
3620a97J43J41l9J36k68n1O1l1J20P0j11k83K21J58j61r2R2q8K11p0n0M4J32o8
$$ -197 -54 87 48 184 -84 -135 -74 -105 15 85 -26 -309 -88 70 -91 -183 -91 -179 32 -38 -88 -44 88 20
3644B0J00q2P6l12L62k16N8j6m2K32k36J84j89J73n7J61j72j61l9J55q2P1J13
$$ 20 120 38 114 -198 164 -52 6 -10 -52 180 -56 128 -61 112 55 216 44 -117 -156 -1 -83 -12 101
3667A01j62K8j9N2j56l9K1M0K40l8J65j13K0k41J22N9q4p8NL07r6j10l4K34m80
$$ 101 -61 -33 -52 0 -156 -195 -174 -134 106 68 233 120 140 -101 21 80 -4 -82 -77 230 134 24 -10 224 -256
3692b56L43K09l71n1K50k05K04k11k75K85J2jJ32j19P8j20M9mL58j14k09K40m84
$$ -256 87 296 -75 -126 124 -81 123 -88 -363 -78 -66 -67 65 -54 24 -96 -47 -51 307 193 -16 224 -260
3715b60J87J51J64l05J35j46k09K38k98L15J27R8l13JJ51R1k75J89O0j04l84L90
$$ -260 -73 78 242 -63 72 -74 -283 -45 -343 -28 99 197 -116 -115 36 127 -148 41 101 -3 -387 3
3737CK0M9j64m1J66J38J1j91K96j21N1r8k42L32k7j76j9pP4l45K69K8J0ML7k01
$$ 3 23 72 -92 -133 33 171 182 -9 287 166 217 119 -123 209 182 6 -13 -20 54 -291 -22 6 16 20 57 -144
3763a44J11j48J77j64j35K66j28K89j27J59l39K2N9L02p2L1k96J45K71k97Q8N4
$$ -144 -33 -181 -4 -168 -303 -37 -165 124 -3 156 -183 -161 -102 200 128 159 -137 8 279 -18 70 124
3785A24K1j97r3N2J17n3J34j18J60k12j40K13k82L07j52K29j18k7j32j15K30o3
$$ 124 145 -52 -145 -93 24 -29 105 -13 147 -65 -205 8 -274 33 -119 110 -8 -35 -167 -282 -52 -115
3807a15NK56m9m3K1k27J72l9j0k36O80k46o3j77J32R1j86J55k23j07J11O8K8q9
$$ -115 -110 146 97 54 75 -152 20 -19 -29 -265 415 169 106 -71 61 152 -34 121 -102 -209 -98 -30 -2 -91
3831i1j20K31o6J92l5k19L38r0m0j05p5J83J00k56J18m9k15K88k20N7q0P4K55
$$ -91 -211 20 -46 146 111 -108 230 140 100 -5 -80 103 203 -53 65 16 -199 89 -131 -74 -154 -80 175
3854A75k44K6N7r1M7K49n60K83J06q2J29J2l7k28M91l12nR9m1P6j61Q2Q0j8j81
$$ 175 -69 -43 14 -77 -30 219 -341 -58 48 -34 95 107 70 -158 333 21 16 115 74 150 -11 71 151 133 -48
3879d8j15K00ln8L10m51J33P0j17k2L5ok4J55j19K58l35J11L83n40J73lJ17j74
$$ -48 -163 37 34 -24 286 -165 -32 38 -79 -101 -66 -72 -96 59 -60 198 -137 -26 357 -183 -10 -13 104 -70
3903g0Lj2J05L1j29%K38k14J27K03q6j35j38K18j02q6K84l96J03Q6j05K43o04
$$ -70 -67 -79 26 57 -72 -72 166 -48 79 282 196 61 -77 141 39 -47 237 -159 -56 30 -75 168 -436
3926d36N0K26k1j32L72k47L52l41K9R3J82j55L21l24K69M9l16j06O5M7J67k75
$$ -436 -386 -160 -181 -313 59 -188 164 -177 -148 -55 127 -28 293 -31 238 287 -29 -135 -70 -23 144 -131
3948a31J08l8pL3J09l4lk23K69q9J00l63M9J84L17m55K38K3M4q7RK94l98J88k02
$$ -131 -23 -61 -68 -35 74 40 37 -186 83 -6 94 -269 -220 -36 281 -174 64 87 131 44 53 347 -51 137 -65
$$ [...]
8191D8
##END NTUPLES=NMR FID
##END=
