##TITLE=1H_Am-Pr
 CDCl3, 8 sc, 
 3.9.2020
##JCAMPDX= 6.0         $$ Bruker NMR JCAMP-DX V2.0
##DATA TYPE= NMR FID
##DATA CLASS= NTUPLES
##ORIGIN= UXNMR, Bruker Analytische Messtechnik GmbH
##OWNER= root
$$ XWIN-NMR		Version 3.5
$$ Thu Sep  3 12:17:06 2020 Russian Standard Time (UT+4h)  she@DPX200
##.OBSERVE FREQUENCY= 200.1315066352
##.OBSERVE NUCLEUS= ^1H
##.DELAY= (6, 6)
##.ACQUISITION MODE= SIMULTANEOUS
##.ACQUISITION SCHEME= undefined
##.AVERAGES= 8
##.DIGITISER RES= 18
##SPECTROMETER/DATA SYSTEM= spect
##.PULSE SEQUENCE= zg30
##.SOLVENT NAME= D2O
##.SHIFT REFERENCE= (INTERNAL, D2O, 0, 15.7039)
##AUDIT TRAIL= $$ (NUMBER, WHEN, WHO, WHERE, WHAT)
$$ ##TITLE= Audit trail, XWIN-NMR		Version 3.5
$$ ##JCAMPDX= 5.01
$$ ##ORIGIN= Bruker BioSpin GmbH
$$ ##OWNER= she
$$ F:/spectra/data/she/nmr/H-F/1/audita.txt
$$ ##AUDIT TRAIL=  $$ (NUMBER, WHEN, WHO, WHERE, WHAT)
(   1,<2020-09-03 12:15:48.21 +0400>,<she>,<DPX200>,
      <created by zg, POWCHK disabled, PULCHK disabled
       configuration hash MD5:
       00 E9 B6 7A A2 85 ED C7 34 08 36 98 17 FE 4E 26
       data hash MD5: 16K
       A0 C4 1A 27 7F F7 F2 01 13 4F 49 23 1A 19 07 CA>)
$$ ##END=
$$ 
$$ hash MD5
$$ C6 9D B2 FB 1D 25 64 9D A4 6B B7 09 AA CD C1 17
##$RELAX= 
##$RELAX= 
##$RELAX= 
##$RELAX= 
##$RELAX= 
##$RELAX= 
$$ Bruker specific parameters
$$ --------------------------
##$DU= <F:/spectra>
##$EXPNO= 1
##$NAME= <H-F>
##$PROCNO= 1
##$TYPE= <nmr>
##$USER= <she>
##$AMP= (0..31)
100 100 100 100 100 100 100 100 100 100 100 100 100 100 100 100 100 100 
100 100 100 100 100 100 100 100 100 100 100 100 100 100 
##$AQSEQ= 0
##$AQ_mod= 1
##$AUNM= <au_zg>
##$AUTOPOS= <>
##$BF1= 200.13
##$BF2= 200.13
##$BF3= 200.13
##$BF4= 200.13
##$BF5= 200.13
##$BF6= 200.13
##$BF7= 200.13
##$BF8= 200.13
##$BYTORDA= 1
##$CFDGTYP= 0
##$CFRGTYP= 5
##$CHEMSTR= <none>
##$CNST= (0..31)
1 1 145 1 1 1 1 1 1 1 1 1 1 1 1 1 1 1 1 1 1 1 1 1 1 1 1 1 1 1 1 1 
##$CPDPRG= <>
##$CPDPRG1= <>
##$CPDPRG2= <>
##$CPDPRG3= <>
##$CPDPRG4= <mlev>
##$CPDPRG5= <mlev>
##$CPDPRG6= <mlev>
##$CPDPRG7= <mlev>
##$CPDPRG8= <mlev>
##$CPDPRGB= <>
##$CPDPRGT= <>
##$D= (0..31)
0 1.2 0 0 0 0 0 0 0 0.06 0 0.03 0 0 0 0 0.0002 0 0 0 0 0 0 0 0 0 0 0 0 
0 0 0 
##$DATE= 1599120947
##$DBL= (0..7)
120 120 120 120 120 120 120 120 
##$DBP= (0..7)
150 150 150 150 150 150 150 150 
##$DBP07= 0
##$DBPNAM0= <>
##$DBPNAM1= <>
##$DBPNAM2= <>
##$DBPNAM3= <>
##$DBPNAM4= <>
##$DBPNAM5= <>
##$DBPNAM6= <>
##$DBPNAM7= <>
##$DBPOAL= (0..7)
0.5 0.5 0.5 0.5 0.5 0.5 0.5 0.5 
##$DBPOFFS= (0..7)
0 0 0 0 0 0 0 0 
##$DE= 6
##$DECBNUC= <off>
##$DECIM= 32
##$DECNUC= <off>
##$DECSTAT= 4
##$DIGMOD= 1
##$DIGTYP= 9
##$DL= (0..7)
0 120 120 120 120 120 120 120 
##$DP= (0..7)
150 150 150 150 150 150 150 150 
##$DP07= 0
##$DPNAME0= <>
##$DPNAME1= <>
##$DPNAME2= <>
##$DPNAME3= <>
##$DPNAME4= <>
##$DPNAME5= <>
##$DPNAME6= <>
##$DPNAME7= <>
##$DPOAL= (0..7)
0.5 0.5 0.5 0.5 0.5 0.5 0.5 0.5 
##$DPOFFS= (0..7)
0 0 0 0 0 0 0 0 
##$DQDMODE= 0
##$DR= 18
##$DS= 0
##$DSLIST= <SSSSSSSSSSSSSSS>
$$ [...]
##$SUBNAM2= <"">
##$SUBNAM3= <"">
##$SUBNAM4= <"">
##$SUBNAM5= <"">
##$SUBNAM6= <"">
##$SUBNAM7= <"">
##$SUBNAM8= <"">
##$SUBNAM9= <"">
##$SW= 16.880792210976
##$SWIBOX= (0..15)
0 0 2 0 0 0 0 0 0 0 0 0 0 0 0 0 
##$SW_h= 3378.37837837838
##$TD= 16384
##$TD0= 1
##$TE= 0
##$TE2= 300
##$TE3= 300
##$TEG= 300
##$TL= (0..7)
0 120 120 120 120 120 120 120 
##$TP= (0..7)
150 150 150 150 150 150 150 150 
##$TP07= 0
##$TPNAME0= <>
##$TPNAME1= <>
##$TPNAME2= <>
##$TPNAME3= <>
##$TPNAME4= <>
##$TPNAME5= <>
##$TPNAME6= <>
##$TPNAME7= <>
##$TPOAL= (0..7)
0.5 0.5 0.5 0.5 0.5 0.5 0.5 0.5 
##$TPOFFS= (0..7)
0 0 0 0 0 0 0 0 
##$TUNHIN= 0
##$TUNHOUT= 0
##$TUNXOUT= 0
##$USERA1= <user>
##$USERA2= <user>
##$USERA3= <user>
##$USERA4= <user>
##$USERA5= <user>
##$V9= 5
##$VALIST= <valist>
##$VCLIST= <CCCCCCCCCCCCCCC>
##$VD= 0
##$VDLIST= <DDDDDDDDDDDDDDD>
##$VPLIST= <PPPPPPPPPPPPPPP>
##$VTLIST= <TTTTTTTTTTTTTTT>
##$WBST= 1024
##$WBSW= 4
##$XGAIN= (0..3)
0 0 0 0 
##$XL= 0
##$YL= 0
##$YMAX_a= 306782
##$YMIN_a= -166624
##$ZGOPTNS= <>
##$ZL1= 120
##$ZL2= 120
##$ZL3= 120
##$ZL4= 120
##$ABSF1= 10
##$ABSF2= 0
##$ABSG= 5
##$ABSL= 3
##$ALPHA= 0
##$AQORDER= 0
##$ASSFAC= 0
##$ASSFACI= 0
##$ASSFACX= 0
##$ASSWID= 0
##$AUNMP= <proc_1d>
##$AZFE= 0.1
##$AZFW= 0.1
##$BCFW= 1
##$BC_mod= 2
##$BYTORDP= 1
##$COROFFS= 0
##$CY= 11.3945322036743
##$DATMOD= 1
##$DC= 2
##$DFILT= <>
##$DTYPP= 0
##$F1P= 16.9975609425685
##$F2P= -3.02152046262296
##$FCOR= 0.5
##$FTSIZE= 0
##$FT_mod= 4
##$GAMMA= 1
##$GB= 0.15
##$INTBC= 1
##$INTSCL= 1
##$ISEN= 128
##$LB= 0.24
##$LEV0= 0
##$LPBIN= 0
##$MAXI= 10000
##$MC2= 0
##$MEAN= 0
##$ME_mod= 0
##$MI= 1.114404
##$NCOEF= 0
##$NC_proc= 0
##$NLEV= 6
##$NOISF1= 3.799351
##$NOISF2= 2.8
##$NSP= 1
##$NTH_PI= 0
##$NZP= 0
##$OFFSET= 15.70392
##$PC= 1
##$PHC0= -9971.406
##$PHC1= 8.400904
##$PH_mod= 1
##$PKNL= yes
##$PPARMOD= 0
##$PSCAL= 0
##$PSIGN= 0
##$REVERSE= no
##$SF= 200.130013532006
##$SI= 16384
##$SIGF1= 3
##$SIGF2= 2
##$SINO= 400
##$SIOLD= 16384
##$SREGLST= <1H.CDCl3>
##$SSB= 0
##$STSI= 0
##$STSR= 0
##$SW_p= 3612.71676300578
##$SYMM= 0
##$S_DEV= 0
##$TDeff= 0
##$TDoff= 0
##$TI= <>
##$TILT= no
##$TM1= 0
##$TM2= 0
##$TOPLEV= 0
##$USERP1= <user>
##$USERP2= <user>
##$USERP3= <user>
##$USERP4= <user>
##$USERP5= <user>
##$WDW= 1
##$XDIM= 8192
##$YMAX_p= 0
##$YMIN_p= 0
$$ End of Bruker specific parameters
$$ ---------------------------------
##NTUPLES= NMR FID
##VAR_NAME=  TIME,          FID/REAL,        FID/IMAG
##SYMBOL=    X,             R,               I
##VAR_TYPE=  INDEPENDENT,   DEPENDENT,       DEPENDENT
##VAR_FORM=  AFFN,          ASDF,            ASDF
##VAR_DIM=   8192,          8192,            8192
##UNITS=     SECONDS,       ARBITRARY UNITS, ARBITRARY UNITS
##FACTOR=    0.000296,      1,               1
##FIRST=     0,             0,               0
##LAST=      2.424536,      0,               0
##MIN=       0,             -166624,         0
##MAX=       2.424536,      306782,          0
$$ Real data points
##PAGE= N=1
##DATA TABLE= (X++(R..R)), XYDATA
$$ [...]
2092B444J51l320J072J429o01k692O65R97j034m96J587Q05j929J231K223r47k868
2109a283J466K397k089k705J724L527k360k472K029K343k208l418K128J209j110
2124h22k029K576J635n31k49J303R84k135j42l52j022j931N95Q29p85k86K159
2141b03J902j101o17J489J101k147j851J706J92j389j206K157O57j511q71J235
2157d57J009k148r9J034J354j032J06J498M43m63n19P02r11j005o50K52l76o58
2175a920J351N15J65l36K287K07j274m45J235L10k813q8R18L71j820n2J702M24
2193G37q73j140J928M52r09j135J043Q45p87k99N63K54o73L45m19m75p24k5P52
2212e40j347L67J487P98j635J024J802j75j893n41J617r38j429q02J859M4p89
$$ y = [2444, 2595, -725, 347, 1776, 1175, -1517, -852, 145, -889, -1385, 202, 1007, -922, 309, 2532, 1585, -1283, 183, 2580, 491, -2214, -490, 3037, 677, -1795, 234, 2577, 369, -3049, -921, 288, -822, -2851, -275, 1360, 829, 580, 1883, 2867, 732, 590, 238, -784, -2715, -2120, -1291, -2076, -2362, -203, 1699, 598, -19, 1470, 2571, 424, -1427, 279, 471, -918, -2124, 33, 690, -821, -1692, -457, 552, -1596, -1695, -661, 693, -339, -233, 1265, 1708, 1245, 726, 1428, 517, -488, -1138, -886, -1262, -1920, -569, -54, 111, -225, 2062, 2269, 995, 550, 1785, 2095, -718, -806, 112, 483, -1337, -1389, 313, 737, -136, -1276, 652, 1104, 195, -940, 103, 948, 161, -138, 425, 679, 6, 351, -68, -543, -1267, -1292, -540, -1887, -1520, -33, 765, -870, 154, 1956, 1781, -112, -653, 964, 26, -1403, -2205, -346, -302, -1091]
2229a091J084Q74L55j647R40m01j54r28q9N64j49O09L38R10n37M33L56q69j396
2248g98n83Q36r35K18J059R30j02J50R04M22r51j066N73r34m57l85M67O79j0N39
2268E56K28M89m96n01n67J64m25o10J62M19J024l42J83L9L09K58q36l66n11L26
2288d97p90N02n28J105qr4R04k40P57r09j06k37J84m08o57M01j8O51o66N54%L73
2310B73K02l65J43o86L80n67N28k32O5O74K9K87K82K74o90K0l38n22q27j85M5
2331a210l29J138O05J025K28M57K72n45n04p92o55j627K05j35L64R14O57R94K17
2350A279O39n82l04j336m00p37n08N96Q5J512J38J136k3J39o89j503m34j337J73
2369b156n64R17J089J455R48M71O12p87q89j265r74j638j06K60O53J571P21J461
$$ y = [-1091, -7, 867, 1222, -425, 515, 114, -40, -968, -1057, -493, -642, -33, 305, 1215, 678, 1111, 1467, 598, -798, -1381, -545, -1480, -1262, -203, 727, 625, 775, 1679, 2101, 1150, 84, 657, -277, -734, -1119, -652, 27, 17, 556, 784, 1273, 777, 276, -291, -127, -552, -1162, -1000, -581, 443, 101, 284, 323, 632, 890, 54, -312, -823, -497, -1287, -785, -1313, -208, -216, -310, 594, 354, 1111, 202, 96, -141, 43, -365, -1022, -621, -639, 12, -654, -100, -100, 273, 475, 110, 253, -433, -53, -620, -92, -324, -259, 415, 444, 731, 1013, 1287, 597, 617, 279, -243, -1070, -1255, -1210, -1539, -401, 204, 1229, 1457, 1914, 2186, 1641, 1137, 345, -310, -1937, -1732, -1867, -1503, -589, 68, 1062, 1279, 1918, 1336, 1032, -304, -704, -1441, -1949, -1353, -1268, 244, 382, 1518, 1495, 1634, 945, -558, -992, -2329, -2156, -2720, -1803, -714, 741, 1689, 2160, 2772, 1985, 1096, -169, -1143, -2781, -2887, -2627, -1974, -403, 318, 1779]
2387A779M65N7n73o18j175q79n69m39N60M62J083M91J022O85m55q81j009k84p88
2406a066m75k20Q35O37O96J046Q07n1o26n09p37p07q79q16L57J92J403MP55N56
2426A202N14n83p66m98l04k76r42M34N71J045k03M83O32j26j224q44j45J37m11
2445a304o16J000J098L82M13P6L82n22n58p67n09k02j10J4M2J311K02K8R5N59
2465A014K36n39q02j35P96l90p90L72Q49L6r59J99K69K65r54l54R52N89n20k1
2485A13P66O92j26j539K65J8n89n88k83M97J40N12k75Q54L85l0l06m65K87L25
2505F53n82j106O38J066o37j390N08J610j053j135J49J719n68q06M20J743l60
2522H69j101K57O34K74j590m62L39K07j40m29O04M12J276o31n38J79J080p8j802
$$ y = [1779, 2244, 2301, 1728, 1110, -65, -944, -1513, -1952, -1392, -930, 153, 644, 1666, 2351, 1896, 1015, 6, -278, -1066, -1541, -1761, -926, -289, 407, 1453, 2260, 2209, 1583, 1074, 337, -370, -1249, -2065, -1708, -1516, -113, -109, 646, 1202, 1716, 1133, 367, -131, -435, -711, -1653, -1219, -648, 397, 194, 677, 1309, 1183, -41, -885, -1030, -893, -1304, -1920, -920, 178, 560, 973, 1049, 1431, 909, 351, -416, -925, -1127, -1237, -1223, -1181, 130, 332, 360, 455, 1014, 1250, 711, -91, -226, 570, 180, -610, -238, 611, 647, -312, -113, 156, 421, -533, -887, 65, 654, 134, 113, 879, 1571, 1445, -94, 171, 189, -400, -988, -1271, -774, -634, -122, -397, 457, 842, 812, 506, 41, 328, 653, 71, -1035, -397, 669, 32, -1358, -850, 760, -293, -1428, -1279, 440, -128, -934, -514, 1229, 869, -232, 25, 659, 933, -657, -1119, -780, -573, -713, -1142, -538, -126, 1150, 519, -19, 160, 1240, 1162, -640]
2541f40q8J038N66j768l23J630O50j146j298J611Q41r19j242O99J738l12j081
2558d4J81J353p09j292n16Q79n9q60K73L85J293l57K81j25R2N1m45j373k35J174
2578e3j90o41j17J412O89r83n15P70O71k122q69Q63J271q91k48J779R87r99j100
2597b86P48N7j766j269R25P20k16O12J169J260Oj3l07j183q16m86n32j373J145
2616a605J305P11n18J268J941p35k119m06J323j362j743l18K235N89j055P22J439
2633A672L50j807m88j49l44q39MJ227M09J044Q48J20o85J50o82j604j363l16J048
2652a405o98r3J420K544K27j023J000L93j156k253k48L36n02p00Q42J758l91P8
2670A29K72M30q34o77J09j56j25K9J323M01J53J7o0p54r69l18m53q1m80J656Q98
$$ y = [-640, -728, 310, 876, -892, -1215, 415, 1065, -81, -1379, 232, 1073, 154, -1088, -389, 1349, 1037, -44, 137, 1490, 781, -511, -1027, -148, -207, -1067, -794, -409, 884, 527, 808, 683, 775, 826, 381, -992, -1227, -53, -243, -884, -1001, 411, 1100, 117, -398, 372, 1043, -1079, -1948, -1085, 186, -705, -953, 826, 1813, 814, -286, 462, 519, -1247, -2516, -1591, -871, -1087, -475, 694, 1954, 1960, 1947, 1640, 457, -359, -845, -1377, -2750, -1605, -300, 411, -107, 1161, 3102, 2367, 248, -158, 1165, -197, -1940, -2258, -23, 566, -489, 233, 1672, 2022, 215, -273, -422, -766, -1605, -1601, -374, 35, 1079, 1927, 2047, 1362, 1512, 830, -774, -2137, -2453, -1405, -2103, -2196, -776, 1768, 1995, 972, 1972, 2365, 1209, -1044, -1292, -956, -1458, -2158, -1316, 442, 51, 129, 401, 831, -3, -680, -571, -727, -852, -823, 500, 901, 1054, 1071, 1011, 257, -712, -1030, -1483, -1564, -2044, -388, 510]
2691E10L14P19O30K29j424r52q3j25j084n30J231Q39K7O8J001N3o70j097j2J72
2711a84m86K4N09J255q5O7j90j59o92j043l04p48L13M65J223K70Q44J088J33o32
2731A668j516k22o95j196j333J251J213K20O09J003J280o81n44n58j32j387q17
2748a837N57K90O98K73J266m19ok50k20j262m41J25J39N18J27J558O15K22k90
2767A663l44n41j783q13J6k38l07J420J370N86M22M97O19r99r48j034J92j137
2785a359m77J060K93M75R7J002p4k40m76k95n24l74M94o8O42L1O66L64o83l10
2805B44m13o45r50k31J56Q79K16O09J261K39K07l17l00q84o91o16n12L79J74P40
2825d55K37O32Q4J27o3k41r7l64j35j82N13K61L19k68J61j83n97J56r06J28j9
$$ y = [510, 824, 1543, 2173, 2402, 978, 26, -57, -182, -1266, -1796, -565, 274, 301, 369, 1370, 1423, 753, -344, -356, -184, -670, -646, -137, 1118, 1033, 1100, 910, 751, 59, -984, -1288, -2036, -1723, -1258, -35, 235, 1079, 2167, 2300, 1668, 152, -70, -765, -1961, -3294, -2043, -830, -610, -1, 1002, 2282, 1601, 1057, 499, 367, -1020, -1837, -1280, -990, -292, -19, 1247, 828, 822, 572, 352, -910, -1351, -1226, -1087, -569, -442, 1116, 1731, 1953, 1663, 1319, 778, -1005, -1818, -1802, -2040, -2347, -927, 443, 1029, 1451, 1948, 2567, 1568, 620, -414, -222, -1359, -1836, -776, -483, -8, 89, 1091, 1017, 777, 301, 6, -518, -892, -398, -466, 176, 207, 873, 1237, 554, 244, -169, -814, -1764, -1995, -1839, -960, -744, -135, 1126, 1365, 1572, 1255, 955, 71, -620, -1236, -1748, -1369, -1195, -455, -218, 414, 498, 625, 562, 321, 224, -140, -275, -457, 56, 317, 636, 368, 529, 346, -251, -95, -1001, -873, -892]
2846h92J28N17N03P45L27J39l78K9q17o48m49o0l28Q0P78N42L48M18R5r3l96j70
2868D18l50k87l01L70l0J64qK76K02k87j02l77N0m12J1N33N9J16N18K4k80p3m22
2891a88m03k60J12M1K8M55L81N73k02J10k20k43n37j20q5m43O82J07L16L23M67
2912H94k68l19K8k64m24m5O77j93J82M26J4L09r47m7n88l97l64K71M35P10N29
2933F19N94O73k8k72m86j153r15n15k77m0N32O81J189O42J73M32o35m73j158o14
2953a031j40O7k61P94Q30M36Q83o76n04r22m19n72n87K07J012R59P22J168O07
2972B573J76j239r26q11j374r83m43N23P60J051J424R36R41r0l38r97r41j172
2990i30m94l92M21N58N24R87K05O02n47n94o72l87j26R5K33M53J211J99M95m0
$$ y = [-892, -764, -247, 256, 1001, 1328, 1467, 1089, 1118, 301, -347, -796, -856, -1184, -1104, -326, 216, 564, 982, 1077, 984, 588, 418, 68, -219, -520, -150, -180, -16, -24, 252, 454, 167, 65, -312, -262, -674, -663, -130, -71, 45, 563, 587, 307, 234, -188, -591, -851, -739, -698, -670, -215, 166, 739, 537, 647, 427, 184, -353, -473, -558, -1001, -319, -212, 104, 427, 894, 626, 307, 335, 71, -353, -398, 279, 86, 268, 694, 708, 1017, 70, 23, -565, -962, -1326, -1055, -620, 90, 619, 1213, 1886, 1858, 1586, 1100, -53, -968, -1483, -1760, -1800, -1268, -587, 602, 1244, 1417, 1849, 1214, 741, -417, -1031, -1171, -1104, -1365, -571, 259, 695, 1578, 902, 398, -524, -943, -1515, -2102, -1895, -883, 76, 798, 1966, 2573, 2749, 1510, 584, -227, -1601, -2584, -3027, -2504, -1744, -693, 731, 1667, 2608, 2518, 2180, 1183, 242, -930, -1424, -1816, -1395, -837, -313, 674, 879, 1481, 934, 340, -332, -719, -845, -750, -517, -64, 1147, 1346, 1841, 1801]
3010A801r8j125j203q23m17K46p02P96R71J416P5M70R32p66p80r03m31n43j50
3029a234l8L28M12J34O31J23o9j07j70n9n4Q7K05K23m52N46M36r41m75K81Q7p79
3051h85k96M91P37k03K95M15K40j17o92K93l98J32o61L89N9J85J06p3J33j85J
3072c4l27q3JR21l06J50K61K99J47r78k93N5m5o12k26R93L00K69L5M03N1l04p71
3095i4m59K27l94m88pQ52N46L01P0J39J34m39n17p43J37j42%J73L58N57j27K50
3117C34n37M57k37n99j34L71J11ON00L83K99m7m33m93k42m36p73K48M07J68J40
3138e07J204M91k5j02r8j16n25q36l30j50L5L81L34k58N90L94q0k90J31K07J09
3159E59n45J11P38o2j89m72L37n67n09o58M35k15j20L25P04Q97mO64Rj10j72q15
$$ y = [1801, 1703, 578, -625, -1448, -1865, -1619, -2321, -1525, -554, 862, 937, 1407, 2339, 1573, 793, -110, -541, -1084, -1234, -1272, -944, -532, -398, 233, 356, 287, 180, 10, -49, -103, -16, 189, 412, -40, 506, 942, 1, -474, -193, -106, -885, -1181, -690, 47, -156, 139, 554, 794, 677, -15, 278, -120, 12, -649, -260, -201, -16, 90, 17, 150, -35, -34, -361, -444, -443, 478, 172, 322, 583, 882, 1029, 51, -242, -187, -232, -844, -1070, -77, 223, 492, 527, 930, 981, 677, -94, -553, -326, -720, -1208, -1215, -363, 183, 484, 554, 693, 827, 388, -129, -872, -735, -877, -877, -704, -346, 211, 84, 334, -203, 254, 17, -582, -716, -345, -234, -228, 272, 655, 954, 907, 474, -19, -261, -697, -1470, -1222, -815, -647, -507, 697, 1188, 1163, 1061, 963, 847, 322, -514, -844, -994, -959, -578, -244, -502, 88, 482, 402, 112, 243, 450, 559, 14, 125, 863, 801, 612, 140, 477, -90, -599, -1257, -822, -1037, -1157, -832, -128, 769, 765, 1429, 1438, 1328, 1156, 341]
3181C41l94r13l65K66k38J18L94O33j6L78j17R92m00l63K8j6k02k01K65j02j92
3202a04l39j3k03j49j11k11P24Q3Q30K79L76K39J43l04n07k28p24n23m91K88l12
3223a257J79O75L39O11O9J79j87L62p7o06j69j60O0l68J37k83N6j16n16M90J44
3244d38K31j87R05K88J02N4l02M30o06m45p96m5n0o9P6L64M30K2N12o11N38k35
3266A68Kl21K6M8N37j01o12M55l86l40j09j64J34l5K42N76O08K2p0M53l41o76
3288A16l56k70m24j78K80M04Q71K21J89J96J66o30k34n01j47k55j82L01J2O01
3308A80L06Q2j76L20n80j37m47l04L23j54N14J33M38j70J70m28k99q5o29p1J53
3329h61O42K96J27P27J15R5n44j17q10k86n05k06M22K9O59L46J36L79N73n54l60
$$ y = [341, -53, -966, -1331, -1065, -1303, -1185, -791, -158, -174, 204, 87, 1079, 679, 316, 344, 328, 126, -75, 190, 88, -104, -443, -456, -659, -808, -919, -1130, -406, -323, 507, 786, 1162, 1401, 1544, 1240, 733, 505, -219, -742, -1233, -945, -1257, -1078, -403, -64, 547, 616, 795, 608, 970, 893, 287, 118, -42, 18, -350, -213, -496, -440, -556, -1072, -582, -438, -207, -394, 511, 799, 901, 955, 653, 1083, 477, 32, -764, -809, -859, -928, -852, -488, -58, -36, 476, -135, 403, 168, 170, -151, -125, -77, 460, 359, -253, 202, -184, -524, -633, -797, -663, -698, -456, 120, 728, 750, 680, 1133, 792, 116, -240, -510, -934, -1112, -832, -428, 443, 664, 853, 1049, 1215, 585, 351, -150, -297, -552, -734, -433, -421, 180, 486, 568, 392, 712, 132, -5, -452, -756, -433, -587, -73, 60, 498, 328, 498, 70, -229, -314, -943, -1014, -861, -219, 77, 204, 931, 1046, 1141, 597, 480, -330, -616, -1121, -1327, -905, -876, -217, 129, 265, 644, 1217, 663, 303]
3350C03k66J40J25o44M15l08R4p7m13n4J53k15j9N55K53L98N86K3K51l13M8o15
3372D20o61l41l45k35Q6L72M08K51K90N48j21K8j06j11q3k94J99q0K46n47Q9j15
3394a02n26l18m23J13M0M56M58R40L47M97K46k90m77j091l04j120k62J2J4O51
3414a139P27M46M64N37M1j00m29p7l17l45K80k84K12M7M30n89r3n19J01m5k32
3435h84K45M96M50M51M95L52l07l3n78q13n55n71n19Q2P71K58Q04J53P79J71K13
3456A460n35k34n20o46J57j71O1L76J78J68r5k85k14j76jK46m40O87J38K44L27
3477G25J20k05k10l83n86k97m05K82j5N37K46L56L19L23j4k54l39l64k50j22j58
3498f94J38J88M83J63J4Q5n8k27k51k1j33Q4o6K45J83J07K48P2k55L8l48l21R6
$$ y = [303, 37, 177, 302, -342, 73, -235, -141, -218, -631, -685, -532, -747, -766, -211, 42, 440, 1026, 1049, 1300, 987, 1035, 420, -241, -582, -927, -1162, -1076, -704, -296, -45, 245, 793, 672, 700, 594, 483, 400, 106, 305, 225, 471, -76, 13, -102, -628, -946, -1369, -1256, -1216, -760, -302, 638, 985, 1482, 1728, 1438, 961, -130, -434, -1554, -1816, -1804, -1790, -1139, -412, 34, 498, 1035, 1076, 976, 547, 470, 153, -192, 88, -196, 16, 63, 493, -96, -189, -708, -607, -652, -884, -639, -143, 307, 758, 1253, 1605, 1298, 1265, 687, -126, -681, -1252, -1771, -1689, -918, -660, 144, 297, 1076, 1247, 1460, 925, 691, 171, -475, -318, -489, -428, -52, 126, 294, 199, -86, -300, -476, -477, -231, -671, 16, 154, 398, 725, 845, 640, 430, 47, -539, -836, -1241, -959, -974, -437, -191, 165, 484, 807, 793, 539, 200, -164, -414, -536, -694, -556, -368, 115, 278, 292, 377, 319, 92, -159, -180, -313, -229, -295, -50, 133, 240, 488, 560, 305, 343, -5, -326, -230]
3521b30P0k49K13L89J33L86m2k97j45l12m55j3M0m0k4O77J58L73j66L08j47n09
3543A18J00k32l69k94Q1J36J63K36j66K76M5K80J9L7o6o6l21K83l13j28K19j53
3565a15k10k77M40l40k6J29K91L21R5L42k08k9L3m38J64k57j63m13K38J56R0j7
3587a94r2L46K10j77o5J69K56Q8J90j82K92j71m12o78L0m59J17l66N3Q73M47N44
3609H19R1N26l03Pp23n73l82j54j62l40N57N18lO54J13j2n16l47k34j40K8J75
3631d01L89M78J64K13l8n98l71p25l61k15J54L16N16P44N72P08j02k7m76n30p40
3652c30o13p7l46J87N23O39M34J50L27j44j58o32k65j73j93L67L61J72K22L27
3672G78m5k23o00j83l26n30J74K07O83J86M48M99Qk56l51k56l31n67l89J73R7
$$ y = [-230, -160, -409, -196, 193, 326, 712, 670, 373, 228, -84, -539, -552, -512, -552, -576, 101, 259, 632, 466, 774, 627, 118, 218, -14, -383, -677, -596, -460, -297, -61, -227, 49, 94, 374, 393, 430, 364, 298, -23, 260, -53, -181, 38, -115, -325, -602, -162, -502, -528, -399, -108, 213, 308, 650, 442, 413, 446, 8, 172, -85, -248, -661, -423, -267, -177, -194, -286, 60, 270, 93, 28, 197, 453, 541, 731, 549, 841, 670, 258, -420, -390, -849, -732, -1098, -1045, -172, 275, 819, 910, 1436, 1133, 1140, 417, -156, -538, -692, -854, -1194, -637, -119, -122, 532, 645, 633, 117, -230, -464, -604, -576, -401, -12, 466, 630, 843, 805, 207, -164, -889, -1250, -1465, -1311, -995, -479, 265, 837, 1545, 1443, 1416, 940, 410, -330, -943, -1020, -1366, -1179, -656, -17, 417, 567, 894, 750, 592, -40, -305, -478, -671, -304, 57, 229, 451, 778, 733, 510, -90, -273, -599, -1129, -955, -748, -65, 121, 569, 1068, 1076, 820, 469, 213, -118, -685, -1074, -901, -804]
3693h04M91L59M05J89m7K36o74l83k25j79K71l27M00L30K57k37N14m50j77k95
3713c46r5q1k36N66K43N25m02M20k91k01j04k50j04j5k2K71M24K35J2j0l84K7
3735A82j87k09j49k81L46J03K72J01K03j38P2m42R0j45K5j56L6K99J79J80j03
3756B78Q8k15l13k59R5j91J16K04K10M45J51J79m63M6j62q18K98m23J42J8L29
3777b45J89M7L88J99o2n92L22l85o4l59L22J52m7R0q8L22r8k50P8j18p8q0q8L13
3801a32K94K6O88k66k39k89k46k35k24O7OK70P0N08J95Q4q6k65K06k60k64K2j86
3824b56J56j02J63M29Lj80J04l48n2o8k51M19M4M05j26K7q4Q3j65m40R6l04K10
3847b37m40L70J71K93O8J18J41j40J05j86l46j74j09j78J40K53q1M75m27N10m1
$$ y = [-804, -313, 46, 451, 640, 593, 829, 155, -228, -453, -632, -361, -688, -288, 42, 299, 62, 576, 126, -51, -346, -441, -522, -758, -192, 51, 576, 174, 594, 303, 102, -2, -252, -356, -371, -393, -122, 302, 537, 549, 539, 155, 182, -5, -214, -363, -644, -298, -195, 77, 178, 381, 243, 315, -127, -37, -182, -157, -313, -277, 22, 201, 381, 278, 366, 151, -162, -421, -326, -517, -401, -197, 13, 458, 609, 788, 325, 371, 209, -609, -311, -734, -592, -574, -245, -56, -9, 379, 578, 516, -76, 246, -139, -203, -562, -240, -88, -135, -45, -133, 189, 91, -159, -81, -199, -277, -357, -445, -132, 162, 188, 876, 610, 371, 82, -164, -399, -623, -556, -550, -280, -210, 298, 493, 577, 491, 226, 432, 172, -92, -70, -256, -100, -202, -39, 390, 393, 213, 317, -31, -83, -151, -402, 17, 61, 466, 340, 367, 283, 366, 201, -239, -143, -447, -237, -677, -307, -136, 157, 225, 343, 484, 344, 449, 263, -83, -257, -366, -544, -404, -151, -232, 243, -184, 326, 285]
3868B85n4j77j60k3K5L23k51J8K16J4j83o6O6j02k66Q8K11J06J40j63K29J84L2
3891D92l23k7k09K6m2k0R0rJ73j42Q2K30p2o3r2K9j70o0P7k24M84l44j1O9J0k14
3917b60J35j1J24L17k19O9k8K5q6K42l20l67J65j11J59j48J22M9M8L90n5J65k03
3940B02l77K35j44J58k98J01q1L08j64M0K80l43k6q3J90j63o8J21K74M2M03j93
3962D14j72K33m44k81j69N2n1K48K81j40J37M45j74N9k54m9k09j13k20K25J7N5
3984a10p9M58o2J14Ll84l19J05J32j27K13K3n0kJ06K04Mk88Q7k84j95L48k5k7
4008a55J23j27K26J50q0lMk82J24j06k53n5L03J6J80J93j75M10j34l18p4J99l2
4031A34m85J82K2pJ31j51K77p7K47q2j38O0m7k7j81n4L17j73n7n9K43R8k45j89
$$ y = [285, 231, 54, -106, -129, -104, 219, -32, -14, 202, 216, 33, -33, 33, -69, -335, -247, -36, 70, 210, 47, 276, 460, 492, 169, 142, -67, -41, -83, -103, -13, -22, 151, 9, 91, 321, 249, 186, 94, 123, -47, -107, -30, -254, 230, -114, -125, -56, -46, -260, -125, -136, -12, 305, 86, 155, 127, 152, 66, 308, -12, -379, -214, -325, -166, -314, -192, -143, -95, 295, 240, 405, 202, -175, 60, -84, 74, -224, -123, -204, 104, -60, -20, 260, -83, -109, -192, -2, -165, -233, -112, 162, 204, 607, 414, 242, 475, 31, -250, -419, -367, -418, -170, 111, -29, 108, 553, 379, 438, 184, 135, -74, -187, -407, -182, -165, -110, -189, 269, 207, 321, 324, -60, -379, -274, -142, -269, -56, -33, -83, -85, 21, 225, 229, -59, 28, -256, -451, -103, -128, -155, -32, -159, 67, 217, 137, 134, 138, -144, -20, -126, -379, -434, -131, -115, 65, 258, 83, 493, 359, 41, -33, 166, 134, -351, -169, -147, -154, -23, -174, 103, 26, 273, 191, 53, 113, 66, 39, -142, -196, 121, -52, -109, -168, 75, 173, -72, -261]
4055b61O37l55j54j89L33K96l42K05p0J04j83K37l98Q8l67J76J12k20Q6J72J28
4076C5m0J52L65J1n65K6J90k81l65K1K58k1K75o3L71m3m36L53J42m68k5q9oq8
4100b91J81J64K00q6l44J79j00J29j36J08l23M70l6J86n7j94L65k18J18m57K3
4121a19r3l9j48N09j23K83O4o3R5k71Q4k73j96L26l95K81l80L79P7K83O0j30j63
4144D8j70r9J30J95n6J6l4j29L93k04N2k41J07j98m04K52J51R1j01K29L90k2p5
4167C21k10K20k75k02O5m7j68K32J3J54K65j48j56j86M31l27l3p1P5L04k84J3
4189a4o6N29k55k52p8K80j73k35J12l2J64J7RN31n0k40j81p7j24J40O3o2j49K06
4213F3m10L09j20K33K58l21j70R5J87j90O2J0j04J33l05L8K44n8q9K50q7j06J78
$$ y = [-261, 376, 21, -133, -322, 11, 307, -35, 170, 100, 204, 21, 258, -140, -52, -419, -243, -131, -351, -265, -93, 35, -5, 147, 512, 523, -42, -16, 174, -107, -472, -451, -193, -214, 61, -2, 369, 326, -110, 243, 385, -83, -108, -197, -203, -291, -110, 54, 254, 168, -176, 3, -97, 32, -104, 4, -319, 151, 115, 301, 244, 50, 415, 197, 315, -142, -119, -212, -251, -399, 110, -13, 270, 334, 271, 366, 95, 179, -94, -290, 36, -359, -78, -458, -79, -2, 281, 341, 211, 48, -122, -221, -91, 104, 48, 64, 30, -99, 294, 90, 142, -99, 8, -190, -594, -342, -191, -100, -201, 28, 418, 396, 321, 111, 331, 56, -146, -81, -128, -296, -64, -51, 103, 368, 220, 64, -122, 309, -18, -51, -122, -47, 257, -27, -14, -80, 449, 194, -58, -136, 144, -29, -264, -152, -184, -20, -3, 6, 537, 487, 247, 66, -11, -135, 5, 68, 6, -143, 63, -347, -38, -158, 75, 333, 12, -158, -63, 124, -66, -4, 6, -98, 35, -270, -232, 12, -46, -135, 115, 28, -78, 100]
4236A00M8O1n26J55O8N6j13J45J35J13K05k39l04m8n9l0k60J26L25K03j63L40
4258C38k0J1o2m95K70j92k49j1N31j76K05K20j52K36q2k64Ol19p3j91J0L41R9
4281a9K80K62o8k5n0k80k50j82J52k40P4K7N26J70r4K63j88j22k27L7j06r0O7
4304h3j36K9K56k0Q6qj94j41P1j77l28L87K36p8L51r2M57l08J29m57p0K15k73
4327a48k24O2N2J04K5N11j52O9J83l07k35O0q7O9o8k6J45o6K2Rj29N8l72L14O4
4352f7J6p0K64jj30L53l22L28l04k9j89K0j20K02n6Q8j3J27Nq4k6j15J27n2J97
4377A49j55N4L8Q6j78j0q7q6J02j76J72J11J7M2k32L22j25J39j07j82L05l09J75
4400F5m16J37L80m0l13K27p2l2Lk91oK05J97J71M7P4J63l52L32j61n93K81k71
$$ y = [100, 148, 209, -317, -162, -94, -38, -151, -6, 129, 242, 447, 208, -96, -144, -203, -233, -493, -367, -42, 161, -2, 338, 318, 329, 267, -228, 42, -150, -399, -410, 121, -55, 150, 370, 218, 454, 372, 108, 114, -205, -278, -469, -459, -118, -19, 261, 523, 455, 430, 380, 100, -150, -332, -180, -420, -346, -319, 207, 377, 283, 546, 358, 236, 9, 46, -60, -150, -83, -219, -190, 66, 46, 132, 124, -70, -211, -140, -317, -645, -258, -22, -100, 251, 159, 616, 308, 437, -20, -90, 125, -148, -372, -310, -258, -154, -129, 382, 230, 299, 482, 175, -60, 0, -87, -18, -86, -112, 33, -33, -11, -2, -131, -73, -445, -131, -67, -51, -121, 143, 142, 12, 365, 43, 371, 67, 38, -151, -131, -251, -49, -105, -17, -30, 97, 102, 18, -8, -123, 4, -48, 149, -6, 48, 86, 172, -6, -16, -103, -189, -87, -263, -91, 20, 37, 79, -153, 169, 44, 183, 76, -106, 199, -110, 65, -351, -214, 166, 126, -187, 40, -32, -64, -61, -352, -358, -153, 44, 215, 262, 336, 499, 147, 479, 318, -275, 6, -265]
4423b65J4K14l17M16O7K18o7l0k04J31m4j12j41j10J98k26M54j14km3nk18p5J32
4447a29JP8J69j7J05J02j33K68m67L5j77j34j80R9K57J7M1O8J12o4M22m14q3J78
4471A54l58J92r3l1J06K91j48M6j50j81r2Q3K0l0M12k45M4L16N0j47M7j30j58
4494bk87j03L25k38J13R4J00J09oJ61n2j57o2J15j05j03k47K72Q4j09J40m7%j92
4518a97nJ05N4l46K02K21R0L9L3j1j93q9L9j86j6O4l4J92j6J08J32m0l9k50L1
4543a12j19J74L4j52K66k2J6J45j81oJ55j40j50l02N56p8k00j08M61j91J4k38
4565a78L1J02q9M2k9J35J46O1J10j85k16J25l05J16j63J18KN5L90J37M3k68j59
4588B1K18l61m9o9rj6J89m5K98O8m7m9J04l29j54p1K84O7J11K5O9Q4jk11o3k60
$$ y = [-265, -251, -37, -354, 62, 129, 347, 280, 250, 46, 177, 133, 21, -120, -230, -32, -258, 196, 82, 80, 37, 32, -186, -261, -129, -128, -50, 119, 102, 207, 309, 176, 444, -23, 12, -165, -299, -479, -380, -123, -106, -65, 3, 115, 51, 473, 59, -24, 154, -204, -12, -105, -136, -30, 261, 113, 159, 9, -172, -264, -181, -161, -191, 221, -24, 20, 336, 386, 239, 286, 156, -2, -289, -392, -67, -305, -192, -98, 2, 111, 105, 266, 214, 57, -5, 110, 5, -98, -345, -73, 11, -98, 42, -5, -5, -197, -202, -97, -43, -389, -187, 34, 124, 163, 196, 185, -8, -97, -58, -244, -260, -196, -230, -38, -54, 54, 186, 146, 107, -143, -112, -231, -57, -23, -175, 91, 69, 85, 230, 49, 43, 198, 58, -92, -394, 162, 84, -116, -224, 237, 46, 60, -178, -147, -45, -134, -92, -121, 14, 160, 221, 331, 146, -70, 55, -250, -134, -297, -179, -177, -122, 268, 405, 448, 180, 21, 239, -122, -171, -240, -249, -265, -76, -121, 177, 245, 198, 149, 253, -76, -230, -301, -17, 50, 161, 186, 255, 339, 338, 127, 64, -196]
4614a96r7J20r8N1J4M11J86j75Q4K52k44k59j38J63j30m00K10J48J1r2J77J18
4636A16qk38K64j57R5k46J83q5L3J11NPJ26q7j96k52J68K3j13L12j82N5L32J6
4660B82q6L5q6J58m44P9J15o5l57J84J37K1N3j08J65Q1o3j5M3J0qk64J43j61K22
4685G1p0J2j97K23j05j03K04J96J36k97k51M12K5m19K94J5j54L52m33L16j35l01
4707b09J75P4o9Q1P8p0M33m89J49J05j82o4j40M2l49M02p7NL3K82L1j41j06l5
4731d1K64k32K50l30kJ04j98J00R2K91l65J94J1k78K30l31K18r2k45M88n1o7J44
4754A54j50J50j93p2J86n25L17k12M66k50K84J9N9k7m6j44k6O8k76J58Q7O5l5
4777E7J78m5o0j60O2k43m2P2J40j84K90m2J38j30J48k52K16l17J19K03l31J33
$$ y = [-196, -293, -173, -271, -220, -206, 205, 391, 216, 300, 552, 308, 49, -89, 74, -56, -456, -246, -98, -87, -179, -2, 116, 108, -130, 134, -23, 72, -174, 9, -76, -43, 68, 73, 80, 206, 119, -77, -329, -161, -138, -251, 61, -121, -66, 266, 282, 196, 231, 145, 303, -141, -62, 53, -12, -369, -185, -48, -27, 26, -82, 83, 164, 101, 86, 129, 139, 131, -133, 10, -151, 71, 1, 13, -184, 39, -66, -169, 35, 231, 367, 70, -181, 231, 256, -163, 131, 146, -8, 344, -89, 227, 92, -209, -34, 40, -29, 52, 130, 60, 493, 4, 153, 258, 76, 12, -128, -86, -435, -33, -110, -105, -72, 210, 241, 100, -6, -41, 223, -9, 241, -89, -91, 13, -185, -85, 7, 298, -67, 127, 138, -140, 90, -241, -23, -115, -360, 128, 77, 10, 154, 4, 154, -39, -111, 75, -450, -133, -345, 121, -129, 155, 174, 233, 206, 160, 16, -10, 58, -218, -60, 27, 92, 57, 235, 190, 130, -30, 32, -211, -253, -181, -41, -225, 65, 23, 161, 31, 179, -73, 143, -174, -55, 148, -183, -50]
4799e0L09j10J43j36k4j47P8j05K4j58J76j20j14J89R5K48J25k5n8l87j17j48
4821c12M8o0J25k1M08j31M1K67j88N9l16J47j54r8O9K52j82j5K53n5m27L61k45
4844a74J20O3r4O7N7o3M45k23J25lq5m73j6R3Oj63r8N52r9j72M05o2n3j4oj50
4870a5K30l64J39R8l85L04K85n18L31k18L2j39L52q1N7jj13K81j33k36Oj15KK62
4894F1r2k60L88j48K44j47k61M05k22l2J82p5J2J65ll13J28r4J36P7n75P8J14
4917b32R2J41Q5J70P9k06o9K26m77J80l7l4k3j81L27J51m8K30n15L24j66K8r3
4940d8k57J82O7L10k1j38J48j52o9Nm6p9J80l95P1K18J49M3J56j44q0j39l0j06
4964a75r0J35K9p2J50K6M60n01J97j60J08j92k04K66K2j95M65l08J29J67k92r0
$$ y = [-50, 259, 149, 292, 156, 132, -15, 63, -42, -18, -176, 0, -120, -234, -45, 50, 298, 423, 398, 340, -47, -164, -312, -264, -324, -199, -220, 188, 57, 98, 365, 177, 236, -80, 67, -87, -185, -116, 136, -46, -61, 192, 137, -290, 71, -174, -54, 9, -85, -18, 39, -24, 421, 198, 323, 320, 235, -238, -254, -161, -155, -318, -416, 136, 37, -135, 270, 208, 155, 141, 135, -15, 215, -149, -10, 88, -297, 7, 292, -226, 105, -113, -81, -220, 132, 51, 108, 107, -6, 275, 142, -94, -88, -203, -201, 61, -31, -291, 97, -51, 193, 46, -215, 190, -32, -64, 118, 43, 55, 220, 217, -96, 32, -62, 74, 151, -424, -346, -232, -140, 1, 86, 256, 335, 129, 60, 286, -191, -11, -48, -82, -105, -286, 41, 192, 144, 374, -141, 183, 17, 45, -48, -305, -123, -56, 254, 233, 95, 243, 91, 22, 27, -19, -98, 82, -313, -242, -24, 125, 168, 324, 180, 100, -39, -69, -175, -265, -130, -101, -173, -23, 3, 463, -38, 159, -1, 107, -85, -289, -23, -1, -196, 269, -39, 90, 257, -35, -125]
4986a25q4K02l23M11R0j35P3J7J17j64N1j66q1J0pj4j3J78Nn7q7J51j3J7J38l44
5012a53K57r3m7k32M55J66l63RJ83l36J49P6N8N7j6j15k22K58j54J99j96JK5m4
5036g8j09M12j54r8J60M0j1l4k73K41j89p3k87K28QJ95J90j67K17P9j74%l56R4
5060a39m8J6l01M52L9K67l53K62k87K75p37N47k7k3Q2j45J60K50j20Q4n3l40K16
5083G7k20Q2j92K41p1J07j57L55k1k33k7L67l99N3J07k36J5J88m99N06J28k49
5105g8O9P2N2k54o2J32J32k03J31k22K80l46N31k25k55M0K41r3k37L54n5p8L82
5128C08k09J38L4j85j79P5j72Q3J18J19j37M5K26j93J9k46J10L9j73K01l23L14
5150A2R8q3L7r6mK70j23k02O6l3J46j92J8K9n1J74j6r2R6j96L9R7K86m17J11K78
$$ y = [-125, -209, -7, -330, 81, 171, 36, 109, 126, 243, 79, 130, -36, -117, -107, -114, -128, -141, 37, 42, -15, -102, 49, 36, 53, 191, -153, 104, 11, -36, -268, 187, 353, -10, -1, 182, -154, -5, 71, 129, 186, 170, 55, -167, 91, -63, 136, -60, -59, -34, -78, -187, 225, 71, -27, 133, 173, 162, 128, -145, 96, -93, -166, -453, -225, -217, -22, 168, 1, 218, 297, 123, 123, -233, -139, -187, -171, -472, -20, 19, 286, -67, 195, -92, 183, -554, -7, -34, -57, 25, -120, 40, 290, 170, 254, 201, -139, 77, -143, -61, -253, -12, -83, 24, -133, 222, 201, -32, -59, 308, -91, -38, 69, -167, -152, 36, -463, 43, 171, -78, -9, 63, 115, -139, -201, -69, 63, -140, -9, -231, 49, -297, 234, 9, -246, -206, 35, -58, -295, 59, 4, -74, 308, 99, 237, 271, 86, -93, -18, -190, -107, 11, 130, -7, 38, 264, 71, 90, -156, -46, -7, -180, 21, -302, 12, 110, 27, 64, -32, -36, 234, 111, -91, -25, -58, 88, -104, -86, -57, -108, 66, 50, -42, 54, -142, -103, -6, 280, -137, -26, 252]
5176B52k40Q4p2j34OJ48k68J85j01J73k47K69L5j67L47l22j21R9M2j40N0P5J38
5199I1M6j74j90J98n3j93J48j49M60j92l09M01p7Q1%m9k93J65J26J58j28j23J04
5222D8J31o9m65M48l03L02o9p9Q8n9L6R9r3o5J73Rk73K2Q4j01J58j56KJ14K11
5247A93k94J44K80j16k90j15K05Qk34R2K13j79J63J52o7R9j43P3m84J93m8J68
5269A3j17J33J64p2l9M4j32k26K33o9l46L77K24q9K43k06J28k4k78p8K14n00M39
5292C6Nq7J55L0PJ62k53K5L4j63j1Q9k03J14J91M0j76J10j36l5L29l67k6j86K65
5317e1Q0M4j93K95l80J87j04L92k11j50p3PQ0J21q5M9M1N1j31m9l1kJ01o9J53
5342G2J42%k18q5J15J09Ql7n3j27J68p8n8L0L9n0j08K29J8k21j10J89q2k3K12
$$ y = [252, 12, 96, 24, -110, -104, 44, -224, -39, -140, 33, -214, 55, 90, -77, 270, -52, -173, -74, -32, -172, -122, -47, 91, 137, -37, -227, -29, -82, -275, -127, -276, 184, -8, -317, 84, 7, 88, 88, 39, -254, -89, 37, 195, 67, -56, 48, 179, 110, -355, 93, -210, 92, 23, -56, 32, -27, 9, 108, 15, -50, 123, 132, -141, -119, -35, -136, 22, -134, -132, -18, 193, -101, 43, 323, 207, -83, -198, 7, 15, -219, -127, 86, -93, 70, 222, 155, 254, 111, 184, -300, -107, -155, 13, -104, 29, 193, 121, 82, 126, -6, -232, 1, -68, -414, -37, 187, 98, 341, 135, 263, 239, -39, -117, 97, -403, 36, 41, -46, 109, 139, 146, 308, 55, 80, 114, -49, -60, 29, -174, -60, 131, 171, -5, 105, -31, -66, 263, -104, -130, -316, -51, 29, 73, -120, 175, -205, -18, -122, 270, 59, -91, -164, -157, -77, 44, -41, 8, 49, 100, -31, -80, -111, -113, -12, -81, 72, 214, 214, -4, -89, 26, 135, 143, 106, 53, -74, 94, 16, -42, -12, 27, -23, -131, 98, 116, -105, -215, -26, -108, -131, 81]
5367H1k28J60O2k34K69j43K19j62p5J64l35K53j51J12j38K44o1r2K8J02j25K95
5389B45Pn4l30J56N7J15q2K0o3O0k95K73j94J81j7j44M1q2J73o2j63Q7l7L9j76
5414b45J08K42J11q0k78J55P5j71j56K05J32l7m2L0j61J00Q0RR4j48m1l3j17K10
5438D2P4j54L01k71j30K3N7J60k67J24r0J18J88j91N7J01Q1k00j64Q0J34l5j25
5461h7N1K74l2k90l8n5k4K53k61J56j64J75l0L15r1k38J72n3j53J96j13j45J76
5484fQm3M5K0J62p2j49p2N3O3q3oj88J27j28L50k96K60K38n6m5k50L4r2L05k0
5510A59k16l9j40L81oKk7l59K30l8j06m8L83K9j65k38K66K79k46J13K8p1q1ql8
5535D4P9j20%j55K13J36k07J42j35r0J05J72k60O2O6k23M7Q5K62l68J09J9L5O
$$ y = [81, -147, 13, 75, -159, 110, -33, 186, 24, -51, 113, -222, 31, -120, -8, -146, 98, 37, -55, -27, 75, -50, 245, 252, 198, -132, 24, 81, 196, 114, 134, 71, 131, -164, 109, -85, 96, 79, -65, -24, -106, 67, 5, -158, -71, -108, -69, -245, -137, 105, 216, 136, -142, 13, 88, -83, -239, -34, 98, 61, 19, 49, -112, -12, 68, 77, 171, 23, -18, -51, -168, 42, 116, -38, 263, -8, -138, -115, -58, 102, -165, -41, -131, -13, 175, -16, 41, 142, 223, 23, -141, -61, 73, 38, -87, -36, 238, 206, -84, -122, -177, -201, 52, -209, -53, -217, -42, -72, 243, 152, -86, 86, 33, -120, 76, -37, -182, -6, 2, -41, 4, 24, 186, 114, -35, -107, -54, 9, -74, -80, -268, -141, -269, 81, -215, 45, 283, 227, 182, -68, -34, -126, 179, 159, -57, -96, -236, 145, 139, 141, 114, -245, -15, -53, -159, -207, 176, 205, 40, -198, 68, 347, 101, 214, 242, 171, 90, 82, 44, 123, 3, 3, -152, 61, 197, -10, 132, -3, -93, 12, 184, -76, -14, 52, -171, -124, -39, 223, -145, -36, -17, 18, 24]
5559B4j8PK39pk73Q3j4m8j1qQ7j04K42m47j45M42p5o6L02l75K87j11n6J49o3j78
5585a37J99j64K92k58Q1j16J35k1lj46Q6j5L99n07L37l1k68L08L2l86L42k08m0
5608h9L65k92M9J9Q7j44k60J36j04K58R8m29L44j6J59J37l14K24l17kj34j02J32
5631a95M42k21j12K78k51L6POO8j34j29P6J33R5qk32L71r0n8J03j31p0qj01K11
5656H6rN6j8p7n4Q0N4j49j46L19j96J26k80J43J71m1J45p5l1k41k2J7P3J69l11
5681b11K85j68N2M8l6o3l6J60j15K58l29J60K51k15mj52P9R8k17R9j44N2P5J22
5705D9l5j79K04p1R8q5k39L74j79M4K9j28J90o2k82L44o3J86k64J03q6o7Q1O1
5729B3j88J60j19O4J06k0J8j71j87M48j09oj58K92k13J55r3k35M49k05j24N9k3
$$ y = [24, 6, 13, 252, 245, -28, 55, 41, -7, -18, -26, 61, -43, 199, -248, -393, 49, -26, -92, 210, -165, 122, 11, -45, 104, 41, -137, 62, -102, 190, -68, 13, -103, 32, 11, 8, -138, -52, -67, 332, -175, 162, 131, -137, 171, 203, -183, 159, -49, -89, 276, -16, 33, 52, 139, -5, -265, -129, -233, 25, 123, -306, 38, 22, 181, 318, 4, 228, -89, -91, -225, -327, -195, 247, 26, -86, 192, -59, -23, -16, -10, 58, -76, -205, -129, 4, 99, 91, -141, 230, 140, 82, 185, 54, -16, -24, -125, 86, 77, 133, 115, 38, -16, 64, 118, -31, -177, 142, -54, 72, -208, -65, 106, 65, 210, 135, 104, -137, -159, -142, -69, 100, -211, 74, -94, -42, 6, -30, -93, -129, 31, -84, 174, -155, 5, 256, 41, 37, -115, -36, 62, -155, -56, -200, -148, -73, 49, 14, -165, 39, -32, 66, -19, -258, 116, -63, -19, 10, -118, 72, 10, -272, 72, 9, 195, -69, 34, -52, -119, -38, 23, -165, -5, -124, -60, 46, 26, 44, -127, -314, 134, 25, 19, -139, 153, -60, 95, 2, -233, 216, 11, -113, -54, -77]
5752g7L41l68J74n1j87K32p0j3P2J15k13j62K82l91M50j72o9J6J26O4n2K7O6j9
5776A21j83K34j52Po4O5O9q5k5j3N2L6j05p6O5j0J53l56N42j24j85J50l31J92
5800b3J39q6j80J98K2j80K58m9J9j12j27O3K90j50J35l76P0M8j9J67o3l2k18M41
5824B35k77M6j22L24j93J91j32m48L23j08J38N9l09J96J94M2k0J03k82q7m6K80
5846A07j94j18J51Kk12K13L2n1J27J79N6m08J52K9jJ34j40j49K5L5K50l6m46M75
5870B12j87J52j91q4q2J74j32J74N9q0K46k95N9n1P9j94p7L07o6j38J70j93J35
5893cJ93j25p4j8Q6o5j02j13L80k90l9J19N2o8P4K1L6q9Q3l26J03K47j27p4J61
5918D2j0L8j12J86k27N0JK04j98JJ38j5r7K1K93j29k30j15J35J66k88K46q6K28
$$ y = [-77, 264, -104, 70, 19, -168, 64, -6, -19, 53, 168, -45, -207, 75, -316, 134, -38, -107, -91, 35, 99, 47, 74, 140, 121, -62, 172, 20, 27, -37, 28, 97, 12, -13, -26, 26, 62, -43, -119, -54, -64, 89, -267, 275, 151, -34, 116, -215, -23, 116, 30, -150, 48, 70, -110, 148, 99, 118, 6, -121, -58, 232, 82, 217, -159, -89, -41, -60, 107, 44, 12, -206, 235, -42, 4, -118, 206, 13, 204, 72, -376, -53, -161, -23, 36, -273, -77, 117, 159, 139, 242, -40, -127, -173, 107, -87, -205, -54, -52, -264, -51, -19, -70, 57, 236, 292, -116, 36, 65, 64, 198, 58, -91, -66, -31, 219, 183, -263, 212, 25, 177, -14, -98, -180, -6, -138, 36, 95, 15, 261, -34, 25, -26, 53, -141, -218, 89, 23, -115, 55, -138, -3, 190, 65, -9, -27, 59, -6, -108, -221, 159, -131, -170, -51, 1, -67, 7, 28, 64, -25, 58, -268, -165, 82, -45, -119, 42, 32, 70, -42, 144, -83, -33, -32, 172, -26, -25, 113, 98, 1, 22, 315, 186, -44, -159, -24, 142, -146, 100, 14, 242]
5942B42k67J21j46p1K63k63J56K5J05j23J07j57r7j2O0l1j15p7L06q4q4J18R4
5965G0P0k64M1J72j53l7J06j14J72m3L8j58P1k39K22k05M00l7l77K27N2p4J25
5988F5k50L3k7K27k86o8K76J0pN9J08p9m8j66K19j15J28j15J29j77J37j73J70
6011E0r6K95j97N3j64J16k5Q3k42K47j03n2J57K1j15m2K82k74J12k31K50l10L83
6034A98j57K00k78J92J18n40L24p8j1Q6k6l4p6K08J96K0m03M1l4J2j6K01j15q4
6058e6J90k24j55J41n7K05Q3q2rj4J60j64j63O3K85k21m3j20J80j72p1K77l2J7
6082A8Q8j94K25N7J0r7M7k22Q3J32k10J09j04j14J11LK81j39j87L20k3q8k40K78
6106A44mP8k33n2j7J4k23K76J63M0j10j13K59j22K8l7rJ74J02l28k03P5M0k40
$$ y = [242, -25, 96, -50, -121, 142, -121, 35, 60, 165, 42, 149, -8, -105, -117, -57, -88, -203, -280, 26, -58, -142, -24, 70, 140, -124, -83, 89, -64, -101, 5, -109, 63, 20, 58, -100, -29, -268, -46, -251, 149, 112, -265, -38, 14, -60, 65, -185, -152, -179, 48, -238, -306, -30, -20, -27, 32, 140, 61, 13, -153, 66, -49, 79, -36, 93, -84, 53, -120, 50, -46, 249, 52, 105, -59, 57, 32, 115, -127, 120, 17, -35, 122, 143, 28, -14, 268, -6, 106, -125, 125, -185, 198, 41, 241, -37, 155, 273, -267, 57, -21, -32, 54, 28, -6, -82, 126, 322, 342, -61, -20, -54, -42, -58, 143, 28, -56, 134, -90, -245, -104, -161, 44, 127, 45, 36, 22, 182, 18, -145, -82, 203, -18, -61, -181, -1, -173, -244, 33, 1, 18, 106, -88, 137, 194, 204, 107, 154, -68, 15, 147, -63, 46, -58, -172, -61, -58, 223, 84, -103, 217, 194, 106, -134, 144, 140, 218, -15, -67, -84, -70, -293, -17, 146, 186, 76, -37, 222, 100, 128, 91, 82, 256, 358, 30, -173, -98, -58, -298]
6130b98J72J48Om4J70j91J42J08k16K42l53K85k13P7P8j43J93k20j55L05q1l0
6152a8J29k31K36j01j29K37k40J17M9J58l82M8J14k09L47j48j64K07j04K10R9
6173B25k30O3P2o5j56L4l7J34n2o3N3m9j15R9J43j10J55Nk15J51j17K69j17j0
6197F7j06K6Nk26J75j60K60j24M38m00n0J03l02L09p4l21J35J53N4j82L38j13
6219EN5k31O3J39j09p6J34qj12M5r4p5K62j86K79k37N0O3j20J84j3M7J69mk09
6244B1j04J58q1l2p6J0k2J48n4L21k73P9O6j72J40n55M88o2n7l3j14K26o0J39
6268A01j86O5J81k60M8q9R6K1J62k25n8L37l69J91l4j78J74J12j34O5l4r6n9K74
6292A05L6j56P6k65L38J19j90l9j30p8L5L8m4m4nQ8K37j2J40l51K19J36k80R6
$$ y = [-298, -126, 22, 28, -16, 154, -37, 105, 213, -3, 239, -114, 171, -42, 35, 113, -30, 163, -57, -212, 93, 12, -18, 111, -120, 116, 15, -114, 123, -117, 0, 49, 207, -175, -127, -13, -222, 125, -23, -187, 20, -84, 126, 225, -5, 58, 130, 65, -91, -57, -94, 40, -12, -75, -22, -71, -186, -87, 56, -54, 101, 106, -109, 42, -75, 194, 77, 67, -39, -13, -8, -234, -59, -219, 41, -83, 355, -45, -95, 8, -294, 15, -59, -380, -245, -92, -38, -220, 118, 5, 60, -171, -108, 31, -78, -154, -20, -28, -140, -95, -189, -264, -2, -188, 91, -146, -96, -33, -153, 31, 18, 65, 234, 230, 21, -83, 75, -6, -38, -114, -104, -126, 22, -32, 289, 16, 95, 161, -11, 129, -426, 62, 0, -57, -90, -204, 22, -38, 101, -85, -20, 161, -99, -51, -140, -44, -23, 139, -86, -144, 193, -176, 15, -19, -197, -23, 89, -45, 20, -14, -110, -169, 105, 141, -15, 61, -204, 134, 253, 63, 24, -106, -184, -149, -111, -155, -199, -204, -116, 121, 109, 249, -102, 117, 253, -27, 69]
6316F9m08K65j9j06m1K78m8L0J49k46K10j14k21Q6K7K46j01o7J36r0O3L9k6j33
6340b2k3j12J96k5K35j40o8J61j79j83J24qk02P6M0J03j4L4J64p7j06K46k32J08
6364I6mN3k56R3Qj4l5K37k04m9J48o6jK7N2o1r5Q9P0n2j54J24J0k24Q5qJ8o0J82
6393In8J26p4k3L46j45m12M25n2l09J05K29j6k09J43n2o7L01J0k07J98k21N7j18
6417a4l35J83K74j4k69K07j45J11m8j71J15R9N6J97m19K31m7K3M1k3R2j82k12
6440b50J24J56j50J48J07k24O9O3N3j50M8o1K62j08k28j12J14L56k85J21j04l4
6462h5J49j0m9J68O5j70n5j84M7q7K29o6J17j35J28k93L93k7J19k59L3j50K2l8
6486a38J04n5O9R0k8M3pJ29k7J37n07L46k27J61n6k17m6J86K16k28q4m4P7j61
$$ y = [69, -339, -74, -93, -199, -240, 38, -10, 20, 169, -77, 133, 19, -202, -116, -89, 157, 56, -11, 125, 35, 98, 137, 111, -22, -45, -157, 39, 14, 249, 109, 41, 202, 23, -160, -36, -44, -246, -170, -130, -27, -41, -7, 157, 80, -26, 220, -12, 96, 92, 145, -111, -18, -10, -24, -59, 178, -26, -75, 73, 7, 6, 33, 85, 24, -71, 18, 88, 36, -118, 6, 16, -208, -123, -131, -113, -173, 9, -49, 77, 3, -20, 326, 181, -231, 194, 142, -167, -62, 167, 151, -58, 85, 33, -34, 267, 277, 70, 268, 47, 104, -14, -349, -166, 108, 94, -175, 32, -113, -2, -50, -221, -106, -7, 49, 246, -173, 58, 11, 34, 75, 52, 144, -38, -250, -126, 30, -120, 28, 135, -89, -20, 43, 96, -54, -6, -67, 195, 87, -141, -253, -139, 217, -68, 53, -51, -85, 64, 54, 5, 173, 238, 68, 13, -171, -124, -211, 18, -48, 69, -66, 62, -231, 162, 135, 254, -5, 28, -122, -100, -138, -34, -89, -20, 70, 42, 85, 78, 207, 180, 317, -190, 156, -71, 90, 34, -183, -229, -43, 173, -55, -139, -183, -106, -267]
6510b67J64J46j98J11J97j18j23L58l4p9k77M4k24p9L46J6j30K88o6j83K30l7
6532H5P8k92J39ML7k87K81J86q4k34n1K53m23L0J1J70L1K65k06J88l6O7ok00j24
6557a18J67j00j60j1J66j47K43J23j26L1K75l76J81j33j76P6k2J1pJ33L3q1R1
6580G3p5P3n4K4j87J11J62j9O7j39J75j33J61j54k62L7J67p3j73R6K69j10o0J37
6604A13k28J61o6r5O1J19j42J95j74j31M04l34k17M85o8q6N0N9P3k72L75k28q7
6627c3j96K27J92n74M95j22R6ok1j96j74N54k46n7pK31j52p5j06J92j7J27j18
6650A4j63K19k43L33l39J95j94J56N0Q2J24k00o2J11m0P5j90N0M3L0K3k48K35
6673F1J54j08o3k77J45M8j19J56j15J48r3J17k1P1j51J64Q1p7j06q5N4J49J15
$$ y = [-267, -103, 43, -155, -44, 153, 35, -88, 270, 236, 157, -120, -76, -300, -379, -33, -17, -147, 141, 75, -108, 122, 85, 163, -129, 10, 14, 51, -236, 45, 231, 147, -87, -138, 115, -308, -278, -267, -97, -66, 199, -7, 181, 145, 212, 206, 6, -118, 49, -51, -211, -222, -56, -203, 40, 163, 37, 68, 343, -33, 148, 15, -161, -85, -107, -96, -103, 30, 63, -18, 73, -2, 71, 17, 41, -146, -35, 127, 108, 175, 36, 211, 78, 239, 85, -177, -140, 27, -46, -219, -123, 146, 36, -24, 113, -115, 46, -20, -115, -54, 65, -77, 118, -56, -187, 217, -117, -334, 151, 83, -3, 47, 106, 179, -93, 282, 54, -33, -229, -2, 190, -384, 111, -11, 85, 79, 58, -138, -312, 242, -4, -61, -68, 163, 11, -64, -170, 22, 5, 132, 14, -149, 70, -173, 160, -179, 16, -178, -22, 28, 110, 234, 34, -28, 83, 43, 118, -72, -22, 21, 51, 74, -174, 61, 215, 107, 44, -233, -88, -40, -159, -3, -118, 30, -63, 54, 33, 104, -47, 117, 198, 121, 15, -70, -16, 133, 248]
6696B48l19L3M1O8Kq4k1Q3k05L16l9oJ57j73j14j06J39R4j13j06J37k39K38k2
6720IJ7K30j98J2P2o6O9r8j97Q0O3k24K16rk02L86l01J67j3K13j29j76L54k20
6744E5K14o7o6Kr2j76J30J27k84k68L87K71j45J8j3J00k5J3k73J25l5n6J40l8
6768D4J6j0mr3L7k5O7j66L20l17L48j14l9J68Q4q2l73P1J02j72K7R4K55l84J75
6793B9J65n7MPo3K8K4k55l8J33K36m17OK13k21J14K61J6j19Lk15J13j51J05J28
6818D9p5j52L01qj33m4l7m2Q3J33j65lJ55j42K6J15o7P7P5l85J92L4q5o6M40k63
6844A3Mj0J52k18J1n0J02j70N3J28o2l7J59N4L6l37J10J53Qj0O8Q9l55J81k88
6869b16N6K54q0J12j46j30O7j15Q5R3O8j28O8p0J56j29j94J72j09k46J96K09O8
$$ y = [248, -71, -38, 3, 71, 73, -11, -32, 51, -154, 162, 123, 117, 274, 101, -13, -119, 20, 114, 1, -105, 32, -207, 31, 9, 26, 256, 58, 70, 142, 76, 145, 47, -150, -70, -7, -231, -15, -24, -226, 160, -141, 26, 13, 226, 97, -79, 275, 55, 269, 202, 136, 138, 46, -130, 0, 127, -157, -425, -38, 233, 88, 106, 93, 193, 168, 181, -92, 33, -2, -58, 82, 44, 60, 50, 46, -47, -10, -35, 32, -134, 186, -131, 217, 103, 64, 232, 316, 234, -139, -68, 34, -138, -111, -17, 238, -146, 29, 194, 137, 141, 148, 85, 113, 137, -118, -156, -23, 213, -204, -198, 15, -206, -92, 169, 185, 66, 69, -146, -33, -184, -79, 49, -26, -178, 123, 115, -18, -62, -99, -141, -58, 75, -90, -93, 62, -80, -54, 61, -6, 71, 146, -239, -47, -13, -98, -164, 276, 13, 17, 7, 159, -59, -48, -98, 4, -166, -113, 15, -47, -84, 75, 129, 165, -172, -62, 91, 99, 89, 157, 246, -109, 72, -216, -160, 94, 14, 126, -20, -150, -83, -198, -113, -20, 48, -80, -12, -82, 74, -55, -249, -77, -186, -432, -236, -27, 41]
6892D1OK1l0j33J49j4R9r8q6J9j22J9j1J43p5K7K04j66j38J84J16j54r0R9m0P3
6918D3m4J39j23J73n19J78Q1j73L25o1J00n5J59J3k99J79j58r4L25k20j72J02
6940a01n4K96l77K74P6j96L1mJ74j94K5j2m6M6J09q2J31j43N4k56J29K7J43Kq5
6965c3mR2L1Q4k08j01L35%j85m1j13Q0Lo4P7K1p5j2O4J72k87N00l43J06n5j88
6991a44N3o2M51m38j21N35k03J08M1l87L58O1j03k73J85k15K55J43l07K26q9K5
7013I9J30O7m29J41L6j3L5k38Q3m1J85k22K78N8j09m4m6p9Q5j01j05J47L5K06
7037A58j05Pj43J07Kk0j23J65r7K15p6j48m9J06Q5K7o7j28J88j28j68K25k8m0
7061c5k7J84n8k30K64j82K67j6j5k52J63J78k41LJ1%k58J40N0NP1J95K5j23J71
$$ y = [41, 47, 68, 38, -95, 54, 40, 139, 41, -45, -26, -148, -129, -140, 3, -72, -45, 159, -7, -145, 39, 155, 1, -89, 10, -30, 43, -1, 138, 15, 188, -331, -153, -72, -245, 80, 19, 119, 64, 223, 236, -63, 116, -42, -136, 189, -31, -203, -101, -155, 141, -236, 38, 114, -82, -51, -55, 119, -75, -50, -62, -108, -62, 47, -35, 96, -47, 7, -249, -120, -93, 50, 52, -33, -37, 55, 86, 170, -38, -139, 196, 196, 11, -30, -143, -63, -60, -124, -47, -26, -101, -113, -49, 123, -164, 336, -7, 99, 44, -144, -91, -153, 298, -140, -261, 274, 71, 179, 220, -167, 191, 252, 149, -124, 61, -154, 101, 244, -63, 163, 74, 99, 229, 296, -133, 8, 44, 31, 66, -172, -89, -130, 55, -167, 111, 169, 60, 16, -30, -109, -24, -125, -230, -83, -48, 158, 53, 60, -83, 24, 26, 6, -117, 48, -49, 166, 90, -58, -107, -1, 84, 111, 44, -84, 104, -24, -192, 33, 5, -35, -62, 122, 64, -166, 98, -84, 183, 167, 152, -100, 63, 241, 0, 3, 14, 14, -244, -104, -54, -49, 22, 217, 242, 119, 290]
7086B90m19J22r3L12j48k90q0K49Q8L9L0m95M72r9j02J43j86J23M0k30N25j77
7108A14k67K09n1L0J2j61K4jQ6j06O7N4J55o6p4j97K68J32k82J68Kk5j36P8l10
7133b77K63O9j02j55K72J73l09q0K14k32P7O0L8O3j79J67q1K49j63o5k6Q6k01
7156a39O6K51k63K02o2m9Q8M1k04J07J3k02MJ08j48o4J73O1j09R8K2r1j35K19
7180a3q7k45J98J47ok48K82L01j48k47J19j25k6K6J1j49p2O8M8L25j63J94k2p8
7204I0O5j58J12J23l36J5L16j99P6l26J65L96o08J73K00j61r1P3J80qr1l43K62
7227g5oJ33L9M0j65J56p5p4Q9N6l6l08J84j03K25J26o2l97L76j12k38j66M31k9
7251Ik39K66lJ37j92j11J74j56K18j08j50L43k56J66o8J19k68qJ81R1k25O7j66
$$ y = [290, -129, -7, -100, 212, 64, -226, -306, -57, 31, 70, 100, -395, 77, -22, -124, 19, -167, -44, -4, -234, 291, 114, -153, 56, 5, 35, 47, -114, -90, -91, -5, -111, -44, 10, 165, 99, 25, -172, 96, 228, -54, 114, 116, 91, -45, 33, -277, -14, 55, -47, -202, 70, 243, -66, -146, 68, -164, -87, -27, 11, 74, -105, 62, -19, 230, 67, 2, -24, 62, -139, -73, 178, -85, 117, 55, 6, 94, 135, -69, 38, 51, -151, -147, -39, -187, -251, -78, -17, -126, -28, -6, -97, -232, -13, -100, -345, -147, 0, -6, -254, 28, 329, 181, -66, 53, -72, -98, -72, -61, -210, -282, -214, -166, 159, -4, 190, 168, 90, 155, -3, 109, 232, -104, -89, 227, 28, 104, -222, -57, 339, -269, -96, 104, -57, -148, -75, 105, 97, 6, -337, -75, -81, 52, 91, 131, -34, 122, 47, -27, 62, 118, 82, -226, -42, -145, 80, 206, 144, -253, 123, 11, -227, -393, 38, 9, -230, 36, 33, 170, -22, -133, 41, -115, 103, -5, -155, 188, -68, 98, 30, 149, -119, -127, 54, 145, -80, -13, -179]
7274a79K57l4j23P2J5P5N8k56K24K7j50J55M2j31r7P1J09j79O8l0R0J07k8l02
7298a39J17J48j35J89k5r6K8p5j4o4K98k3k04o9K05r0o6J56k0k26J46o8pm4K70
7323A92k55J63l01m2R0J9J53j20m2O3k6J49J36r7O7o5K1l2%K0L8j35R9k2r8K05
7349A80l04M8r7Q2J15k2l5l12N10j42m4m6L05l06N0j94Q4j52L21j63K62j81j20
7372a61L15j77PR0j9k6k0r3J75qOJ24M4l27K36l17K65P2j82l6o8K27J56l24M1
7397@J43p4l98M34j86j17K12l39K43K25K0K8k79q4J88Q6l9k60Q3K94j22l0k9J82
7421A81k04L13m27J69j11J34k4R0q5k91J09L66J90m46K71l54O8p%o1k2P7L42k94
7445a6J5n1l0K55n85M92j38J03p3j09m5K97L08n13l7J41j94N9q2J44K96j96j37
$$ y = [-179, 78, 44, -79, -7, 8, 83, 141, -115, 109, 136, -14, 141, 183, 52, -45, 26, 135, -44, 24, -6, 84, 191, 163, -139, -22, 126, -9, 180, 155, 59, 87, 12, -2, -66, 232, 209, 5, -64, 141, 51, -15, 141, 121, -105, 41, -27, -34, -78, 192, -63, 100, -201, -243, -153, -134, 19, -101, -143, -80, -106, 43, 179, 82, 149, 84, 105, 73, 73, 93, 131, -4, 95, 73, -25, 180, -124, -76, -173, -91, 24, 2, -33, -345, 165, 23, -21, -67, 238, -68, -18, -212, -128, -280, 41, -122, 140, -41, -161, 154, -23, -16, 74, 55, 29, 9, -84, 91, 83, 89, 213, 257, -70, 166, -151, 114, 186, 4, -32, -100, 127, 283, -41, 0, 143, 69, -329, 105, -81, -198, 14, -325, -82, 143, 163, 191, -88, -172, 16, 102, 63, -197, -114, 180, 58, 28, -1, 181, -23, 290, -137, 32, -79, 55, 31, 121, 36, -255, -146, 220, 410, -36, 235, -119, -51, -58, -58, -119, -141, -64, 278, -16, -1, -52, -82, 173, -412, 80, -58, 45, -28, -137, -182, 115, 423, -90, -127, 14, -180, -121, -203, -59, 237, 41, -96]
7468i6Q4O1j26O2M1k53J13k5N0k66L82o5J5k27M54l65J07K9O5j66k8K99l48L49
7492A46r8K52l55j2J87j06P4P6k09j24R5K63j87N7p4n2n9o4Q7N7m9K19l58M13
7516A79k51r6K35p8M8m0o0J69O0n10M69j1J43j56k7J08l04O1n7j4J35J07k82K31
7540E9j67K96k69Q6nQ3K1J05k93o7K45m7j06K26j11j92n5J35o2n1J26k01J24K0
7564a00K82k8J7O6k72k41K21j59K81j8o5J14k16J31Lj97K37p6K47l26j15J76Q4
7587D6k85K04J40r3k14PJ95P6j94m6K80k32l3J03J81j66R3jk51Kk9K5K75j47K32
7612A68l22K98p3k24J2L78k43p0J52k32L9L96l33J13M5l83j3K64J09k23J60j45
7634a27J50J51j81j18O8J27P5l00k5j14J33L84l04J20o0J15K8k26K08k71L98q3
$$ y = [-96, -12, 49, -77, -15, 26, -227, -114, -139, -89, -355, 27, -38, -23, -250, 204, -161, -54, -25, 40, -126, -154, 145, -203, 146, 48, 300, -55, -67, 120, 14, 88, 164, -45, -169, -74, 189, 2, 59, -15, -67, -126, -190, -103, -46, -95, 124, -234, 179, -72, -168, 67, -11, 37, -3, -63, 106, 166, -344, 125, 114, 257, 101, 74, 182, -122, -61, -118, -132, 3, 110, -172, 59, -108, 188, -81, 5, 0, 83, 104, 209, -84, -151, 94, 47, -59, 167, 56, -136, -191, -56, -118, -169, -43, -244, -120, -100, 182, 154, 171, 237, -35, -276, -55, -214, 67, 49, -16, 98, -118, 13, 16, -181, 56, -20, 227, -99, -214, -38, 46, -239, -35, 105, 12, -202, -195, 0, 76, -118, -164, 116, -116, -149, -46, 135, -31, 62, 61, -190, -188, -217, -192, 83, -64, 168, -154, 144, 71, -153, -141, 237, -6, -76, 76, -156, -117, 279, -54, 59, 104, -279, -292, -28, 81, -142, 18, -127, 23, 174, -7, -125, -57, 70, 145, -155, -180, -294, -161, 223, -81, 39, -21, 94, 122, -104, 104, -167, 231, 148]
7656A48k30J39j10K07j56p7Q5Jj63kPK64j62j60L43m0p8k9N5o5L7j97J55m8m9
7681a25Pq8J9K20k3N1q1O8M2j88l2p2N6K1L16J1j76o5J11p1J33j00j13L20k84
7706d3R4l84J53L48j38k03J70pL0L2J5p2j90J89r1J65p2r2J86k24N3j98K35J49
7730A05L9j51K63m71L41qK45O1k24k54Qj76J21R8l1q8J83m4J79p0O4k7k98P7L4
7755b4K16j71M0r4K83k41J20k72p7Rj04L53M0p7o0L1j2L75m10L17j48j26J23j2
7779G9k94K69j7J38k24K30j92l8n6j23K41P6j66O7J85k8l01J75j06k7J44j06j47
7802b21O5K73K0q5j37L1p7L72p9P7q2J52n81M27k68N4pK50m35L33J09k49j06M3
7826a21K34j87J97j15j31q7n1R1K96j26J79j52k7k8j7p3P3Q2p0K28o6j12K0q5
$$ y = [148, -82, 57, -53, 154, -2, -79, 6, 7, -156, -158, -151, 113, -49, -209, 134, 94, 16, -13, 42, -23, 14, -183, -28, -76, -125, -118, -206, -187, 33, 10, 61, -20, 48, 90, -98, -130, -202, -146, -125, 191, 202, 26, -39, 72, 1, 134, 34, -79, 241, -43, 51, -333, -180, 168, 30, -173, -3, -10, 20, 52, 67, -5, -195, -6, -97, 68, -4, -96, 90, -134, -81, -279, -44, 105, 144, -7, 256, -215, 126, 118, 363, 424, 200, -54, -46, -222, -101, -3, -34, -122, 61, 17, 196, 126, 190, 163, -135, -58, -24, 192, 21, 61, -33, 250, 9, 129, -143, -220, -211, -315, 38, 78, 1, -59, -28, -40, 335, -75, 242, 94, -32, 91, 79, -215, 54, 37, 175, -49, 181, -11, -49, -105, -228, 13, 89, -77, -10, 175, 147, -154, 21, -85, -112, 32, -74, -221, -156, 117, 137, 52, -85, -54, -131, 241, 162, 239, 157, 309, -272, 155, -113, -59, -66, 184, -251, 82, 191, -58, -164, -121, 113, -74, 123, 8, -123, -210, -261, -170, 126, 0, 179, 27, 0, -28, -45, -118, -45, 37, -33, 195, 129, 17, 37, -48]
7850d8N6O3K09Lk42J62k41Q6k39K05k63J73N1Q5L0J4P2o6j7k38k4Q5j07o2K39
7875a4J77j2j46n1M0j3q4j4LP5R5k58R8N5J06O9k23J57j18Q2L4j02O4j13K90j97
7901@J0j72m6M6L01j85k8Q0J53j10J3K8p6j35l4K91m07K93j31K24l9j29L2K9m4
7926c6P4n0M4K29l28j23N5k13L93N4j6K29k91om8m6J01L7r1J44J14p1j95M7j6
7951iM2n0K4n1QJ33j32Q9j26m7JK99K0k42R2k60Q4J19K50j46j63K57k79NK74j70
7977B2j6l4n5j10L07j53J29p6J48j03k24K90L7k55p0N8J36j31O7P4k06L02j43
8000fP2K0r6l7M6J16n8j74K97p8p6R2j56K1R0J42j94j06J21k66L61k37j5NR3n6
8026g9L2kK42j53K30l40J85K3Q7j62O6j14j57K2J6P0K48l20j11L60l31L29m01
$$ y = [-48, 8, 71, 280, 283, 41, 203, -38, 48, -191, 14, -249, -76, -25, 60, 90, 104, 176, 110, 93, -145, -169, -84, -191, -253, -14, 163, 151, 5, -46, -6, -19, -103, -117, -114, -39, 56, -202, -104, -49, 57, 126, -97, 60, -58, 24, 58, -44, 20, -93, 197, 0, 10, -162, -208, -162, 139, -46, -74, 6, 159, 49, 62, 90, 14, -121, -155, 136, -271, 22, -109, 115, 76, -53, -21, 8, -36, 38, -12, 32, 261, -67, -190, -135, -348, 45, 99, 83, 312, 21, 15, -33, -79, 22, 59, -32, 112, 226, 155, -40, 7, -9, 33, -17, 7, -44, -36, 97, -35, 54, -72, -119, -118, 181, 201, -41, 51, -209, -125, -6, 244, 98, -65, 192, -87, -82, 192, 22, 6, -28, -83, -193, 114, -39, 90, 14, 162, 59, -165, 125, 162, -93, -163, -105, 31, -100, -33, 41, -165, 137, -6, 66, 86, -10, -47, -1, 115, 57, -117, 180, 102, 26, 118, -38, -17, 73, 215, 21, -85, 36, -230, 131, -106, -121, -116, -23, -79, -47, -49, 193, 40, 270, -70, 115, 138, 225, 63, 129, 15, -142, -120, -104, -34, 214, -106, -217, 143, -188, 141, -260]
8049b60K22o3K54m23J03K79j16j33L75m01J60j21K82j11j70K9q4L47j76j41J95
8070D7pRj73J82J44m1j51J05m30L65j73J55N5j93K10k53J49j48j2K34k34J81J20
8093A41o5j8j78O3J13kn2p8N2J27kk6k97N34j79j49k6J17l24k8L23M6n2R0k26
8118i6P2J90j54J2p9Q8Q3r0j64L98j89L3J39j15k21J55J38k24j49L6J27n7K8J05
8142F6J32k46OJ64P2m58K34N3j23N3K02K42k17m82M71p3j12N6j66j66J45J80p4
8165d1K99k35L30k55N8m12J01J09J32j07j75K30j75L72Q3j16n2k47j05J33L88
8186C15m02m9L12J38l52
$$ y = [-260, -38, -101, 153, -270, -167, 112, -4, -137, 238, -163, -3, -124, 158, 47, -123, -94, -178, 169, -7, -148, 47, 40, 49, -124, 58, 202, 161, 10, 115, -315, 50, -123, 32, 87, -106, 104, -149, 0, -148, -160, 74, -160, 21, 141, 76, 58, -120, -57, 56, 54, 2, -76, -24, 103, 101, 75, -222, 312, 133, -16, -42, 75, -249, -277, 46, 92, 40, 130, -96, -24, 166, 12, 24, -55, 33, 116, 26, -138, 260, 71, 104, 243, 128, -93, 62, 200, -24, -173, -137, -10, -67, -39, 66, 198, -48, -42, 122, 194, -264, -30, 23, -100, -47, 155, 397, 180, -302, 169, 96, -16, 40, -126, -292, -147, 33, -41, 258, 23, 353, 98, 156, -256, -155, -46, 86, -21, -196, 34, -141, 231, 314, 198, 146, -101, -206, -73, 315, -87, -136, 176, 314, -38]
8191c8
$$ Imaginary data points
##PAGE= N=2
##DATA TABLE= (X++(I..I)), XYDATA
0@%%%%%%%%%%qJ6j6J6k4L2l5M3n6O7p8R4j14J36j56J82k13K46k86L30l78M30m89
33b61N55o25P05p93Q89r94J109j235J373j524J688j868K062k274K510k767L047
50A597l357L698m075M494m963N494o094O778p573Q505r617J0975j2672J4862j7809
65i757K2014k8544M0144o6892K41901J07916l54687J09356P0709j05062j93722
76a66624P459R3534J2408n3739R2283Q0118R297l1564J3708j1996n7610J5521
88B795n226p2432K6101R0074K8533n3509k5799N7557M4447j34226p8698P0839
100d9544J6011o2926n240R4400J00680j3959n7055P4031M2212r1104r6972j4553
112f4019L6988m0951l7663L6241O3410K7204j1592R615M9964j9000n4973J2356
$$ y = [0, 0, 0, 0, 0, 0, 0, 0, 0, 0, 0, -8, 8, -8, 8, -16, 16, -19, 24, -32, 35, -43, 51, -63, 73, -83, 99, -114, 132, -154, 176, -202, 228, -261, 294, -331, 374, -419, 470, -524, 585, -650, 723, -801, 887, -981, 1081, -1193, 1317, -1450, 1597, -1760, 1938, -2137, 2357, -2606, 2888, -3206, 3572, -4001, 4504, -5113, 5862, -6810, 8052, -9757, 12257, -16287, 23857, -43035, 198866, 306782, -47905, 61451, 132160, 27098, -166624, -159165, -65631, -53223, -106962, -14679, 65439, 74736, 43172, 56880, 44884, -12726, 2795, -2431, -74863, -48762, 41312, 69845, 16336, -9463, 48094, 92541, -41685, -120383, -49544, -33533, -96459, -101699, -7299, 93381, 79422, 22367, 96398, 138610, 47506, -49466, -64019, -27031, -67982, -105645, -69404, -5994, 21210, 9618, 19233, 69197, 50197, -4776, 7580]
124G580k0310J777J7225l0837k097M1114K3702j8843l4532j1013M1738j6471n9917
137f0884N14N7907L5316m1359J509P3813K5366p9563m0459M6282R478p8225l6244
150h6549P4804K4116j4895J512J8028L2061q490m0409l029O786k1666J1147m516
163a1100o892K6532K1616j0702l3747J8160K8347l1541n2346K1646M5855j2660
175C168l8507K2939O7489k3236m1383R130J5997j7245m3129p561L7390J4003k0859
188b1804K6428K6260R773q307k0375k415j6156j6462q989j155K237J9055J3616
201A706O918N818R138J0296k7774p541N958l122j1421j3182J4639K6221o137k2838
215a1321K4143Q968k0985k2985J168J5589j3547m928K2156K7616J480K548J896
$$ y = [7580, -12730, -10953, 6272, -24565, -26662, 14452, 38154, 19311, -15221, -26234, 15504, -967, -60884, -60370, -2463, 32853, -8506, -6997, 66816, 92182, 12619, -27840, 18442, 27920, -50305, -86549, -11745, 12371, -2524, -1012, 17016, 49077, 40587, 178, -2851, 3935, -17731, -6584, -11100, -17992, 8540, 30156, 19454, -14293, 3867, 32214, 673, -51673, -30027, 15828, 3168, -35339, -12400, 55089, 31853, -9530, -400, 15597, -1648, -44777, -52338, -14948, -945, -21804, 4624, 30884, 40657, 32350, 11975, 9560, -6596, -23058, -32047, -33202, -30965, -11910, 1706, 8624, 14442, 23580, 33876, 6102, -1439, 4519, 1397, -10024, -23206, -8567, 17654, 11517, -11321, 12822, 21790, 805, -22180, -21012, -5423, -18970, -23898, -1742, 25874, 27354, 29902, 31798]
228C1798L98j1727k4601j2973j7567L626l2j31J8362J7888J0635J0209K081o651
242B1315Q451j6172j4274o668r56N169j0962N02J2294Q190j0066l612r59N18r105
257a6335o765J4278N027J3221O267R274R701p729j4100j0888j6095k0339j792
270c6275r858P888J4960J4334J9603J0529J2055L301n326j3372n968j4755j0681
283a3565n068j674Q181n46J2884N031J589J96l463n219l854k270M30J3689k04
298F137J3168R254j919l325j1696j0050j6812j4463o742O215J667J3826J9252
311D512J3220J1240o34N891j0413j5700j0022q231q735l604L918N643J1918j668
325b665J0685L237o193l088n102k036k897L400M194R088L0N914m8r324m901j2815
$$ y = [31798, 32196, 20469, -4132, -17105, -34672, -31046, -31078, -31209, -12847, 5041, 15676, 25885, 27966, 21315, 29766, 13594, -680, -7348, -8304, -3135, -14097, -13595, -1301, 6889, -3177, -6789, -7748, -7230, -16335, -23100, -8822, -3795, 9426, 15693, 24967, 34668, 26939, 12839, 1951, -14144, -34483, -36275, -46133, -38245, -23285, -8951, 10652, 21181, 33236, 36537, 31211, 17839, 11871, -2884, -13565, -18633, -20307, -12126, -12672, 212, 5243, 6832, 7028, 3565, -1654, -5508, -7778, -7348, 6341, 6137, 19305, 28559, 26640, 23315, 11619, 1569, -15243, -29706, -36448, -30233, -28566, -14740, 4512, 17732, 28972, 28338, 34229, 23816, 8116, -1906, -10137, -18872, -22476, -18558, -12915, -997, -2665, 8020, 11257, 5064, 1976, -3126, -5162, -8059, -4659, -465, 8623, 8653, 14567, 14519, 5195, 294, -12521]
341a2521m063p639M16O509Q211Q764J1739N788j395K059j0971l683j0214n857
355a2857K477j655L593O236Q120J083K617l613N58o607p119K354l446M405L697
370a57R592L361J059M62j082r031j1775Q3o870J52J190J0868J1038J545N047M589
386B0071l702j4811n444p219l497n608K967J3720L537P756N724O040m394p866
400G274p731n806r152n245O277j024J0865Q797P815J587l494J26n129r601j0821
415a5262J372K580O632r40P550J5197j706p515p369K383r548j3278k451R705P591
430e059Q21P583Q909J1972p519o340j206o401q933o742K1j983N677L676O509J505
446B490M515M963m330m16l615L980l83o236m227J1081K487j4834l841O905O061
$$ y = [-12521, -16584, -24223, -23807, -17298, -9087, -323, 11416, 17204, 15809, 17868, 6897, 3214, -7000, -12857, -10380, -12035, -8442, -2206, 5914, 6997, 9614, 6001, 6559, -48, -7167, -4813, -8259, -3854, -157, 9435, 12796, 13855, 14317, 13235, 4204, -7571, -7488, -14358, -14206, -13016, -2148, 8890, 10435, 15482, 20071, 16369, 1558, -3886, -11105, -14602, -20210, -17243, -3523, 14, 7770, 13494, 19534, 15140, 7274, -457, -6263, -15415, -20660, -14383, -15407, -4542, 4255, 12070, 13657, 10163, 10289, 5160, -4441, -15262, -13890, -11310, -4678, -5618, 1932, 17129, 15423, 7908, 539, 2922, -6626, -19904, -22355, -12650, -5059, -4238, 3345, 12254, 24226, 16707, 10367, 9161, 2760, -6173, -12915, -12894, -14877, -9200, -5524, 985, 2490, 7005, 11968, 7638, 7222, 3607, 7587, 7204, 968, -3259, 7822, 10309, -4525, -8366, -1461, 4600]
461D600j8743m320J7876P057r906k792K0015O763j5435r077J6835l189j7003k755
475a0074P380R94j2205N535M767k831j075N418R61j743K907O162N507j1484M552
490D771J1710q160j9488K817J5350j6660j9203R701K3551p344j0716J4626J8752
503A9707K466j6730j512R758k382k0679l867R009J522n174k285J2294J200J588
517D915j411n499K524M478j175q252k78J2047J2280j7364q276J4932P166j6731
531f44k3142J5055J4702j4375j2928J7873J9607l209j1318N111J6818j1603j8697
544f750m203R699k720j2675L126J0786P435k938K642j76J673j286n746l598m663
559i394P027M448o949o277J7348Q554j7241j3141J5512J6835k8710j4136K6056
$$ y = [4600, -14143, -18463, -587, 6470, -3436, -6228, 13787, 20550, 5115, -3962, 12873, 9684, -7319, -10074, -2694, -1700, -13905, -8370, -3603, -6434, -7509, -2091, -1130, -2873, 34, 6196, 11703, 219, 4771, 16481, 8321, -11167, -8350, 7000, -9660, -28863, -19162, 4389, -2955, -13671, 955, 19707, 22173, 5443, 3931, 13689, 11307, -9372, -13239, -4230, -2708, -7882, -10167, 2127, 3327, 4915, 3504, -1995, 529, 5007, 3832, -4420, -4698, 7349, 19629, 2265, -6011, 8921, 16087, -644, -23786, -8731, 5971, -8404, -21332, -3459, 16148, 12939, 1621, 6732, 23550, 11947, -6750, -10953, -1254, -3974, -16649, -13523, -2737, 4698, 1760, 4402, 4226, 5899, 4613, -1133, -4731, -9394, -2367, 2081, -4868, -11145, 6203, 14757, -2484, -15625, -113, 16722, -11988, -26124, -68]
572f8J5680j9126j0651K3634J5983k0211j9862J8437P498j7497j6541J2098J7438
585F812q205k594R164P354j131M17n883o770j538K550j306j5120N254J8482Q60
600H346j6892K704K4272q32k5762n805K7849ok5747o075K5964J1649k5604o501
614a2440K1175O405k1554o321J0236O090r295n067J2800K171k07J977O53l772
628B851L52J597p372r596J528J2838q651j0052R425J7925l641j8066J1046J9430
642A9614r062k1657P640J3815o223j9047Q11J9317m666j1606K047J4496J708r364
656b177k08J1552J454j1315Q85K422Q88n280j197P66k586N905L939n180o112J1249
672E005M999j0117r797R496J2968j4410q339J5031J3219j3248j1433R661J0448
$$ y = [-68, 15612, -3514, -14165, 9469, 25452, 5241, -14621, 3816, 11314, -6183, -22724, -10626, 6812, -1393, -3987, 5177, 12531, 11400, 11817, 5934, -836, -2374, 176, -1130, -16250, -10996, 7486, 8346, -8546, -5842, 18430, 17598, -8164, -13969, 13880, 13874, -11873, -17948, 8016, 19665, -5939, -12440, 8735, 15140, -6414, -12735, -2499, 3591, -5704, -10771, 2029, 4200, 3993, 5970, 6623, 2851, 3203, 4800, -2572, -12168, -10640, 2198, -6453, -16505, -7080, 10845, 7204, -10862, 184, 19614, 10552, -11105, -3465, 10350, 4127, -14920, -14109, 5208, 542, -11064, -9017, 5479, 7187, -2177, -2385, 9167, 10621, -694, 191, 2613, 3501, -1779, -2976, -2210, -4796, 1109, 5048, -132, -6244, 5005, 10004, -113, -9910, -414, 12554, -1856, -10195, 4836, 18055, 4807, -6626, 3035, 13483]
685A3483j3132j8331Q972P875m023p397Q486J3502N49j386J844J818n792n373
699A095r634m094j991K296M406l190Q825J3873N520q999l582M940k615j4997j0140
714a8287R531K346l335J459J3976P746o584l080K405l55j1856o726l43P109J676
729d318L81R881O378J936l651j276n292p997q262r26N9l00R714N991O816L852
745A2986O165m00j0513o771k368m617j1006Q20O550P634q28N208J1762K01o679
760H144n215K049n735p631k828N441L645L86N907K139J854l615k908l834n041
775g242k538p9K659K107P415L454L937p37j002j047q115n344l870Q0o21K284L648
792e011O189L973O50K699l066n54n461k364j159l93J004R94L665J473J080k909
$$ y = [13483, 351, -17980, -9008, -1133, -5156, -12553, -4067, 9435, 9984, 8598, 10442, 12260, 6468, 1095, -8539, -12633, -14624, -12328, -7922, -11112, -2287, 11586, 17106, 8107, 4525, 9465, 6850, -8147, -18287, -8756, -6410, -9745, -8286, 5690, 13436, 6852, 3772, 6177, 5822, -6034, -12760, -13103, -5994, -4318, -3937, 5944, 12322, 14258, 10607, 9331, 4039, -3958, -12220, -13146, -13087, -13387, -3673, 2318, 9134, 12986, 19151, 18751, 8238, 1467, -901, -5518, -16524, -15704, -9154, -1520, -2348, 2860, 14622, 14823, 8144, 2929, 4978, -757, -8388, -11216, -5775, -2130, -1744, 4163, 6302, 8156, 4541, 1633, -2201, -7242, -9780, -9859, -7200, -5093, 2322, 5776, 9713, 8976, 7974, 6927, -1188, -6532, -10402, -10322, -10943, -8659, -5011, 1178, 5151, 5801, 8500, 5434, 4880, -581, -2945, -4104, -4497, -3493, -2499, 1166, 2639, 3719, 810]
808H10Q69l099k520L69m47K377J316M445K291K311j318j077l143m918j915l959
824g608J013l00L380L482L392K397Q93L66l050j078l884n73k624L93L038P29J897
841A863Q64J388k787j178l201q29k233k33L794O85M391J094L334k77k176l611
857H88k473k762m759J070k67M840R30L603M215K43J36k645j034m209j289k024
873e537J260O40K108M224L00J401j080K55l944l608j98P49k35r93O197L562J649
890F750k563J384Q76n039m786j719K350k255J032L046N524Q00o19J475k359j169
906B728m600k172j635J385J379J827K334K019M069j587j494n156Q65j217o289
921g544j342N300M452l622K115O055L354o640m821K875j50n498n370P518M271
$$ y = [810, 1679, -1420, -3940, -3571, -4018, -1641, -325, 4120, 6411, 8722, 7404, 6327, 3184, -1734, -3649, -7608, -6595, -6895, -3515, -33, 3359, 5756, 6649, 7015, 3965, 2887, -997, -1570, -4194, -3801, -763, -34, 1863, 2727, 4115, 1328, 150, -3051, -3880, -6113, -6346, -2552, -1867, 2524, 3618, 6952, 6675, 4499, 888, -1585, -4347, -9106, -8036, -8303, -3463, -2533, 1070, 5285, 5528, 5664, 3019, 1985, -2224, -3513, -5537, -4277, -3637, -1529, 2695, 2995, 4396, 3316, 3571, -373, -3981, -4179, -3430, -3665, -4658, 1539, 5101, 6750, 4187, 5571, 6447, 1408, -3378, -5097, -2747, -5002, -3970, -924, 4600, 5400, 4781, 6256, 3897, 2728, -1872, -4044, -5679, -4294, -2915, -1088, 1246, 3265, 7334, 5747, 4253, -903, -38, -1255, -7544, -8886, -3586, 866, -2756, -641, 5414, 8768, 2128, -2693, 182, 32, -5466, -10836, -3318, 953]
936I53q17p76M786L960m171m118k806J144l536j734k53K493M805L616J869j979
952C436L381P49k586q848j660N218k346n080O65J0673J854n520j033Q578J383
967H864j0814m038O509N445r665k146Q742N346m603m906M658O10l899m977P27
982d147N78P36N85J529K125J108N751k910m760R57M039m805r837L545P916k177
998B33j0543N713J0884k829j0779K676J2078m415r194J979J1128k313q203K519
1012a066N909k027q056R22J420K46k283P07K004K346L703k6j695k618O680l69
1028E797r737k476P789L333r354k513R942O584j0478n876Q204O398q638j0429
1042a1454R438Q686k726o623M580Q230r41p367l796L345k333m175m362K953M984
$$ y = [953, 136, -640, 4146, 8106, 3935, -183, -2989, -1845, -5381, -7115, -7368, -4875, -70, 3546, 5415, 3436, 6817, 7566, 4980, -3868, -5528, -310, -2656, -7736, -7071, 3602, 5456, -64, -1097, 7481, 8864, -1950, -5988, 521, 5966, -3699, -5845, 2897, 8243, 3640, -1266, 3392, 4002, 103, -4874, -4147, -3569, -2833, -2248, -719, 1406, 2514, 8265, 5355, 595, 1552, 5591, 786, -9051, -5506, 2410, 233, -10310, -4597, 6287, 3458, -7321, -4645, 7433, 3018, -6176, -4197, 6931, 4618, -3585, -1066, 4843, 2816, -5240, -4318, -2898, -2652, -4935, -4228, -2224, 122, 3825, 3799, 2104, -514, 6166, 5797, -3940, -6416, 1373, 4706, -4648, -7161, 2781, 9365, -1113, -6989, 1215, 7613, -1025, -11454, -2016, 6670, 3944, -2679, 1901, 10131, 9190, 1823, -1973, 1372, -961, -5136, -9498, -6545, -1561]
1057a561J697R7J180N760K311j908p924j478L340j140p854l984J0990M953m602
1072a23l647R237L929q584p444L864N526r598m914P422R584j846m033N718N057
1087A0148l886q582l70j347k695l978K080M875Q44M779K991J134K6K169l328p314
1103b454k156L867k70q283L865R039K559o444m30Q695j267j0323m506Q927P19
1118A538o694j464R823O709n185k840L306L124o784n935j120J354j280m22K996
1133b874J361M768K402J0k803N38K143l877o996OP346l082n732K102Q730L47q787
1150d398J065O393K13q020J98O246K057n186p01O052l96k731l145K340r33k549
1166c495l32J097l3K3M128q11m70Q34K583r55l873K207J761j881n150L608L417
$$ y = [-1561, 136, 233, 1413, 7173, 9484, 7576, -348, -1826, 1514, 374, -7480, -11464, -474, 4479, -123, -3770, 5467, 9396, 812, -6632, -2768, 2758, -6840, -11754, -4332, 5252, 3406, -627, 5091, 10148, 6262, -2320, -2690, -4037, -6732, -10710, -8630, -3755, -2911, 1868, 4859, 5993, 6019, 8188, 4860, -2454, -4610, -743, -1013, -9296, -5431, 3608, 6167, -277, -707, 7988, 6721, -3602, -8108, 819, 1538, -5156, -6620, 3203, 9912, 4727, 1887, 5193, 8317, 1533, -4402, -5522, -4168, -5448, -5870, -2874, -1513, 3255, 5657, 5667, 2864, 3402, 5545, 1668, -5328, -5322, 2024, -1058, -6790, -4688, 4042, 4389, -4398, -3333, 3060, 3273, -4747, -4549, 1697, 3754, -1432, -2133, 3919, 3523, 792, -2353, -13, -946, -3495, -3827, -2730, -2763, -2740, 1388, 577, 107, 941, 3524, 2569, -1304, 903, 2664, 783, -4367, -759, 2658]
1183B658k601m422K738N528l468k854J647N236j932l401J959L246k381l976K573
1198E50J165l37l057R20K013o56J8o22P25j696J391l08o11j027J722J867k755
1215f98N36J016J649l445j617K180J813k264l241L717K027K32l806O87K660j498
1231e2k410o24K564j156m6Q02L199j31q74J090j259m25j901K82k323j030J370
1248b924J982L0q16L180J178K46k240J049M95k310j281Q31J706k093L77O79J615
1265A704j468j282R58l93j51j248K444L09L70Q86J628J68j216L35j812m40k561
1282a769m29j002m92K63O51J627M86K354O49J789m61r3m43j927j183k570k47j983
1300d780N0l51J765J528J383J894K23J931j205p01j113r95q11o96N49M1J739k48
$$ y = [2658, 57, -4365, -1627, 3901, 433, -2421, -774, 4462, 2530, -871, 1088, 4334, 1953, -2023, 550, 1715, 1378, -1679, -759, 1254, 598, 616, -6, 719, -977, 414, 106, -505, -1532, 190, 2057, -698, -162, 854, 2503, -942, -2559, -379, 1434, -830, -4071, -354, 1673, 1905, -1901, -1214, 1446, -52, -2462, -3086, -522, -1678, -1724, -922, 2277, 2146, 1272, 2362, 1103, 678, -1223, -941, -3264, -4294, -2924, -942, -912, -1728, 1452, 2630, 2876, 636, 1685, 2180, -130, -1411, -580, 1126, -967, -590, 89, 1704, 236, -1046, -88, -481, -632, -1880, 564, 873, 1243, 2129, 3757, 3925, 2709, 3044, 1232, 792, -1769, -2198, -3200, -3692, -3429, -2778, -1151, -665, 1689, 2338, 4127, 3666, 3573, 3130, 1203, 20, -2550, -2797, -4780, -4730, -5081, -3316, -1788, -405, 1489, 1712, 3643, 2438, 1737, 624, -371, -1182, -1878, -1329, -1288, 451, 203]
1318B03J162j111k59q59k421Jn62J504M09L066K297K539J011l82o07l890k723
1335f22l818k033k328N04K786L034L643K827M493j1q91k111k402l663m087r55
1351e634n9J791P30L744K313J346k29r18j088l951q09j464J002Q48K921K495K005
1368E043R42m43j047m606k634l359j547n61J213L950K694L971J682K263r83k105
1384D473l253l738k014k243p0Q0M032K753K035R73J769K94m160j206j350q5j751
1401c461L58K714K303N62J52J216j393j428k795J26j273o34K826P70J326J109
1417B478K517p92k469j168N25k371l729K080K552O41k134L095L606j432l577J78
1433@K019l174k026P62K517n04n26K122Q05n87j686Q57j160o90l08J285L18j033
$$ y = [203, 1365, 254, -5, -864, -3285, -3284, -3846, -2342, -1933, 1133, 3430, 5969, 6980, 6598, 5991, 2101, -622, -4440, -6473, -8801, -8297, -5511, -2477, 1166, 3993, 8486, 8475, 7584, 5473, 3071, -592, -4679, -5634, -5693, -3902, -3172, 572, 2885, 4231, 4002, 3084, 1996, -1955, -2764, -4228, -3226, -2378, 543, 3038, 5043, 5985, 5542, 4495, -111, -2745, -6104, -7651, -8212, -6999, -3049, -355, 3616, 5298, 7561, 6578, 4473, 1220, -2518, -4532, -6775, -6845, -6765, -2733, 20, 2055, 3028, 4797, 5091, 931, -275, -1625, -1710, -3461, -3103, -389, 1914, 2476, 2628, 3844, 2451, 1023, -1772, -1646, -2919, -3553, -727, 43, 1369, 2478, 4995, 4203, 1734, 566, 1091, -1280, -5009, -2929, -377, 264, -1870, 1225, 4831, 3399, -178, 0, 2019, -1155, -3181, -2419, 98, -406, -932, 1190, 1995, 1408, -278, 579, -581, -1271, -1579, -294, 24, -1009]
1451a009L286K03j882j839J918p10l757j376K684K177k268J111L294L712k974
1466B570k733K526Q58m503m297K272J711q81k274L165M110l31j105K53J853j153
1482B041j338j598Q73K62K4J240j619J281J472m67m166j015K952J86l867p60P170
1499B671K440l339k054O593K378p997l911L437J400p112k649L999M585k645j010
1514c214N607K077q65k250J287r53j808o26l10j736o2L854p85k784K0M849j554
1531G47n992J873N650l89o444L773P528n22p243N59O723l719q452j293N990j215
1547b426m308J763O554K064k730J998K280q2l702j407n67j151L11J5j029m77M789
1564A895J549l059l512L931L532o178l713M944O765m163m271N359N999m715q310
$$ y = [-1009, 2277, 2480, 598, -1241, 677, -33, -3790, -5166, -2482, -305, -2573, -1462, 1832, 5544, 2570, -163, 2363, 3221, -1282, -5579, -3307, -1596, -2477, -4751, -1586, 2524, 2193, 1088, 1341, 3194, 2041, 703, -895, -22, 240, 264, 1504, -115, 1166, 2638, 2171, -1995, -3010, -58, 128, -3739, -4499, 2671, 5111, 1772, -282, 6311, 8689, 692, -3219, 218, 1618, -5494, -8143, -4144, 441, -2204, -3214, 2393, 4470, 3605, 1355, 2642, 1689, -119, -745, -1055, -2791, -2853, 1001, 216, -2568, -2548, 2301, 747, -5245, -3372, 2278, 1889, -4555, -782, 6746, 6224, -1019, -460, 6263, 2544, -5908, -7201, -1211, -2426, -6734, -4971, 1583, 3647, 917, 2915, 5195, 5113, 1411, 4, -563, -1714, -1403, -1388, -2417, -2894, 1895, 3444, 385, -3127, 804, 4336, -1842, -5555, -611, 6154, 1991, -2280, 3079, 9078, 4363, -3947]
1579c947K635L972l742p475K088O418J035k544J617N545k96j860k541J08k064
1594a051j325m21j911Q56L467J972k789J14M284P31o188l183N755J709n306k156
1610e442P573M287n577k962M889K008o772l265K324L538k885j231M264L319k92
1625C776k280O03j90r81k385j257J32J162J739p93Q29K323J512k793k996O88K065
1642A154k182m001L041N047O53m124N01M337o69n860k914M270J487k486j975N366
1658A645M460k204l064P92J872l746m222j009K565L24L9K161K162L042k25p79
1674C813l268o55J60l624l753J325N953k95j729J811N846o79n577j189J820r61
1690a002m543J060L868K383j047J236L531n89k667l050p57k019j451N67Q66K281
$$ y = [-3947, -1312, 2660, -1082, -8557, -6469, -51, 984, -1560, 57, 5602, 5306, 3446, 905, 1013, -1051, -2376, -2797, -4708, -3852, -385, 1587, -1202, -1088, 3196, 3927, -2261, -5444, 311, 2020, -3286, -5442, 2131, 6418, 841, -2121, 2768, 4776, -1996, -5261, -2937, 601, -2284, -3515, 749, 4068, 3776, 1496, 2099, 1909, 928, -1457, -2714, -2582, -1420, 319, -474, 355, 2678, 4190, 1397, -1599, -911, 1154, -1028, -5029, -1988, 3059, 3712, -412, 89, 4426, 3757, -2103, -5017, -747, 740, -1746, -3721, 1645, 6105, 3901, 837, 1629, 3501, -245, -4467, -5476, -2911, -2587, -2548, -387, 1775, 4817, 4592, 3813, 545, -110, 50, -3574, -7327, -6002, -49, -344, -2073, -262, 5584, 4905, -672, -1861, -41, -1002, -5545, -4485, -617, 1766, 719, 1955, 5486, 4897, 2230, -820, -1577, -3596, -5047, -4480, -3614, -1333]
1706a333K724L633N68O62m90q08l844l721m93j151j523m52M755L078L95J61K697
1723D858Q94l405k430j076M70k274o11J866K820R36j385J165Q11o29l570j194
1739b754l16N51L79L27K055K106K026n11n03j251q95j893l339n14M58J047q81
1756c908J830K840K149k20p26R10n74j542k238j22j80l80p8J49J474N42l7o4J147
1775I72l37k36n5k54Q12l93K37k03N37j47k26k57n56l64o27O86l68K89M24P82
1795G16O05J3R74p14n9r25P8j347n68K36k50K31k66J374L86m31lR05k3q26q3j01
1817g8O11j211K69Kl82K50l25M40j52K41k22J033m50M11J81n84o7m15N17j131
1837a062l52O51M91n9J03Q94j2J56m66K13o55n08j89J03J03j16J083m08J76j78
$$ y = [-1333, 1391, 5024, 5592, 6254, 5764, 4956, 1112, -2609, -3102, -4253, -5776, -6228, -1473, 1605, 2000, 2161, 4858, 5752, 2347, -83, -1159, -689, -2963, -3574, -1708, 1112, 2048, 663, 1828, 2639, 2010, -1560, -2754, -3070, -2519, -2140, -1813, 242, 2348, 4374, 3863, 3360, 2109, 1214, -679, -4018, -4532, -4074, -3027, -3908, -2078, 762, 2911, 2691, 1965, 2875, 2301, 759, -1479, -1601, -1781, -2161, -2239, -2090, -616, -74, -111, -175, 972, 635, 399, 344, 90, 902, 509, 746, 543, 1080, 933, 707, 450, -106, -470, -1097, -411, -779, -490, -66, 716, 1321, 1334, 2308, 1594, 1535, 610, 688, -659, -1227, -991, -1241, -1010, -1276, 98, 484, 53, 50, 955, 932, 106, 23, -78, 533, -678, -409, -407, -789, -539, -864, -424, -576, -335, -557, 476, 26, 437, 618, 34, -33, -448, 69, -1062, -1414, -763, -272, -331, -228, 666, 654, 810, 344, 557, -98, -606, -795, -692, -589, -705, 378, -30, 146, -32]
1857c2O44m70o29N12j41O50J49M97J11K23m64l68j94j227q8q94M03N40P25O79
1877F26N16J071J08K19j309l59j328k83o72k80o9K70J516l27K37l0M94q51p22
1896a173P75J6L17l67J565O94l38j195N9m25k354m73o02J073k81J293K014J495
1914B093Q57K39L73j139j026j850p29j728n33J381O1R01N98K305M11j135r5Q34
1932A818j210k091N90J256N96j579J219J385J34k068j074P66j239j320l96J692
1948a521R81J236J255J484J076j030l52j578j592j798m81j097o07J707J418J013
1964A14O6J855J625j062k127j95Q94j885j966p1K544n08q99Q84J410J19k042K99
1982i45J119k75k010Q24J890L4m58J60J506r45m69r9n82j031j69J215j122l60
$$ y = [-32, 612, 142, -487, 25, -116, 534, 683, 1180, 1291, 1514, 1050, 682, 488, -739, -827, -1721, -1318, -778, -53, 626, 1142, 2213, 2321, 2540, 1231, 872, -456, -739, -1411, -1691, -1760, -1490, 26, -301, -64, -94, 400, -451, -1173, -398, -382, -65, -432, 1133, 1827, 1489, 294, 353, -72, -2426, -2899, -3501, -2428, -2709, -1416, 598, 2093, 2950, 3189, 3562, 2423, 1397, -453, -1182, -2910, -3443, -2062, -2001, -1100, -502, 1803, 2214, 1079, 984, 1818, 608, -1483, -893, 363, 959, -620, 599, 1984, 2118, 50, -1024, -258, -1497, -2817, -3213, -1521, -540, 696, 1951, 3435, 4511, 3481, 3129, 1551, -41, -1839, -2320, -3417, -4024, -2317, -899, 114, 180, 2035, 3660, 2598, 471, 276, 1170, -715, -2681, -2752, -208, -716, -1615, -731, 679, 798, -1244, -945, 174, -101, -2111, -1287, 603, 637, 179, 339, 1845, 900, 431, 332, -250, -1281, -1450, -235, -1357, -1717]
2000a717R66K725j310j106K445J641k157k685K226J194k680l212K718J947k336
2015a341p80K184L204k158j162J551R93k167j590P14j12n58k66K088n75L04J490
2032A819L02j908j099K006l95k554j231L345Q20k316N8K696J388l543p95J861
2048D54N40k844q54K433R56j045j050K629L21j558q31Q83J1j565L69J80Q12j090
2066a249J462O76o07o86J284N39j979P0J223Q57l169J37K933n13k541m38L653
2083A652J4l146J98L544N0k857O16K168k31l415N67J819r67j967M42K175q52m12
2101f02J030J237j810K43K084j482k431O35L023k031k463J790L153k116l083K289
2117e34J956j891l222K497K342j101j421K043K465j769r22J47N10k273p89L58
$$ y = [-1717, -751, 1974, 664, -442, 2003, 3644, 1487, -1198, 1028, 2222, -458, -3670, -952, 995, -1341, -2121, 63, 3267, 1109, -53, 1498, 2491, 324, -1266, -552, -664, -1222, -1488, 600, 25, 329, 1819, 2121, 213, -886, 1120, 725, -1829, -3060, 285, 1105, -1211, -1153, 1543, 2931, -612, -1407, 454, 994, -1850, -2704, -271, 685, -360, -1410, 1219, 1540, -18, -849, 34, 45, -1520, -1151, -971, -159, -1249, 213, 889, 282, -404, 880, 1419, -560, -490, 733, 1590, -1579, -1442, 1491, 978, -1563, -2001, 1652, 1666, -1480, -1282, 2262, 2312, -545, 71, 2239, 2008, -1407, -840, 979, 12, -1955, -1513, 662, -190, -602, 428, 1665, -145, 98, 2182, 700, -1731, -1096, 1927, -104, -2567, -777, 2376, 260, -2823, -534, 1422, -469, -3691, -1194, 1148, 47, -1374, 669, 3134, 1365, 443, 590, 1100, -1173, -1962, -1604]
2133a604n49m29Q77K234p61M04J164J869j931j581J438K27j711k425K202R23j224
2150h77r25J965J039j681l20J037J112j465n50J472J109o97o21R73j21p65j205
2167e20K92k37j345L44L52J041n88J473N32J33n89J225j2k332m03R50J60k430
2185a954j07J741M40j355k29K182R7r90r68J926N43j797k23L98J305j238l06M20
2203a15M01j150l17N97o02Q6J32J119p19P21J293K58j090l79J567r67j869p56
2221a790K302j006j114J08J924O95j124N40R28j10j996M26O75j173j71L59J526
2238I99n53O52K09j86p35l53K91j171o57M9J349k67K58J277P94o26n96Q01q42
2257F93j246j063O11L04o23P40M26P91l89L41j92p1l60p10k58J76N71o88P80J28
$$ y = [-1604, -2153, -2582, -1705, 529, -232, 172, 1336, 3205, 1274, -307, 1131, 1358, -353, -2778, -576, 347, -877, -1802, 163, 1202, -479, -799, 238, 1350, -115, -665, 807, 1916, 1219, 598, 1571, 1450, 685, -520, -228, -465, -1810, -1466, -1114, -73, -661, 812, 1344, 1477, 888, 2113, 2101, -231, -634, 316, 476, -1954, -2061, -320, 120, -1235, -1464, 718, 815, -175, -1143, 783, 1326, -471, -694, -296, 1009, -229, -535, -115, 286, -864, -1181, -584, -1186, -1100, -968, 151, -568, 153, 1446, 1704, 614, 235, 1802, 835, -1034, -1790, 512, -494, -1608, -1500, 424, 1119, -5, 535, 1463, 1353, -643, -217, 458, -715, -886, -527, 999, 446, 1098, 1307, 1121, 386, 33, 324, -847, -1504, -1455, -106, -373, -115, 1162, 1956, 1330, 734, 1535, 693, -553, -1616, -1005, -701, -1324, -584, -158, 633, 244, 585, 393, 322, -38, -748, -1006, -830, -259, -947, -167, -39]
2277c9R47N9r24K60l83n4j154L90j98L93L30M6P85j34Q24p06M78k47k11n52p04
2298g94M14k76M93q43P50M05K91j05J75L94m45J3j15J62n83j23p9L96J15q5Q90
2319A050k88J34l30L1o56o30j4l87L41k59J018o9R89P42j47P4n33n38q46p99p50
2340a867K90n97O99J138L60Q95L11N22n16n50p91r81n14m26O61K9J072N81R81
2359A297J78n14k25j026o32q86o0j14Q84P95J262J245K83M30j088o90j467r94
2377a322j198j73J92P52J722R62J235L36J81l63j332r30j415j54q40P12N49J423
2395C37Q36N53L93n64j7j631n90r72P2K7M05P18J163R47k46P66n42q70j102p37
2415a054m59n94J03J43J558M45J483l63no2m40o82j134j18m55J108m37O88P90
$$ y = [-39, 908, 967, 43, 303, -80, -134, -1288, -898, -1096, -703, -373, -327, 458, 324, 1148, 442, 920, 673, 462, -90, -794, -380, -656, -163, -1006, -256, 149, 440, 335, 510, 904, 459, 472, 357, 519, -64, -187, -266, 130, 245, 160, 1050, 762, 896, 566, 597, -59, -689, -703, -1090, -749, -1008, 10, -59, 930, 1672, 1525, 1599, 1066, 528, -318, -1117, -1867, -1577, -2174, -1475, -337, 23, 918, 1229, 1751, 1235, 685, -106, -1087, -1601, -2027, -1366, -1337, -265, 316, 1297, 1475, 961, 736, -290, -922, -1808, -1868, -1982, -1098, -303, 959, 2204, 2487, 2917, 1829, 1139, -328, -1322, -2520, -2693, -2501, -1749, -27, 935, 2170, 2506, 2687, 2324, 992, 62, -1353, -1507, -2347, -1635, -1086, 337, 1173, 1726, 2119, 1555, 1538, -93, -683, -1655, -1583, -1556, -1151, -433, 730, 1677, 1431, 2197, 1655, 785, -317, -1054, -1513, -2107, -2004, -1861, -303, 142, 1625, 1262, 1257, 1195, 755, 73, -1061, -1179, -1634, -526, -963, -275, 515]
2434E15M26j2n97N73q02r56o80M60O55l29O29P86J449p13k54l86l83m20j210j23
2454a372l12R02J3P62M28Q40K20m10k12j70K10j132l06J0N55J11q18M22P56J71
2474F68j325L54N33K74j032j31J536K80p67o82J051K06j145r57j27Q95k92q95
2492a556N92R58L52O7r8K14L71m04m93p27M22N2k55r83Q14J378r79p91O74J482
2512A090r78j101M40J613l90j024M25J218k04j665J16R05n14j151J2Q89K79L21
2530B81l60O57L94L70k32j147K71J76K62j514k6J188K92r50m74J548L81j178j159
2549a220J626Q33j141r04J147J320j133j187K8J144n70j277Q1P64N33n03K71N60
2567C72N51On82m73j3K17r78l75k44J552Q9l78K89R69M58j747l99M24N15j412
$$ y = [515, 941, 929, 332, 905, 103, -853, -1533, -1073, -418, -747, -118, 668, 2117, 1404, 1150, 764, 381, -39, -1249, -1372, -1684, -782, -769, -7, 421, 1261, 1481, 1071, 859, 689, 899, -233, -539, -529, 26, 137, -681, -259, 497, 668, -657, -303, 230, 504, -528, -659, 877, 1157, 390, -292, 759, 965, -180, -1137, -1264, -369, -661, -1556, -964, -6, 346, 413, 315, 529, 900, 496, 3, -724, -302, -250, -505, -1488, -674, 704, -275, -1066, -392, 1090, 112, -989, -549, 1064, 674, -350, 75, 1293, 1089, -576, -460, 445, -69, -1220, -1208, -319, -40, 281, -79, 578, 972, 1342, 1110, -37, 234, 410, 672, -842, -868, 320, 612, -338, -812, 736, 1117, -61, -1220, 406, 1239, 98, -806, 341, 1661, 528, -659, -631, 513, -57, -1334, -1253, -489, 44, -459, -188, 372, 923, 929, 347, -126, -139, 78, -900, -1275, -1519, 33, 122, -256, 33, 1002, 1460, -287, -686, -262, 253, -1159]
2587a159p38J817J208q84l63J624M09j414j762P30J54j222m56J567J374L3N07
2604A425O92O6j037j124j82q42o30l15O86k3J167J765M73q61J84J133j661k258
2622a342l44J372q6j977J123K148J172j779K28R52m58k168p01Q44J00k48N50J586
2640I72O70J85k55p95q33p88k10j180p83J099J885L18j33J732J152n55k335L33
2658D79l97r33j697k3J750R3j5P55J992p33p28r8Q6o37j144P79P0L63K04J421
2678A587j54j181R7m08n95j150R71J40K23O43J367M19k48j33Pq31j506j002L27
2697a427L53m54M76J707N07N4n55L16j52r99j354O22Q82m18L54M15O52k06q25
2716e2n01k00m51p16O42Q6J065P40J044K43n75J48p73j163j542J90L23l60K39
$$ y = [-1159, -1897, -80, 1128, 244, -119, 1505, 1914, 500, -1262, -532, -378, -1600, -2056, -489, 885, 918, 1425, 2117, 2183, 1146, 22, -160, -1002, -1632, -1947, -1261, -1284, -117, 1648, 2121, 1260, 1444, 2577, 916, -1342, -1686, -314, -400, -2377, -1254, 894, 2066, 287, 515, 1467, 1009, -1159, -1860, -1016, -916, -1164, -614, 972, 1642, 1827, 1572, 777, -56, -844, -1054, -2234, -3017, -1918, -33, 285, 152, 1884, 3036, 2481, 146, 479, 82, -851, -2548, -2571, -821, -728, -743, 12, 2004, 1271, 543, 445, 531, -106, -1250, -471, -401, -38, 166, 1587, 1433, 252, 349, -59, -654, -1804, -833, -693, -470, 173, 1540, 1959, 1711, 1578, 1585, 754, -752, -1754, -1427, -1074, -1528, -1052, 655, 1162, 1216, 661, 977, 825, -174, -1528, -906, -24, -442, -88, 327, 979, 773, -52, -553, -753, -1204, -1920, -1278, -1192, -127, 613, 1657, 1900, 1325, 1473, 700, -463, -2005, -1815, -1492, -1852, -1613]
2735a613J427J480P4K54J63K15j691q21l73k56m72M3J447M17M92L53L91m56j057
2754A7k95l37l62k19P73O29N92O35M09K98j171r50j103J60j241O6R64N97J019
2773D81N05J516n0n32n07p09j062j622K85l9L95J28J467O74o1J14j68p7j100l02
2793f64k48lK56P49J06M54j47M0l1j276l22l91J68l85N74J097R60N48p8M21m45
2814A383o53j168o02k87m81O63k38J146N29O16K06K45j25p14Pr70M31l65J50N08
2834B81K9O8K3j46n31J9n38O7k9P5O59M86N60P3M11m32q39n36k20n40n99N64J68
2857i27L08K12J254J71q6n0m01K7r38J24n62M76r5L01M36j79L83l45q0l80j95
2878e46K6N07m12J79Q14m39L59l24L16o54l04l77KK31K38N14L10L10M8l9No33
$$ y = [-1613, -186, 1294, 1368, 1622, 1785, 2000, 309, -512, -885, -1141, -1613, -1570, -123, 294, 786, 1139, 1530, 1074, 17, -278, -615, -977, -1196, -423, 206, 798, 1433, 1842, 2140, 969, 19, -1084, -924, -2165, -2099, -1135, -538, 481, 986, 2502, 2452, 1920, 1413, 704, -358, -1980, -1695, -1734, -1339, -1211, 256, 930, 869, 983, 815, 738, -362, -664, -912, -915, -659, 90, 196, 650, 503, 543, 512, -764, -1086, -1477, -1309, -1694, -1120, -23, 937, 1485, 1407, 1828, 1383, 730, -438, -1040, -1327, -1808, -1145, -1383, -237, 292, 908, 1114, 1359, 1234, 520, 527, -443, -12, -377, -227, 281, 310, 378, 401, 255, -276, -257, -795, -728, -757, -682, -23, 463, 1023, 1096, 1507, 1075, 236, -300, -520, -1060, -1659, -1095, -927, -619, -407, 847, 1018, 932, 882, 481, 508, -430, -306, -868, -392, -487, -186, 250, 71, 454, 109, 29, -351, -546, -520, -13, -425, -246, 568, 129, 488, 164, 480, -174, -478, -855, -853, -622, -384, 130, 440, 750, 798, 759, 764, 131]
2900A31l6o44o6j99K53K60N74M87k39M94m16l23m52k7k31q6K37N68L39m17M28
2921F35o09N0p71q2j79R9L56L74R28L03M07J15o40p44p67o25r84l65O29P49P10
2942d11R97M53R72j65o68l12j110n84r88J66O01M76N34Q64K93l64M4o84p93o92
2962a371J03O7O0J173J021R57j63J08o34r69j370j162o6l32K07Q80K048R77O44
2981B178O00K18n83j606q09j178n10m30K26P51O72J362J39N34q30K07q29p46n08
3000a142K85P10l90J105M86O91l74o29n17r53q29j039N89J10J201O86O97J007
3018A694L07j00p41m10j054p98q77K56L49J3Q12P41P10o20L64j08l06n6j67n3
3038d4k66M27L52j02k29K07p7o97m87K96P30n98J29N11Q70j65l12J33k32j95n44
$$ y = [131, 95, -549, -615, -814, -561, -301, 273, 760, 521, 1015, 599, 276, -176, -203, -434, -520, -283, 285, 624, 207, 635, 26, 76, -695, -777, -956, -857, -501, -127, 801, 1104, 1511, 1626, 986, 242, -525, -1150, -2134, -2499, -1870, -1121, -411, 586, 1039, 2011, 1846, 1178, 866, -244, -828, -1816, -1650, -1049, -573, -39, 825, 1118, 754, 798, 114, -679, -1371, -1268, -1201, -1141, 32, 1053, 2010, 1847, 1955, 1321, 352, -1018, -2180, -2246, -2578, -2371, -1491, 557, 1534, 2178, 2778, 2996, 2413, 807, -2, -1180, -1690, -2120, -1894, -1143, -471, 891, 1030, 1564, 734, 941, 112, -634, -1142, -857, -147, -537, 568, 1054, 1745, 1371, 742, 225, -728, -1557, -2596, -2007, -1897, -696, -10, 687, 1694, 2001, 1901, 1160, 750, -304, -1102, -1979, -1723, -1374, -1361, -549, 192, 902, 282, 646, 538, 232, 176, 9, -44, -310, 117, 469, 367, 138, 345, 268, -429, -916, -620, 110, -488, -359, 152, 1022, 857, 545, 678, 446, 251, -293]
3059b93j69P7J00j3K95M37n8p2k41R4j67J38n8k65N52O8O16r10N3q9J11j069l03
3082a166P64l59J94J57J000J10lk88O4k76p96o33K08K32K10K68K91O60L11k5l58
3103E65m07m27k74j12k60K5N90m6P10J50L55l55k69l23n2J85p79M58J83N76l1
3124D62j58J57n3m47p24L19l50j14j05R19O03j52O46Q1L66l71p87l81n12o64j75
3145a440N75n0P24j6N43K68J23P5k80m12j85M36l50o0M9N42k85m67j69l6j86r34
3167a535L30O41L63J74M52N06M24J45p84l2n05q11p48m00J85J84N45J64O38P94
3187G30K62N4k07k2J65n36n18k2J6J90m27l4K07m3l46%q8K56L09K23O70M87j72
3210A154K77k64k76p22n62m64j22m90m05J000J3N90N12O03J74K75l10j65l70l12
$$ y = [-293, -462, -385, -285, -298, -3, 434, 376, 304, 63, 157, -10, 128, 70, -195, 357, 425, 1041, 131, 184, 95, 206, -863, -1166, -402, -761, -567, -410, 590, 700, 697, 409, 473, 197, -599, -1232, -1024, -792, -582, -314, -23, 637, 948, 923, 565, 158, -269, -543, -655, -915, -890, -300, -346, 364, 514, 869, 514, 245, -78, -130, 55, -724, -266, -83, 493, 462, 304, 461, 408, -39, -763, -444, -794, -908, -1013, -94, 509, 357, 1003, 1084, 1450, 1079, 292, -89, -601, -1265, -1440, -865, -915, -191, -207, 336, 604, 727, 802, 522, 110, -75, 361, 11, -49, 0, 542, 257, -210, -379, -415, -601, -1535, -1205, -564, -201, -27, 425, 931, 1355, 1500, 716, 684, 179, -632, -1380, -1780, -1595, -1411, -866, -702, -64, 730, 992, 1046, 839, 817, 982, 446, -72, -94, -78, 112, -315, -349, -142, -185, -531, -531, -619, -363, -54, 169, 839, 1326, 1154, 1431, 1167, 891, 169, -393, -857, -979, -1469, -1874, -874, -861, -271, 241, 844, 1018, 1293, 983, 818, 448, 136]
3230A36lp59J4K09j1m5k07L82l19K74l37Q42J55M23k23K32L82n99l61p90M73m87
3252f19k96m08O06J35K30M55K83L67k21J27k62m61J13q8J1l13L71o2J48k55r0
3273b29m9k83j1K21Q30l66L74L24K83l01p16K45n56l23l32m7N60J0M93L98L40
3294H65K86j52m22j07j044k66N3l78O29K87N86j09J33M09k03l74n45n7k77j4J63
3315e37L90P9J16L53j73K15o68l77j30K73q3K46L89P42K49k59O9P6p16p27l08
3336g81k58l37L61M43N57M36N55K6lm3k04l60o10K7j59J86k22O1L15j53O7j66
3358b62N08n34J21N26M58J59l4L15l84j83r37p4p48k61R0L49J62M76P78L46K08
3379A079k03R1n59j94j55k29J9q4P8j41J20l19l6k07j92J47O8O27M43K94M07J54
$$ y = [136, 133, -626, -612, -403, -414, -459, -666, -284, -603, -329, -666, 176, 331, 754, 531, 763, 1145, 546, 185, -605, -132, -619, -915, -1323, -717, -582, -352, 103, 386, 753, 532, 659, 397, -64, 49, -39, -28, -341, 30, -32, 116, -139, -229, -278, -561, -572, -351, 479, 113, 487, 811, 1094, 793, 77, 322, -234, -557, -889, -936, -376, -366, 127, 525, 865, 1151, 999, 577, 470, -574, -840, -787, -1165, -536, -249, 337, 228, 361, 770, 567, 193, -352, -409, -686, -700, -537, -147, -68, 48, 401, 228, 443, -225, -602, -732, -459, -542, -296, 93, 835, 1084, 825, 894, 970, 254, -473, -781, -1039, -1376, -1015, -572, -15, 421, 976, 1002, 999, 956, 752, 392, -218, -191, -350, -164, -386, -325, -10, -163, -96, -262, 246, -288, -167, 359, 817, 976, 942, 1257, 873, 690, -247, -321, -1069, -1330, -1240, -891, -729, -253, 525, 871, 1079, 876, 967, 408, 214, 59, -170, -151, -235, -157, -298, -178, -497, -533, -740, -932, -785, -717, -90, 353, 647, 1054, 1208]
3401A208K65m81m77j095k24q41o3Q8K81Q04M33J017K38M86l06k59j39o43m74j61
3421c43R6k85K18J06J35j36J99r4k97j31N1M07L28K50M93qN32n19k32q04n40l34
3443i08o11o2J48P32J57O87P62L57K8p1n35m91m72l84m3l60L78N0M53R2K1M04
3465C32m79j25K8n9j33L71L41m4M44k64K02m15k74m32l08j09K3Q6M80N39K88K30
3487G22jJ3Lj36r19k21k36K94L9o5P15K73K32j88L0j98m87J31k29l7o0J61M5L20
3511B01L38j37L3k98m2k83l17L6Q4M08J80J13k02P0K06m49k69p9R4j18M9P2M42
3534A32l1N20k0k78j10k00J85m74m28J63M3K61J20K15J30R0q8M89m51J39k54j16
3556C7k26l9N0jJ36m24O0N6J6J00K66K52j60N6L35j02L15k66L2m43n71L66j33
$$ y = [1208, 1473, 992, 515, -580, -804, -1645, -1708, -1620, -1339, -535, -102, 915, 1153, 1639, 1333, 1074, 935, 292, -182, -343, -247, -532, -314, -208, -73, -209, -10, -104, -401, -532, -481, -74, 254, 504, 997, 989, 1521, 1002, 770, -34, -574, -908, -1519, -1581, -1433, -701, -544, 143, 905, 1262, 1290, 1219, 684, 193, -279, -663, -706, -1066, -688, -638, -185, -93, -72, 332, -147, -272, -244, -303, -436, -65, 276, 232, 676, 412, 614, 199, -75, -507, -815, -924, -901, -815, -335, 204, 492, 722, 721, 734, 737, 601, -318, -539, -775, -481, -442, -507, 208, 481, 713, 525, 555, 357, -130, 1, -228, -265, -325, -164, -119, 201, 539, 402, 435, 137, 95, -188, -505, -469, -385, 23, 203, 316, 114, 184, 390, -59, -328, -407, -313, -431, -382, -310, 132, 101, 621, 601, 323, 213, 13, 198, -276, -704, -541, -498, -237, -117, 98, 228, 318, 230, 719, 268, 407, 153, 37, -189, -228, -178, -179, -43, -467, -407, -351, -335, -235, 31, 283, 123, 179, 514, 412, 727, 461, 493, 50, -521, -155, -288]
3579b88j12j35o6L71M74n1J41j14j8j9j04p6J96L40k51Kk64M0m11k77m27L8M99
3602e12J71M5M09J231l88K99k85m15p98k18m01n56K19L2N34K19O59J60J30P5j88
3623D22k58n14M3k55M15K40K96L83l69J75o99P6p47k85j50M7O25N19N34M27N18
3644A443K22k72p51n59m86o59m16Q5K86P21L85Q03J80J47j75k50k91o12m44j12
3664g55K76M07M28P9K89k63o4m50k43m70j6L7Q3L33O42N33l03J60J26m60n21n24
3686f76m88J64K19qL92O16K22L35J46m41k80j67o72j22P0J20K87M45K85P4p6m50
3708ej23J21k19m4m73Q07J06j33N58L1l20m18P9j01k50L3J13j22P53L7J41J7l52
3731B36o9j28l74k6j36L71Q5L0M59L50n85L11l30k37l41j64K66J4K75M4N3K87
$$ y = [-288, -400, -535, -601, -230, 244, 193, 334, 220, 202, 183, 79, 3, 199, 539, 288, 290, 26, 66, -345, -622, -1049, -1011, -512, -341, -296, 113, 1344, 956, 1255, 970, 555, -243, -461, -862, -1418, -1199, -1167, -633, -414, 245, 405, 535, 610, 422, 164, -350, -307, -562, -147, 93, 389, 772, 403, 578, -121, -45, -792, -1077, -1227, -1180, -555, -36, 498, 925, 1443, 1665, 1393, 642, 83, -403, -1062, -1478, -1393, -1107, -386, -1, 802, 982, 1129, 954, 704, 413, -199, -643, -755, -479, -72, 356, 435, 724, 461, 397, -53, -296, -766, -782, -745, -662, -329, 313, 846, 543, 703, 829, 369, -152, -676, -1164, -1000, -781, -789, -397, 219, 441, 776, 922, 481, 201, 34, -638, -760, -690, -570, -283, 162, 447, 521, 445, -5, -128, -7, -226, -270, -743, 64, 170, 37, 595, 626, 306, -112, -33, -134, -384, -351, -238, -360, 393, 430, 571, 588, 236, 167, 39, -335, -361, -497, -126, -41, -11, 448, 798, 213, 524, 194, -43, -384, -548, -282, -268, 7, 51, 104, 391]
3753C91k10j45q1j78l20Q1J47K08K32R5M23k79j10q0l62j32j93j93L42n2J41J32
3775a43N08K22j15Q0k19k28l07j21J9L6j73K32M92m22M23K05l47j04j55l48K07
3796b58L73J24Q6K94j45J46m69j41l23r5j27M5q1L54J57L36L01L4J05m13j85m32
3818c14K06l44j93K16J17O4J22J79K19l47k9k3N26o65J43M9K26j00K23L7k03l96
3840b87j62K13l83l0K76lM24J48J34J22J98m02J23j61n00k14j3L96j79J56P3K98
3862B27n8O7%k40K26k56R0k23J89P1r2J90Pp5j13M8k30kq0J13J48K16J06q6P3
3887C16n4r7k06k51M6j82K03J33k30L61J62j45K01J73n04N4j02J62j57j97R1J51
3909g2N0Q4j60P1J11K1j17kp7L52k34M9Rp6Ll5l13M95n68k2K90K63Q8l4n4o9J75
$$ y = [391, 181, 36, -45, -223, -543, -462, -315, -107, 125, 220, 643, 364, 254, 174, -188, -320, -513, -706, -364, -416, -275, -143, 365, 587, 472, 552, 333, 105, -202, -323, -304, -268, -441, -209, 283, -139, 284, 489, 142, 38, -117, -465, -258, 115, 239, 325, 619, 474, 620, 151, 10, -313, -408, -535, -490, -571, -217, -60, 276, 577, 611, 716, 303, 118, -314, -108, -452, -645, -429, -312, -248, -126, 53, 272, -75, -104, -127, 399, -266, -123, -74, 152, 52, 275, 312, 109, -287, -449, -236, -619, -649, -373, -376, 48, 196, 330, 452, 650, 248, 371, 210, -290, -504, -517, -121, -300, -144, -71, 227, 169, 236, 236, -4, 222, -34, 56, -167, 22, 93, 1, 191, 198, 123, 10, 58, -172, -174, -254, -141, 7, 223, 329, 243, 316, 262, 165, -41, -292, -246, -428, -225, -92, -322, 39, 201, 56, 257, 430, -74, -20, -122, 40, -117, -314, -223, -72, -22, 62, -98, -27, 84, 105, -12, -14, -91, 261, 27, 76, 85, 9, 12, -23, -336, 159, -409, -431, -141, 122, 210, 176, 122, 53, 228]
3936B28J77m48P5pj19j01J15o1R2j13L70j35K4r4j12J59l77L02O2J14J52K0j3
3959C10j81J33m35j37r5MK54J88k42N16K94m42Q7P0k56l17j95K95l47J61j54N87
3981I8j11K44J51J2o4k29k24K3j28q4K13O1Q7O4K10k42r9Nj65l15K48k27M57n
4005b0K18l83K75J17p2p7L3m9k09j60o1M59o0k10M54Q5Q6j27J5j73J8k69pJ6j65
4030b66P8J06olM00j0P9r5j5kk94k5j11o2J29r0L39jj36o0L62k24l37P6j70N66
4056B28l05l9P9J48Kk46O7K64o7Jk68R7k23j87M39k16L18j7K5R8J74j20k71r6
4080a15r5K31k52j3KK22J88L1K89j17q1k74Q9M4k66m46K92M38m2Lj44J62J28k88
4104a4J22k24J35k07J37jL3L36K00j91l90J53k29k79j01J87J03o7N8K65M47k38
$$ y = [228, 405, -43, 32, 25, -94, -195, -80, -141, -49, -162, 208, 73, 97, 3, -109, 50, -327, -25, 37, 151, 303, 323, 310, 129, 262, -173, -310, -405, -401, -147, 41, -201, 315, 609, 167, 254, 324, 68, -249, -444, -149, -496, -335, -489, 98, -13, 231, 382, 394, 330, 101, -123, -100, -228, -312, -99, -38, 49, 113, 323, 81, -18, -13, -178, -493, -245, -472, -15, -20, 198, -185, 90, 207, 135, 58, 91, 42, -167, -327, -388, 71, 11, -199, 255, 340, 426, 299, 314, 141, 159, -110, -117, -101, -266, -188, -82, -88, -91, 309, 299, 378, 283, 268, 266, -28, -53, -164, -226, -97, -187, 152, 151, 15, -45, 317, 93, -244, -168, -338, 228, -77, -116, -37, 111, 113, -133, -66, 198, 131, 132, -136, -39, -262, -449, -10, -226, 92, 75, 100, 198, 372, 252, -19, -115, -210, 21, -231, -244, -242, -20, 168, 199, 488, 371, 290, 16, 105, 149, -117, -563, -271, 167, 125, 128, -16, 146, 274, -14, 108, -116, 19, -188, -51, -52, -19, 317, 517, 326, -64, 89, -140, -419, -520, -333, -230, -297, -239, 26, 473, 235]
4126B35L5j33M5j85j66M3l33M08j29p4J48L57m27K30J87l51J65j16r9o6N22k16
4148H0j62M63k46j94k36J77l02K43r3j20M52K59j47k4K87o4K05n56j09J89p32
4169f30M28K03q0j76L00K15k20N0q5L18n41J65k7P9j99K49J33p5j15n0K37j77
4191Bk18Q8k8j67K33J32J71J57m25K68P3j92j67m10M92q5k14J77O8j15K01j02
4213f1j32L40j87K97l11O3j00L52k27k24j22K65j13n5K39K12j33j00K06O5j10
4234A64p0p4O0k06n9K74R4J67p8J64k60n2j94l06J40j47P2Q1L29j72L70j19Q7
4257B65l08P6O6n25K58k56J97m9K07K42J41p9j10N8k19r5k92J04J57j02M41l3
4279A44J66M58l87j13m25jk39n2K46q5oL66J73j18J78Q3l06ml46K27k90J14n6
$$ y = [235, 270, 137, 182, -3, -169, -126, -459, -51, -180, -254, -106, 251, -176, 54, 241, -110, 55, -61, -160, -226, 296, 80, -82, 381, 135, -59, -295, -118, -420, -177, -270, -390, 62, 321, 174, 150, 437, 373, 578, 22, -87, 102, -630, -202, 1, -79, -255, 45, 260, 40, 90, 5, 323, -218, -53, -80, -1, -200, 49, 182, 107, -8, -58, 179, 2, -216, -128, -156, -323, -90, 42, 213, 370, -55, 213, 286, 94, -73, -483, 9, -76, -290, -113, -45, -160, 41, -61, -193, 147, -40, 257, -54, 9, -91, 261, 34, -190, -312, -47, -160, -215, 24, 236, 103, 3, 209, 274, 164, 94, 20, 80, -126, -185, 89, 183, 350, 272, 436, 176, 124, -70, -376, -236, -383, -311, -230, 99, -73, 297, 178, 265, -43, 33, 99, -426, -168, -424, -227, -276, -69, 173, 314, 235, 125, 183, -36, -131, -423, -319, -162, -264, 177, 144, 310, 768, 381, 268, -157, -158, -397, -449, -203, -288, -294, 72, 245, 127, 305, 388, 82, 78, -268, -41, -331, -217, -273]
4302b73L36L4J9J32m4K7k90q0n0l59J89L25p6N04j12J92k27K74k13o5m23j49m7
4325c76K25j76J43J00M38k26Q2N2l6M1j84k62j44O3K42O6l26J81K13K72m45l0
4347h7j03K97l32K13L80m77M18j86J11j58M1l30PK19j80K25l16J12P0K78j50N4
4369A06N5k36J46j84q9M64j97N3j18J09k09Q4k1j28J2k45N81q0J82N7l30n4K93
4392B51k44J11j45kK26k51j5J66j52m2M58m68n5L38k69j51K57J45j68J54J96j38
4414B02k11Q3k3j89j7j12n9J8J20L49k98N50l90M50l26Q7m99K24q6m87N81j55
4436a88K39j18J29p6j23J86N4l06N8J73J29j59L21j18J81q9j46k83K9j61L1l6
4458b73Q8K6P3K27j06M15k20kk04l49P3N2J54K05j57j60L29K20n98q1K92j67l4
$$ y = [-273, 63, 97, 116, 248, 204, 231, -59, -139, -189, -548, -359, -34, -110, 394, 282, 474, 247, 521, 308, 243, -180, -329, -376, -151, -327, -184, -84, 354, 128, 210, 262, 226, 267, 83, -179, -323, -260, -18, 48, -278, -97, 116, 388, -57, -87, -190, 107, -225, -12, 368, -109, 309, 123, 234, 76, 117, -213, -206, 13, -167, 58, -258, -146, -76, 202, 52, 106, 161, -75, 71, -113, -202, 262, 65, 118, 0, 109, -100, -16, -37, -165, -153, -398, 183, 103, 285, 342, 12, -42, 251, 7, 118, -27, -29, 197, -54, -69, 97, -55, -97, 361, -107, -162, 176, -93, -244, 13, 158, -10, 144, 340, 202, -9, 74, 51, -138, -155, -267, -326, -308, -188, 161, -137, 413, 23, 473, 147, 234, -265, -41, -127, -614, -33, -188, 51, -67, 62, -14, -137, 49, 103, -203, -145, 28, 157, -2, 319, 201, 382, 293, 147, -136, -107, -268, -237, -273, -185, -159, -86, 141, 35, 450, 230, 228, 24, -325, -252, -200, -46, 159, 2, -158, 171, 391, -207, -288, 4, -163, -197]
4481a97J19l1N06k86J40K53l04J91l58j47p7k82oL99j35K8L41j72L20j63L5l17
4503a43J11o8j94M08k66K6j08M34j81q8L1m2N4n23L35M5K30k24L55M2j82j09l
4526f0J12l00j0K15n4Q1J85k46J22L12j04k26j00J94q4j90K42k74R9J19j85J72
4548B0NJ12l28K6L7J45N6k30K63J45l33N2J59j71k0j01K31l51M06j65J73j30M5
4571D6j18K05k41j02k41J59K32q9j09N93r9q6L5jj35P0l02k14M9J24K81N0j11
4594dn3K9R1j26j75L5R0m5k40M20j27K38J35j33o3J29m14J21j60j20K75j10J85
4617b2L50K27j89n2p6J08k67j97j26l3J2J65J93J43j55K21j88K7K53l96O1J43
4639B02p6j50J53l2J84k40J7k75K40j42L2J9j87L03J8J97q2lK01m18N7j48L28
$$ y = [-197, -78, -109, 397, 111, 251, 504, 200, 391, 33, -114, -191, -473, -479, -80, -215, -187, 154, -18, 302, 139, 174, -143, -32, -100, -294, 114, -152, -126, -234, 200, 19, -69, -38, -80, -26, -549, -214, -169, 61, -163, 192, 234, 52, -57, -60, 52, -248, -258, -43, -97, -16, 169, -77, 45, 357, 253, 27, -73, 121, 37, -153, 89, -185, -86, 33, -152, 20, 25, 137, -191, -165, -128, 17, 73, -157, 106, 251, -82, -30, 129, -42, -62, -163, 68, -283, 123, -42, 131, 1, 46, -72, 133, -108, -210, -451, -292, -60, -149, -258, 335, 236, 150, 185, 184, 49, 119, -183, -397, -348, -224, 57, 107, -4, -57, -28, 63, -63, -238, -203, -113, -158, -398, 22, -105, 133, 268, 135, 72, 201, -213, -92, -252, -372, -97, -207, -22, 328, 555, 366, 314, 238, 346, 79, -118, -244, -277, -265, -100, 93, 236, 81, 302, 114, 141, 394, -2, 59, 202, 126, -24, 129, 97, 281, 41, 58, -217, 23, -119, -87, -68, -255, 48, 66, 263, 181, 178, 379, -39, 18, -130, 198]
4662A98m61j61J32K60r2Q4O4j26J13K5L44m43J67J55k67J97k25j13N2N5k57J35
4684a64K96k77r9L14P8k00J64m8L8l47L3J56k1k5r1R2qR0MO5m4k34L61k94K69
4709A08K2k09J38P2J9k60J27k01K31k58J62k25K43RN8J93Qj04K27m71j64L00k38
4732b13n3N1O0Q5L4K75k91M45l89l8R2j36nj6J34J4O%Q5P4q0Q6k97j31n2L08k7
4759B1Ok24M52P9k85J40j51j73%P8p0P3j44K07O4J75k5p9o1j62j55Q2J03j10J3
4784a46j9K44j80J37o4J54p8K0j06n2k06N9L96m07K03K32R4k11l45K66l42K14
4806a37j06J13K73j16k87N01Q5k83qj41J19l60J07Q1k85K13P8L07j06K99j62m64
4828b79L86k05J22n7k50K00J62J87l69K49k35J52o7lJ8j64J3O0P4K10J35j16k9
$$ y = [198, -263, -424, -292, -32, -124, -40, 24, -102, 11, 36, 380, -63, 104, 259, -8, 189, -36, -149, -97, -42, -299, -164, 132, -145, -244, 70, 148, -52, 112, 64, 102, -245, -212, -56, -77, -102, -193, -101, -109, -19, -15, 50, 6, -228, 133, -161, 108, 130, -79, 59, 131, 150, -110, 17, -184, 47, -211, -49, -274, -31, -22, 36, 229, 237, 133, 360, -111, -275, 25, -213, -266, -215, -155, -70, -36, 239, -52, 393, 4, -34, 58, -78, -83, -99, 35, 49, 55, 55, 140, 214, 134, 220, -77, -208, -260, 48, 21, 27, -197, 255, 334, 49, 189, 38, -135, -135, -57, -127, -54, -198, 9, 73, 248, 223, 144, 83, -79, -234, -152, -49, -159, -146, -165, 79, -101, 36, -28, 126, 48, 68, -38, -90, -296, -237, 159, -248, -45, 187, 281, 70, -275, -9, -351, -137, -243, -130, 143, 27, -260, 241, 326, 43, 35, -106, 13, -347, -240, -159, -444, -231, -153, 154, 48, 347, 185, -279, 107, -98, 24, -33, -283, -83, 79, 266, -103, 146, -89, 63, -4, -7, 11, -153, -140, -80, -6, 204, 339, 223, 194]
4851A94j43j8j82j11J6l9J42J27K4P6L1J40l40J30K4p7q1J3j45L75l29M65k76
4874A6k56J71N1J28j87J20K05l02j13L71L9l57J52l2p1k06M79l36J62J0rj40K11
4897A06M7k83n0k5K53J9n4J80m84L53k22J21j13K14k72k32L88m2J44K17j46j52
4919c3K48l02J27j22J02j9k63M9J57L2k0J03J5n3L76k48j44j60J5J75o5OJ6J36
4943A28M9J8j88l2m3k3j88L4J85j25K74m6J19q5k26J32K1J52m21M70q1j0J9j07
4967B6K18p6n2n1p9n4j88J08k97M01K4nK88k9k09J48q1k46N3M7j12P7M0J61km8
4993F2J32P5k63kj24J86r4O5J30l9j44kl4k10J96o6J40j02J83K9P6k43K62j46
5017F7O6j49O1j19J13j67L9J42j05R8q1J83j87j41K8J74l4L5k18L84J77j32k45
$$ y = [194, 51, 33, -149, -260, -244, -283, -141, -14, 10, 86, 117, 257, -83, 47, 71, -6, -87, -74, -219, 156, -173, 292, 16, -240, -69, -18, 110, -77, 43, 248, -54, -167, 204, 243, -114, 38, 6, -65, -271, 208, -128, 34, 44, 35, -105, 106, 153, -130, -180, -205, 48, 67, 13, 193, -291, 62, -160, -39, -152, 62, -210, -442, -54, -96, 48, 265, 119, -33, 215, -87, 40, -82, 20, 1, -262, -213, -56, -24, -44, 59, 74, 21, 397, 149, 5, -155, -140, 35, -30, -24, -8, 128, 177, 195, 7, -25, -68, -91, -279, -245, -60, -185, 89, 43, 162, 77, -149, -17, 4, 156, -265, 205, 124, 114, 133, 26, 244, 168, 116, 65, -14, -68, -256, -148, -445, -44, -20, -25, 263, 234, 25, 173, 92, -154, -101, -54, -166, -89, -49, 112, 110, 62, 194, 269, 6, 4, -120, 66, -28, 37, 167, 128, -16, -18, -52, -262, -66, -132, 8, -94, 89, 118, 194, -49, 213, 67, 133, -16, 45, -74, 39, -128, -89, 53, -52, 46, -35, 148, -39, -180, -152, 22, -12, 23, -195, 189, 366, 234, -11]
5040a1K52k56J03q8j00n4J80k17K00N1N8R3m0k18J72l7k31J44Lj3M2K6O7q3j82
5065a39J22j36J6L01k77K44l12k5K72mN1l1j7J61j17j73J69P5l32l2K12l2J05
5088A01J44j54K19l50p7L43l18k15M35k3J0j04r4R2j4k78J95L00j51k83K97o8
5110GJ78k18Q0J15k44J12m3k52J59m1J41p3K87J27l35J39j47J74j27j60k73M65
5132G1j77l5L0o5M1M52l0l35M1q9n6J40J78m1l5Qj32J98J21j49k66L75l09j3p1
5157a48L05k61J43J79k69J92j36K30l84J13L43m14m8J91nM9Q9r2j4K5j53P1n0
5180d4J33j56P4j73q6K98j83J17l6M8k6j32J08m2J14j20J77O2j95Q9%j08J04o1
5204c8R5J13J34k08P3l3j98J03J71l55j02M12J42m24K32j40j1N6r8K39k34r4k0
$$ y = [-11, 241, -15, 88, 0, -100, -154, 26, -191, 9, 60, 118, 211, 171, -47, 125, 88, -143, 1, 4, -9, 33, 59, 126, 43, -139, -17, -153, -137, 164, -113, 131, -181, -206, 66, 62, 113, 82, 65, 226, 109, -64, 105, 180, -152, -184, 28, -4, 101, 245, 91, 310, -40, -117, 226, -92, -307, 128, 105, 115, 11, -83, 9, -5, -283, -88, 212, 61, -222, 75, 7, 185, -33, 47, 162, -82, 30, -13, -265, -106, -147, -6, -79, 208, 335, 0, 139, -8, 166, 39, -121, -394, 71, -106, -141, -111, -176, -135, 317, 287, -48, -7, -96, -152, -12, 166, 125, 90, 98, -34, 164, 285, 136, -130, 245, -64, -77, -148, 157, -104, 39, 218, -51, 141, 5, 235, -149, -36, 307, -107, -155, 36, 31, 80, 169, 77, 63, 88, -65, 6, -44, 89, -67, 7, -166, -252, 46, -137, -20, -56, -8, -34, -166, -58, -100, 14, -106, 71, 133, -62, 27, 27, -81, 23, -38, 57, 170, 304, 96, 169, 136, -62, 41, 212, -143, -245, 167, 309, -115, 117, -23, -34, 22, -76, 163, -71, -165, -185]
5227a85L05j56j20J3J72k2k25J72q0J35j18J0j85K54l6K02J91j81R4l64N2k1P1
5250b2k89J51rL22l12L28j8L9Nj55lk55K51K39l50J23J72k04LJ61k18p5K92k19
5274d3p3r9L08j90J0K26j09K02j66L2ml24K63q0l17J95N2L04Lk54K42p1J04j83
5298B8j25J48k33J20J1K38m21K53N9Q1j08M4l15J41N1K3j06K8q2L1K63p9Ok19
5322a63j95J93j52J39M7J16RL35m44N2QJ16j80Q6p5q9Q8M4M5o6n8J40K18N1j81
$$ y = [-185, 120, -36, -156, -143, 29, 7, -218, -46, -126, 9, -109, -99, -284, -30, -66, 136, 327, 146, 240, -124, -72, -93, -22, -311, -160, -169, 153, -159, 169, 151, 190, 195, 40, 37, -218, 33, 272, -78, 45, 217, 13, 16, 177, -41, -116, 176, -43, -116, -215, 93, -97, -87, 139, 30, 232, 66, 98, 94, -230, 33, -47, -364, -169, -117, 187, 190, -64, 178, 107, 211, 28, -97, 51, -182, -62, -51, 187, -234, 19, 78, 159, 51, 95, -220, -79, -28, -5, -111, -83, -165, -134, 129, 50, 56, -163, -358, -165, -317, -178, -131, -15, -6, 329, -115, -63, -55, 61, -119, -33, -108, -197, -109, -65, -20, -86, -144, -4, 214, 265, 84]
$$ [...]
8191A25
##END NTUPLES=NMR FID
##END=
