##TITLE=1H_Am-4989-2
 CDCl3, 8 sc, 
 23.9.2020
##JCAMPDX= 6.0         $$ Bruker NMR JCAMP-DX V2.0
##DATA TYPE= NMR FID
##DATA CLASS= NTUPLES
##ORIGIN= UXNMR, Bruker Analytische Messtechnik GmbH
##OWNER= root
$$ XWIN-NMR		Version 3.5
$$ Wed Sep 23 09:38:27 2020 Russian Standard Time (UT+4h)  she@DPX200
##.OBSERVE FREQUENCY= 200.1315066352
##.OBSERVE NUCLEUS= ^1H
##.DELAY= (6, 6)
##.ACQUISITION MODE= SIMULTANEOUS
##.ACQUISITION SCHEME= undefined
##.AVERAGES= 8
##.DIGITISER RES= 18
##SPECTROMETER/DATA SYSTEM= spect
##.PULSE SEQUENCE= zg30
##.SOLVENT NAME= CDCl3
##.SHIFT REFERENCE= (INTERNAL, CDCl3, 0, 15.7039)
##AUDIT TRAIL= $$ (NUMBER, WHEN, WHO, WHERE, WHAT)
$$ ##TITLE= Audit trail, XWIN-NMR		Version 3.5
$$ ##JCAMPDX= 5.01
$$ ##ORIGIN= Bruker BioSpin GmbH
$$ ##OWNER= she
$$ F:/spectra/data/she/nmr/H-F/1/audita.txt
$$ ##AUDIT TRAIL=  $$ (NUMBER, WHEN, WHO, WHERE, WHAT)
(   1,<2020-09-23 09:37:25.29 +0400>,<she>,<DPX200>,
      <created by zg, POWCHK disabled, PULCHK disabled
       configuration hash MD5:
       00 E9 B6 7A A2 85 ED C7 34 08 36 98 17 FE 4E 26
       data hash MD5: 16K
       92 69 CF A8 01 7B 86 0E 5A 30 CD DF 85 3C 61 5F>)
$$ ##END=
$$ 
$$ hash MD5
$$ E7 5E D7 32 11 06 22 1E 2A 55 D3 EC 0D C6 19 BA
##$RELAX= 
##$RELAX= 
##$RELAX= 
##$RELAX= 
##$RELAX= 
##$RELAX= 
$$ Bruker specific parameters
$$ --------------------------
##$DU= <F:/spectra>
##$EXPNO= 1
##$NAME= <H-F>
##$PROCNO= 1
##$TYPE= <nmr>
##$USER= <she>
##$AMP= (0..31)
100 100 100 100 100 100 100 100 100 100 100 100 100 100 100 100 100 100 
100 100 100 100 100 100 100 100 100 100 100 100 100 100 
##$AQSEQ= 0
##$AQ_mod= 1
##$AUNM= <au_zg>
##$AUTOPOS= <>
##$BF1= 200.13
##$BF2= 200.13
##$BF3= 200.13
##$BF4= 200.13
##$BF5= 200.13
##$BF6= 200.13
##$BF7= 200.13
##$BF8= 200.13
##$BYTORDA= 1
##$CFDGTYP= 0
##$CFRGTYP= 5
##$CHEMSTR= <none>
##$CNST= (0..31)
1 1 145 1 1 1 1 1 1 1 1 1 1 1 1 1 1 1 1 1 1 1 1 1 1 1 1 1 1 1 1 1 
##$CPDPRG= <>
##$CPDPRG1= <>
##$CPDPRG2= <>
##$CPDPRG3= <>
##$CPDPRG4= <mlev>
##$CPDPRG5= <mlev>
##$CPDPRG6= <mlev>
##$CPDPRG7= <mlev>
##$CPDPRG8= <mlev>
##$CPDPRGB= <>
##$CPDPRGT= <>
##$D= (0..31)
0 1.2 0 0 0 0 0 0 0 0.06 0 0.03 0 0 0 0 0.0002 0 0 0 0 0 0 0 0 0 0 0 0 
0 0 0 
##$DATE= 1600839444
##$DBL= (0..7)
120 120 120 120 120 120 120 120 
##$DBP= (0..7)
150 150 150 150 150 150 150 150 
##$DBP07= 0
##$DBPNAM0= <>
##$DBPNAM1= <>
##$DBPNAM2= <>
##$DBPNAM3= <>
##$DBPNAM4= <>
##$DBPNAM5= <>
##$DBPNAM6= <>
##$DBPNAM7= <>
##$DBPOAL= (0..7)
0.5 0.5 0.5 0.5 0.5 0.5 0.5 0.5 
##$DBPOFFS= (0..7)
0 0 0 0 0 0 0 0 
##$DE= 6
##$DECBNUC= <off>
##$DECIM= 32
##$DECNUC= <off>
##$DECSTAT= 4
##$DIGMOD= 1
##$DIGTYP= 9
##$DL= (0..7)
0 120 120 120 120 120 120 120 
##$DP= (0..7)
150 150 150 150 150 150 150 150 
##$DP07= 0
##$DPNAME0= <>
##$DPNAME1= <>
##$DPNAME2= <>
##$DPNAME3= <>
##$DPNAME4= <>
##$DPNAME5= <>
##$DPNAME6= <>
##$DPNAME7= <>
##$DPOAL= (0..7)
0.5 0.5 0.5 0.5 0.5 0.5 0.5 0.5 
##$DPOFFS= (0..7)
0 0 0 0 0 0 0 0 
##$DQDMODE= 0
##$DR= 18
##$DS= 0
##$DSLIST= <SSSSSSSSSSSSSSS>
$$ [...]
##$SUBNAM2= <"">
##$SUBNAM3= <"">
##$SUBNAM4= <"">
##$SUBNAM5= <"">
##$SUBNAM6= <"">
##$SUBNAM7= <"">
##$SUBNAM8= <"">
##$SUBNAM9= <"">
##$SW= 16.880792210976
##$SWIBOX= (0..15)
0 0 2 0 0 0 0 0 0 0 0 0 0 0 0 0 
##$SW_h= 3378.37837837838
##$TD= 16384
##$TD0= 1
##$TE= 0
##$TE2= 300
##$TE3= 300
##$TEG= 300
##$TL= (0..7)
0 120 120 120 120 120 120 120 
##$TP= (0..7)
150 150 150 150 150 150 150 150 
##$TP07= 0
##$TPNAME0= <>
##$TPNAME1= <>
##$TPNAME2= <>
##$TPNAME3= <>
##$TPNAME4= <>
##$TPNAME5= <>
##$TPNAME6= <>
##$TPNAME7= <>
##$TPOAL= (0..7)
0.5 0.5 0.5 0.5 0.5 0.5 0.5 0.5 
##$TPOFFS= (0..7)
0 0 0 0 0 0 0 0 
##$TUNHIN= 0
##$TUNHOUT= 0
##$TUNXOUT= 0
##$USERA1= <user>
##$USERA2= <user>
##$USERA3= <user>
##$USERA4= <user>
##$USERA5= <user>
##$V9= 5
##$VALIST= <valist>
##$VCLIST= <CCCCCCCCCCCCCCC>
##$VD= 0
##$VDLIST= <DDDDDDDDDDDDDDD>
##$VPLIST= <PPPPPPPPPPPPPPP>
##$VTLIST= <TTTTTTTTTTTTTTT>
##$WBST= 1024
##$WBSW= 4
##$XGAIN= (0..3)
0 0 0 0 
##$XL= 0
##$YL= 0
##$YMAX_a= 630979
##$YMIN_a= -637773
##$ZGOPTNS= <>
##$ZL1= 120
##$ZL2= 120
##$ZL3= 120
##$ZL4= 120
##$ABSF1= 10
##$ABSF2= 0
##$ABSG= 5
##$ABSL= 3
##$ALPHA= 0
##$AQORDER= 0
##$ASSFAC= 0
##$ASSFACI= 0
##$ASSFACX= 0
##$ASSWID= 0
##$AUNMP= <proc_1d>
##$AZFE= 0.1
##$AZFW= 0.1
##$BCFW= 1
##$BC_mod= 2
##$BYTORDP= 1
##$COROFFS= 0
##$CY= 11.3945322036743
##$DATMOD= 1
##$DC= 2
##$DFILT= <>
##$DTYPP= 0
##$F1P= 16.9975609425685
##$F2P= -3.02152046262296
##$FCOR= 0.5
##$FTSIZE= 0
##$FT_mod= 4
##$GAMMA= 1
##$GB= 0.15
##$INTBC= 1
##$INTSCL= 1
##$ISEN= 128
##$LB= 0.24
##$LEV0= 0
##$LPBIN= 0
##$MAXI= 10000
##$MC2= 0
##$MEAN= 0
##$ME_mod= 0
##$MI= 1.114404
##$NCOEF= 0
##$NC_proc= 0
##$NLEV= 6
##$NOISF1= 3.799351
##$NOISF2= 2.8
##$NSP= 1
##$NTH_PI= 0
##$NZP= 0
##$OFFSET= 15.70392
##$PC= 1
##$PHC0= -9976.056
##$PHC1= 17.4009
##$PH_mod= 1
##$PKNL= yes
##$PPARMOD= 0
##$PSCAL= 0
##$PSIGN= 0
##$REVERSE= no
##$SF= 200.130013532006
##$SI= 16384
##$SIGF1= 3
##$SIGF2= 2
##$SINO= 400
##$SIOLD= 16384
##$SREGLST= <1H.CDCl3>
##$SSB= 0
##$STSI= 0
##$STSR= 0
##$SW_p= 3612.71676300578
##$SYMM= 0
##$S_DEV= 0
##$TDeff= 0
##$TDoff= 0
##$TI= <>
##$TILT= no
##$TM1= 0
##$TM2= 0
##$TOPLEV= 0
##$USERP1= <user>
##$USERP2= <user>
##$USERP3= <user>
##$USERP4= <user>
##$USERP5= <user>
##$WDW= 1
##$XDIM= 8192
##$YMAX_p= 0
##$YMIN_p= 0
$$ End of Bruker specific parameters
$$ ---------------------------------
##NTUPLES= NMR FID
##VAR_NAME=  TIME,          FID/REAL,        FID/IMAG
##SYMBOL=    X,             R,               I
##VAR_TYPE=  INDEPENDENT,   DEPENDENT,       DEPENDENT
##VAR_FORM=  AFFN,          ASDF,            ASDF
##VAR_DIM=   8192,          8192,            8192
##UNITS=     SECONDS,       ARBITRARY UNITS, ARBITRARY UNITS
##FACTOR=    0.000296,      1,               1
##FIRST=     0,             0,               0
##LAST=      2.424536,      0,               0
##MIN=       0,             -637773,         0
##MAX=       2.424536,      630979,          0
$$ Real data points
##PAGE= N=1
##DATA TABLE= (X++(R..R)), XYDATA
$$ [...]
2190e27J499j129l00J553j327P68K31j456K169j408l75J941j604K04R78j751J512
2207I78n32j301K947j987p13J974j582O45N10k054K782j274k033L800k374n35
2223g49J753k339K310p06k604M026j750k125L576k225N04J122l052L247o89l099
2239b800M294j756k109L191k719K227M47m134M841q14l621M221j751o17K337m238
2255c001M330J05n003N476r51l207L883k859J797J504n661N462L19n157N055j415
2271F77j492K859m234L557J876p226N901O11m666M147k584J049K541o359M544
2286A201K294o993N091r0k915L899m701K699L106p759M700K636n922L964j539
2301c29m95L866o930L693M021p771L673K070l973L126k956J136M754q161K696
$$ plain form
2190 -527 972 -157 -457 1096 -231 537 768 -688 1481 73 -302 1639 35 239 1217 -534 978
2207 978 446 -855 2092 105 -608 1366 -216 429 939 -1115 1667 393 -1640 2160 -214 -749
2223 -749 1004 -1335 975 269 -2335 1691 -59 -2184 1392 -833 -329 793 -2259 988 299 -2800
2239 -2800 1494 -262 -2371 820 -1899 328 775 -3359 1482 668 -2953 1268 -483 -1100 1237 -3001
2255 -3001 1329 1434 -3569 1907 956 -2251 1632 -1227 570 2074 -3587 1875 2194 -2963 2092 677
2271 677 -815 2044 -2190 1367 3243 -3983 1918 2529 -2137 2010 -574 475 3016 -3343 1201
2286 1201 3495 -3498 1593 1503 -1412 2487 -2214 485 3591 -4168 532 3168 -2754 1210 -329
2301 -329 -824 3042 -3888 -195 3826 -3945 -272 1798 -2175 951 -2005 -869 3885 -4276 -1580
2316a580N191o791K870N14j930M277n588J320O466q415J949M663n209L062k011
2331a212n57O479p419K10P549p634J857K745m024M841m862k85Q509q640k72P182
2347D467o174K686n62l171Q110o982j705R361p762K65M725n153N132l732l262
2362c757J0465q348j937Q252o202K150L14m280Q269n734l621J0341p544p40M975
2377B603m971M553k685m091R997o094l745Q337n652J598J013m844P295l924l896
2392d506R113n296k718N506l883K741r58m690Q589l657m752P283l140r54K683
2407A361l930M729j546m965P915k433m261M682j966J129O87m776N883m86n779
2422c756O189j359k380K987k584K361O12n780O110M70o125M634o77r43K376m421
$$ plain form
2316 -1580 3611 -3180 -310 204 -1726 2551 -3037 -1717 4749 -3666 -1717 2946 -2263 799 -1212
2331 -1212 -1769 4710 -2709 -2499 5050 -2584 -727 2018 -2006 2835 -2027 -2312 6197 -2443 -2715 4467
2347 4467 -1707 979 417 -2754 5356 -1626 -3331 6030 -1732 -1467 3258 -1895 3237 -495 -3757
2362 -3757 6708 -1640 -3577 4675 -1527 623 937 -3343 4926 -808 -4429 5912 -1632 -2372 2603
2377 2603 -2368 2185 -500 -4591 5406 -688 -4433 3904 -1748 -150 863 -3981 3314 -610 -4506
2392 -4506 4607 -689 -3407 2099 -1784 957 -1 -4691 3898 241 -4511 2772 -368 -1322 1361
2407 1361 -2569 2160 614 -4351 3564 1131 -3130 1552 -414 715 1402 -3374 2509 2023 -3756
2422 -3756 2433 1074 -1306 1681 -903 1458 2070 -3710 2400 2870 -3255 1379 702 -241 2135 -2286
2438b286L664J700o279M711R07m870L949k080O82K474n837L998K486o509L803
2453E13L41k514L771m201J773L078o365L845K114n404L754j414q04L796n532K575
2469f74L549o045L501O44l174L791l209N82L607n872L015K375m393L114j081o65
2485i35L037m069J369L090m480K569N75k551K629j840J70K703l810J219K421l164
2501a067J821j96q96K537k780M91K169k923J389Q66k141J357n00l26J964k552
2517g87L29J698j417N1O72r44R52q40l09J581j455r6J455j189j03L97p71J319
2535E43o66p80J453p52l87P47p13K43M32j114J096m12j053J933p61n04J135j428
2553i88J008J74j065J471n73q40J498j068k4R73j204J048m3j046J332j98p32J033
$$ plain form
2438 -2286 1378 3078 -3201 1510 2417 -2453 1496 -584 98 2572 -3265 733 3219 -3290 513
2453 513 854 -1660 2111 -2090 -317 2761 -3604 241 2355 -3049 705 -709 -1513 2283 -3249 -674
2469 -674 2875 -3170 331 975 -2199 1592 -1617 -1035 2572 -3300 -285 2090 -2303 811 -270 -935
2485 -935 2102 -1967 -598 2492 -1988 581 1156 -1395 1234 -606 -436 2267 -1543 -324 2097 -1067
2501 -1067 754 558 -338 2199 -581 -90 2079 -844 545 1411 -730 627 127 -199 1765 -787
2517 -787 -458 1240 -177 -126 546 -398 554 -286 -595 986 -469 -565 890 -299 -402 -5 -776 543
2535 543 -123 -903 550 -202 -589 158 -555 -312 120 -994 102 -310 -1363 570 -191 -695 440 -988
2553 -988 20 194 -871 600 27 -813 685 -383 -407 566 -638 410 367 -679 653 455 -277 756
2571G56q93M39L04q53J054k84o71R85m07l25P94j067O54M89j490J457n52l90P04
2590G04p24J04L75p08O27O5j097J592r68l4N74r17N07L43r79P12l55n07O91n41
2610e36K3M74o12M36K8l79M81j47m57O59p76J12O15n84P41m14j68P83n20m05J009
2631C63q70M85K83o42N68j42m46Q80n40n40R51m27L28q1m23P41l92n53J443o96
2651B90j59M53o55N01J34j111J510q01k76Q83q66K61M40j018J198l98j138J652
2669I00q24n20J325j373R78Lj428J562k9j359J245j062L07P27j682J601j55j751
2687a535J774l71r24J323j404J061N32k279K078j11j515J756p62m5J130k322J606
2704hP97k580K169j72j125J602j362O10J006k525K159O10k602K474r22m10J380
$$ plain form
2571 756 -137 302 606 -247 807 523 -148 837 430 105 899 -168 486 975 -515 942 390 0 704
2590 704 -20 84 459 -249 378 443 -654 938 -30 -64 510 -407 100 443 -536 176 -179 -686 5 -536
2610 -536 -513 -39 -651 -215 -187 -566 -85 -232 -689 -30 -806 -694 -79 -663 78 -336 -504 279 -241 -646 363
2631 363 -507 -22 261 -381 187 45 -401 479 -61 -601 350 -77 251 170 -253 488 96 -457 986 290
2651 290 131 584 -71 430 564 -547 963 162 -114 769 -97 164 604 -414 784 386 -752 900
2669 900 76 -444 881 -492 486 489 -939 623 594 -765 480 -582 -275 452 -1230 371 216 -1535
2687 -1535 239 -132 -1056 267 -1137 -76 456 -1823 255 144 -1371 385 -377 -422 708 -1614 -8
2704 -8 789 -1791 378 206 -919 683 -679 -69 937 -1588 571 1181 -1421 1053 131 -279 1101
2721A101k427J585J322k972J781R09k073K021j694M02J918l186J584J771l368
2736a326J949Qr98J754k319Q43K201l721J478J571k409J759j105j11K285l474
2752a615R92K738l603J115Q78j271J992k290j62L509m074O37K886l491J605M5
2768a09j056K609l202R0M241l855K16K040k474K167j003j288M117l750m20M002
2784B325l448O72J198k143L641k864j512N143l621n95K851k972K320o86k388N262
2800C183l495j576M769l657O97J354k541L839k657k193N559l480j191L590l149
2815i48J593n2k396M246k328k438M981k831m95J540k659L514j528k826N031k359
2831D5k277L856k320P04N75k897M242j968k942M482j658j150K010k323K523m29
$$ plain form
2721 1101 -1326 259 1581 -1391 390 1299 -774 1247 -447 -45 1873 -1313 271 2042 -1326
2736 -1326 623 631 -367 1387 -932 -89 2112 -1609 -131 1440 -969 790 -315 -426 1859 -1615
2752 -1615 -623 2115 -1488 -373 505 -766 1226 -1064 -1226 2283 -1791 -1154 1732 -1759 -154 -109
2768 -109 -1165 1444 -1758 -1668 2573 -1282 -1066 974 -1500 667 -336 -1624 2493 -1257 -1677 2325
2784 2325 -1123 -451 747 -1396 2245 -619 -2131 3012 -609 -1204 1647 -1325 995 309 -2079 3183
2800 3183 -312 -1888 2881 -776 -79 1275 -1266 2573 -84 -2277 3282 -198 -1389 2201 -948
2815 -948 645 593 -1803 2443 115 -2323 2658 -173 -668 872 -1787 1727 199 -2627 2404 45
2831 45 -2232 1624 -696 8 583 -2314 1928 -40 -2982 1500 -158 -1308 702 -1621 902 473
2847D73l274M215j148k449L038j286QO86k399L275M3l721L385M4k192K184j612
2864g30R99J155l398K913M87l627L326j69j419J497k064J645J389m022K840J019
2880A841l354K625j090l82K111l117K021J509m073K396Q76k467K543k500P55K601
2896B295m347K078J737l661K800o53j109K257k947J185K417m090J861J285k378
2911a270K223j624k86K415l186J389J975l627K382k03j287K091k280Q54K046l442
2927a830J462J045j811J933j204l87K024k483Q87J556k244J190M85j122J488j707
2943g18L75J806k202O49J041j328R35k96m37J387j495L34J351j947L38J021q70
2960e6O68o04m29J416j298J21J225j080J6M39n83O61m23p85J556q86o70J233q26
$$ plain form
2847 473 -2801 1414 266 -2183 855 -431 -423 263 -2136 1139 1182 -2539 846 890 -1302 882 -730
2864 -730 269 1424 -1974 939 1426 -2201 1125 956 -463 1034 -1030 615 2004 -2018 822 1841
2880 1841 -1513 1112 22 -360 1751 -1366 655 2164 -1909 487 1363 -1104 1439 -1061 -306 2295
2896 2295 -2052 26 1763 -1898 902 249 -860 1397 -1550 -365 2052 -2038 -177 1108 -1270
2911 -1270 953 -671 -957 1458 -1728 -339 1636 -1991 391 188 -1099 992 -1288 -434 1612 -1830
2927 -1830 -368 677 -1134 799 -405 -792 1232 -1251 -364 1192 -1052 138 623 -499 989 -718
2943 -718 -343 1463 -739 -90 951 -377 558 262 -175 1212 -283 51 1402 -545 -207 814 -56
2960 -56 612 8 -421 995 -303 -182 1043 -37 -21 418 -165 496 73 -712 844 -42 -712 521 -305
2979c05Q2N29r05Q23j77r28J431q17l69R13n84L97K36j135R53n0j214J320m44
2998b44k80J014j099O76l8p47J005m42m75J057p18j38O38r32J064k23p59J228
3016E87p45J81L80n91M42L40j094J065j57n38Q06p01L02L17p32M70J4o61J005
3035F90n25k28P74o79K93K44p01O08k74l67M57m59K77Q1m05M81k6o60N35j52l51
3056c87O49k37j62K22k48k14L28n43L82j27j22O11n75K13J74o14N79Q7k00K99
3076A15j91k63L16j13J9J55m30j71N72m39O18j8l94N15l23L13J56o36N33k32k14
3097a12L23k57K02J41j02J81N6q99Q31l09K8N32n65K12K52o83N85J14q33R25m32
3118A90l18Q11o66J64J13n36O73k61n01N04k24J07L69j215R30k09p51Q58j96l13
$$ plain form
2979 -305 -223 306 -599 224 47 -881 550 -267 -636 277 -307 90 326 -809 144 94 -1120 200 -244
2998 -244 -524 490 -609 67 29 -718 287 -155 -630 427 -291 -429 209 -723 341 118 -641 587
3016 587 -158 23 403 -188 254 594 -500 565 408 -130 676 -25 277 594 -138 332 346 -315 690
3035 690 165 -63 711 32 325 569 -132 476 202 -165 292 -167 110 191 -214 267 241 -419 116 -36 -387
3056 -387 262 25 -137 85 -163 -377 -49 -592 -210 -337 -459 152 -423 -210 -36 -650 -71 16 -184 115
3076 115 -76 -339 -23 -136 -117 38 -392 -563 9 -430 188 170 -224 291 -32 281 437 -199 334 102 -112
3097 -112 211 -46 156 297 195 376 432 -467 364 55 83 615 50 262 514 -169 416 530 -303 622 190
3118 190 -128 683 17 181 294 -242 431 170 -331 173 -51 56 425 -790 140 -69 -820 38 -158 -471
3138d71O44o46J36P21j498J073M43j248J144p09K1R39j354O02P03j507J194k99
3156a12m20O03o47P73L45j338O96Q25j085Q29p19J68R03j379O77Q95j851J007
3174A70L70r26J088q14Q7J234j969P65Q45j215P87n2p13J353j702O39J318k013
3192g48R98N44j233R56o94j32J662k093K35J562j643P44J2o94J389j102n46J773
3210I90j641n4J301j751J256l12n91J955j680o58K421j836K19O38j299J644q62
3227b60q93K426j897j50J655j628R43K01j495K499j727q73K718k031J26J072j168
3244d82J342r30j115K680j565q48K243j654P08K40j523K020r58j305L051j900
3260Dl43J160j416J376m15j756K739j229j233K295j462K57O47j866K355q21j755
$$ plain form
3138 -471 173 -473 -337 384 -1114 -41 402 -846 298 -411 -390 549 -805 -203 500 -1007 187 -112
3156 -112 -532 71 -576 197 542 -796 -100 725 -360 469 -250 -82 821 -558 119 1014 -837 170
3174 170 540 -386 702 -112 -25 1209 -760 5 850 -365 422 370 -343 1010 -692 -53 1265 -748
3192 -748 250 794 -439 517 -177 -309 1353 -740 -505 1057 -586 158 170 -524 865 -237 -783 990
3210 990 -651 -705 596 -1155 101 -211 -802 1153 -527 -1185 1236 -600 -381 257 -1042 602 -260
3227 -260 -1153 1273 -624 -774 881 -747 196 397 -1098 1401 -326 -1199 1519 -512 -386 686 -482
3244 -482 860 -70 -1185 1495 -70 -918 1325 -329 379 619 -904 1116 158 -1147 1904 4
3260 4 -339 821 -595 781 366 -1390 1349 120 -1113 1182 -280 -23 624 -1242 1113 292 -1463
3277a463K689j024j184J562j069O63Q9j850K751p77j597J698o28n00J027j189
3293h02J127J25j972K018k4j783J459n70J89N94j551J712J90k223J977l11q99
3310g44J262j084N00Q43k104J800P44k231J469j94n26J053j677J131J132k471
3326a097J626O39j819J498r30J46J227k635J494J464k620J396or30J908k128Q10
3343D3J310k735J494P77j755J538o73m74J945k345O83J632k337J138j35r29J876
3360A053j830K87J520k210Q55J182j639J050n61k00J166j739M48J225j517R45
3376C5K36p65R18r26L26Q70j533L45J137r15N93mq02J081r19n7J328j300N43M27
3396F18p64N56n04l05J419j141j42R97l64n79O47l62L58j87l57O02m97k66Q49
$$ plain form
3277 -1463 1226 202 -982 580 -489 174 263 -1587 1164 387 -1210 488 -140 -640 387 -802
3293 -802 325 450 -1522 496 472 -1311 148 -422 -233 361 -1190 522 712 -1511 466 155 -744
3310 -744 518 -566 -66 777 -1327 473 1217 -1014 455 261 -265 788 -889 242 1374 -1097
3326 -1097 529 1168 -651 847 -83 63 1290 -1345 149 1613 -1007 389 383 -547 1361 -767 43
3343 43 1353 -1382 112 889 -866 672 -1 -475 1470 -875 -192 1440 -897 241 106 -823 1053
3360 1053 -777 -490 1030 -1180 -325 857 -782 268 -293 -493 673 -1066 -618 607 -910 35
3376 35 271 -494 424 -502 -176 694 -839 -494 643 -272 321 317 -485 596 -323 -380 948 -352 191 618
3396 618 -146 410 -94 -399 1020 -121 -263 734 370 -209 438 76 434 247 -110 492 -5 -271 578
3415E78n85j53L24n35Q36l71n84J287q63m70Q26m32L20L39j117J088m50p80J165
3434D23n72j60M96r28R02J5j091J350m46n06R62q25J17O23j057P33K5p49R84k45
3454E1j90O17j004M55K92p09O57k69j58N53l99p0N16m75M00J27q40R12l47k88
3474a69P36p06Q4M69o86O61n1o87R39m79K43k16k16M56L9n57N23q1m82L28j38
3495A0p2Q3k67L50K88q44K23K15m04M87l18K9K19k73R1J82j36k78L44j96K83j68
3517a52l17L49n3J11N4l19L29pm34K79L7j76L26j22O5PL7m1m4L9J80k96K50J78
3541B80m02J16L55l76K07q6J71N7m58J28K37l12N31j10k72L40l06J53J01m65O14
3562E03j06n57M11m51j80Q47o09M39no13O94k88k73O98p49K31M49q67N80J13o09
$$ plain form
3415 578 -7 -160 164 -371 465 94 -490 797 -66 -536 290 -142 178 517 -600 488 38 -742 423
3434 423 -149 -309 187 -741 161 176 -915 435 -11 -517 445 -380 -263 360 -697 36 61 -688 296 51
3454 51 -139 478 -526 -71 221 -488 169 -100 -258 295 -104 -174 342 -133 267 394 -446 466 119 -169
3474 -169 567 -139 -55 414 -272 389 338 -349 590 111 354 138 -78 378 417 -140 383 302 -180 148 10
3495 10 -62 21 -246 104 392 -452 -229 -14 -418 69 -249 -220 -1 -274 -183 -1 -137 -415 -71 -267 16 -152
3517 -152 -469 -120 -173 -62 -8 -327 2 -5 -439 -160 -123 -299 27 -95 -30 -23 14 -27 -71 -32 148 -148 102 280
3541 280 -122 -6 349 -27 180 94 265 322 -136 -8 229 -83 448 338 66 406 100 253 354 -111 503
3562 503 397 -160 251 -200 -380 467 -142 297 292 -321 373 85 -188 510 -239 -8 441 -426 154 267 -342
3583c42N11l91j40O42n73O2L97p91O34q0j38M84m66K5M03n93N3P23r53L94M2m34
3605e31Q69r40M22L32o25N41P2n48O39m57P8O74p81K67K61n01L23J51m10M75l61
3626e0Q9N53p83M24K33o01M01q7l44Q38n75l46R11q37J4N22o64Q05n67j56Q95
3647F75p75k79J153r45J84J04m21M69n32n6R68p85QL95o82Q51l11l82Q81q70l05
3668f55J382j145J45M31o10J060p56o72J512j142j91Q88o48P34k73q84J487p56
3686i3n84J347q14j89O88q58J179o14q52J426o23p0O85p11K66L1r43J683q64j026
3706i36J913p73k01N21j054Q85o8j108J482m25q45J593j078L56J29j063J175j17
3724C86j151J240l95m73O43r31P02M81j373J380m37o48Q64l51j59N29r58R29Q8
$$ plain form
3583 -342 169 -222 -362 280 -293 -231 166 -625 9 -71 -209 275 -191 -166 237 -356 -303 420 -533 -139 -97 -531
3605 -531 338 -602 -180 152 -473 68 140 -408 231 -226 -148 526 -255 12 273 -228 95 246 -164 311 -50
3626 -50 39 592 -191 233 466 -135 266 179 -165 673 98 -248 663 -174 -160 362 -302 503 -64 -220 675
3647 675 -100 -379 774 -171 13 117 -304 165 -367 -423 545 -240 -232 163 -519 332 21 -361 520 -350 -655
3668 -655 727 -418 -273 158 -452 608 -148 -820 692 -450 -641 247 -401 333 60 -824 663 -93
3686 -93 -677 670 -144 -333 355 -503 676 62 -790 636 13 -57 628 -83 183 214 -729 954 90 -936
3706 -936 977 204 3 524 -530 355 287 -821 661 236 -609 984 -94 262 391 -672 503 386
3724 386 -765 475 80 -393 250 -681 21 502 -871 509 72 -576 288 -63 -222 307 -651 278 366
3743C66j282J133p7r81J054n92L05N10j220P89N37j331Q67k3o11Q75r60Q94N77
3762H30j574O60P48j314J331q46MJ143j780R63O56j690J204J50p67J042j140L11
3780f9J103j834R48P48j404O90j68j85J060j633Q25J027j868J037L99r48O10n70
3798b32j73J256j415N69P48j352Q68l18k03P10j009J76J326j362J26O55j151J195
3816D14p57j43R18r26K50P84j002M02O1l18O90q51k29J192j083L44P69r42M21
3835fp9k87P84o80l20R75m45j08K16k11L35o6l95N14k02l35O32k11j24J22k53
3856a44M48J66p72R43l96p74Q91m78L45P7n88P43l9r19J101n25o81R74n78L06
3876A00Q2q10R12k84n15Q03m17j69N68q18R11l39n94Q52m76L8N97n88l4L74p33
$$ plain form
3743 366 -916 217 140 -841 213 -379 -74 436 -784 5 542 -789 78 55 -556 319 -641 253 830
3762 830 -744 -84 664 -650 681 -165 -161 982 -798 165 821 -869 335 485 -282 760 -380 -69
3780 -69 1034 -800 148 896 -508 182 14 -171 889 -744 81 1108 -760 277 676 -272 338 -232
3798 -232 -405 851 -564 5 753 -599 269 -49 -252 458 -551 -375 951 -411 -285 370 -781 414
3816 414 -343 -486 432 -494 -244 540 -462 -60 1 -317 373 -478 -707 485 -598 -254 515 -427 -6
3835 -6 -85 -372 412 -268 -588 387 -58 -166 50 -161 174 108 -287 227 25 -310 322 111 -13 109 -144
3856 -144 304 470 -302 641 245 -529 362 -116 229 306 -282 461 422 -497 604 79 -602 372 -206 100
3876 100 182 -628 284 0 -515 288 -129 -298 270 -548 363 24 -570 282 -194 -156 441 -147 -181 193 -540
3897e40M66M4m88O43k87k61O38m00K38K8l67K04K03m84P42l76L4p9k79M24J31
3918B34n93Q77m70o2L25l38K61R2m11K25N1k10L62m49J65K79m94K87q4j25K30
3939A52O2j77J51m3j6J71l38J63J10j79J06r9Q2k55L47n14K86k58K94J29l54o
3961a86K24l11J44j23JJ49q6K73o2k74Q3L00l53L29k83k00M78m13K68J46k26K59
3983A37J54m74J23r6j37L37l19L02J72l70K16k76K15M52m80K05J64m88L67J05
4003C09l06J79j75O9J96l15l7M46m18J99J89j36J10o60L60L44n14J03K39l23J96
4024E5o1p0K33l34L86K9j50O0j94l93M59j82Q9L85n45K23n1k10L43k57o2L5O2
4047a50k0L13n51L98k28K5L03j29K8L05n25K8J81l49N06l26q2M70l56J18M42n38
$$ plain form
3897 -540 -74 -30 -518 125 -162 -423 215 -185 53 81 -286 -82 121 -363 379 3 37 -42 -321 103 234
3918 234 -359 518 48 -14 311 -27 234 326 -85 140 191 -19 343 -106 59 338 -156 131 47 -78 152
3939 152 214 37 188 145 129 300 -38 125 235 56 162 63 145 -110 237 -277 9 -249 45 174 -180 -186
3961 -186 38 -273 -129 -252 -251 -102 -188 85 23 -251 -168 132 -221 108 -175 -375 103 -310 -42 104 -122 137
3983 137 291 -183 -60 -156 -293 44 -275 27 199 -171 45 -231 -16 436 -44 161 325 -163 204 309
4003 309 3 182 7 76 272 -43 -80 366 -52 147 336 200 310 -350 10 354 -160 -57 182 -141 55
4024 55 -6 -76 157 -177 209 238 88 148 -46 -439 20 -162 -73 312 -233 -10 -61 -271 72 -185 -247 -212 -150
4047 -150 -170 143 -408 -10 -238 -213 90 -39 -11 294 -231 -203 -22 -371 135 -191 -273 197 -159 -41 401 -137
4069a37J37K31j8J06m04M8M70m37m2M15n77N06ol40M24l67K3M40m03r2K22k39
4091d0M81k52k69M39l49j05N13n31K85k63j83O97m91j83N02m97P2N04o88M52k5
4112F9m62O91m47k83N49k48J55J27p53P17n16r8Q44o85P0M94n89N10K2o86O18
4133I9m5l54O01o31L42J17n80Q41k32n55Q71l55m23P28p67O32K9p51Q28j17n36
4154b58N41j32q7L83p54Q18m2j017J018j69l04K6J47R7J24r80R27j42p82O66M5
4175A25j77L68n35J17N17p40K91L97p71L72J8k61P87j297P16N20j138O70J28m87
4195c80O90m04j45M99j086O99M57o61M99l55j13P42q73N2P61q85N37M62p27L28
4215I7k93j62R41j054N9J039r28O07J59q07R74p02k63J256j298O51k6m69O43n02
$$ plain form
4069 -137 0 231 213 319 -85 -37 433 -4 -46 369 -208 298 292 -48 376 9 32 472 69 -23 199 -40
4091 -40 441 189 -80 359 10 -95 418 -113 172 -91 -274 423 -68 -251 251 -246 -174 330 -358 94 69
4112 69 -393 298 -149 -432 117 -131 24 151 -602 115 -401 -499 345 -340 -270 224 -365 145 167 -519 99
4133 99 54 -300 301 -330 12 129 -451 390 158 -397 474 119 -304 424 -343 289 318 -433 395 278 -258
4154 -258 283 151 64 447 -307 511 469 -548 470 301 -3 23 170 267 391 -589 338 196 -586 80 125
4175 125 -52 316 -219 -102 415 -325 -34 363 -408 -36 -18 -279 508 -789 -73 447 -691 -21 107 -380
4195 -380 310 -94 -239 260 -826 -127 330 -331 168 -187 -300 442 -431 -379 382 -503 34 496 -231 97
4215 97 -196 -358 583 -471 -412 627 -301 306 465 -342 632 -70 -333 923 -375 276 250 -219 424 -78
4235g8j5P26p39l4R62j274N73O3m90Q99m68n33J058r26M4O73o10M79l51k85Q03
4256D77q65m2P82k79j10K07m10L35l90k44O84k23l77N55o39N63o0k76N39m16l78
4277e67O87l67q3J24K17J66k42l92J033n86m87N34r1j05L91l16p4L16n31P93j88
4298B32q86R40n11J03M10n85M49q3n35P01j10k99O94o32K07Qq28J366n4r06O44
4319C25K5n21P90q71K65L87j055R65p2l84M68l89rK95n69N48K77r83N04J09l20
4340b15K45k63J92O8k67P4L13p05Q53n33L6L05n49L11M38o10K18N4l15K84k82
4361c48O35l89mK42O6k98J86m49K63K81l14K93K53l32K70K5o69M70L8k03J73j46
4383D3J96j00q6O1K11j94J9r8m7R5N7k13K96nl04K68l68M27q6l10K40k78J48L34
$$ plain form
4235 -78 -93 633 -106 -140 822 -452 121 184 -306 593 125 -408 650 -276 -232 441 -169 310 -41 -326 477
4256 477 -388 -430 352 73 -37 170 -240 95 -295 -539 145 -78 -455 100 -539 24 -36 -312 227 -189 -567
4277 -567 120 -247 -330 -206 11 177 -65 -457 576 -10 -497 37 -54 -159 232 -84 -158 158 -373 420 232
4298 232 -654 286 -225 -122 288 -297 152 69 -466 235 125 -174 520 -112 95 103 -725 641 587 -319 325
4319 325 350 -171 619 -252 13 400 -655 310 238 -146 322 -67 -76 219 -350 198 475 -508 -4 105 -215
4340 -215 30 -233 -41 27 -240 -166 147 -558 295 -238 -202 103 -446 -135 303 -307 -89 -35 -350 -66 -348
4361 -348 287 -102 -106 136 202 -96 90 -359 -96 185 -129 164 417 85 355 380 -289 181 219 16 189 43
4383 43 239 139 53 114 325 131 150 52 5 100 157 -56 240 235 -69 199 -169 258 172 -138 102 -176 -28 306
4407C06k69k6J55l79L26k53j76O81m32k24J96l0j21L5k89P39l01l79N05m62L67
4428c1J30n14N29j81l16L04L5p9J72k53K57k56m6M83j46j96L34m69L41m9k86M32
4450A95j65k1L8L8J4J55k57j04L28k79L84j85j06M97l82N1j28m3L6K59l64J52
4472A13O3m6o2l49L99Q0l02KK77j98l2O7j82L55k77M9J04j34J42j73k7L08n90
4495d13N0L38l34J26J07j78K69j79n2M34o3l86J66k2N1J00k19L24k15J09R9J10
4517B22j93k2j09L25k55j62N03k46j66M30m13L72j62l49N67j85j57L39n71L09
4537G7P5k81M34j79P6K00n06J59K01m04K13K14n91N76j08n34P55k66j53J71l37
4558b08K36K05p08N71q4m06M70k09J34J51l00K0J86l31M88k41k56M03j99L46o0
$$ plain form
4407 306 37 11 166 -213 113 -140 -316 365 -67 -291 -95 -125 -246 -211 -500 239 -62 -441 64 -398 -31
4428 -31 99 -415 114 -67 -383 -79 -44 -123 49 -204 53 -203 -249 234 88 -108 226 -243 98 49 -237 195
4450 195 30 9 47 85 99 254 -3 -107 221 -58 326 141 35 532 150 201 73 30 66 325 -39 113
4472 113 176 130 68 -281 118 198 -104 -102 175 -23 -55 12 -170 185 -92 -43 61 -73 69 -104 -131 177 -413
4495 -413 -363 -25 -359 -233 -126 -304 -35 -214 -266 168 105 -281 -115 -137 -86 14 -205 119 -96 13 112 222
4517 222 29 7 -102 223 -32 -194 309 63 -103 327 -86 286 124 -225 342 157 0 339 -232 77
4537 77 152 -129 305 126 202 402 -104 55 256 -148 65 279 -312 264 156 -378 377 111 -42 129 -208
4558 -208 28 233 -475 96 12 -394 76 -133 1 152 -148 -128 58 -273 215 -26 -282 121 -78 268 208
4579B08o68O67j94m03K97n6J68J3m11L87K74o07L72K15m11L99m49O7N24n88N60
4600C64j82m98L96Q9m31N02o00L47L65l53K16J60l39Q5m2k98M58m83L38L36n96
4621a66N0L13l28M09n15K40M35p05J65L89n85J45J34PL28o02j20N04m21L30Q3
4642I0m59P09l33rL60n65O6M04o31J69J15m87N65j12q8M50n07R0K99k15N46l82
4664G5k58L04j98j32L95m19K53P1n15R08m88n8N17o12J80K34l84L17j62n7K03
4685A74q2j05P46o25k2R6m41O58k97k53M91n31K76L25m60L60j62l71M59j47k85
4706a96M77k37j77K21j61J06O6l56N15k29j17K36j83o3O5j4J76j76n9j6J24j60
4728a58K05l23J36L70l46j44J95j29J84K2k41J49l07N53J72n49J26L04o28M33
$$ plain form
4579 208 -460 207 13 -390 -93 -149 19 32 -379 8 282 -325 47 262 -149 250 -199 -132 392 -196 364
4600 364 182 -316 80 169 -262 240 -360 -13 352 -1 215 375 36 121 79 -219 239 -244 94 430 -166
4621 -166 -116 197 -131 278 -237 3 438 -267 -102 287 -298 -153 -19 -12 316 -286 -406 98 -323 7 90
4642 90 -369 340 7 -2 358 -207 -141 263 -368 -199 -84 -571 -6 -118 -206 244 -263 -173 126 -89 457 75
4664 75 -183 121 -77 -209 186 -233 20 91 -424 484 -4 -62 455 -157 23 257 -127 190 28 -29 174
4685 174 92 -13 733 108 86 182 -259 399 102 -151 340 -191 85 410 -50 310 148 -223 236 89 -196
4706 -196 281 44 -133 88 -73 33 99 -257 258 29 -88 148 -35 -98 -33 -47 129 -47 -106 -122 2 -158
4728 -158 47 -276 -140 230 -116 -260 -65 -194 -10 12 -229 -80 -387 166 338 -211 -85 219 -409 24
4748B4Pm5L26n11o2N72m58K46m5k26M58k39j69L05m05L02K93m68K92q0k51N89
4770D55p07K45L11n17N14p4k16K03k81j93P01n43j02N28p48N37J72n14M74o54
4790d09M06L83o89N14j65l3L8j24k32M83l43J48m2p5J77l1j63L18j51j14J20j96
4812a80j7K04k01j09K38j21M55o09L45k0j02O1J05n0J52j17j21L44k42j16M15
4833C14k94K5J1J48j40N1m10O02J20p56N94l11k5J76k95K53K74m73L39j25nJ50
4855B23q4j29K85k76K54j87m14N53l05j26K06l47L77Q4l15J54J44j97J70j79K27
4876A18j83m63O28j40j22L4k15L4M92j63r6K37m35K88R8l84L73j71j8K53r1l56
4898b82K65j8J94j79k21M33j74j69J75K0j14K82l80L56j89l4j1N9J54nj02K47
$$ plain form
4748 24 31 -14 312 -199 -261 311 -147 99 54 -172 286 47 -122 183 -222 80 373 -95 197 117 -134 455
4770 455 -252 -7 304 -213 301 227 11 214 -67 -260 441 -102 -204 324 -424 113 285 -229 245 -409
4790 -409 -3 380 -309 205 40 7 45 -79 -311 172 -171 -23 -65 -140 37 6 -157 161 10 -104 16 -180
4812 -180 -197 7 -194 -303 -65 -186 269 -340 5 -15 -117 -56 49 -1 151 34 -87 257 15 -101 314
4833 314 20 45 56 204 64 115 -295 307 427 -329 265 -46 -71 105 -190 63 337 -136 203 78 73 223
4855 223 139 10 295 19 273 86 -328 225 -80 -206 0 -347 30 114 -201 -47 97 -100 70 -109 118
4876 118 -65 -528 100 -40 -162 -128 -343 -309 183 20 -76 161 -274 14 112 -272 101 -70 -88 165 74 -282
4898 -282 -17 -35 159 -20 -241 192 18 -151 24 44 -70 212 -168 188 -1 -35 -46 13 167 162 60 307
4920C07k34m1K78q7Jj5k53KJ61j37J54j42j19K12J3k30M77k29q4L0n0n9j5q8J38
4945a0q2J00j88j3J54k52J77K59j34J12j45l06K01J45m22K41L05k53J05j94J48
4966e2j46J18j28K53j10K19j89l6J95o7Q8j40J74j89J78j79J5P1j34oO0K23j07
4989A11j15R5qo3J75j12j23K90j36J02j98J24l64L24k08J82j46j46K37k09K89
5010A01L3j43Q1j38j39L76m05K69J42j09n9k2j7J55k62k26L90k67K03J70k59j63
5032b89P5J11K42k89j40M58n03J44J11k10M52J39o51N19k34J43O7l91K07l3j4
5053h6K89l20K11k4k29L02J97k81j11K08j74K39j12l45L88j85j42K53p9K6p5j91
5075b41L71L4l20O11n70K17K46l13N1k19K3K86j05j70J18j25J27p2p1K18l55J83
$$ plain form
4920 307 73 32 310 223 224 209 -44 -42 119 -18 136 -6 -125 87 100 -130 347 118 34 64 14 -45 -60 -148 -10
4945 -10 -92 8 -180 -193 -39 -291 -114 145 11 123 -22 -328 -127 18 -404 -163 142 -111 -6 -200 -52
4966 -52 -198 -80 -208 45 -65 154 -35 -71 124 57 145 5 179 -10 168 -11 4 75 -59 -65 -5 218 111
4989 111 -4 91 83 20 195 83 -40 250 114 216 18 142 -222 102 -106 76 -70 -216 21 -188 101
5010 101 134 -9 72 -66 -205 171 -234 35 177 68 9 -13 -30 125 -137 -363 27 -240 -37 133 -126 -289
5032 -289 -214 -103 139 -150 -290 168 -335 -191 -80 -290 162 301 -350 169 -65 78 145 -246 -39 -72 -86
5053 -86 203 -117 94 70 -159 143 340 59 -52 156 -18 221 109 -236 152 -33 -175 78 -1 25 -50 -241
5075 -241 130 164 -156 455 -115 102 348 35 86 -133 -110 176 71 -99 19 -106 21 -51 -122 96 -259 -76
5097g6J37q9M4o3k04L18p2k98K88o5J12N0k51K71l35jJ63L24m86N63n31K72l5
5120C6q8J42j38P7m2J5j11L28k42K74k50l6J35J91o41L83o9N5n9l1M07k78p2J52
5144A38j40j32L0J09J49L4j87Q5J30j83J62r6L2J95k85j05K34j72O9N7j75J78
5166A27m29J97L1Nj36L64m59K89K45n10J40Q5N7J27m68L40pk77J53N0K09M6k91
5189a12R3J36m33K18K45j12j30n3M5M86n77J94K56j28j50ok52K88J6Q7p1p3J14
5212H1n6k63M33l20N9K97n42M57j6j64K36j44j35K00l14r3O57l84j11K82j09M2
5234I3q7J24j8r4J4k3k27K89k69K42J43pq1k6k15M8J32Jp4K6j14J24O1n4k5K6
5260Im3J25j03j31J74j87J92j14q2o6o5k3L42j08M0J04j66K23K9k30K59j75M8
$$ plain form
5097 -76 61 -28 16 -47 -251 67 -5 -303 -15 -80 32 82 -169 102 -233 -234 -71 253 -233 330 -201 71 36
5120 36 -52 90 -48 29 -13 2 -109 219 -23 251 1 -35 100 291 -350 33 -36 19 -40 -71 336 58 -14 138
5144 138 -2 -134 -104 5 154 188 1 86 216 33 195 99 131 326 41 -64 170 -2 67 124 -51 127
5166 127 -302 -105 -74 -69 -205 159 -300 -11 234 -276 -136 -51 6 133 -335 5 -2 -279 -126 -76 133 179 -112
5189 -112 -19 117 -316 -98 147 35 -95 -148 -103 383 -194 0 256 128 -22 -28 -280 8 24 111 40 -33 81
5212 81 25 -238 195 -125 -66 231 -311 146 130 -34 202 58 -77 123 -191 -284 373 -11 -122 160 51 93
5234 93 6 130 112 18 32 9 -218 71 -198 44 187 180 99 73 -142 -94 38 39 -35 -9 -123 1 62 8 -17 9
5260 9 -34 91 -12 -143 31 -156 36 -78 -160 -226 -291 -314 28 -80 -40 64 -102 121 150 -80 179 4 52
5283E2l0n8J98r7m8J52M2m35M74k92j1N77l02r0oj82O2k9J06N5P0l80K44m86K50
5308a64N7J31P4l4O5J58m40J84j63K9K93j91R8j72J45j57J98k45J86k34N5J46
5330A9l15L07J04j75K65j44m66L75j3J32j25k75L63k18K17J13j48k4j02J08k0
5351b2K10j94N8n3O2J7j88j6L03J96m71p5O6J54q0L79j81r9K1k3O3j32K35k31
5375aK4j20k3l5K29J50k97K21k3j19l7M22l10j12j24K95n4j91K56k88L44k22m
5398a9J62j50m2K08l09K13j25PP8j20J9N8k10K2P3n6K31M0k63J6J9R0M5J5K13
5423B15l29R3L35k81p6P1K8j4M8q3J98k70R4O0k9j4oJ05M1r2r2J31p3J17m3j80
5449d6L53k43Qn8P2O0oL6j41J39j78J27Q4k74Q6l97L81K32m47J12N9M3J6q0M2
$$ plain form
5283 52 22 -36 162 65 17 169 211 -224 250 -42 -53 524 222 132 126 -56 6 -23 83 138 208 -172 72 -414 -164
5308 -164 -107 24 98 64 129 287 -153 31 -132 -103 190 -1 97 -75 70 -87 111 -134 52 -182 -127 19
5330 19 -296 11 115 -60 205 61 -405 -30 -43 89 -36 -311 52 -166 51 164 16 -8 -110 -2 -22
5351 -22 188 -6 52 -1 61 78 -110 -126 177 373 -98 -173 -107 47 -33 346 165 66 87 64 127 -5 230 -1
5375 -1 23 -97 -120 -155 74 224 -73 148 125 6 -31 391 81 -31 -155 140 86 -105 151 -137 207 -15 -19
5398 -19 143 -7 -49 159 -150 63 -62 -55 23 -97 -78 -20 -230 -208 -135 -191 40 80 -183 -167 -148 -58 -13 2 215
5423 215 -114 -21 314 33 -43 28 56 42 90 7 205 -65 29 89 60 46 40 145 186 94 2 133 60 177 134 -46
5449 -46 307 64 72 14 86 146 140 176 35 174 -4 123 207 -67 19 -378 3 235 -212 -100 -41 2 18 -62 -20
5474b0J61l54R2J33k02K33l28J72ko6N1J63k33J46J15k20K7R3mJ89j66k32J88
5497f4l2j71J98r7n0L77k35K53N6n40K60J87k29J23k84L89j06O6j98N3J13nj38
5520g4K57K43n44K25O0j3jL8L2l39j31N24l09p2Q1J22l2R2j20M6p9j08K55j64
5544a1p9L27k0l83K77k38K02j87k2N8rJ6J57l49L24L7m52N12j89j02P2K83k55
5567c1L75o08J88J13k06N2O8j36J97p0J53J0l11J38M6j17J15J0M7j43j07L92P4
5590B49k68q6l0L87M7l45O3R1k45J71L14r1m45K81p5J99k47K57J67j25m21J30
5612b2J20j25R1J6Q9p0j97J80l53L89n8j05j91J28n1J04r3O9j8J4k21N10m81K11
5636f4O4k3J16j98R4J01k43J58J23l49J65J32k12L08k7q0Q7k69L14j77m4K16l77
$$ plain form
5474 -20 141 -213 -121 12 -190 43 -285 -113 -115 -181 -130 33 -200 -54 61 -159 -132 -39 -43 146 -20 -252 -64
5497 -64 -96 -267 -69 -166 -216 161 -74 179 235 -305 -45 142 -87 36 -248 141 35 101 -97 -44 69 64 -74
5520 -74 183 426 -118 107 167 154 153 191 223 -116 -247 277 -32 -104 -23 99 67 159 39 85 6 -102 153 -11
5544 -11 -90 237 217 -166 111 -127 75 -112 -134 -76 -85 -69 88 -261 63 100 -352 160 -29 -131 -59 224 -31
5567 -31 344 -264 -76 37 -169 -117 -49 -185 12 -58 95 105 -206 -68 -22 -139 -24 -14 33 -110 -217 175 249
5590 249 -19 -105 -135 252 299 -46 17 108 -137 34 348 257 -188 93 18 217 -30 227 394 269 -152 -22
5612 -22 98 -27 64 80 169 99 -98 82 -271 118 60 -45 -236 -108 -159 -55 -148 -79 -97 -83 -304 206 -275 -64
5636 -64 0 -23 93 -105 -11 90 -153 5 128 -221 -56 76 -136 172 145 65 152 -117 197 20 -24 192 -185
5659a85J99K06l95L20j21j77J58j81J09K50j98N7P3kk11P1K0K29k45n9J50j27
5681e9J52J31l75R7l6J04l6q1P9J27j82K98m58K71Q3j96Q8j28p2j6K81l14L09
5704F7l3j64J45k55O1j49L46rm4J4q4J45K05j65L8k9j02J8k64K62J05j55L15j33
5728A35o5P6k19K51l5l50J45j18L11k37J94k99L55k64J33m57J81N00l60M42k35
5749H4j33ql7p3M47m10L50Pk43J33j24K01n8l18K97l2j76j6L31l39j7l5K38mm3
5774B2p7n9m7L0Q4l3J37R8m25J10J50Q9j91k7M4J29j34l7l1M0K04k7j6j00O3J33
5800A29j21k22N8J14N0J29j82R7n8J21J2j85R0J60k63J85n4J1Kk87K54J45o5j09
5824A1n1K30k57J86j05l4L80m33R8k8J41n6O3k04J63k21J70J8m0Ql46K61M0n9
$$ plain form
5659 -185 14 220 -175 145 24 -153 5 -176 -67 183 -15 42 115 113 -98 -27 -7 222 -23 -82 68 -59
5681 -59 93 224 -151 -54 -90 14 -22 -103 -24 103 -79 219 -239 32 115 -81 7 -121 -193 -209 72 -242 67
5704 67 34 -130 15 -240 -179 -328 18 9 -35 -21 -105 40 245 80 118 89 -13 5 -259 3 108 -47 268 135
5728 135 70 146 -73 178 143 -207 -62 -180 131 -106 88 -211 144 -120 13 -444 -263 237 -123 319 84
5749 84 -49 -57 -94 -167 280 -130 220 227 -16 117 -7 194 136 -182 115 83 -93 -109 222 -117 -134 -169 69 65 22
5774 22 -55 -114 -161 -131 -47 -80 57 155 -270 -160 -10 79 -112 -139 -95 34 -100 -137 -168 -128 76 49 33 -67 -4 129
5800 129 8 -214 -156 -42 8 137 -45 52 -6 115 127 -58 32 192 -71 114 60 71 73 -214 40 185 120 11
5824 11 -40 190 -67 119 14 -20 360 -73 25 -3 138 82 145 -59 104 -117 53 71 31 39 -307 -46 -6 -65
5848f5J46N6l69L38l29M04J04n40K88O7l53M42m90K13J58q2rj02jJ6J19l8N7j47
5872a17O5J48L1o2P9j75K42l72j30J38M02k96n4rJ72R4M7l61L28j44n6K09k76
5895i7P8j7K37L9k06N7p2j45L21k72J29j31J1J3J6j4J82j80K3J2J54k15K48l69
5919a98K87k24J19Q3j00J83j34o0R1j57n3K47o4j6j29m3J53l0n8j9P3j43K18O5
5943I1k57K20n9l18L34J38j6j21j13R5J37k61K27k85L0M32m11L92r8j02j33J40
5965F2k23L82j98J15j08kN3k88L82n1m36K28J48m6K6Mk19M27k98J62qj01j9J60
5989A52M7p2N4k01j24K09p4Rk54K40J59k92P9J15l5n0J32j20J49j69P0K52m68
6012a92J17Kl5J64j14O1m4p8K7N4q8J97j20j31J43j85J63k02Q6L38j23k50J21
$$ plain form
5848 -65 81 137 -232 106 -223 181 285 -255 33 100 -253 189 -301 -88 70 -12 -21 -123 -124 -108 11 -27 30 -117
5872 -117 -52 96 127 65 144 -31 211 -161 -291 -153 249 -47 -101 -110 62 156 203 -158 170 26 -30 179 -97
5895 -97 -19 -36 201 240 34 91 19 -126 195 -77 52 -79 -68 -55 -39 -53 129 -51 -28 -16 138 -77 171 -198
5919 -198 89 -135 -16 67 -33 150 16 -44 47 -110 -163 84 20 4 -125 -168 -15 -45 -103 -122 -49 -192 26 91
5943 91 -166 54 -5 -323 11 149 133 12 -101 -6 131 -130 97 -188 -158 274 -137 255 157 55 -78 62
5965 62 -161 221 23 138 30 28 81 -207 175 124 -312 -84 64 18 44 48 -171 256 -42 120 112 11 -8 152
5989 152 199 127 181 -20 -144 65 -9 0 -254 -14 145 -147 -68 47 12 -38 94 -26 123 -46 24 276 -192
6012 -192 -75 -73 -108 56 -58 3 -41 -119 -92 -38 -126 71 -49 -180 -37 -222 -59 -261 -175 163 40 -210 -89
6035h9J66j50P6N2j45J07k84K32J02J37J5k19k04J76P3N1q6K53j19j88l8L08k37
6058a1j08K28k4n5O9l98N69l13k60M63j61jJ08j85J51J09k56K82j73o4q1n3L88
6081B24l53%J74j35p4Q1J20k33J71k69K78l8k59N94k49m45O31k26l10L99l29L44
6103I6l6l44L20p9J0J06j58l7L4NK56Kn2p0n1%J10l18L41j07j4J08J34k36N01
6128E21l66J07j73k73R2J15J2K6l6j17J43k1p5K41k63j40K33l3J1J06j2j66J83
6151A15q6k16P5m8L31m51J40K05LO7j33J47k63J57j28k69K01J25R6l44L06q4j63
6174b17K22K4J4j8J10j30k43k3J62O6J94j05r8K09k99K39l8k41M68m32o9K03p7
6197g9M7K18j53n0J38R4k44L5Q1k50J19N6J09J08j40kj84J00j65J55L8k88O07
$$ plain form
6035 -89 77 -73 3 55 -90 17 -267 -35 67 204 219 0 -204 -28 45 96 10 263 144 -44 -82 226 -11
6058 -11 -119 109 85 30 99 -299 270 -43 -303 160 -1 -2 106 -79 72 181 -75 207 34 -30 -111 -164 224
6081 224 -129 -129 45 -90 -164 -83 37 -196 -25 -294 -16 -54 -313 281 32 -413 218 -8 -318 81 -248 96
6103 96 60 -284 36 -43 -33 73 -85 -122 -88 -83 173 175 123 53 2 2 112 -206 135 28 14 122 256 20 521
6128 521 155 262 89 -184 -92 23 35 61 25 -92 51 30 -45 196 -67 -207 26 -7 4 110 98 -68 115
6151 115 29 -187 -112 -160 171 -280 -140 65 68 135 2 149 -114 43 -85 -354 -153 -28 68 -276 30 -54 -217
6174 -217 5 29 43 25 135 5 -238 -261 -99 -33 161 56 -42 167 -132 107 69 -172 296 -136 -205 -2 -79
6197 -79 -32 186 33 -17 121 215 -29 6 87 -163 -44 12 121 229 89 87 -97 3 -162 -7 31 -257 350
6220C50k87k55M02j04k09j6P9J53o3J28l88L87j27K7n7J32j65M0j91l6j5L00k71
6243a86qJ72k8M2r1Ol7K02l35K25k52J33J89j4k82L68k28J59Q4j18J74l4j8k20
6267i7J32k00J69j09k0K43j23j69L60j14m1J30k42J55j98J19J10q5J1N8k87L25
6289A27J5l36L32j93k4m2Q0j76L52k28k8j23K32L7l9%N8l5k40K14P7O3j96j4j31
6314b18K29j69J23P3J43m47Q5L79j79J43J34n9l78J03KK33m56L03M1j14Q3P1l15
6337a90Q2L24k05m2j1k00K28J35n0nk13J54l8k65L06K56m65K57r4O0J0l8J10J11
6361B17k7L8J03m28K44k10K50m56L04r8N9j56K32j56J31M9k90M22m0k32J17m6
6383B7k38K17j03l2J87j85J60j90Q0r0k2K23N0k43o4K99l60M60j86j91J41j04
$$ plain form
6220 350 63 -192 210 106 -103 -119 -40 113 50 178 -210 177 50 77 20 152 -13 27 -164 -200 -215 85 -186
6243 -186 -194 -22 -50 -8 -99 -93 -130 72 -263 -38 -290 -157 32 18 -264 104 -124 35 119 1 175 141 123 -97
6267 -97 35 -165 4 -105 -125 118 -5 -174 186 72 31 161 -81 74 -124 -5 105 20 31 89 -198 127
6289 127 142 -194 138 -55 -79 -121 -41 -217 135 -93 -121 -244 -12 25 -14 -14 44 9 -231 -17 60 123 -73 -87 -218
6314 -218 11 -158 -35 38 181 -266 -181 198 19 162 296 237 -141 -38 -36 197 -259 44 85 -29 54 125 -190
6337 -190 -108 216 11 -31 -42 -242 -14 121 71 66 -147 7 -31 -296 10 266 -199 58 -36 24 34 -4 106 217
6361 217 190 228 331 -97 147 -63 187 -269 35 -63 -4 -160 72 -84 47 96 -194 228 188 -44 73 27
6383 27 -211 6 -97 -129 58 -127 33 -157 -77 -167 -189 34 84 -159 -223 76 -284 176 -10 -201 -60 -164
6405a64K16k42K01j36J48l81L30l6j41J00k0N7L96j39j70Q1k84k88O72k13Q1p6
6427hP6k5r4j25M91l52J07l8N9K92l05j58K09n2M2L5j53k00N85m61L01l75K01
6450E2M8m0p8J73k7k95K39l1j61Q1k11O5J87J5j26r8J39k39M37k73M2J00k1MP1
6475E3l33K10j36q6P7J16o8K31j21kJ83j65K16k57K97k89k94K84k6J98O5L9q2
6498A10n2J36O9k83J9R5nl2mj03J11j9R9j61J2K12O3k58M8o0P1j4j0K99o08J55
6524a10J89n8o1N6Q6Ol19J02L83j44R2l54QJ59k14np5K03K1m9qO8J65k77rJ82
6550C7j43j54J23L4J41j16k9K71l23J17j53J39k6J38lN3l31J31J3R5J3k5J45j89
6574d2M01k57j36q6J13K69p9k5j23j3L4K63l75K56j61K53k00k11p5Q9R3J81j74
$$ plain form
6405 -164 52 -190 11 -125 23 -358 -28 -64 -205 -105 -125 -68 328 189 19 100 -184 -472 200 -13 68 -8
6427 -8 68 43 -51 -176 315 -37 70 32 91 383 78 -80 129 77 119 154 1 -199 386 -75 226 -149 52
6450 52 100 60 -18 155 128 -167 72 41 -120 -39 -250 -185 2 17 -109 -207 -68 -307 130 -143 -101 -1 -22 -18 53
6475 53 -280 -70 -206 -292 -215 -99 -167 64 -57 -59 124 -41 175 -82 215 -74 -368 -84 -110 88 153 192 110
6498 110 58 194 263 -20 -1 94 89 57 53 -50 61 42 141 -20 -8 204 267 9 57 -3 68 54 44 343 -265 -110
6524 -110 79 21 -40 16 102 108 -211 -109 274 130 222 -132 -124 35 -179 -184 -259 -56 -35 -84 -92 -24 141 -136 -145 37
6550 37 -106 -260 -137 -103 38 -78 -107 164 -159 -42 -195 -56 -82 56 53 106 -225 -94 -81 14 27 2 147 -42
6574 -42 359 102 -34 -120 -7 262 183 158 35 22 56 319 -56 200 39 292 92 -119 -194 -105 -12 169 -5
6597eK00j88J16p8J41l67O4J71j37J79j57K14j77l20K2K37Q9N4qj75J51k58P4
6620a58J47j75J74r1K64j97R6m2k10J38L43k55k25K19j09K94k87l5k0K27J75k21
6642E2j01N2n5j91L30Kp9qJ40l8k70L26J16k85j37K15K65k45K32j96J30l29l45
6665d19L86L0J45M2r2j86P2o5o8J05n6L03K6j43n8p7K12n03L97N9J19k95K1K1
6689b4J2R8l33K84j03m4M1J11l0J7n4J3J11P3k23Q4k6k69M33m03M26k45J76j21
6713DJ54j40J25l09K0J93K6k61M57l10qJ64j98L52k63J67q9N9j44pJ20j03nkJ24
6738A26l8j52K80l27J23j14O2J02j36K44j42o0n0K75l16K25k68M36k96M0J45j16
6760D3Jj28M3l4j62K72o6J17q1j60J31o9J24K8j63L08o28L90K8Pm8M0O5k08J85
$$ plain form
6597 -5 195 7 123 45 186 -181 -117 54 -83 96 -61 153 -24 -344 -322 -85 4 58 50 -125 26 -232 -158
6620 -158 -11 -186 -12 -103 161 -36 60 18 -192 -54 289 34 -191 28 -81 213 -74 -109 -129 98 273 52
6642 52 -49 3 -52 -243 87 89 10 2 142 104 -166 160 276 -9 -146 69 334 89 321 125 255 -74 -419
6665 -419 -33 -3 142 184 92 -94 -22 -87 -155 -50 -106 197 223 80 22 -55 157 -346 51 110 229 -66 -45 -24
6689 -24 -12 86 -247 37 -66 -110 -69 42 12 29 -25 -12 99 172 -51 33 7 -262 171 -232 194 -51 125 4
6713 4 158 18 143 -166 -146 47 73 -188 269 -41 -49 115 -83 269 6 173 84 143 -1 -8 112 9 4 2 126
6738 126 88 -64 216 -111 12 -102 -40 62 -74 170 28 -32 -82 193 -123 102 -166 270 -26 14 159 43
6760 43 44 -84 -41 -75 -237 35 -31 86 5 -155 -24 -93 31 59 -104 204 -424 -34 -6 1 -47 -7 58 -150 35
6785C5mJ23l98J73J81j1l00R7J00j96K28O2j07J14k84K15q4JQ2l2J2K04j47N5
6809A19j21L0N3j72N01l31j62L9L4J64k83k4M21m36j16L63j50K15j89J18L0k82
6831a79K76P5k96J05K9j2J48n0j50m1J14j15K83k00j29J47j00j31Q6J85pj04q4
6854a50o1M15M7k50R7k78J39k2J21j7j5J59l92P6Q7Q2q3o5j08K26R1O5l46p4j44
6879d00J68K02J15l54M87j78k5j31J70J58k52J51j18R5m3k5o3L0M8J98r1o6K10
6902B86k33N5j47R1Lj56J30r6K81l28J87j32k65Q7L79j05o3J20l04J14R5j17M4
6925g4L4K53q8k36K24k91K44n9k08K35j33M4M0J58l14J70L6j9j37K04j22k48J84
6948a03j06L07Q9j45J51l52K11j25J03l8M3p8J50n9Kk11L69k16K38j81m8k21K31
$$ plain form
6785 35 31 154 -244 -71 110 99 -201 -104 -4 -200 28 90 -17 97 -187 28 -56 -55 27 -5 7 211 64 119
6809 119 -2 28 81 -91 410 79 -83 -44 -10 154 -129 -153 268 -168 -284 79 -71 144 -45 73 103 -179
6831 -179 97 172 -124 -19 10 -2 146 96 -54 -95 19 -96 187 -13 -142 5 -95 -226 -140 45 38 -66 -150
6854 -150 -211 204 251 1 98 -180 -41 -63 58 41 26 185 -207 -131 -44 38 -45 -110 -218 8 99 164 -182 -256 -400
6879 -400 -232 -30 85 -269 218 40 15 -116 54 212 -40 111 -7 88 45 20 -43 -13 35 233 142 76 286
6902 286 53 108 -39 52 55 -101 29 -67 214 -114 73 -59 -324 -237 142 37 -26 94 -210 -96 -1 -118 -74
6925 -74 -40 213 125 -111 113 -178 66 7 -201 34 -99 -55 -15 143 -171 -1 35 16 -121 83 -39 -287 -103
6948 -103 -209 98 187 42 193 -159 52 -73 30 -8 35 -43 107 48 50 -161 208 -8 230 49 1 -220 11
6971A1M7k16J39O8j98O9J09j1O7l5o7J6j62K19k45l0J37J54m69K40L15l03L18
6994A73j65Nn0J34r0J10k65J92q6K41k25q5J78k29J2K27j58J27J00j55j93J43
7016e9J25k45L37j10k0l7l2kJ22K8j82J70p2o2J28K2j68J08r4n4P0N0l3J03Q6
7041A79j54o1M0K2J13l3j24J08Q0l21J06n7R3nj49J25Q2r6r0J56J6p1J9l9J79
7066A18r3j84K04Pl3m0k9N6j05p2L01k39K1M9qr0M3j08K5Q7j2J71k43J58J63j19
7092B8J28m28L79j28J21O7l57L49j27j28J69M8j22J57m40N08k74L28k34o8o3O5
7114b2k8j9J57l17K66n4J65Lk10J94j11j11K95j01j28K60j39q6k63J51j19K13
7136dP5n3R8k52J87j4m1j00L38m42K81p2J21o91L53J35q6J75n8j69J74J46k26
$$ plain form
6971 11 58 -158 -19 49 -149 -80 29 18 85 50 -17 -1 -163 56 -189 -219 -82 72 -397 -157 158 -145 173
6994 173 8 13 -37 97 7 117 -148 44 -42 199 -26 -111 67 -162 -150 77 -81 46 146 -9 -202 -59
7016 -59 66 -179 158 48 28 -9 -41 -43 79 107 -75 95 23 -39 89 111 -57 51 -43 -97 -27 23 -10 93 179
7041 179 25 -36 4 26 139 106 -18 90 170 -151 -45 -102 -9 -14 -163 -38 44 -52 -142 14 30 -41 -22 -61 118
7066 118 25 -159 45 52 19 -21 -50 6 -99 -171 130 -109 -88 -39 -47 -137 -94 -202 -177 -90 -102 69 -174 -16 147 28
7092 28 156 -272 107 -21 100 167 -190 159 32 -96 73 121 -1 156 -284 224 -50 278 44 -24 -87 -22
7114 -22 -50 -69 88 -229 37 -17 148 151 -59 135 24 -87 208 107 -21 239 100 14 -249 -98 -217 -4
7136 -4 71 18 116 -136 51 37 -4 -104 234 -208 73 1 122 -569 -216 -81 -167 8 -50 -219 -45 101 -125
7159a25O2Q2Qj40K56k88L03m0j2q1J90k83J96j00k31L32l14j4J68M6j29J29R0
7182A05K38k83l9J9o0Q9q2j4K18l91K21M4J04j1k06j85L34J50j50q6J57k52K80
7205B00l47K86j82k5M26j88k64nL2n7k3k9P5Oj8K81k68J81j61k1J25k58K34l0
7229c0M0l2M1k35J20P0q8QJ63j61J79j53n8J19K4q4K79j73J2j7J1P0j87Kj00K35
7255E5O0N2j12k7K37j57n3k23J23P9R2j29J13O0Q5k1l42R6R7M2p7k5k02K05j06
7280g8K12k99j05K52J7mO1M3j06j74K09J90l98K52k67K46j20K10k7l16J70j04
7302a36K66l06n6J43K8O4l0j05J03o1J32l9J45M8k02J44p0k91N24n13K87J40j79
7325C6j6J94k31K24j35P3k67J58j03L4R9k9O5Ko3j26L49l72J46K8J58k16R8l15
$$ plain form
7159 -125 -63 19 27 -113 143 -145 158 118 106 25 215 -68 128 28 -203 129 -185 -199 -31 15 -114 15 105
7182 105 343 60 21 40 -20 69 -13 -27 191 -200 21 65 169 158 -48 -233 101 251 101 15 172 -80 200
7205 200 -147 139 -43 -68 358 170 -94 -99 -67 -124 -147 -176 -101 -95 -113 168 -100 81 -80 -101 24 -234 0 -30
7229 -30 10 -22 19 -216 -96 -26 -114 -106 57 -104 75 -78 -136 -17 7 -77 202 29 41 24 35 105 -82 -80 -180 55
7255 55 115 167 55 28 265 108 55 -168 -45 34 126 -3 110 170 255 234 -108 -12 85 127 50 25 -177 28 -78
7280 -78 134 -165 -270 -18 -1 -5 56 99 -7 -181 28 218 -180 72 -195 51 -69 141 114 -202 -32 -136
7302 -136 130 -176 -232 -89 -61 3 -27 -132 -29 -90 42 3 148 196 -6 138 68 -223 301 -212 75 215 36
7325 36 20 214 -17 207 72 145 -122 36 -67 -33 66 37 102 104 41 -85 264 -108 38 66 224 8 106 -209
7349b09L88k18L77n7m00P4K88l02k09L27O7l07J74j3r1P5O9q7Q7m9j2J14L9l04
7373a79R6J81j1k04m7P7p4J15qJqK52j86r2R7Pk53J45K29k33J10L4J03j24m3N5
7399D0J27l1k97L55l72L31j50j14J15m5J88l3j26j3j54L41j75J29k53K23P0k82
7421a26N8k9J40J46j68O9j73M7j81O3J3j2L31j57P4m16M48j61P9n1p4l9J66J27
7445A74l99K26J05j3K24m46Pj6j3j2K70l32L13n8j6r4O7N6N8j43r9R6K05j37o6
7470d3M5p0O7M5r8Q2K5j12J15k19J38k40K76k64J61J08M3M1L8m3L7k04J5m7K90
7495A86N5j68K4m8N5M3k00J47o2P7K5k14j27P4K4K39j40N3m7k05K38p9n6K01k14
7520a19n7K16k18J54Q5j70K0j49K46j75o7J77J61r0m6N4n4m9k11M83l8k62J87
$$ plain form
7349 -209 179 -39 338 281 -119 -45 243 -59 -268 59 126 -181 -7 -20 -111 -36 33 -54 33 -16 -28 86 125 -179
7373 -179 -83 98 87 -117 -164 -87 -161 -46 -54 -53 -61 191 5 -87 10 17 -236 -91 138 -95 15 49 152 28 -15 40
7399 40 167 136 -161 194 -178 153 3 -111 4 -41 147 114 -12 -25 -179 162 -13 116 -137 86 156 -126
7421 -126 -68 -97 43 189 21 90 -83 -36 -217 -154 -141 -153 178 21 95 -321 127 -34 45 -6 -80 -119 47 174
7445 174 -225 1 106 93 317 -129 -122 -138 -151 -163 107 -225 88 30 14 -80 -13 43 101 -42 -141 -45 160 23 -43
7470 -43 2 -68 -1 44 -54 28 53 -59 56 -163 -25 -265 11 -253 -92 16 59 100 138 95 132 -72 -57 -104 186
7495 186 241 73 97 49 104 147 -53 94 32 109 134 -80 -207 -133 -109 130 -10 43 -4 -209 29 -50 -106 95 -119
7520 -119 -176 40 -178 -24 61 -109 -89 -238 8 -167 -234 -57 104 14 -32 22 -32 -81 -292 191 153 -109 78
7543G8j44P5P3R9k49J97l02J60J64l06K90on0k42m4K00J37k08l6J66j28Rjk0o
7568i4L89k84j63J60O7j4J53k03j9L2o5o7O8nPj33J52L4m0k7K43l32l9L93j00
7593A13j09l2J30l18J48k6J14p3l56L51K31k37L6J85j92qJ95j57P6k01p1K79k20
7616a42N4R2J6q5M0J71j44J58l24N1P8R0j78j38K33J41o7p8r4K13K7j99J09k1
7640Cop5Q9L8j10o4J76J69k88L16j49p4P0j74Q7R5p4p7L3K2J42j76P5k1k89N32
7666B70m09J8j3JL85j08k93J19Q9j22M1J17j75o2J18Qk50M2M0K18j81Q1J23l31
7690b74R2K57m4j62l5J07J28L4k67J43M6j11J72O7r2j30J72L0l4N4k65O2N3k21
7714b18J76J81J7k45J33j33J51L9r6p6J6K1O0j02L0Jk0j85K89J62j19j92n8J75
$$ plain form
7543 78 -66 9 82 181 -68 129 -173 -13 151 -155 135 129 79 -163 -207 -7 130 -78 -114 52 -76 -67 -68 -88 -94
7568 -94 295 11 -152 8 75 61 214 11 -8 24 -41 -108 -40 -45 -38 -171 -19 15 -25 -52 191 -141 -180 213 113
7593 113 4 -28 102 -216 -68 -94 20 -53 -409 -58 173 -64 -28 157 -35 -43 152 -5 71 -130 -201 78 -142
7616 -142 -88 4 20 -65 -25 146 2 160 -164 -113 -35 55 -123 -261 -28 113 46 -32 -126 87 114 -85 24 3
7640 3 -3 -78 11 49 -61 -125 51 220 -68 248 99 25 95 -79 8 103 29 -48 -15 7 149 -27 48 27 -262 270
7666 270 -139 -121 -134 -133 252 144 -149 -30 59 -63 -22 95 -80 -142 -24 -16 -266 -224 -184 34 -147 -66 57 -274
7690 -274 -182 75 31 -131 -166 -59 69 103 -164 -21 25 -86 86 153 61 -69 103 133 99 153 -112 -50 3 -218
7714 -218 -42 139 156 -89 44 -89 62 101 5 -71 -55 -34 26 -76 -46 -45 -65 -250 39 201 82 -110 -168 7
7738Gk17J15l4n2m6M0J95P8k99J23jJ3P6l0l14L02p9K57L4k60j17J8O4N8LOp5
7765a35Kj2J85K5j14j87OjN5M37k18K4j13R2j6K26k14P7j40J58k14R6J67l77J13
7790g8J72j58K12k70L52j66k46P9r0K01O4L6j22J2J59k1l01J69J23J58l39J17
7812F3j50l0L33l72k6Q7k10K72j50K32j99j67L13M4j88K18m01J96J10M2j06m6
7834a35J82Jk40N7K50r8o3o7R3O9j05LM1j57J87Q7l18K13J9o9O0j30J25K15r4
7859A26j13N4r7R8J07n6Lp9q6p7K02k6k3J08J28k99J66P8l10J91M8k22O2k9L14
7884B68j4j82j65L8m9J24q2K11j24J40k5l61K33J45k05K34K1k19j50P1P5J7K15
7907B16j57Q4j34J4k50P9R6Q8l0P2L8j28j74K88J1J3J13m31K70k32K12k25K93
$$ plain form
7738 7 -210 -95 -129 -181 -227 -187 8 86 -213 -90 -91 -78 -2 -32 -346 -44 -123 134 168 -92 -209 -191 -127 -69 -66 -60 -135
7765 -135 -133 -145 40 65 -49 -236 -230 -231 -176 261 43 67 -46 46 30 256 42 119 -21 137 -77 19 186 -191 -78
7790 -78 94 -64 148 -122 230 64 -182 -103 -193 8 72 108 -14 -2 157 136 -165 4 127 285 -54 63
7812 63 -87 -117 216 -156 -182 -95 -305 -33 -183 49 -150 -317 -4 40 -148 70 -331 -135 -25 17 -89 -135
7834 -135 47 48 -192 -135 115 17 -46 -113 -20 49 -56 -53 -12 -169 18 105 -213 0 19 -50 10 -120 5 220 126
7859 126 13 67 -30 68 175 119 122 43 -43 -120 82 56 33 141 269 -30 136 214 -96 95 143 -79 -17 -46 268
7884 268 254 72 -93 -55 -104 20 -62 149 25 165 140 -221 12 157 -48 186 207 -12 -162 -91 -16 1 216
7907 216 59 143 9 23 -227 -148 -52 36 6 78 116 -12 -186 102 113 126 239 -192 78 -154 58 -167 126
7930A26j4j96J9J93J51j02K0n64L82m3j25J76J06j39n9K17k04J79o2J57j63qk82
7953b35N8L2n9J28J17J90j89l7J38%J26l16OJ90k22k0Q3k28K48j99O0N1k6J53
7977D9m3l25K16k9o3L9J36J33p1k78J61j90J92K55j83o4m9m6O9J89k08J71j73
8000a12M7J58m13L57k07Q2J85j97OJ03mK9k6Jl9Q1N1J51j86k35j38M15p3j9K61
8025B78l41K08j68Q2k89N01k90n6J65k22l4K03qk5l7J06k4o8J61j27k6J71l26
8048a66L02o1J0j40J84n2j12k09K27L5mj73K0K81j54K4j9q6m8R5J12P5k64J39
8072A6p3L8Q7k34J54L4k14K34J5j64J4J37m9K19l85J94r1K07j8k3j54J42K4K1
8096A31j33K63k25j41J60p0KJ73j02J43k33N3P1k60O2K09r9k0p4O9J37p1m9L4
$$ plain form
7930 126 112 -84 -65 128 279 177 197 -367 15 -28 -153 23 129 -10 -69 148 -56 123 61 218 55 47 -235
7953 -235 -177 -145 -204 -76 41 231 42 5 143 143 269 -47 -41 149 -73 -93 -10 -238 10 -189 -129 -78 -104 49
7977 49 6 -319 -103 -132 -195 -156 -20 113 42 -236 -75 -265 -73 182 -1 -65 -114 -160 -91 98 -110 61 -112
8000 -112 -65 93 -320 37 -170 -88 97 -100 -94 9 5 34 8 9 -30 51 102 253 67 -168 -306 109 36 17 278
8025 278 -63 145 -23 59 -230 271 -19 -75 90 -132 -166 37 29 4 -33 73 49 -19 142 15 -11 160 -166
8048 -166 136 75 85 -55 129 77 -35 -244 -17 18 14 -159 -139 142 -12 12 -7 -93 -141 -46 66 141 -123 16
8072 16 -57 -19 68 -166 -12 22 -192 42 57 -107 -93 44 -5 214 -171 23 -68 139 121 98 -56 86 110 131
8096 131 -2 261 36 -105 55 -15 -13 160 58 201 -32 21 92 -168 -106 103 4 -16 -90 -21 116 45 -4 30
8120C0k6J2j83J55j80L23l31J07J26N0m3j70m0K34q1j84M03k88K7J35k0R2J1j26
8144C3L8k43j59M23k62J69j73ML11l9k15R1nJ74q8p4L3mj50L81m79J39K86j90
8168AJ43j71J89l44J45P6m6M7J67j59k18L48k82J94o8j39J71j4j47J50j09M9N1
$$ plain form
8120 30 4 16 -167 -12 -192 131 -200 -93 33 83 40 -130 -170 64 -17 -201 202 -86 -59 76 56 148 159 33
8144 33 71 -172 -331 92 -170 -1 -174 -170 141 102 -113 -22 -27 147 59 -15 18 14 -136 245 -234 -95 191 1
8168 1 144 -27 162 -182 -37 39 -7 40 207 48 -170 178 -104 90 22 -117 54 40 -107 43 -66 -17 34
8191C4
$$ Imaginary data points
##PAGE= N=2
##DATA TABLE= (X++(I..I)), XYDATA
0@%%%%%%qJ6j6J6k4L2m0M8o0Q4j04J22j46J78k18K64l12L68m34N06n86O78p83
29d19R01j033J177j338J516j709J925k166K429k714L027l371L745m153M600n090
45b673N626o210O845p540Q306r147J0075j1107J2253j3531J4969j6605J8480k0650
59a0909K3199k6245K9957l4591M0566m8594N9992p7509J07997j75359N63878j79247
71B73135r10908R92069k51762j12146N0505k62911N52341k86076n19609Q98413
81D23051k89692m23732L77995j15973K13074j64218l98055O91385k21570m23605
91c31340N02105j69784k9025O4144l04868N42082j89505n04635O39656j05790
101A13040l06896K79038k08801K65312l2648n12285O47394l5943o00235M99171
$$ plain form
0 0 0 0 0 0 0 0 -8 8 -8 8 -16 16 -24 24 -36 48 -56 66 -80 98 -120 144 -168 200 -234 272 -314 364 -419
29 -419 482 -551 626 -712 804 -905 1020 -1146 1283 -1431 1596 -1775 1970 -2183 2417 -2673
45 -2673 2953 -3257 3588 -3952 4354 -4793 5282 -5825 6428 -7103 7866 -8739 9741 -10909
59 -10909 12290 -13955 16002 -18589 21977 -26617 33375 -44134 63863 -111496 452382 273135
71 273135 -637773 354296 102534 -9612 40893 -222018 330323 44247 -475362 423051
81 423051 133359 -290373 87622 -28351 184723 20505 -377550 313835 92265 -331340
91 -331340 170765 981 -28044 36100 -268768 273314 83809 -420826 218830 113040
101 113040 -193856 85182 -123619 141693 109045 -403240 244154 208211 -392024 107147
111A07147k7253j89488K16385l00377K64033J45048n43101L93020J73088m27370
121a88868J56833K9985P0297K6587l65852L46433J37800m58103K82318P3708k01018
132h9880J45143j56375J68867J05957m36989K96054J73693l61616J91675m2746
142f217m2800K14678l27319J41337K40094m08241J82193J56845k40252J68353
152G8671j35863Q159K72973l69222N8142K85605k85731O4204O6821p7614J54185
163A20330k20890N4365K48965l21507O8311J65747j80492J10371q4536j7758K20627
174A63533k77818L1842K39645k39950O0419N1603r5161J64982j63793j7741K40639
185A58200k44353L909J87360j56586M9044j7129l7946J62476j65976j7010J90827
$$ plain form
111 107147 79894 -109594 106791 -193586 70447 215495 -327606 65414 238502 -188868
121 -188868 -32035 -2050 68247 94834 -271018 75415 213215 -244888 37430 111138 -89880
132 -89880 55263 -101112 67755 173712 -263277 32777 206470 -155146 36529 -6217
142 -6217 -49017 165661 -161658 -20321 219773 -188468 -6275 150570 -89682 78671
152 78671 -57192 -49033 223940 -145282 -87140 198465 -87266 -23062 43759 -33855 120330
163 120330 -100560 -46195 202770 -118737 -50426 115321 -65171 45200 -39336 -57094 163533
174 163533 -114285 -82443 157202 -82748 -22329 29274 -65887 99095 -64698 -82439 158200
185 158200 -86153 -82244 105116 -51470 -2426 -19555 -57501 104975 -61001 -78011 112816
196A12816j62349R780R4056r3328O6099n2061k0260J28459j28335j205J09454
207F3126r9678M7346J0348p1369J09895o3805m4243J14839p9963q487N8430o0342
219b3903N1603j7021n6618J03034n1920m3282Q6315m8638l651L0863m3495M2790
231B6077r799m6797O3504k7828k4013M1029l1407J5588N337l4572M5050r675l8453
244b5959M6787j7561j3184K2034k6885K0869k960k8105L7631j1604k7646L9219
256A2636j7771j1510K5108k2270J0129N216j5261J5689n199j0095J7967j4831
268a0192l251J5908j7101O719M843l891M939k40L263J615p283N086K360j1925
282i150R973l503k148P259l003L242K556l225K761M406q788N406j161l289M436
$$ plain form
196 112816 -49533 -39753 54303 -39025 27074 -24987 -45247 83212 -45123 -46328 63126
207 63126 -36552 10794 21142 -50227 59668 -4137 -48380 66459 -13504 -21991 36439 -23903
219 -23903 27700 10679 -45939 57095 5175 -38107 48208 -430 -4081 26782 -16713 26077
231 26077 16278 -30519 32985 5157 -18856 22173 -9234 6354 11691 -22881 22169 12494 -25959
244 -25959 20828 3267 -9917 12117 -14768 6101 3141 -24964 12667 1063 -26583 12636
256 12636 -5135 -16645 8463 -13807 -3678 1538 -13723 1966 -3233 -13328 4639 -10192
268 -10192 -13443 2465 -14636 -7917 -3074 -6965 -2026 -2266 997 2612 -4671 415 2775 -9150
282 -9150 823 -2680 -4828 2431 -572 2670 5226 2001 4762 9168 380 5786 4625 1336 5772
297E772k378L80J303O67j944N730m711j060K678j232j462p01L905m361J829J823
313F238r25l915J288j733n47o8n211R717o089k438J0230n918o630R639o206k965
329e533N908j1370J0977l233j0144J5214o292o800J3093p999J049P336j6784J7258
343B680l745j5808J9861p865l964J2382j5392J1748O002k6464K8890m833k1586
356a8094K8557j4237K555J5002l1802K4905J0490m1329L6782m792k2672L6005
368B1370l0078J2323K3871n3687L6451J7249n1532M1052j2877j1721M1270n7689
380b3998K8711L5998p5789M5010J7520m8716M4477l4826Q186N0228r1140M6636
392B297M5223q9913N0632M976l2806N3226o9845K6838O8201j12410N0691M2753
$$ plain form
297 5772 3394 3774 5077 5744 3800 9530 4819 3759 6437 5205 3743 3042 6947 2586 4415 6238
313 6238 5313 1398 2686 953 406 338 -4873 4844 -1245 -3683 6547 629 -6001 3638 -2568 -5533
329 -5533 375 -10995 -18 -3251 -13395 1819 -4473 -11273 1820 -6179 -5130 2206 -14578 2680
343 2680 -1065 -16873 2988 -4877 -8841 3541 -11851 -103 5899 -20565 8325 3492 -18094
356 -18094 10463 -3774 -1219 13783 -18019 6886 17376 -23953 12829 8037 -14635 21370
368 21370 -8708 3615 27486 -26201 10250 27499 -24033 17019 4142 -7579 33691 -23998
380 -23998 4713 40711 -35078 9932 27452 -21264 23213 -11613 -3427 46801 -44339 2297
392 2297 47520 -42393 8239 13215 -19591 33635 -36210 -9372 58829 -53581 -2890 39863
404C9863p8901N6342k8354r826P1561j08613L7128Q6239j16816M4494K4934m9073
416c1022P0892p5449M976J00284j26883L1227Q4639r7706M4104j4690j6306R6867
428G0933j25781R676J31493j28375J7329O4271o7614O3680o0623r380J29600j43646
440d8437n493J37130j04484R035K1513l4983R9055j08156k0965J64354j36262
451b7693k1832J12425q2222L7743k0896m6672J44044j16135n5651J72613j01304
462e580k7185N8490n9311R5430o8146q1264J87929j02445p4679J47889q7999J5646
474a225J2995q3108J61582q5429j28190K11084p0534p5459R3485q0070Q9263k9986
486A4408j23293K06072q5236j30819J91748p4732k2139M9072j13335J67608m1970
$$ plain form
404 39863 -39038 17304 -11050 -20876 50685 -57928 -20800 65439 -51377 -6883 18051 -31022
416 -31022 39870 -35579 -30603 69681 -57202 -25975 58664 -39042 5062 -9628 -25934 70933
428 70933 -54848 -45172 86321 -42054 -24725 39546 -28068 35612 -25011 -34391 95209 -48437
440 -48437 -53930 83200 -21284 -12249 9264 -25719 73336 -34820 -55785 108569 -27693
451 -27693 -49525 62900 -19322 18421 -2475 -49147 94897 -21238 -76889 95724 -5580
462 -5580 -32765 25725 -33586 61844 -6302 -87566 100363 -2082 -76761 71128 -16871 -1225
474 -1225 11770 -71338 90244 4815 -123375 87709 17175 -58284 35201 -44869 44394 14408
486 14408 -108885 97187 11951 -118868 72880 -1852 -23991 25081 -88254 79354 37384
497C7384j73100K15362n3051j04191J25919q7389O0776J5881j55452K01436l3743
508D9832j70497J80253m7747l3640O1338j26717J47630P287k02976J98814n668
519E7909j33883J19675o7248M3042L1194j62010J78160R303j96812J64808n399
530C8739o4839O8022j15313J14568M1282k02139J57340L4305j50482J08196k8995
541F84J441M7413j48366J36618N5238j98324J13135L8455p6981O2745q3540N6882
553E400P2231j77446J07657P4950j57589P3177J4862k2329N4742j25153P2418
564g080J05192j81301O1765P9710r7935N3531l7820R222Q6239j48777N2895J20379
576I6020j56850L7766N6995n5121N9388q4164J9099J17931j49186K4783J02389
$$ plain form
497 37384 -135716 79646 26595 -77596 48323 -39066 21710 37591 -117861 83575 49832
508 49832 -120665 59588 11841 -21799 39539 -87178 60452 67739 -135237 63577 57909
519 57909 -75974 43701 -23547 19495 50689 -111321 66839 76142 -120670 44138 38739
530 38739 -26100 41922 -73391 41177 82459 -119680 37660 71965 -78517 29679 684
541 684 2125 49538 -98828 37790 93028 -105296 7839 46294 -30687 32058 -51482 5400
553 5400 77631 -99815 7842 82792 -74797 -1620 13242 -9087 45655 -79498 -7080
564 -7080 98112 -83189 -21424 58286 -39649 13882 -23938 -14716 71523 -77254 -24359 96020
576 96020 -60830 -23064 33931 -21190 38198 -45966 -26867 91064 -58122 -33339 69050
587F9050j06300M5792n169l1192R7534j17323J0140J32115j35033J3118O9420
598D2152o6143O5111o0097k3742J30011j20851o462J10924j00530K8109K0091
609A8573m7157Q7881q4024k3432J30583j04634r948P1858o4537M9418k4887m0180
621d0486J00791p8340k3117R6257p6109J0858K4453m4228P0929n2740l6562J02878
633E4584o6256k0270O0158n1578L4305p837m2194P9563m9570l3374Q0852m8344
645i961q516L0712l6111M5293k0758m0729P1283l1375k6424M7253l1190R331J0487
658I295l3432M5769j7020l5679N2995j7998j6423K3440k1099K1001p4l3633M1629
671A8771r597k8985L6694j5141n561J6023k2397K1045K580l1908L2520m069k1675
$$ plain form
587 69050 -37250 8542 3373 -27819 69715 -47608 -37468 94647 -40386 -27268 42152
598 42152 -23991 41120 -18977 -42719 87292 -33559 -40021 70903 -29627 -1518 18573
609 18573 -28584 59297 -24727 -48159 82424 -22210 -32158 39700 -24837 24581 -306 -40486
621 -40486 60305 -18035 -41152 55105 -21004 -10146 14307 -29921 41008 -11732 -48294 54584
633 54584 -11672 -31942 28216 -23362 10943 3106 -39088 40475 -9095 -42469 38383 -9961
645 -9961 -18477 12235 -23876 21417 659 -40070 31213 -162 -26586 20667 -10523 -1192 9295
658 9295 -24137 21632 4612 -31067 21928 3930 -12493 10947 -10152 10849 10775 -22858 18771
671 18771 9174 -19811 16883 1742 -3819 12204 -10193 10852 13432 -18476 14044 9975 -11700
684a1700K3742j5176L747J3192k5538J7868P099k5709K1132l620j2418J5997j5637
697g021Q261Q046k2864J6687M678j7047J4556o904m831J3682j6901Q079O157j6407
711a1829J2997L70q920J0992q965k61J1492j5212O236M994j0747Q553q01l270
725d371N654n786K093O226j0012N632J746o427O789k200j092L279k825J954K430
740C090n248N142j814l076O142l129o05K434o97L33J116j685J767j435k155M726
756D906l512p02K156n88K6Q12q82L69m42r69K778m336P30J435j896O78L17j025
774a45P71q12m77K161m937K589J284m166L184l23j829K043j584oK891o612M241
791a727J770n842N181j702j513M199m292J568M254q603N843K228p306P617m754
$$ plain form
684 -11700 12042 -3134 613 13805 -11733 6135 13234 -12475 8657 5037 -7381 8616 -7021
697 -7021 1240 9286 -13578 3109 7787 -9260 5296 -1608 -6439 7243 -9658 -1579 4578 -11829
711 -11829 1168 1538 -7382 3610 -5355 -5616 5876 -9336 -3100 1894 -8853 -300 -1101 -4371
725 -4371 1283 -4503 -2410 3816 -6196 -564 1182 -5245 1544 -656 -1748 1531 -1294 660 3090
740 3090 -2158 2984 1170 -1906 4236 1107 502 2936 2239 2572 3688 2003 3770 2335 180 4906
756 4906 1394 692 2848 2260 2286 3098 2216 2585 2143 1174 3952 -384 346 1781 -115 563 880 -145
774 -145 626 -186 -663 1498 -3439 -850 434 -3732 -548 -871 -2700 -657 -2241 -2247 644 -5968 -1727
791 -1727 43 -5799 -618 -2320 -3833 366 -3926 -2358 1896 -6707 -864 1364 -5942 1675 -3079
806c079K97O778r235M576N957j1683Q626N53p425J1140r881K225J0561j6043P890
821A257P228j3853J1038l213o153J5941j7556M522J5076k1921R908O554j3889
834e061J4006j0269l003K1434k5530O164J7219k4197J3414J49j1466K0712k0974
847g402O1K7097l1802Q033J5464k2407J8745j1178q395L0856l0914L07L0396l2626
861a3765J0795Q355j8921K7213k2481p472L8923l4608j373K8050k7190J6474m951
874i51j7386M0103l0083j2361M3303l1439q97J9386k2810K6763j6419k0822N2764
887B9151l1474j9561M1214k4677O639N320k6040M3417k2353l0361N9756k9457
899A574j9433L4152k4178K1422o406l7125O0552k0660m0309N5625k5133o085K0340
$$ plain form
806 -3079 -2782 3996 -5239 -663 5294 -6389 2237 2790 -4635 6505 -3376 -1151 9410 -6633 1257
821 1257 8485 -5368 5670 2457 -3696 12245 -5311 -789 14287 -7634 2274 8828 -5061
834 -5061 8945 -1324 -4327 17107 -8423 -2259 14960 -9237 4177 4326 -7140 13572 -7402
847 -7402 -7341 19756 -12046 -4013 11451 -10956 7789 -3389 -11784 19072 -11842 -11535 18861 -13765
861 -13765 -2970 5385 -13536 13677 -8804 -16276 22647 -11961 -13334 14716 -12474 4000 -951
874 -951 -18337 21766 -8317 -20678 22625 -8814 -9711 9675 -13135 13628 -2791 -23613 29151
887 29151 -2323 -21884 19330 -5347 1292 6612 -19428 23989 1636 -28725 31031 1574
899 1574 -17859 16293 -7885 13537 7131 -29994 30558 9898 -30411 25214 81 -6004 14336
912A4336l5385M3533j1112n1629P0792j7166m1340M6158k6529J5861P889n4189
924c8781O4372o027o2610O4792j4330k4164L1722m0380M2337K485p1022P6146
936B4540k187n9972N1294j9834N399K0389o4217O3049Q872p8328O9333m391l7496
949b3549L7859l7381L4190J6585q2810P1899J4895p1026N2230j5284k787L0062
961B4883o3672N0999K3344q5460O2638J2587m7687L6288l2160K6932K7669q3588
973d7227N3638L3844p3216M0123J369j6214L1967n4019L6026L6686q4376M1475
985G6L3658n0712K4038j6607Q436L8460p3165L0047M8851p0670K4902J8985k7163
998a0864K8073l7276J2016N1557p6774J7584N1981n1952J5476k861q828M4126
$$ plain form
912 14336 -21049 22484 11372 -40257 30535 13369 -27971 18187 -8342 7519 15408 -38781
924 -38781 25591 19564 -43046 21746 7416 -16748 14974 -25406 16931 19416 -51606 24540
936 24540 22353 -37619 13675 -6159 -760 19629 -44588 18461 27333 -50995 18338 13947 -23549
949 -23549 14310 -23071 11119 27704 -55106 16793 31688 -39338 12892 -2392 -5179 24883
961 24883 -38789 12210 35554 -49906 12732 25319 -22368 13920 -18240 8692 36361 -47227
973 -47227 6411 40255 -32961 7162 8531 -7683 24284 -29735 6291 42977 -41399 76
985 76 33734 -16978 7060 -9547 -1111 37349 -35816 -5769 43082 -27588 -2686 16299 -10864
998 -10864 17209 -20067 -8051 43506 -33268 -15684 36297 -15655 -179 -3040 -11868 32258
1010C2258n6713K884O3626o5577P549L8151l6187K4781k3562n500O0853o4780
1022b2217p751O6075m9225N539J3312k4919M6561l9767j5255O9478n6624r146
1034b3939N0101l7770J8292r195k2711O4738m7336k4283O7258m1938j768K2097
1046A3546l1528L9967k3833k7460O8993m4520j9623N0651l2549J3154k352k9024
1058b4578N7009l1141l1572O0786l3748o743K6389l0505L0945j4348k9476N8025
1070C1043k9370k6630M4044k3900O817N067k9326M2887j5645l0741M5681j9766
1082A61j4110K4280k0945J7854l780k8088M2169j2132k7171L1557j1599k095R868
1095E969k2040K4161j546k7761L1899o965j8310K0599j0637N248N551k3318K4463
$$ plain form
1010 32258 -24455 -21571 42055 -23522 -15973 22178 -14009 10772 -12790 -18290 42563 -22217
1022 -22217 -29968 36107 -13118 -7579 5733 -19186 27375 -12392 -27647 41831 -14793 -23939
1034 -23939 26162 -11608 6684 -2511 -25222 39516 -7820 -32103 35155 -6783 -8551 13546
1046 13546 -17982 21985 -1848 -29308 39685 -4835 -24458 26193 -6356 6798 4446 -24578
1058 -24578 32431 1290 -30282 30504 -3244 -9987 16402 -14103 16842 2494 -26982 31043
1070 31043 1673 -24957 19087 -4813 2004 7071 -22255 20632 4987 -25754 19927 161
1082 161 -13949 10331 -10614 7240 3460 -24628 17541 5409 -21762 9795 -1804 -3899 5969
1095 5969 -16071 8090 6544 -21217 10682 3717 -14593 6006 -4631 617 6168 -17150 7313
1108G313K470k6079K1845k674q675J2623j4419R550P507k2846J8970L987k0496
1121a0924J5903l895k206J0031j7872J1272J0193k1803J3288L106j3046J2989
1133G036q583J057J0401j8604J0758Q544j8123J0732Q45p613J1822j2251K717
1146a262J0527j6823Q295N128j2482R761k946m243J0616j2288M201P525j2580
1159f571P078O78o219Q380o646r88Q969j0379L926M046q456O661j996k443O726
1174B766o420P50O609p627K938K079m988N326l120p05M145m212J185L649m242
1189a867K057J165k786L784k581K84K114k352R02J663k601J603M72j948K389j593
1205G05O8J459j331Q83M95j265O60L64j804J636j234k13J268j490N66K27r37Q28
$$ plain form
1108 7313 9783 -16296 5549 2875 -5800 6823 -7596 1954 9461 -13385 5585 9572 -10924
1121 -10924 4979 1084 -1122 8909 -8963 2309 12502 -9301 3987 7093 -5953 7036
1133 7036 -1547 -490 9911 -8693 2065 10609 -7514 3218 4063 -3550 8272 -3979 -1262
1146 -1262 9265 -7558 737 5865 -6617 3144 198 -4045 6571 -5717 -1516 6009 -6571
1159 -6571 507 1185 -5034 3346 -3300 -4288 4681 -5698 -1772 2274 -6182 479 -1517 -3960 2766
1174 2766 -3654 -2904 3705 -3922 -984 1095 -3893 1433 -1687 -2392 1753 -2459 -1274 2375 -1867
1189 -1867 190 1355 -1431 2353 -228 56 2170 -182 720 2383 -218 1385 1857 -91 2298 705
1205 705 773 2232 901 1784 2279 1014 1674 2038 234 1870 636 423 1691 201 767 994 57 885
1223H85L46j832J621j398m32J860k252J074j5j401J447m44p39J832k343J37J913
1240B59k948J897n11q63J851j556J24K401l210N61K534l591K987j653n59L159
1256H82l133O47L431m125J993J342l015M022l522k79N051n448J777L654n102L791
1272A966o22l170O741n860m63O853p106K193K979n057N741l457k979R517q311
1287a035k41P144p966M385j27n195R086o698l397J1434r239M8N995p927P668l992
1303e7n724J3029q961m507J2587r479J681L116q175J2384o846q203J6398r325
1317b082m149J0751r540O255o06j0456J7583q236j0276J7371q277j968O860j1392
1331h162J3467k719j5092K1263o861j1032J5154q896L653L447j5712J9924k672
$$ plain form
1223 885 1231 -601 1020 -378 -810 1050 -1202 -128 -143 -1544 -97 -541 -1280 552 -1791 -1654 259
1240 259 -2689 -792 -1303 -2166 -315 -1871 -1747 654 -2556 -1995 539 -3052 -65 -1718 -2277 882
1256 882 -2251 -1604 1827 -2298 -305 1037 -1978 2044 -1478 -1757 3294 -2154 -377 3277 -1825 1966
1272 1966 1344 -1826 4915 -945 -1408 5445 -1661 532 3511 -1546 4195 738 -2241 7276 -1035
1287 -1035 -1276 5868 -2098 2287 2160 -3035 6051 -647 -4044 7390 -1849 -1801 4194 -3733 3935 -57
1303 -57 -5781 7248 -1713 -6220 6367 -3112 -1431 1685 -6490 5894 -952 -9155 7243 -2082
1317 -2082 -6231 4520 -5020 1235 629 -9827 7756 -480 -10756 6615 -1662 -3630 3230 -8162
1331 -8162 5305 2586 -12506 8757 1896 -9136 6018 -2878 775 4222 -11490 8434 5762
1344E762j9988K2698n116q590J2049j2913J1575K955k2779K3352l38k1447K0866
1357H086p369j799R533k0601K0215M343k9568K4659M45j6706J7203j4739Q524
1370B226J0130k9985K4586N926k9517K2796l486p168J4655k5533J8654J3155l6924
1383b0485K4782N955k2407J9386j3498M526J5380l4976K3367J4491l6282K2056
1395B295J892j0127J6083k5070J3752J9436l9510K0585J3951k7040J8362q171
1407c562N30J8097l3820J6628K2638l6963J4363R625j3787J6873k1191P103K4636
1420B1170l7282J1834K1948k7798J1403j35m836K0369l0150P267L0549l4502M579
1433e584J6751j6110J3006j2671k591K8244l2163J223L1304k8228L332Q196r393
$$ plain form
1344 5762 -14226 8472 3356 -5234 6815 -6098 5477 8432 -14347 9005 8667 -12780 8086
1357 8086 717 -1082 8451 -12150 8065 12408 -17160 7499 7944 -8762 8441 -6298 2226
1370 2226 12356 -17629 6957 12883 -16634 6162 2676 -4492 10163 -15370 3284 16439 -20485
1383 -20485 4297 10252 -12155 7231 -6267 -1741 13639 -21337 2030 16521 -19761 2295
1395 2295 4187 -5940 10143 -14927 -1175 18261 -21249 -664 13287 -13753 4609 -3562
1407 -3562 -3032 15065 -18755 -2127 20511 -16452 -2089 7536 -6251 10622 -10569 -3466 21170
1420 21170 -16112 -4278 17670 -10128 1275 1140 -3696 16673 -13477 -6210 24339 -10163 -5584
1433 -5584 11167 -4943 8063 -4608 -7199 21045 -11118 -9895 21409 -6819 -3487 4709 -4684
1446d684J8890k1843n874L6563k9033n892K5683j9530Q765l120j0799K8938k4610
1459f546j1044L8058k4763n374J6180j4955J9778j3687j6390L8244k2153j4177
1471a6829L0591j9519L661N117j7205L0225j8100j9265M0216j9944j0930J9674
1483G692j7236J7433n123k2570L7599j6913j8034L2025j7863K12Q053j7939K7013
1496A4349j0900k3947L6964j3206j3457J9219j5883J3118p5k1851L0670r959k0858
1509a5816K8531j1551m292R087j6233K1162m363k3508K8045n659j4604J6514j1132
1522c819O129M040j8889K1514k744k0573K1206l605q222Q950j2050J2505K881
1535G323k1078J8249Q61j4832J3161m836q44O145j3420J2267L912j9364J3513
$$ plain form
1446 -4684 14206 -7637 -13511 23052 -5981 -11873 13810 -5720 3045 -75 -10874 18064 -6546
1459 -6546 -17590 20468 -4295 -9669 6511 -8444 11334 -2353 -18743 19501 -2652 -16829
1471 -16829 13762 -5757 -2096 3021 -14184 16041 -2059 -21324 18892 -1052 -11982 7692
1483 7692 -9544 7889 2766 -19804 17795 882 -17152 14873 -2990 -2778 5275 -12664 14349
1496 14349 3449 -20498 16466 3260 -10197 9022 -6861 6257 6182 -15669 15001 5042 -15816
1509 -15816 12715 1164 -3128 5959 -10274 10888 6525 -16983 11062 5403 -9201 7313 -3819
1522 -3819 2310 6350 -12539 8975 6231 -14342 6864 3259 -4963 3987 -8063 4442 7323
1535 7323 -13755 4494 5355 -9477 3684 -1152 -1996 4149 -9271 2996 6908 -12456 1057
1548A057L483r934P344o760L850P499j5759R331O949j5701R791J384o307P447
1562C674r290M865Q954j6009O863P598j1538P361k569k405R776j2125L868R155
1576H178j3837O081M109p755P935o780L62J0595j3723L570P860j0038N970m83
1590B044m673Q916q837J106R049j2028M122M484p264O061l824j799Q707q925J239
1605a622O253q550N013J62m597O147m926m37O705p491J554L553m957M219j981
1620i55k219N326m213l76M420m475J387J420k884L784k641j191M359l122j64K681
1636A137k361J185P36k244K691j602r56K807j783m5J699j057J76O16j477K016
1652A538r06q62J762j208Q8P59p49N05O38j487J567o06j188J563j226O77L84j223
$$ plain form
1548 1057 4540 -5394 1950 -4810 -960 6539 -9220 111 7060 -8641 1150 2534 -3773 3674
1562 3674 -5616 -751 8203 -7806 -943 6655 -4883 2478 -91 -2496 7280 -4845 -977 8178
1576 8178 -5659 422 4531 -3224 4711 -2069 -1707 8888 -4835 -1265 6595 -3443 2527 2044
1590 2044 -2629 6287 -2550 -1444 7605 -4423 -301 4183 -3081 2980 -844 -2643 6064 -2861 -1622
1605 -1622 4631 -3919 1094 1256 -3341 2806 -2120 -2557 4148 -3343 -1789 1764 -3193 1026 -955
1620 -955 -3174 2152 -2061 -2437 1983 -2492 -1105 315 -2569 1215 -1426 -2617 1742 -1380 -1544 1137
1636 1137 -1224 -39 697 -1547 1144 -458 -1414 1393 -390 -435 1264 207 383 999 -478 1538
1652 1538 632 -230 1532 324 412 1171 422 927 1565 78 1645 1039 -149 1414 188 865 1249 26
1670B6O53N41j637J577o10p54J375j727M61L84j306R70J84j400J577l12o28J335
1688G09k134R70j6j202J556n99o37J873j672L8J454k082J375m00r73J810j085
1705a015n29K041j762O24J299k156K118r87r55K737k157K02J525j628J030L25
1721G12j851L248k150q27L271k606P02J012k008K172q08k331M312k393j104L198
1737B549l326J926M63k531L646j933k504M427k693n58K538l276L121p81l549N127
1753B646k348k913M382k759O55J372m436N413j217m713O588k931k387L911l920
1768b657L029P25o346P447j046n554O217k702n13K974n526N055O65p677P837o91
1784A237n022N606l859K390K359q392P490J562r129Q135j571k593N105o876N217
$$ plain form
1670 26 679 1220 -417 1160 550 -204 1171 -556 -95 289 -1017 -47 137 -1263 314 2 -626 709
1688 709 -1425 -455 -471 -1673 -117 -716 -1353 520 -1152 -1114 340 -1742 -367 -767 -1740 70 -1015
1705 -1015 -1544 497 -1265 -641 658 -1498 620 -367 -1322 1415 -742 -540 985 -643 387 712
1721 712 -1139 2109 -41 -868 2403 -203 499 1511 -497 1675 867 -1464 2848 455 -649 2549
1737 2549 -777 1149 1612 -919 2727 794 -1710 2717 24 -534 2004 -1272 1849 1068 -2481 2646
1753 2646 298 -2615 1767 -992 -337 1035 -3401 2012 795 -3918 2670 -261 -2648 1263 -2657
1768 -2657 372 1097 -5249 2198 1152 -4402 1815 -887 -1400 1574 -3952 1103 1768 -5909 1928 1237
1784 1237 -3785 1821 -2038 352 2711 -5681 1809 3371 -5758 2377 806 -1787 3318 -3558 1659
1799A659L366j1676R194J543q375P519m217Q21N911j1458Q158M014j2698Q927
1813B688O29o091O934p688M210O771j5186R182M848j1483P933k915j285P939j2906
1828f420O448Q120j5986Q388L179p824P606p641K682R336j6348P108Q712j3575
1842f215P279j162l283R428j3104M523J1036j6382N782O985r126O633o200Q58
1856b948J1856j6086L153J2197j3370M409K629n494R373j0411Q52J4356j6118
1869e602J420J0987r435M030k326l074J3297j2896j971J5520j2601r2O973o854
1883b624P523o567m246J7086j3170m762J4764r207J757R19o366J3342r153p381
1897h085J8486j1377m424J1028q315O238l497q326J8427j0147r709J7232q800
$$ plain form
1799 1659 5025 -6651 2543 4086 -4289 3230 -987 -166 5745 -5713 2445 6459 -6239 2688
1813 2688 3317 -2774 4160 -3528 682 7453 -7733 1449 6297 -5186 2747 -168 -1453 6486 -6420
1828 -6420 28 8148 -7838 550 3729 -4095 3511 -4130 -1448 7888 -8460 -1352 7360 -6215
1842 -6215 1064 -98 -3381 6047 -7057 -2534 8502 -7880 -2098 4887 -4239 2394 -3806 -2948
1856 -2948 8908 -7178 -4025 8172 -5198 -789 1840 -3654 5719 -4692 -3840 10516 -5602
1869 -5602 -4182 6805 -2630 1400 -926 -4000 9297 -3599 -5570 9950 -2651 -2743 4230 -2624
1883 -2624 4899 -1668 -5914 11172 -1998 -6760 8004 -1203 554 1473 -4893 8449 -704 -8085
1897 -8085 10401 -976 -5400 5628 -2687 3551 54 -8272 10155 8 -9701 7531 -1269
1910a269p60N038r802J3124o017j0899J9865r632p706J3319q464M844k07j1831
1924a0397J8932o883j2634J7865p809k527P022r984J1100k449j3280J9412o354
1937B014j0367J3060p201L700J729j2075J5757k641j3477J5494m621m781P456
1950D047q594Q443n07j2546J5562j895j1173J0608m386J161L435j1004J1270L26
1964D747j2366J2020j243o890O654n186M614J627j1726J1136J831j0816P288q63
1978H27j595L889p642N464L615j1419P845L156q434N039j752O45M269r599N089
1993f03O092j0765M717K381m844M952m531J303N859r931L985O412q951L549L40
2008c5j975O048p923J701P447r130L038M054o361N095k886j063O973q684K029
$$ plain form
1910 -1269 -2029 3009 -6793 6331 314 -10585 9280 -352 -8058 5261 -3203 1641 1434 -10397
1924 -10397 8535 1652 -10982 6883 -926 -3453 3569 -6415 4685 2236 -11044 8368 2014
1937 2014 -8353 4707 -2494 1206 2935 -9140 6617 3976 -9501 5993 1372 -3409 4047
1950 4047 -4547 3896 3389 -9157 6405 4510 -6663 3945 -441 720 4155 -6849 4421 4747
1964 4747 -7619 4401 3158 -3732 2922 -2264 2350 3977 -7749 3387 5218 -5598 1690 827
1978 827 -768 3121 -4521 943 4558 -6861 984 4140 -4294 745 -1007 -362 3907 -5692 -603
1993 -603 5489 -5276 -559 1822 -3022 1930 -2601 -1298 4561 -5370 -1385 5027 -3924 -375 -35
2008 -35 -2010 4038 -3885 -2184 5263 -3867 -829 3225 -3136 1959 -927 -1990 4983 -3701 -1672
2023a672O845p671K772J140l630O243n342p55P592q056K208M179n848L856j377
2038D84k108O424o372j00O254o319K009J527l804M909l439j263N582n580N79M029
2054B812m785K418l16j728M405m215n06M203l952J096J430l016K890j513j170
2069a947L816l443q5K602k029P63K86j728K816j701j138K575j573k61J472j075
2085f50L84O64j025J518j000j226K124r83r0J102j195P58L38j525J416n8j151
2102e99J910r72l72J002j187P34O96j585J329J52j442J602j003M0Q45j222N70
2119D98N95j612J495l81q94J500j402M18M69j320J041r6j005J318q34n77J393
2136F06j516Q34K63j168J092l66p26R54p71oQ01j082J056k55p23J390q99k76M71
$$ plain form
2023 -1672 5173 -2498 274 1414 -2216 4027 -1315 -2070 5522 -2534 -326 3853 -1995 1861 484
2038 484 -1624 4800 -1572 -1672 4582 -1737 272 1799 -2005 2904 -535 -1798 3784 -1796 -1217 2812
2054 2812 -1973 445 129 -1599 2806 -1409 -1915 2288 -1664 -568 862 -2154 736 -777 -1947
2069 -1947 1869 -1574 -1659 943 -1086 -323 -37 -1765 1051 -650 -1788 787 -786 -1047 425 -650
2085 -650 -266 398 -627 891 -109 -1335 789 -194 -284 818 -377 381 719 -806 610 552 -599
2102 -599 1311 339 -33 969 -218 516 1212 -373 956 1108 -334 1268 265 305 1150 -72 498
2119 498 1093 -519 976 595 -299 1201 -201 217 686 -634 407 311 -694 624 -210 -787 606
2136 606 -910 -76 187 -981 111 -255 -981 -27 -798 -804 -3 -1085 -29 -284 -1007 383 -516 -792 -321
2155c21l14J36N56j077J123M7q76J389j285J31J047j084O76K36j239J501l47r45
2173f46J655j064K19O63j039J041k6j383J826p68o08J559j412P09J55j363J745
2190A263q78o08J243q86l77J445j731J503j98j764K179n28j443J823j580L81Q02
2207F46j942K311m15k392K583o38j218J788j927J270R65l570L163l43k267K422
2223D36j075j47J323k789K176J298m199L532r5k093K681k453J295J637m176L184
2239E35R29l910L386n35j160K713l859K437K039n315L263J349l407L332k565P21
2255d7L218n633L172K467n427L353j84j613L529m587J907L614o739L424K073m393
2271a866L607k467J81M223o715K774M207o733K853J208k682L862m743Q86N320
$$ plain form
2155 -321 -635 -499 57 -1020 103 150 -726 663 -622 -491 556 -528 148 384 -855 646 299 -646
2173 -646 1009 -55 164 827 -212 829 803 -580 1246 478 -130 1429 17 726 881 -482 1263
2190 1263 385 -223 1020 134 -243 1202 -529 974 776 -988 1191 663 -780 1043 -537 -156 646
2207 646 -1296 1015 600 -1792 791 153 -1065 723 -1204 66 1031 -2539 624 281 -1986 436
2223 436 -639 -786 537 -2252 -76 1222 -2977 555 460 -1633 1048 -1405 -110 1527 -2649 535
2239 535 1464 -2446 940 405 -755 1958 -1901 536 2575 -2740 523 1872 -1535 1797 -768 -47
2255 -47 3171 -2462 710 3177 -2250 1103 919 -694 2835 -1752 155 3769 -2970 454 2527 -1866
2271 -1866 1741 -726 -545 3678 -3037 -263 3944 -2789 64 1272 -1410 2452 -2291 -1405 3915
2286C915o980J703M171n317L128j424r16M934o297Q10O421o787J190K877l638
2301b210M097l727o19O836p030P3O082n318J337N32k331N924n477j673Q160o011
2317a355j024M522m054L587j848k731P777n881k670Q305n295q6K263l593N709
2332C626l431m252R621n473l190O590m740K640k15m453Q228m281n616R896m442
2347E08k426M183n077N803j671o559J0009l927n215P769m160O40J847o269Q695
2362D150l085p356J0149l420l556N172n146M642L8p849R871k724o054Q020m006
2377a154L43K459o472P716p89q524R362j727m421N096m336L598J077p276Q075
2392C027o71p168O872j589j370K597n154N648Q78p811O817K49m568M166k780J327
$$ plain form
2286 3915 -3065 -1362 2809 -2508 620 -804 -1720 3214 -3083 -2273 4148 -2639 -1449 1428 -2210
2301 -2210 1887 -1840 -2459 4377 -2653 -2580 3502 -1816 -479 53 -2278 3646 -1831 -3504 4656 -1355
2317 -1355 -2379 2143 -1911 1676 -172 -2903 4874 -1007 -3677 4628 -667 -753 1510 -2083 3626
2332 3626 195 -4057 5564 91 -3099 3491 -1249 1391 1176 -3277 4951 670 -4946 4950 508
2347 508 -1918 2265 -2812 2991 1320 -5239 4770 843 -4372 3397 -763 -123 1724 -4545 4150
2362 4150 1065 -6291 3858 438 -3118 2054 -3092 1550 1588 -6261 3610 886 -5168 2852 -1154
2377 -1154 -811 1648 -4824 2892 2103 -6421 2941 1214 -3207 1889 -2447 1151 2228 -5048 3027
2392 3027 2356 -4812 2060 471 -899 1698 -3456 2192 3070 -4741 2076 2325 -2243 1923 -857 470
2408D70J990o206O000J271p259M846Q07k576K461l863K696K800o990M002K454
2423B903n510L453n87o83K718m999K654L830p158K688K948l953K830k402P6M385
2439C193n821J802L871o077K600J465k936L513l738M92N323o382J303L833m630
2454b189K708r83j840M967m889L59N215n920J570K506l112L450k745j066N806
2469C837n418L51M036m570K886m45k377M498m131l26N318n160R70K369k701K836
2485A973j984j657M677l895k7L612m003J910K49j969L266k761p48L863k887m21
2501h02K205k335K277j318j489L230k353m58K421k226M14P45j538K073j277j116
2517a547K563j376o83J152j136O10M30j552J813n33j004J647o78o81R08p03O56
$$ plain form
2408 470 2460 -3746 2254 3525 -3734 1112 1919 -657 1804 -2059 637 3437 -3553 449 2903
2423 2903 -2607 846 259 -424 2294 -2705 -51 3779 -3379 -691 2257 -1696 1134 -1268 -1192 3193
2439 3193 -2628 -826 3045 -3032 -432 1033 -1903 1610 -2128 -1636 3687 -2695 -1392 2441 -2189
2454 -2189 519 -464 -2304 2663 -2226 -1867 3348 -2572 -1002 1504 -1608 1842 -903 -1969 3837
2469 3837 -1581 -1230 2806 -1764 1122 677 -1700 2798 -1333 -1659 3659 -1501 -531 1838 -863 1973
2485 1973 -11 -1668 3009 -886 -913 2699 -1304 606 855 -1114 2152 -609 -1357 2506 -381 -802
2501 -802 1403 -932 1345 27 -1462 1768 -585 -1043 1378 -848 -434 311 -1227 846 -431 -1547
2517 -1547 1016 -360 -1043 109 -1027 -417 13 -1539 274 -259 -1263 384 -294 -975 -67 -770 -114
2534a14Q5r50J373l50j043J279l70l22Q90j212P84N22j292J370N8j446J432o51
2552D3PO57j275Q71O74j566J321O5j010J045o94L53O65j628R01M20j439J129l47
2571A92k71R10j106N80N76j394R24j02q41J028p72j9Q93j411P05M13r00R85n55
2590a65l15Q02p90P3N08q19O27P9q39J193r09p7Q09p02L42K35q73P95j47n38Q67
2611A56l74l6M17n50O2M69o26Q43l54l15P80n51K20L00p43P58J52q40Q72l18n94
2632b72Q07n88M14Q5n72P75k53m44L74L35o68P12q94K96P05j325J076p5p17P49
2652E20n39k00P60j451J148M05j561J287m33o73J128j117M93O24j424J051M97
2669E15j344J028o40p0J151j862R96R50k094J370Q0j136J454j087M37J133k221
$$ plain form
2534 -114 -29 -979 394 44 -999 280 -90 -412 478 -734 50 572 -720 650 708 -738 694 43
2552 43 50 707 -568 303 977 -589 732 797 -213 832 138 491 1156 -472 429 849 -590 539 192
2571 192 -79 831 -275 305 881 -513 411 309 -532 496 -276 -295 598 -813 -108 305 -595 390 -165
2590 -165 -480 322 -468 -395 113 -706 -79 0 -839 354 -555 -632 177 -525 -183 52 -821 -26 -173 -711 156
2611 156 -218 -254 163 -387 -325 144 -482 361 7 -308 472 -79 141 441 -302 456 608 -232 640 322 -272
2632 -272 535 -53 361 446 -126 649 396 -48 326 661 -7 705 -189 107 812 -513 563 488 -229 520
2652 520 -19 -219 541 -910 238 643 -918 369 -64 -737 391 -726 -233 391 -1033 18 515
2669 515 -829 199 -441 -511 640 -1222 -226 724 -1370 0 80 -1056 398 -689 -252 881 -1340
2686a340J098Q75j714J645n44o30J572k051R30J370k384J528%j137J577j213J05
2703c13K048k691P63J729k315J369l29q02K282k228M43K075l082J113J120j828
2719f46J918j269n80K669k923K78K471k691Q99M27j393K326k302o8K989l195M40
2736f50J738k100J585r99j173L318k919k52L104k877O59J063j772J873j459j142
2752b003L894l052l61K646k067J127k15j645L397k061j741L880k701O9J942k111
2768a002K057r97k197M364k168j928L753k288N50R66k633L416j402k735M713j907
2784E62j934L036k415J809m3l196M655j723l012M616k346m77J953l290L483o58
2800A020m052N533j762k489L290k444J491Q96m274M601p07m122M460j262j311
$$ plain form
2686 -1340 -242 633 -1081 564 20 -610 962 -1089 -159 1211 -1173 355 355 -782 795 -418 -313
2703 -313 1735 -956 -193 1536 -779 590 261 -541 1741 -487 -44 2031 -1051 62 1182 -646
2719 -646 1272 3 -577 2092 -831 -553 1918 -773 126 553 -840 1486 -816 -884 2105 -1090 -650
2736 -650 1088 -1012 573 -426 -1599 1719 -1200 -1452 1652 -1225 -566 497 -1275 598 -861 -2003
2752 -2003 1891 -1161 -1522 1124 -943 184 -31 -1676 1721 -340 -2081 1799 -902 -833 1109 -1002
2768 -1002 1055 58 -2139 2225 57 -1871 1882 -406 144 1110 -1523 1893 491 -2244 2469 562
2784 562 -1372 1664 -751 1058 1015 -2181 2474 751 -2261 2355 9 -468 1485 -1805 1678 1020
2800 1020 -3032 2501 739 -1750 1540 -904 587 1483 -2791 1810 1103 -3019 1441 179 -1132
2815a132K266l169K926L15m559M758o02l102L068j999J292J018m021L790O17m344
2831b878L900m82j845K131k421K116Q10m225L705M29l102K687j228K03J843l628
2847a985K558J049l692K796N18k316J728j273N86J912m115K541J655l387J925
2862E00P2r99K010k506R05K337m117J714J954k627J197o48L4K060l135O34L164
2879B549l810J277J097k286K183j751j54K994l691N31K954l314J151M40j215K814
2895A769l123p6L423l599R73K030k813K026j074j144L677l541j60L284k891J299
2911F0K98j718K604j649q75L374l169N08J792k017J396n86j271L351k675m64K666
2928A625k157Q36N22j945K447j562n98K641k172K30J447j460P76l23j108K506
$$ plain form
2815 -1132 1134 -2035 891 1206 -3353 1405 803 -2299 769 -1230 62 1080 -2941 849 1466 -2878
2831 -2878 1022 540 -1305 826 -1595 521 1331 -2894 811 1240 -1862 825 -403 -200 1643 -1985
2847 -1985 573 1622 -2070 726 1244 -1072 656 -617 -31 1881 -2234 307 1962 -1425 500
2862 500 572 -427 1583 -923 -18 2319 -1798 -84 1870 -757 440 -208 -174 1886 -1249 -615 2549
2879 2549 -1261 16 1113 -1173 1010 -741 -895 2099 -1592 -1061 1893 -1421 -270 170 -1045 1769
2895 1769 -1354 -1430 1993 -1606 -633 1397 -1416 610 -464 -1608 2069 -1472 -1632 1652 -1239 60
2911 60 358 -1360 1244 -405 -1280 2094 -1075 -567 1225 -792 604 18 -1253 2098 -577 -1041 1625
2928 1625 -532 304 826 -1119 1328 -234 -832 1809 -363 -133 1314 -146 630 307 -801 1705
2944A705j755p08J894j390K30Q42j283J332r66p48J883j162o07J276n23J14j15
2961A9p11J315l71j184J317o14n36Q21o20N27m0p34J099p1j285J345l60l37O22
2980B02r33M92N46j138P11L52j210J220l43j24O81j153P44M97j348J122K96j209
2998e95J270q63P7O35q14P72J37j185P21K33m32R03j108N82M12j331R27J16o48
3017a91O46n01o3P85r88N97K33j022Q56k95k17O15p01j3P07q41M02K64p69O43
3037A47j46k69M07n18J97L55o39M62o2m12N74l84J82N4j82n9J52k09M17j81m00
3058e14O00n34L57m0j18J78l4k00K84j08l10O80m37j02P25n05M34j65l07M81l07
3079E8N4K64l89L14J97n08K58K25m96J51J89m49O92l76Q0K74p30K81K97n73M04
$$ plain form
2944 1705 -50 -758 1136 -254 -24 818 -465 867 -99 -847 1036 -126 -733 543 20 134 19
2961 19 -692 623 252 -932 385 -229 -765 56 -564 -37 -77 -811 288 217 -1068 277 -83 -420 202
2980 202 -731 -239 307 -831 -120 232 -978 242 -101 -225 456 -697 47 544 -804 318 614 -595
2998 -595 675 -188 -111 524 -290 482 619 -566 155 388 -44 859 -249 333 745 -586 341 457 -191
3017 -191 455 -46 -109 676 -312 285 518 -504 352 57 -160 455 -246 -259 448 -393 9 273 -496 147
3037 147 1 -268 139 -379 -182 173 -466 -4 -66 -478 96 -288 -106 -52 -234 -293 -141 -350 67 -114 -514
3058 -514 86 -448 -91 -131 -249 -71 -105 -305 -21 -129 -439 241 -196 -298 427 -78 356 191 -116 365 58
3079 58 112 376 -13 301 498 -10 248 473 -23 128 317 -132 560 184 264 538 -192 89 386 -187 217
3100B17j24j34M92q03K51N78r43Q21k00o01O14m19k8O24r64N53J11n13M83l41
3120c26K7M92o23J86P87j296N06M19r78J032r16M45P22j183N71M38r08N66l05
3139c44R4O91r52K90O71j047P24M8n86Q15o37j96J346j349M38R14j348R97m53
3158A16l59J094j325K89J151j450P02M10q03P02n55j56J421j501p7J154j367Q52
3176B98m6j060J873j387j84J406j258P9N72p54O86o22m51J625j166m02J464j261
3194e88L45O46j332J289n74r07J876j256l32J434j075N79n3j312K085j276q62
3211a313K371j470L2O17j145J579m94j623K588r53r18J563j146M61K63j360K131
3228A183q92j688K899j418o17J481j713J486J98k345K775q41j086J722j267L87
$$ plain form
3100 217 93 -41 451 -352 -101 477 -466 355 155 -446 168 -251 -279 345 -619 -66 45 -468 15 -326
3120 -326 -299 193 -430 -244 543 -753 -247 172 -806 226 -690 -245 477 -706 -135 303 -605 -39 -344
3139 -344 -250 441 -511 -221 450 -597 127 175 -411 404 -233 -429 917 -432 6 920 -428 569 116
3158 116 -243 851 -474 -185 966 -484 218 628 -175 527 -28 -184 1237 -264 -341 813 -554 298
3176 298 252 -808 1065 -322 -506 900 -358 -279 293 -461 225 -397 -848 777 -389 -791 673 -588
3194 -588 -243 403 -929 360 -214 -1121 755 -501 -833 601 -474 105 52 -1260 825 -451 -1313
3211 -1313 1058 -412 -380 237 -908 671 177 -1446 1142 189 -729 834 -312 149 412 -948 1183
3228 1183 291 -1397 1502 84 -533 948 -765 721 919 -1426 1349 508 -578 1144 -123 264
3244B64M93k109K539k65k353K446p53q10J402j507J109M78k573K542k76j922K152
3261H57j199K52O55j977J860L36k478K203k96j334J696j418N04R20k482K253L48
3278G00j910J586m25m22J050j836J481Q65k774K090K11j626J373n41j18J136k108
3295a268J311J118k359J166N28o78Q06j070J64J578k257P96J354j907J276l40
3311B18m93J366j801M01J897k401O69R48j252J110j067j78J930k192N24J644k069
3328g46R03L39j209J832j605J4J955k404K63J388j329J097o98p99K120j990MK057
3346A192k096K90J024j280J731j148r25K403k235K79J757j908R16k3p59J683j579
3363f78l47K478j961K22Q96j540J898r13q18K056j876L5J447j425O45L00j051
$$ plain form
3244 264 757 -1352 1187 922 -1431 1015 262 -548 854 -653 456 934 -1639 903 627 -1295 857
3261 857 -342 -90 565 -1412 448 784 -1694 509 213 -1121 575 -843 -339 581 -1901 352 700
3278 700 -1210 376 -49 -471 579 -1257 224 1089 -1685 405 616 -1010 363 -178 -296 840 -1268
3295 -1268 43 1161 -1198 -32 496 -182 624 -446 -282 1296 -961 -165 1189 -718 558 218
3311 218 -275 1091 -710 -309 1588 -813 -144 804 -448 662 -405 -583 1347 -845 -321 1323 -746
3328 -746 157 496 -713 1119 -486 -472 1483 -921 -658 730 -599 498 -200 -999 1121 -869 -865 1192
3346 1192 -904 -614 410 -870 861 -287 -1212 1191 -1044 -765 992 -916 0 -23 -782 901 -678
3363 -678 -1025 1453 -508 -286 610 -930 968 55 -763 1293 -583 -548 899 -526 119 419 -632
3380f32J710j426k37J641r50l37Q36q52Q13n28o40J360q19k04R68o31n9M23p39
3399c03J059m87p26J219n43l19M01p20K39M43j029J017k52n64R41k58m83L71k73
3418b67J86L45j047P72K55j083J101n79o9P27r48Q21o4r48J097k90p52R76m27
3437a94R2O22j412P92K94p46N79J37l23O71p74K75M94r95P48rn31R13n42k21Q37
3458G07p52J19M89r24P98k5o07O55p30L45L50o52L91K15n06N31n44j07P80o90
3478a57L73J41m71P5J35k53N21l31k54N52l35j14L75m00J63j1m56P05o42L19P7
3499A2k88K03Q1k12l3R0j41L96k56l1J74l89M46P6l80J99K71n51M17l1j15M22
3521C60j85j06N9l6j3J02k36K51m02J87N72n37J3K08r1L83l04l33N99m58k7L51
$$ plain form
3380 -632 1078 -348 -585 1056 106 -231 605 -247 566 38 -602 758 -61 -265 703 72 13 436 -303
3399 -303 756 269 -457 762 219 -100 301 -419 -180 263 -766 251 -1 -565 376 118 -365 6 -267
3418 -267 -81 264 -783 -11 244 -839 262 -317 -386 341 -607 214 150 -798 299 9 -743 233 -194
3437 -194 -102 520 -892 -100 194 -552 27 164 -159 512 -262 13 507 -488 260 251 -280 633 91 -130 707
3458 707 -45 74 563 -361 437 412 -195 460 -270 75 425 -227 164 379 -127 404 -140 -247 533 -157
3478 -157 216 357 -114 -39 96 -157 364 33 -221 331 -4 -118 257 -143 20 9 -447 258 -384 -65 12
3499 12 -276 -73 8 -204 -237 -147 -288 108 -148 -179 -5 -394 52 128 -252 -53 218 -333 84 53 -62 360
3521 360 175 69 128 92 79 181 -55 196 -206 -19 553 16 29 237 146 529 225 -108 491 33 6 357
3543C57m93L57j34j61K95j19j08L27k40j84M16n61L50m2j95K67k03o9M01p73M13
3564i9J90m90N35m05N7L33m69l0O49q54L71L30n66P75n75J01K82o04J29M76m49
3585c13M08l33p9P22o65L9N14p19M35J00m75P11l71m82P67n14K89L07m64K52k9
3606A00p2M89o18pM61m70J81K19n65Q91n66j89P63p11o4O59p33N75l20m03J067
3627F87q39l71J259o25j94J43q5N04n56m07R88q31J04O36q72J74K31l53M04m6
3647d9n02J232r30j91O14q95O02J25o11J090o46o55J094o64K85K13r21J155O8
3666D14j074J293p84k88J031q42M31J79j201J524k60j172J080j66l23O54j014
3683e18J002r4j273J456k43n90Q65q53N61L08j448J417j08j332J456m62l30O22
$$ plain form
3543 357 -136 221 87 -74 221 102 -6 321 81 -103 313 -248 102 60 -135 132 -71 -140 261 -512 -99
3564 -99 91 -399 136 -269 -212 121 -348 -378 271 -583 -212 118 -448 327 -248 -147 135 -469 -340 136 -313
3585 -313 95 -238 -317 405 -260 -221 293 -426 9 109 -366 345 -26 -508 259 -255 34 341 -123 129 100
3606 100 28 517 -101 -108 353 -117 64 283 -282 609 43 -146 617 -94 -158 501 -232 343 23 -380 687
3627 687 -152 -523 736 111 -83 60 -25 479 -77 -484 504 -327 -223 413 -459 -285 -54 -407 -3 -49
3647 -49 -551 681 -249 -440 174 -721 -119 6 -605 485 -161 -816 278 -386 -101 112 -809 346 414
3666 414 -660 633 -151 -439 592 -250 181 360 -841 683 423 -749 331 165 -158 496 -518
3683 -518 484 390 -883 573 330 -260 605 -248 313 621 -827 590 482 -850 606 144 -186 436
3701D36q55Q14L43j416J296k18j047J107r08P32P4p69P48L10j660J232j89m97
3719d67R55j274R84M03j992J403K26j121R06j64j16P60j542R04O15j282Q47L71
3737D16r41R36o33L3R12j590J011N93j348O72K61o16R51j020L69J022j652N10
3755a14R44q99L85k52m88J347j259J39J540j595K97O20q91P86q96J40J385j394
3773b05m5J305j459P18J01j264J714j304k24J382j130K49O05r61Q08m05p18J865
3791A032j356l43J333j084N76j99o14J481j416j69J416j284o6J245r10P41m31
3808d8m25J345q95p11J473j205M81J26o41Q27l48o67J371q37m97J052o71K83L2
3827D5n34J087l33o40J051p97K28L18o78N85n9o46Q45k30l61N30j64l63L57l51
$$ plain form
3701 436 -419 395 738 -678 618 400 -647 460 -448 284 358 -411 337 647 -1013 219 30 -467
3719 -467 488 -786 198 601 -1391 12 238 -883 23 -141 -257 503 -1039 -135 480 -802 45 416
3737 416 -525 411 -222 -189 723 -867 144 737 -611 61 322 -294 657 -363 6 1028 -624 -114
3755 -114 830 -69 316 64 -424 923 -336 -197 1343 -252 45 665 -226 560 -336 -196 1189 -205
3773 -205 -250 1055 -404 314 415 -849 865 -439 -663 719 -411 -162 443 -518 290 -115 -833 1032
3791 1032 -324 -667 666 -418 158 -41 -655 826 -590 -759 657 -627 -693 552 -358 383 -48
3808 -48 -473 872 -23 -734 739 -466 15 141 -500 327 -21 -688 683 -154 -651 401 -270 13 45
3827 45 -489 598 265 -375 676 -121 107 425 -253 332 273 -373 472 242 -119 411 247 -116 241 -110
3847a10O22j72n31O31q2o04O15k73j89M35p73N25K84j065O70L5m98P13o83K25
3867b25O02j081P59K31p65M23J12k92N09o42L23M46p76O14Oq12Q23o26K09N53
3887C91q81O05K74q54M65J10k32M51n80K86K62n48N55J9o23P80n89M07N2m86M43
3908C07L0n73M52J68n46P44o84K3K28m54N19r1k90N89k78o9J38m90L44K25n47
3929b55L09n7n5K19l3k42K51l33L20K33o26L79j85j40K59l54J8J81k4Q4j0k58
3951c19K00J99k92L13m49Q0N18l76j10L05j02N5R7l52K08j35r8L15j53J84K16
3972C04l35J50r5k62P40n59j01M54j76n2J77l84N39Oo77M40Lj64L61k79J5Q4m25
3995b36M31j86k66N52m70K74L23p09M66l3m32M58O1o00N43j65k04K76q7J27O6
$$ plain form
3847 -110 512 340 -191 440 358 -246 369 96 -93 342 -431 94 378 -687 -17 18 -480 233 -450 -225
3867 -225 377 -704 55 286 -479 -56 56 -236 273 -369 -46 400 -376 238 244 -568 255 -371 -162 391
3887 391 -490 115 389 -465 0 110 -122 329 -251 35 297 -251 304 323 -300 480 -109 298 350 -136 307
3908 307 337 -236 216 384 -162 582 -102 -79 149 -305 214 123 -167 422 144 75 213 -277 67 292 -255
3929 -255 54 -3 -58 161 128 -114 137 -196 124 357 -269 110 -75 -215 44 -310 -292 -111 -135 -51 -61 -319
3951 -319 -119 80 -212 101 -348 -268 250 -126 -236 69 -33 22 119 -233 -25 -160 -258 57 -96 88 304
3972 304 -31 119 24 -238 502 -57 -158 296 120 68 245 -139 400 406 -271 169 172 8 369 90 105 189 -236
3995 -236 195 9 -257 295 -175 99 422 -287 179 146 -286 172 233 -367 176 11 -193 83 -4 123 189
4016A89m12N11m80K36R1m70K18K8l70N22k20k10M79m97K28J61k51K81L9n38O64
4037A99l80K20Q4l69J33J50j93K15l59K14J42j27J96K31k62M0j08m5M21n99N8
4058a39M76l50N0L22m31M34q4l70N88m80K7O40q38K13L46m06M01r3n01M74l29
4079e0J89J89o94M58o0l86P26k77l12N22n75J61J56m79P20k43n55Q09m49l81O66
4100A35n40M69J68q47N37K7l81O25n27j36O51o39O17K41q42M00K5l71M26m42L65
4121c9K78r76Q87j5m80O66j97k18K92m32L47O00j151P77j39k54L20l90M21K98
4141E95r96L13P26q62L91j01l09M00n08L04M63p02M00M4k48K89l84J62M22q90
4161d91O11K24q47M17J05j63N58o58K98N01j020L14K78m81N19j55m72Q35q62J53
$$ plain form
4016 189 -223 288 -192 44 135 -335 -117 -89 -459 63 -157 -367 112 -385 -157 4 -247 34 73 -465 199
4037 199 -181 39 123 -246 -113 37 -156 59 -300 -86 56 -71 125 356 94 134 26 -19 402 -197 -139
4058 -139 337 -13 37 359 -72 362 278 -92 496 16 43 683 -155 58 404 -2 399 306 -195 279 -50
4079 -50 139 328 -366 92 32 -354 372 95 -217 305 -270 -109 47 -432 288 45 -510 299 -150 -531 135
4100 135 -405 64 232 -615 -78 -51 -432 193 -334 -470 181 -458 159 400 -442 -42 -17 -388 38 -404 -39
4121 -39 239 -737 150 135 -345 321 124 -94 198 -234 113 713 -438 339 200 -54 266 -124 297 595
4141 595 -401 -88 638 -224 167 66 -243 157 -351 -47 416 -286 114 158 -90 199 -185 -23 399 -491
4161 -491 120 344 -503 -86 19 -144 414 -244 54 555 -465 -151 127 -354 165 10 -462 373 -489 -336
4181c36O53p47L94L66n00J69k70l2P23n58j53N96m55L3L67k99L43p52K48R91j282
4202e01M33M07o36N82m68kQ19n86k90J099j038M00N3n06J000p01m36Q65n84K3
4222f7M63q05N28J85p17R71p41m71J242p69M3M70p68R04l68q23J204o45l29Q47
4242C54o87L43J1n11J060o32l25P65n55k93M74m37Q19k29q98J018n42k4N54n37
4262b72K69K7l92N03q3m58O76k58l45L17j57K92K52o41M86j22j98M54k31R5q5
4283A29n37N48J57n11N32P8o29L53j57j35N47n13K38J94m06L36J04m39K87j59
4303A7o6N35o71m5P61p27L73J6l66O36m83o5M48n77J55M53o93L75k54k38M96n23
4325d43L62K28n95N39j26l95N82m76M4N68p54M89k7k03L25j79j78M44o07J54O61
$$ plain form
4181 -336 317 -430 -36 330 -170 -1 -271 -303 420 -138 -291 305 -150 -117 250 -49 294 -458 -210 781 -501
4202 -501 -68 339 -297 285 -183 -185 634 48 -242 857 -181 219 272 -234 766 65 -371 494 -90 -67
4222 -67 396 -409 119 304 -413 558 -183 -654 588 -181 -138 332 -436 468 100 -723 481 -164 -493 354
4242 354 -333 10 21 -490 570 -62 -387 378 -177 -470 4 -433 386 157 -741 277 -265 -289 265 -272
4262 -272 -3 24 -368 135 52 -406 270 12 -333 -16 -173 119 371 -270 216 94 -104 350 119 214 129
4283 129 -408 140 297 -214 318 396 -233 120 -37 -172 375 -138 100 294 -112 224 328 -111 176 17
4303 17 -49 486 -185 -230 531 -196 177 193 -173 463 -20 -85 363 -214 -59 394 -299 76 -178 -416 80 -443
4325 -443 -81 147 -448 91 -35 -430 152 -324 -280 288 -466 23 -4 -207 118 -61 -239 205 -402 -248 413
4346D13q20N22n2q6K80k10q6N39p85J21M71n60P96m18r7K57l6k90L33m83K90M06
4368E05n12K40k40J52r8j6j95O55n54pJ25j94L89j85R0j36J24k70J70o3j44J77
4390A3l00J69k0o3O7R6j58M25k84o8J89k53L3K10j52Q0k71L27M3k05N8N5n9RJ08
4415D9m23O33m27J01Nm97N52O1k02J16K13l41M46k60J41j55l06N32J02k94o9J01
4437G8n3N7j27R4K14k90L14k90q4O47p77J92kO9K45j34j94P3k11K12J80l90O6
4460a11K06j21J44N3m19N22k27p3l8r5L73k81j92L25j00k42M85k83R8N2P5q7M2
4483A06m61L73J14k57L29r3l22K52k79J49j6j49K97R0p7p8J90j68J97k59M30l12
4505E6j61K63J63l35J48l6K05o7k98L4K23k99K24l28L36P1k61K47J09j57N1j73
$$ plain form
4346 413 -407 115 63 -23 257 47 -39 500 -285 -164 307 -253 543 125 28 285 249 -41 292 -191 99 505
4368 505 -7 233 -7 145 47 31 -164 491 -63 -70 55 -139 250 65 155 19 143 -127 43 -20 -164 13
4390 13 -287 -118 -138 -201 -134 -38 -196 229 -55 -123 66 -187 -154 56 -96 -16 -287 40 83 -122 -64 -9 -68 -59 49
4415 49 -374 259 -168 -67 -62 -559 -7 54 -148 -32 181 -160 286 26 167 12 -294 238 340 46 -23 78
4437 78 25 82 -45 49 263 -27 287 -3 -87 560 -217 -25 -27 42 287 153 -41 32 -179 33 213 -177 -111
4460 -111 95 -26 118 171 -248 274 47 -26 -64 -159 214 -67 -259 66 -34 -276 209 -74 24 76 151 64 106
4483 106 -355 18 132 -125 204 111 -211 41 -238 -89 -105 -254 43 133 56 -22 168 0 197 -62 368 56
4505 56 -105 158 321 -14 134 98 303 236 -62 -28 195 -104 120 -208 128 199 -62 185 294 137 188 15
4527A5NJ92l99K30K65l93qJ82j45K18j85j47L64m75M74m7m98N03j76k3M8l05p2
4550c77N13n49M14J87n53L08m7m3L54m94N63l90k76K98R1j07L14j26R1j1m85K66
4572e9J40l03L01O6k65M48q06M38J13l15M43l13j94M95l16K04L50m64J44K27o86
4593c52K54J9J69L99m16OJ96l63J4K50j27L19l01l17O79l62k64M94k02O5j43n8
4615d1J18k07k61O94m08j49M83m93L76ok42M61m06k80N75n59L10M8k47J62M5k02
4637b29L53k99j4M44k51l49K71j99P51l26n92O77l95j50P28n17K31j93m43J019
4657E17o30j83M41j41j14M92m69M77l15m28N89o3l88P22m73j53L47n37O67k76
4677H2k42J99l0k3L72n69N74m24k56N46k80j88N16m18L6K73n74N87r1l80M20j71
$$ plain form
4527 15 20 212 -187 43 308 -85 -93 89 -56 162 -23 -170 194 -281 193 146 -352 151 -25 -48 0 -305 -377
4550 -377 136 -413 1 188 -365 -57 -104 -147 207 -287 276 -114 -390 -92 -1 -108 206 80 171 160 -325 -59
4572 -59 81 -222 79 145 -120 328 -478 -40 73 -242 201 -112 -306 189 -127 77 427 -37 107 334 -352
4593 -352 -98 -79 90 489 73 79 275 -88 -74 176 49 368 67 -250 429 67 -197 297 95 160 17 -41
4615 -41 77 -130 -391 303 -105 -254 229 -264 112 106 -136 325 -81 -361 214 -345 -35 13 -234 -72 -27 -229
4637 -229 124 -175 -189 255 4 -345 -74 -273 478 152 -440 237 -158 -308 420 -97 134 -59 -502 517
4657 517 -113 -296 145 4 -110 382 -87 390 75 -353 236 173 -215 507 34 -119 228 -309 358 82
4677 82 -160 39 9 -14 358 -211 363 -61 -317 229 -51 -239 277 -141 -105 168 -406 181 90 -290 130 -41
4699d1k11L65o12M80q3k33N31k68k47L42l6n3Q0l47M64K1n48L44J32j71j9j11
4721b21K18K13l71J51J94m82M17r8j02R1k70L42J77k82j21N91n96J06L46r9q4
$$ plain form
4699 -41 -252 113 -499 -19 -102 -335 196 -72 -319 23 -13 -66 14 -333 131 152 -396 -52 80 -91 -110 -221
4721 -221 -3 210 -161 -10 184 -298 119 21 -81 10 -260 82 259 -23 -144 447 -149 -43 303 204 120
$$ [...]
8191a91
##END NTUPLES=NMR FID
##END=
