##TITLE=1H_Am-222
 CD3OD, 8 sc, 
 28.10.2020
##JCAMPDX= 6.0         $$ Bruker NMR JCAMP-DX V2.0
##DATA TYPE= NMR FID
##DATA CLASS= NTUPLES
##ORIGIN= UXNMR, Bruker Analytische Messtechnik GmbH
##OWNER= root
$$ XWIN-NMR		Version 3.5
$$ Wed Oct 28 10:24:51 2020 Russian Standard Time (UT+4h)  she@DPX200
##.OBSERVE FREQUENCY= 200.1315066352
##.OBSERVE NUCLEUS= ^1H
##.DELAY= (6, 6)
##.ACQUISITION MODE= SIMULTANEOUS
##.ACQUISITION SCHEME= undefined
##.AVERAGES= 8
##.DIGITISER RES= 18
##SPECTROMETER/DATA SYSTEM= spect
##.PULSE SEQUENCE= zg30
##.SOLVENT NAME= MeOD
##.SHIFT REFERENCE= (INTERNAL, MeOD, 0, 15.7039)
##AUDIT TRAIL= $$ (NUMBER, WHEN, WHO, WHERE, WHAT)
$$ ##TITLE= Audit trail, XWIN-NMR		Version 3.5
$$ ##JCAMPDX= 5.01
$$ ##ORIGIN= Bruker BioSpin GmbH
$$ ##OWNER= she
$$ F:/spectra/data/she/nmr/H-F/1/audita.txt
$$ ##AUDIT TRAIL=  $$ (NUMBER, WHEN, WHO, WHERE, WHAT)
(   1,<2020-10-28 10:23:53.29 +0400>,<she>,<DPX200>,
      <created by zg, POWCHK disabled, PULCHK disabled
       configuration hash MD5:
       00 E9 B6 7A A2 85 ED C7 34 08 36 98 17 FE 4E 26
       data hash MD5: 16K
       29 46 95 62 3A E0 7A C8 E4 56 19 64 80 39 7E B1>)
$$ ##END=
$$ 
$$ hash MD5
$$ 5C E9 CA A5 8E 77 FC F0 F8 8C 67 CF E9 B3 6E BA
##$RELAX= 
##$RELAX= 
##$RELAX= 
##$RELAX= 
##$RELAX= 
##$RELAX= 
$$ Bruker specific parameters
$$ --------------------------
##$DU= <F:/spectra>
##$EXPNO= 1
##$NAME= <H-F>
##$PROCNO= 1
##$TYPE= <nmr>
##$USER= <she>
##$AMP= (0..31)
100 100 100 100 100 100 100 100 100 100 100 100 100 100 100 100 100 100 
100 100 100 100 100 100 100 100 100 100 100 100 100 100 
##$AQSEQ= 0
##$AQ_mod= 1
##$AUNM= <au_zg>
##$AUTOPOS= <>
##$BF1= 200.13
##$BF2= 200.13
##$BF3= 200.13
##$BF4= 200.13
##$BF5= 200.13
##$BF6= 200.13
##$BF7= 200.13
##$BF8= 200.13
##$BYTORDA= 1
##$CFDGTYP= 0
##$CFRGTYP= 5
##$CHEMSTR= <none>
##$CNST= (0..31)
1 1 145 1 1 1 1 1 1 1 1 1 1 1 1 1 1 1 1 1 1 1 1 1 1 1 1 1 1 1 1 1 
##$CPDPRG= <>
##$CPDPRG1= <>
##$CPDPRG2= <>
##$CPDPRG3= <>
##$CPDPRG4= <mlev>
##$CPDPRG5= <mlev>
##$CPDPRG6= <mlev>
##$CPDPRG7= <mlev>
##$CPDPRG8= <mlev>
##$CPDPRGB= <>
##$CPDPRGT= <>
##$D= (0..31)
0 1.2 0 0 0 0 0 0 0 0.06 0 0.03 0 0 0 0 0.0002 0 0 0 0 0 0 0 0 0 0 0 0 
0 0 0 
##$DATE= 1603866232
##$DBL= (0..7)
120 120 120 120 120 120 120 120 
##$DBP= (0..7)
150 150 150 150 150 150 150 150 
##$DBP07= 0
##$DBPNAM0= <>
##$DBPNAM1= <>
##$DBPNAM2= <>
##$DBPNAM3= <>
##$DBPNAM4= <>
##$DBPNAM5= <>
##$DBPNAM6= <>
##$DBPNAM7= <>
##$DBPOAL= (0..7)
0.5 0.5 0.5 0.5 0.5 0.5 0.5 0.5 
##$DBPOFFS= (0..7)
0 0 0 0 0 0 0 0 
##$DE= 6
##$DECBNUC= <off>
##$DECIM= 32
##$DECNUC= <off>
##$DECSTAT= 4
##$DIGMOD= 1
##$DIGTYP= 9
##$DL= (0..7)
0 120 120 120 120 120 120 120 
##$DP= (0..7)
150 150 150 150 150 150 150 150 
##$DP07= 0
##$DPNAME0= <>
##$DPNAME1= <>
##$DPNAME2= <>
##$DPNAME3= <>
##$DPNAME4= <>
##$DPNAME5= <>
##$DPNAME6= <>
##$DPNAME7= <>
##$DPOAL= (0..7)
0.5 0.5 0.5 0.5 0.5 0.5 0.5 0.5 
##$DPOFFS= (0..7)
0 0 0 0 0 0 0 0 
##$DQDMODE= 0
##$DR= 18
##$DS= 0
##$DSLIST= <SSSSSSSSSSSSSSS>
$$ [...]
##$SUBNAM2= <"">
##$SUBNAM3= <"">
##$SUBNAM4= <"">
##$SUBNAM5= <"">
##$SUBNAM6= <"">
##$SUBNAM7= <"">
##$SUBNAM8= <"">
##$SUBNAM9= <"">
##$SW= 16.880792210976
##$SWIBOX= (0..15)
0 0 2 0 0 0 0 0 0 0 0 0 0 0 0 0 
##$SW_h= 3378.37837837838
##$TD= 16384
##$TD0= 1
##$TE= 0
##$TE2= 300
##$TE3= 300
##$TEG= 300
##$TL= (0..7)
0 120 120 120 120 120 120 120 
##$TP= (0..7)
150 150 150 150 150 150 150 150 
##$TP07= 0
##$TPNAME0= <>
##$TPNAME1= <>
##$TPNAME2= <>
##$TPNAME3= <>
##$TPNAME4= <>
##$TPNAME5= <>
##$TPNAME6= <>
##$TPNAME7= <>
##$TPOAL= (0..7)
0.5 0.5 0.5 0.5 0.5 0.5 0.5 0.5 
##$TPOFFS= (0..7)
0 0 0 0 0 0 0 0 
##$TUNHIN= 0
##$TUNHOUT= 0
##$TUNXOUT= 0
##$USERA1= <user>
##$USERA2= <user>
##$USERA3= <user>
##$USERA4= <user>
##$USERA5= <user>
##$V9= 5
##$VALIST= <valist>
##$VCLIST= <CCCCCCCCCCCCCCC>
##$VD= 0
##$VDLIST= <DDDDDDDDDDDDDDD>
##$VPLIST= <PPPPPPPPPPPPPPP>
##$VTLIST= <TTTTTTTTTTTTTTT>
##$WBST= 1024
##$WBSW= 4
##$XGAIN= (0..3)
0 0 0 0 
##$XL= 0
##$YL= 0
##$YMAX_a= 166197
##$YMIN_a= -147395
##$ZGOPTNS= <>
##$ZL1= 120
##$ZL2= 120
##$ZL3= 120
##$ZL4= 120
##$ABSF1= 10
##$ABSF2= 0
##$ABSG= 5
##$ABSL= 3
##$ALPHA= 0
##$AQORDER= 0
##$ASSFAC= 0
##$ASSFACI= 0
##$ASSFACX= 0
##$ASSWID= 0
##$AUNMP= <proc_1d>
##$AZFE= 0.1
##$AZFW= 0.1
##$BCFW= 1
##$BC_mod= 2
##$BYTORDP= 1
##$COROFFS= 0
##$CY= 11.3945322036743
##$DATMOD= 1
##$DC= 2
##$DFILT= <>
##$DTYPP= 0
##$F1P= 15.9154993809931
##$F2P= -4.1035820241983
##$FCOR= 0.5
##$FTSIZE= 0
##$FT_mod= 4
##$GAMMA= 1
##$GB= 0.15
##$INTBC= 1
##$INTSCL= 1
##$ISEN= 128
##$LB= 0.24
##$LEV0= 0
##$LPBIN= 0
##$MAXI= 10000
##$MC2= 0
##$MEAN= 0
##$ME_mod= 0
##$MI= 1.114404
##$NCOEF= 0
##$NC_proc= 0
##$NLEV= 6
##$NOISF1= 3.799351
##$NOISF2= 2.8
##$NSP= 1
##$NTH_PI= 0
##$NZP= 0
##$OFFSET= 15.70392
##$PC= 1
##$PHC0= -10688.07
##$PHC1= 9.60088
##$PH_mod= 1
##$PKNL= yes
##$PPARMOD= 0
##$PSCAL= 0
##$PSIGN= 0
##$REVERSE= no
##$SF= 200.130013532006
##$SI= 16384
##$SIGF1= 3
##$SIGF2= 2
##$SINO= 400
##$SIOLD= 16384
##$SREGLST= <1H.CDCl3>
##$SSB= 0
##$STSI= 0
##$STSR= 0
##$SW_p= 3612.71676300578
##$SYMM= 0
##$S_DEV= 0
##$TDeff= 0
##$TDoff= 0
##$TI= <>
##$TILT= no
##$TM1= 0
##$TM2= 0
##$TOPLEV= 0
##$USERP1= <user>
##$USERP2= <user>
##$USERP3= <user>
##$USERP4= <user>
##$USERP5= <user>
##$WDW= 1
##$XDIM= 8192
##$YMAX_p= 0
##$YMIN_p= 0
$$ End of Bruker specific parameters
$$ ---------------------------------
##NTUPLES= NMR FID
##VAR_NAME=  TIME,          FID/REAL,        FID/IMAG
##SYMBOL=    X,             R,               I
##VAR_TYPE=  INDEPENDENT,   DEPENDENT,       DEPENDENT
##VAR_FORM=  AFFN,          ASDF,            ASDF
##VAR_DIM=   8192,          8192,            8192
##UNITS=     SECONDS,       ARBITRARY UNITS, ARBITRARY UNITS
##FACTOR=    0.000296,      1,               1
##FIRST=     0,             0,               0
##LAST=      2.424536,      0,               0
##MIN=       0,             -147395,         0
##MAX=       2.424536,      166197,          0
$$ Real data points
##PAGE= N=1
##DATA TABLE= (X++(R..R)), XYDATA
$$ [...]
1965a295K516K48n43o79j098j213J264K370O14k046r34l88r7J336J573n8j411
$$ -1295 1221 1469 926 247 -851 -2064 -800 1570 2184 138 -796 -1184 -1281 55 1628 1570 159
1982A59j405l17R98J490R31q71j692p89O37O30J244R17j302k543K08J587J172
$$ 159 -1246 -1563 -565 925 1856 985 -707 -1496 -859 -229 1015 1932 630 -1913 -1705 -118 1054
1999A054Q6O7j118j650k60K030J594o78p95j063o82N33J489J250p04j746q13k14
$$ 1054 1140 1207 89 -1561 -1821 209 1803 1125 330 -733 -1415 -882 607 1857 1153 -593 -1406 -1620
2017a620J534J316L45j243j292k20M8J246J869l98k335j061Q22J064N35R33n87
$$ -1620 -86 1230 1575 332 -960 -1180 -1132 114 1983 1585 -750 -1811 -989 75 610 1543 956
2034I56j758j187J061J569P78n29p72j475j53J069J507K56o39j181j284N13J872
$$ 956 -802 -1989 -928 641 1419 890 118 -1357 -1510 -441 1066 1322 683 -498 -1782 -1269 603
2051F03R34n24j194o38n26P36J589J001j483j586R7M75J95J452P17j526k050M23
$$ 603 1537 1013 -181 -819 -1345 -609 980 1981 498 -1088 -991 -516 -321 1131 1848 322 -1728 -1305
2069a305J139R48L57n8j293j387L15J432J023K29j025j471m82J567P96L29m72
$$ -1305 -166 782 1139 1081 -212 -1599 -1284 148 1171 1400 375 -1096 -1578 -11 785 1114 642
2086F42o60j179k94J513J389l41j182n54l17R5J054J804r58j673n28L07R10Q04
$$ 642 -18 -1197 -1491 22 1411 1070 -112 -666 -983 -888 166 1970 1012 -661 -1189 -882 28 832
2104H32M40n06j755m23R88R11J054n58j314j032L84J052M71M10M6j318j442P89
$$ 832 1272 766 -989 -1412 -424 487 1541 983 -331 -1363 -979 73 544 954 1000 -318 -1760 -971
2122i71K010J46p38m92o73n82M24K009O09j618j015j99K37P48J486j52j299j206
$$ -971 1039 1185 447 -45 -718 -1300 -876 1133 1742 124 -891 -1090 -853 -105 1381 1229 -70 -1276
2140a276J31O95J327N34q72j224l31O20O22O89L93r43j821m3J704Q32l11J5p83
$$ -1276 -1145 -450 877 1411 539 -685 -1016 -396 226 915 1308 365 -1456 -1499 205 1037 726 741 -42
2159d2j144k46J937J029n99j183o14l8M89J144O94q85r71o53j5R11J459l9j137
$$ -42 -1186 -1432 505 1534 935 -248 -862 -900 -411 733 1427 542 -429 -1082 -1097 -186 1273 1234 97
2178I7r58K64j3Q35J203j34j934j002J185Q71J05K80Q3j568q44Q18J638L22p48
$$ 97 -861 -597 -610 225 1428 1294 -640 -1642 -457 414 519 799 882 -686 -1530 -712 926 1248 500
2197E00o98n14l35Q11J489k16o48j002m98N09J306N99p19r68k65j22J67J477O82
$$ 500 -198 -712 -1047 -236 1253 1037 389 -613 -1111 -602 704 1303 584 -384 -649 -771 -604 873 1555
2216A555j484j037J45M89L45P11M53j082j341L01Q09R23K30k59j300o50O81J012
$$ 1555 71 -966 -821 -332 13 724 1177 95 -1246 -945 -136 787 1017 758 -542 -1192 -511 501
2234E01L30lp64j102j38J149J121l99k30o10n52o36J287J491o06j073p05L43J37
$$ 501 831 828 64 -1038 -1176 -27 1094 695 465 -145 -697 -1333 -46 1445 839 -234 -939 -596 -459
2253d59O74J025q04j061l22M04N76O41M33q21j182N5O26N54O06q1j041j120N41
$$ -459 215 1240 436 -625 -947 -543 33 674 1107 286 -896 -841 -215 339 945 864 -177 -1297 -756
2272g56R84N65K7m78p51r26N18J459N64r30o06l73l48R75R90L03j183q90L2J01
$$ -756 228 793 820 342 -409 -1335 -817 642 1206 276 -330 -703 -1051 -76 914 1217 34 -856 -824 -723
2292g23J172K01J60j208n83J92O90O87N15p67r79o40R40N11M28K26o38j225J58
$$ -723 449 650 810 -398 -981 -789 -99 588 1103 336 -643 -1283 -343 168 596 822 184 -1041 -883
2311h83R12P74k20k44n43o41J05Q63Q70m86l60p73j74L01J271L30q08p94n48J78
$$ -883 29 803 583 339 -204 -845 -740 123 993 507 147 -626 -800 -499 772 1102 294 -500 -1048 -870
2331h70P80Q60P4p52r53M70L52K47P86j25j251q97P93M97L58K66k22q34m80P68
$$ -870 -90 770 844 92 -861 -391 -39 208 994 869 -382 -1279 -486 11 369 635 413 -421 -901 -133
2351a33P79pr9p23n03n3Q84O73j94n13m91o66K34J265N68o51j150lK19L46Q37
$$ -133 646 639 540 -183 -686 -739 145 818 624 111 -380 -1046 -812 453 1021 370 -780 -783 -564 -218 619
2372F19M36r88n83j22L20P31L02%r48m11j36Q21M95L34l07q42o50L69J113j6j10
$$ 619 1055 67 -516 -638 -318 413 715 715 -233 -644 -780 41 536 870 563 -279 -929 -560 553 537 427
2393D27k82r10l31J115O28o9m64l25m36K32M44R80m16r21j43nL13N60K75m0j075
$$ 427 145 -765 -1096 19 647 578 114 -211 -647 -415 29 1009 593 -328 -471 -476 -163 397 672 632 -443
2414d43m13M92N36P25n7n77r87N1P30K00K95P6p31p14P5J010K74j10k73o59K8
$$ -443 -856 -364 172 897 840 263 -724 -673 57 257 552 628 -103 -817 -742 268 542 432 159 -500 -472
2435d72M4R45N22p17n72l14j71Q62O11M0p67n65J39j30R73M04n91o41k98L62L92
$$ -472 -428 517 1039 322 -250 -564 -735 127 738 778 11 -554 -415 -545 428 832 241 -400 -698 -336 56
2456E6K08L87k34j048k82P48L41M17k52k69n01k62Q37O23k11l77n38l45J01Q28
$$ 56 264 651 417 -631 -913 -165 176 593 341 72 -429 -691 146 769 558 181 -357 -702 -601 227
2476B27O42n90k92o18M2L11P45J67o60l44k32N08q7N62L37p26n73K73K09K91N67
$$ 227 869 279 -13 -631 -589 -278 467 634 -26 -370 -602 -94 -181 381 718 -8 -581 -308 -99 192 759
2497G59j17r58m99O28K80J96k3j34m90j57L28O69Nj28l77o58pQ05N58l91l35n37
$$ 759 642 -316 -815 -187 93 289 266 132 -358 -515 -187 482 487 359 -18 -676 -683 122 680 289 -46 -583
2519e83O6J77Q50L48m42q11k04K54K56N37L03p93n63Q6N25L17m0K55o29o34K85
$$ -583 -517 -340 510 858 416 -395 -599 -345 -89 448 751 -42 -605 -519 6 323 283 538 -91 -725 -440
2540d40M53K67J22r6n30m03M17J29P19m36o6n52k31P78N54J31q02k98k14r6N36
$$ -440 13 280 402 306 -224 -627 -210 -81 638 202 136 -416 -647 131 685 816 14 -284 -498 -594 -58
2561e8P89l51n83o9q4L17L22K83l32n88j85L35M06Q7K24n61m60L1N51L60L6j58
$$ -58 731 380 -203 -272 -356 -39 283 566 234 -354 -539 -204 202 289 513 -48 -508 -477 74 434 470 312
2583C12n55m39L88M84L24k54l29p6n43N09L80K20j42l39n46K77J87P29r8p06m16
$$ 312 -243 -682 -294 190 514 260 -69 -145 -688 -179 201 421 279 -60 -606 -329 -142 587 489 -217 -633
2604f33J25K58N11L13m24k65l03P8M48K21J07m17o27K0L44N69K5r0m33l3l54O04
$$ -633 -508 -250 261 574 150 -115 -418 -340 108 329 436 19 -608 -588 -244 325 350 260 -173 -206 -560 44
2626D4J45m2j97k78m34M09N42K88l78k64l72j61O17P47j0n24l17j94l5Q8P98J23
$$ 44 189 147 -50 -328 -762 -353 189 477 99 -165 -537 -698 -81 666 656 132 -185 -379 -414 -326 472 595
2648E95p04jm28P75J15k5l71k44k11R1O14K8Jk96m05p8M14N57K51n22n06j06K34
$$ 595 -109 -110 -538 237 352 327 -44 -288 -499 -408 206 234 235 -61 -466 -544 -130 427 678 156 -350 -456 -222
2671b22J39O97m54m01k22k4M4Q07L97n03n66k39K33N8N02Q1l95k36k00L32M35
$$ -222 -83 614 160 -241 -463 -487 -443 364 761 258 -308 -547 -314 -256 246 327 -68 -304 -504 -172 263
2692B63K76l01n83k50J41L82L17K52m78j52l99M86M46J04l90m0m07k30O13M21
$$ 263 539 238 -345 -595 -454 -72 245 497 19 -133 -532 -46 400 504 114 74 -333 -563 50 471
2712D71m2k98n14R8q9N21M49m65l38M3j22K54L42K34m94n00j35M47K71K26L4l26
$$ 471 429 131 -383 -285 -374 147 596 131 -207 -164 -286 -32 310 544 50 -450 -585 -138 133 359 393 67
2734F7q65L47N61m5K09q9m37m63M95L14L4j5j5m27PL2O09Q7n14pl73J52L84N56
$$ 67 -798 -451 110 65 274 185 -252 -715 -220 94 128 113 98 -329 -322 -290 319 406 -108 -115 -488 -336 48 604
2758F04k82k75m52J58L7M55J66l92k33k83K31K87J25L44k41o35M5J66K98O9M2
$$ 604 322 47 -405 -247 -210 245 411 19 -214 -497 -266 21 146 490 249 -386 -341 -175 123 192 234
2779B34k64m39P8M15M75j76k40j34m70K63N68K00j76o26n4J12J8O40q9l17l20
$$ 234 -30 -469 -391 24 499 323 83 -51 -521 -258 310 510 334 -292 -346 -234 -216 424 335 18 -302
2800c02j18K70n8L41J86l20l83O6J81L81j52K5l37j4K86O4J63k78M7k05m54O45
$$ -302 -420 -150 -208 133 319 -1 -384 -318 -137 244 92 117 -220 -234 52 116 279 1 48 -157 -611 34
2822C4K35J59m40j40l64L4N58M24m48q9o5N0Q1J61L72o01o4k05n8M09K36K57n78
$$ 34 269 428 -12 -152 -516 -482 76 500 52 -37 -102 -52 29 190 562 -39 -103 -308 -366 43 279 536 -42
2845d2j75RL35p4q0K16m23j18J76M24p4J9K2p19q0K75Q09m32j69j27K5o4K12M16
$$ -42 -217 -208 127 53 -27 189 -234 -352 -176 248 174 193 215 -504 -584 -309 500 68 -101 -228 -203 -267 -55 361
2869C61Nl01j03j6j88J87M55k41l43j98K61N9K27J59p6m54o8J92K27j55K20j87
$$ 361 366 65 -38 -54 -242 -55 400 159 -184 -382 -121 -62 165 324 248 -206 -274 -82 145 -10 210 23
2891B3l53L49N1J34K75j5n80k76M95M3o6j99J74n5m07K51L05M89o39k57J09K4
$$ 23 -330 19 70 204 479 464 -116 -392 103 146 80 -119 55 0 -407 -156 149 638 -1 -258 -149 -125
2913a25K27M58j71l58m85K62J70N9L27j83m93k1L58K77k81K88j79l57l40M45J17
$$ -125 102 560 389 31 -454 -192 -22 37 364 181 -312 -333 25 302 21 309 130 -227 -567 -122 -5
2934eK62K2l07j20J29L19J94n14K52l18j46J77R7L36j09l58k04M34k15Q6N15o66
$$ -5 257 279 -28 -148 -19 300 494 -20 232 -86 -232 -55 42 378 269 -89 -293 141 -74 12 527 -139
2956a39l70M33n1P6L09M1k57j09k68M03j48L27m8m78j34M27J53P8J68m79j79q9
$$ -139 -509 -76 -127 -51 258 299 42 -67 -335 68 -80 247 199 -279 -413 14 167 245 413 -66 -245 -334
2978c34K09M16m5j78o3k0j67M23R6m04J38k77J75k43L52L70m27l55r3L98j7J78
$$ -334 -125 291 246 68 5 -15 -182 241 337 -67 71 -206 -31 -274 78 448 21 -334 -427 -29 -46 132
3000A32J97m54p4J34J31K41j41k2l20l65K64N78l4J83m12k48j58J15P72l51j95
$$ 132 329 -125 -199 -65 66 307 166 144 -176 -541 -277 301 267 450 38 -210 -368 -253 519 168 -27
3021b7N2j13j88L74m6K30n01m9K22J11N1J45p9k06p1N9j5J87M3j45k71JK77P4
$$ -27 25 -88 -276 98 52 282 -219 -268 -46 65 116 261 182 -24 -95 -36 -51 136 179 34 -237 -236 41 115
3045A15P0R1k78L3k07M71o4M5l0m95Qj91Q53j65k89r1k13q2N66M6j4j16k56N8
$$ 115 185 276 -2 31 -176 295 231 276 246 -249 -241 -432 421 256 -33 -124 -337 -419 147 193 179 63 -193 -135
3069a35R6J85K06j85l46M3j26K87L04M2k89l35J06K87j35J3J24l08L7j02J91K26
$$ -135 -39 146 352 167 -179 -136 -262 25 329 371 82 -253 -147 140 5 18 142 -166 -129 -231 -40 186
3091A86lk86L38m35k7N75j76r0l36P6L5k2M68Q7l83j29K7mJ51K06M8l99k47K67
$$ 186 183 -103 235 -200 -227 348 172 82 -254 -178 -143 -165 303 390 7 -122 -95 -99 52 258 306 -93 -340 -73
3115g3K05j67L48p2l50k56J62K10O3J11j61k80Q5K51L01m41N2M3j64k04K08M01
$$ -73 132 -35 313 241 -109 -365 -203 7 70 181 20 -260 -175 76 377 -64 -12 31 -133 -337 -129 272
3137B72l7l02l01K3K65K06J83J9m21o7o6J80K80j29j1l35mK07m7K94p7m3m03M00
$$ 272 235 -67 -368 -345 -80 126 309 328 -93 -160 -226 -46 234 105 94 -241 -245 -38 -85 209 132 89 -314 86
3161H6l04M19O5p1n40K11N4R8K95l31o2N7k46M05j16J38j09j34J28J9J40J85o7
$$ 86 -218 201 266 195 -345 -134 -80 18 313 -18 -80 -23 -269 136 20 158 49 -85 43 62 202 387 320
3184C20m68P6P2O2n5J72Mj79l17J44n8K52L72j79k71o0J07j03K00K02l58j63L28
$$ 320 -148 -72 0 62 7 179 183 4 -313 -169 -227 25 397 218 -53 -113 -6 -109 91 293 -65 -228 100
3207A00J14o4m5j38r3j67J60K92l4j30j25rj59M34L34j60l55J57m20K50R8L25
$$ 100 214 150 105 -33 -126 -293 -133 159 125 -5 -130 -139 -298 136 470 310 -45 112 -308 -58 40 365
3229C65l67j42k1K0L11j05K32k28l66L48k59K07K62k61n8Kp1K70m7O5l25J1m2
$$ 365 -2 -144 -165 -145 166 61 293 65 -301 47 -212 -5 257 -4 -62 -60 -131 139 92 157 -168 -157 -199
3252a99K25K74j17j19r6j33j98L52J48k09j15M3Q6KP2P3M1J15l93p4P1L75J1k17
$$ -199 26 300 183 64 -32 -165 -363 -11 137 -72 -187 -144 -58 -56 16 89 130 245 -148 -222 -151 224 235 18
3276A8j84o7M09l09J47O5p6j00k3J28k31O07l61p8k53K10J34J22J29k47l4r1R1
$$ 18 -166 -233 176 -133 14 79 3 -97 -120 8 -223 384 23 -55 -308 -98 36 158 287 40 6 -85 6
3299FJ35L03m01j69j49q7K25K03Q0p3j45j25N0J91RJ32k59p2l4J32M0m5J4N1j39
$$ 6 141 444 43 -126 -275 -362 -137 66 146 73 -72 -197 -147 44 53 185 -74 -146 -180 -48 -8 -53 -39 12 -127
3324a27j34L59j74K82l28M3l10L63Q8J33j04o6k23Q9J43K49J48m52m8p7J40R6
$$ -127 -261 98 -76 206 -122 -79 -389 -26 62 195 91 25 -198 -109 34 283 431 -21 -69 -146 -6 90
3346I0L56m46q2k83L49m1J66j30J0k03J35K2J48L9O5j9o97L76J00L23j37j14O5
$$ 90 446 0 -82 -365 -16 -57 109 -21 -11 -214 -79 -57 91 130 195 176 -521 -145 -45 278 141 27 92
3369I2l08K83K5j08K4q8m3j36L30J26o3l73K22j28L07q2p4J99l38j27J52mK82
$$ 92 -216 67 92 -16 8 -80 -123 -259 71 197 134 -239 -17 -145 162 80 6 205 -133 -260 -108 -112 170
3392A70j11k40Q7j02O14r7p9j03k12j53K79J81o3j64k6K2j01j0J26n5P6l9j9k5
$$ 170 59 -181 -94 -196 418 321 242 139 -73 -226 53 234 171 7 -19 3 -98 -108 18 -37 39 0 -19 -44
3416d4j5M1K22j36j08m6q0M1M88p3k77k28RL40l1j1k1j62k11J39J53M4l7K00l66
$$ -44 -59 -18 204 68 -40 -86 -166 -125 363 290 13 -215 -206 134 103 92 71 -91 -302 -163 -10 34 -3 197 -169
3441a69m2K63R%j56j7JK8J75N1rm29K2K15q3L40J63k61k3k04J02o6Q2J71n1j18
$$ -169 -211 52 61 61 -95 -112 -111 -83 92 143 134 -295 -273 -58 -141 199 362 101 78 -126 -24 -90 -8 163 112 -6
3467fpj4j23K81k10J99n31J99K23K78l72N6l7o8l3K35K42m24P9k7J25k60J08P5
$$ -6 -13 -27 -150 131 -79 120 -411 -212 11 289 -83 -27 -64 -132 -165 70 312 -112 -33 -60 65 -195 -87 -12
3491a2LJ05l45J13L18j29J32m37M9J05J13J76q5q3K4q4J8R0Q0J46l89j1l8K32
$$ -12 -9 96 -249 -136 182 53 185 -252 -203 -98 15 191 106 23 47 -37 -19 71 151 297 -92 -103 -141 91
3515I1N5P4j95K55n26K40j51J79N2P2l66M0J63K02N5q6l43K73k03J30J89m1O0
$$ 91 146 220 25 280 -246 -6 -157 22 74 146 -220 -180 -17 185 240 154 -189 84 -119 11 200 159 219
3538B19n24K18J52j26K34o4k76L2J12J02M4j55K74l32J25j77L89j64n2j03R0L8
$$ 219 -305 -87 65 -61 173 109 -167 -135 -23 79 123 -32 242 -90 35 -142 247 83 31 -72 18 56
3560E6j3J24m5O5k41O2R9j29M28k80k06R4k08K19m1k2L1q5m7Q7N5j04L05k94J13
$$ 56 43 167 122 187 -54 8 107 -22 406 126 -80 14 -194 25 -16 -38 -7 -92 -139 -52 3 -101 204 -90 23
3585B3j42J33r1J76r1j13J85m4Mj62N82o18M6p1J10J30j0nj28k7n1L47q3j21n6
$$ 23 -119 14 -77 99 8 -105 80 36 40 -122 460 -158 -112 -183 -73 57 47 42 -86 -113 -164 183 100 -21 -77
3610g7J15J6j12J86N6k10J32j5j67K46k42J44J42L8k75m3J98j43K14r8n6q3m0
$$ -77 38 54 -58 128 184 -26 106 91 -76 170 -72 72 214 252 -23 -66 132 -11 203 105 49 -34 -74
3633g4K27q9L2k9k24K56k29L71p7j97K38r6J15j40R8j67K2l08J05O8K27k6m03
$$ -74 153 64 96 67 -157 99 -130 241 164 -33 205 109 224 84 182 15 37 -271 -166 -98 129 103 -300
3656c00K17j10K40J47R1j96l37rK72N7k09J67m5l2j44K29r9J40n2k19R1J68k88
$$ -300 -83 -193 47 194 285 89 -248 -257 15 72 -137 30 -15 -47 -191 38 -61 79 27 -192 -101 67 -221
3679b21J12M8r9J52m4k12M00K49m86J13p2J56k35O22l41m12J51J34n4l5J48J0
$$ -221 -109 -61 -160 -8 -52 -264 136 385 -101 12 -60 96 -139 483 142 -270 -119 15 -39 -74 74 84
3701H4J09j13k25J53M7n6n4j1kj43K39K20k14k6k89J41Qn3K36k73RN8J93j06K62
$$ 84 193 80 -145 8 55 -1 -55 -66 -68 -211 28 248 34 8 -281 -140 -132 -185 51 -222 -213 -155 38 -68 194
3726A94k71K27l50O4L06k06P6L8j8K22n21L57J20k01l20J92K81j16p7j24K9l0
$$ 194 -77 150 -200 -136 170 -36 40 78 60 282 -239 118 238 37 -283 -91 190 74 -3 -127 -98 -128
3748a28j44K94j51j07K20L6k39L77k38l8K31J23l73L40j27k42O26m60M2j05m8
$$ -128 -272 22 -129 -236 -16 20 -219 158 -80 -118 113 236 -137 203 76 -166 460 0 42 -63 -111
3769a11k45N12j0r1J22l55Q6L8RJ23J52l23M4K07kk21k4j18R9n5K74Qj70k1J62
$$ -111 -356 156 146 55 177 -178 -92 -54 -45 78 230 -93 -49 158 156 -65 -89 -207 -108 -163 111 119 -51 -72 90
3794I0j41q9R0pl0L99l47j32J9K48k5m3j35p3L39k17K00k24l1J91O1k1J29j94
$$ 90 -51 -140 -50 -57 -87 312 -35 -167 -148 100 75 32 -103 -176 163 -54 146 -78 -109 82 143 122 251 57
3818E7rj33N6k7P5k73K32j62P0N8Q6M0O9j06j8j3N1MJ20j58N5l75L54m8l23L00
$$ 57 48 -85 -29 -56 19 -254 -22 -184 -114 -56 30 70 139 33 15 2 53 57 177 19 74 -301 53 5 -318 -18
3844a8l8j91J07J40J26M6k18J24o1j45M9R6K3J6p8K4J72k64N3K84j78j77rK23
$$ -18 -56 -247 -140 0 126 172 -46 78 17 -128 -79 17 40 56 -22 2 174 -90 -37 247 69 -108 -117 106
3868A06J35K26m02k12lm0K49r8K09m49j54N47l28K22K6K56k25j31q9J11r7J22
$$ 106 241 467 65 -147 -150 -190 59 -39 170 -279 -433 114 -214 8 34 290 65 -66 -155 -44 -141 -19
3890a9K32k96j63M6kQ5L36l40N0m1j07K04m9l0K1J3J74j09J1K46l99K55J33k42
$$ -19 213 -83 -246 -200 -202 -117 219 -121 -71 -112 -219 -15 -64 -94 -73 -60 114 5 16 262 -137 118 251 9
3914Im6j8J09J33n47L90q8Q9j68mP8o9j2K70j00P6k2j69o3R9j06P9J87k13nK36
$$ 9 -37 -55 54 187 -360 30 -58 31 -137 -141 -63 -132 -144 126 26 102 80 -89 -152 -53 -159 -80 107 -106 -111 125
3940A25l2j47o3k7k9r1M87k3k39M1k05K54JR2q9j77M24j30n41L37K04j01N1l50
$$ 125 93 -54 -117 -144 -173 -264 223 200 -39 2 -203 51 52 144 55 -122 302 172 -369 -32 172 71 122 -228
3964b28N4J00J79k9o1J58l24J8nJ08N5L9J84l97o1n8L78J87k44k68Q0K11K5l01
$$ -228 -174 -74 105 76 15 173 -151 -133 -138 -30 25 64 248 -149 -210 -268 110 297 53 -215 -135 76 101 -200
3988b00M4K47k34J3p0L25jj85R2l5L5r8J04k0j34K06k50L39j74r6K12j17jR8M7
$$ -200 -156 91 -143 -130 -200 125 124 -61 31 -4 31 -67 37 17 -117 89 -161 178 4 -92 120 3 2 100 147
4013A47j78l76N55j45J53l81J94Qk56L15j00m3Q4p4R1q7O2K6j24L04k31m%j05
$$ 147 -31 -407 148 3 156 -225 -31 -23 -279 36 -64 -107 -23 -97 -6 -93 -31 -5 -129 175 -56 -60 -60 -165
4037a65K41o2J1Po3k2k25K17K78j38k71J3K04P5K53m64L25j95n7j30Q9J70p6J08
$$ -165 76 14 25 32 -31 -53 -278 -61 217 79 -192 -179 25 100 353 -111 214 19 -38 -168 -79 91 15 123
4061A23j00Jk66K88j41J90k92J87k92K61J01n9O6r8K2o1Q3J96l5j66j17J5r8L68
$$ 123 23 24 -242 46 -95 95 -197 -10 -302 -41 60 1 67 -31 -9 -70 13 209 174 8 -109 -94 -192 176
4085A76Q6k38j07K14L4j98L35l40O8j98K21j82k2J27k83L09J11l24K28K5K8L0
$$ 176 262 24 -83 131 165 -33 302 -38 30 -168 53 -129 -151 -24 -307 2 113 -211 17 42 70 100
4107A00k01LJ28J72k79mK1J11k62L18r8K52l12J8k46J66J63oJ00o5k10k4K38K02
$$ 100 -101 -98 30 202 -77 -81 -60 51 -211 107 9 261 -51 -33 -279 -113 50 44 144 79 -131 -155 83 285
4131B85k51j02q0K79n7l5j27j3KJ46N4j75J70j65K05N1j05j88m7J31q5J52J3j43
$$ 285 34 -68 -148 131 74 39 -88 -101 -99 47 101 -74 96 -69 136 187 82 -106 -153 -22 -107 45 58 -85
4155h5J05j52L34k44j36O8L21k53j33J33j68M65l66J70k71K85l4j42q0N7L3K32
$$ -85 20 -132 202 -42 -178 -110 211 -42 -175 -42 -210 255 -111 59 -212 73 39 -103 -183 -126 -93 139
4177A39J45j74m6l85M12j82O3M6m6j60J05K91m25L58k65p5L09J6j8j66K2j74K14
$$ 139 284 110 64 -321 91 -91 -28 18 -28 -188 -83 208 -217 141 -124 -199 110 126 108 -58 -36 -210 4
4200Dm8k36N20p7l34J61N7k93K99k97K48QK17m22J04J36k3l6K8j70m3L44P0k06
$$ 4 -44 -280 240 163 -171 -10 47 -246 53 -244 4 12 229 -193 -89 47 24 -12 16 -154 -197 147 217 11
4224A1k76J92k3J13N6p3k19J60M2N2M9p3j0K8Mk9j21jK90l1k69J69p9L03j66l1
$$ 11 -265 -73 -96 17 73 0 -219 -59 -17 35 84 11 1 29 33 4 -117 -118 172 141 -128 41 -38 265 99 68
4250F8L5j98jO9K30n10K53l7j80K27J06J9j85K26j78j9J64J1j1j6k57J43j3r7
$$ 68 103 -95 -96 -27 203 -307 -54 -91 -271 -44 62 81 -104 122 -56 -75 89 100 89 73 -184 -41 -54 -151
4274a51l2K76q8j7r9J44L68l18j09r1L5r0R2K58n7l01o6J08K81p1J20j45j47J29
$$ -151 -183 93 5 -12 -111 33 401 83 -26 -117 -82 -172 -80 178 121 -180 -246 -138 143 72 192 47 -100 29
4298B9j54J36J19m4J28n3k88K32r8N1j64J10K5j51L3j7J33P0j81P1n9M0j01pR5
$$ 29 -125 11 130 86 214 161 -127 105 7 58 -106 4 29 -122 -89 -106 27 97 -84 -13 -72 -32 -133 -140 -45
4323d5p7J26J58r9j22K36j76nr9K9j2J4p6L2kP9J8j37L07k41j19K82o1QJ36k62
$$ -45 -122 4 162 63 -59 177 1 -4 -103 -74 -86 -72 -148 -116 -118 -39 -21 -158 149 -92 -211 71 10 18 154 -108
4349a08lR1P6J3j66J02j21q2l9J72J67K5M5l37K38K64k22j96R3k6j11j20K09j39
$$ -108 -111 -20 56 69 -97 5 -116 -198 -237 -65 102 127 172 -165 73 337 115 -81 12 -14 -125 -245 -36 -175
4373a75R7K87n5k10j25M02j08Jk62oJ99l8r9K64k41r3N6N4j4J52j79Q1P6O1j70
$$ -175 -78 209 154 -56 -181 221 113 114 -148 -154 45 7 -92 172 -69 -162 -106 -52 -66 86 -93 -12 64 125 -45
4398d5J63J07m4j61N1K9N0k22L12j97oO9j94J86n2j25Q8r6K86o8k10K46q4j69
$$ -45 118 225 181 20 71 100 150 -72 240 43 37 106 -88 98 46 -79 9 -87 199 131 -79 167 83 -86
4422h6J9O1q6K31p1k07L08k95nK37O9j71l3j06L57j84J45o8j96J03n8k13K28j69
$$ -86 -67 -6 -92 139 68 -139 169 -126 -131 106 175 4 -29 -135 222 38 183 115 -81 22 -36 -249 -21 -190
4446a90K09J9j6L8k57L59j70N5P2j68J15J1k46K05l7L8M3j24J12Jn1l55J57K12
$$ -190 19 38 22 60 -197 162 -8 47 119 -49 66 77 -169 36 -1 37 80 -44 68 69 18 -337 -180 32
4470C2j67L8J57J21l69K12p5j9J74j4l14K76J36J88m49K40j83J50j62J21p5P1
$$ 32 -135 -97 60 181 -188 24 -51 -70 104 90 -224 52 188 376 -73 167 -16 134 -28 93 18 89
4492H9j43j26K95J35j92K89k93l21K90N6l8q4r9J91q1J68l06J16J46R9l44l7J08
$$ 89 -54 -180 115 250 58 347 54 -267 23 79 41 -43 -142 49 -32 136 -170 -54 92 191 -153 -190 -82
4515h2J65k43Q0J92k69M79k33k64J72K14l1l41L20j82n6l2M18m00J57n7n9j62
$$ -82 83 -160 -80 112 -157 322 89 -175 -3 211 180 -161 159 -23 -79 -111 307 -93 64 7 -52 -214
4537b14K19j06j05K52p4L18k28k25J66k4P8r7K34p9p4O3k92L1J14R1j48L3O2J38
$$ -214 5 -101 -206 46 -28 290 62 -163 3 -21 57 -40 194 115 41 104 -188 -157 -43 48 -100 -67 -5 133
4561A33k15K07l9m0j57J11J30j15K4nj09o8K66K7r6l7J32j84K22l3m9r7m0J58
$$ 133 -82 125 86 46 -111 0 130 15 39 34 -75 -143 123 150 54 17 149 -35 187 154 105 8 -32 126
4585A26k51K45k02k1J45rp4k30K60l1J36j80k08K56P3mj71N7K82k96r6R0J04Q1
$$ 126 -125 120 -82 -103 42 33 -41 -271 -11 -42 94 -86 -294 -38 35 31 -140 -83 199 -97 -193 -103 1 82
4609H2jj3l6j72K8L49m18j05K33oj33K23Q7j57K65J76n79K06l8k42L73j91J62
$$ 82 81 68 32 -140 -112 237 -181 -286 -53 -59 -192 31 118 -39 226 402 -177 29 -9 -251 122 -69 93
4632I3j8j44K03j59q4O1K37k87J30o8k2J18lr7j26K21K0j8k22J45n9kJ60J05k51
$$ 93 75 -69 134 -25 -109 -48 189 -98 32 -36 -58 60 57 -40 -166 55 75 57 -165 -20 -79 -81 79 184 -67
4657f7R9P4k79J57k80j26K62K27l73L66j65J75j32N8o6K2o3K57M5k46J56l95L42
$$ -67 32 106 -173 -16 -296 -422 -160 67 -306 60 -105 70 -62 -4 -70 -48 -111 146 191 -55 101 -294 48
4680D8O0k36J9J87k21M48k67k2J79l60P3j88M62r4m1J00k16K11j59K1N0qm0K25
$$ 48 108 -128 -109 78 -143 305 38 16 195 -165 -92 -280 182 88 47 147 -69 142 -17 4 54 46 6 231
4704B31j96j95J73J02r6J42lk55J67j64J65M9k04K95k90nM0J32n9k07L67o14N20
$$ 231 35 -160 13 115 19 161 158 -97 70 -94 71 120 -84 211 -79 -84 -44 88 29 -178 189 -425 95
4727I5k08N5k64L30J36l17J44R7j58n6J41k1J23j33k2M5j4k6K06l27J68j60J46
$$ 95 -113 -58 -322 8 144 -173 -29 68 -90 -146 -5 -26 97 -36 -58 -13 -27 -53 153 -174 -6 -166 -20
4750b0J66j13J18j68M1j60Q8l0k00L56j50J34j00k52K86P6n8K10k77M8j03J96
$$ -20 146 33 151 -17 24 -136 -48 -78 -278 78 -72 62 -38 -290 -4 72 14 224 -53 -5 -108 88
4772H8j23J15K17m96J50L02k68J66j37r8L6J57R2l27J01J03l2K6q1L4k03K02k39
$$ 88 -35 80 297 -199 -49 253 -15 151 14 -84 -48 109 201 -126 -25 78 46 72 -9 25 -178 24 -215
4795b15J23O9J41j72J59q7K5j41p1L88j76n5o2j59K98k16n6J58P4L1j53o0k8K66
$$ -215 -92 -23 118 -54 105 18 43 -98 -169 219 43 -12 -74 -233 65 -151 -207 -49 25 56 -97 -157 -185 81
4819H1j95J11n2O3j34K40k66Oj1M61k90N6l08L96k75J71R1M4k2k9k24N7k6j3J98
$$ 81 -114 -3 -55 8 -126 114 -152 -146 -157 304 14 70 -238 158 -117 54 145 189 167 138 -86 -29 -55 -68 130
4844A30o3j62K25l3j68k6m5J89k1j97J90j3m9J76l00P3K5O1J4j50J10J32k63%
$$ 130 67 -95 130 97 -71 -97 -142 47 26 -171 19 6 -43 133 -167 -94 -69 -8 6 -144 -34 98 -165 -165
4868a65P5Q5Q5j1N9k52J31K18k69m9k4j07J29M8L61l38P5j49N0n6n1J23L5P7k29
$$ -165 -90 -5 80 69 128 -124 7 225 -44 -93 -117 -224 -95 -47 314 -24 51 -98 -48 -104 -155 -32 3 80 -149
4893a49J56l9J18M7o2p0o1k37L58K40l48J7L5J42j02k78K98J75k68j40J06K46
$$ -149 7 -32 86 133 71 1 -60 -297 61 301 -47 -30 5 147 45 -233 65 240 -28 -168 -62 184
4915A84m27K84J57l23K36l07M25k48N8R6j23j04K4k7K28k96Q3r5j13L06r5j0N9
$$ 184 -243 41 198 -125 111 -196 229 -19 39 135 12 -92 -68 -95 133 -163 -80 -175 -288 18 -77 -87 -28
4938b8N1j49K12O9Q5r6j84L60m00J08K5j17p6L32k84j22L35k01km8K89o7q5J52
$$ -28 23 -126 86 155 240 144 -40 320 -80 28 53 -64 -140 192 -92 -214 121 -80 -82 -130 159 92 7 159
4962A59j0j32l8l5J11Q4Mj50k30K17P1l4q5J26j87K1K2J57j43J06P8J39j33j78
$$ 159 149 17 -21 -56 55 139 143 -7 -237 -20 51 17 -68 58 -129 -108 -86 71 -72 34 112 251 118 -60
4986f0r6K77j28J23l0O2n8o7j13J76k45K37n2O7k16M18l82m8L6Q2r4K04Q2j89
$$ -60 -156 121 -7 116 86 148 90 23 -90 86 -159 78 26 93 -123 295 -87 -135 -99 -17 -111 93 175 -14
5010a4J59l63K30k55K35j90J75r5J14Q2J7N0l09P1M03k61k15J27P1j41J16j3j7
$$ -14 145 -218 12 -243 -8 -198 -23 -118 -4 78 95 145 -164 -93 310 49 -166 -39 32 -109 7 -6 -23
5033b3K2l3P5q3L25l14p7P5j95P3J0K88j76K95k83j02J76j36J48j14J04O4m09
$$ -23 -1 -34 41 -42 283 -31 -108 -33 -228 -155 -145 143 -33 262 -21 -123 53 -83 65 -49 55 119 -290
5056b90J44L5J94r1m4J44j09j01K63J55k75L7j02L6K77j40K3r1N1O8l59K20o1
$$ -290 -146 -111 83 -8 -52 92 -17 -118 145 300 25 62 -40 -4 273 133 156 65 116 184 -175 45 -16
5079a6O2r5K3Q0j0m7k35mM36J05k21k78r8M07n9j39OK16r7P1J82j80k41L4J34
$$ -16 46 -49 -26 54 44 -3 -238 -242 194 299 78 -200 -298 109 50 -89 -83 133 36 107 289 109 -132 -98 36
5104C6p6j64Q8l8N2M6k24L90J84k16j73J48J79k95P1j80J19J34j05Qk53O9N9K32
$$ 36 -40 -204 -116 -154 -102 -56 -280 110 294 78 -95 53 232 -63 8 -172 -53 81 -24 -16 -269 -200 -141 91
5128I1k44J48j31Q5J20n4RJ11L3l13K57O8k15J64n0J05k76L8mK11j95J70k84M4
$$ 91 -153 -5 -136 -51 69 15 24 135 168 -145 112 180 -35 129 79 184 -92 -54 -58 153 -42 128 -156 -112
5152a12m8Q3J10j32k1k3J21M6j82m9L26k38L38k50l3R9J99k27j89R8J56q7o7o4
$$ -112 -160 -77 33 -99 -120 -143 -22 24 -158 -207 119 -119 219 -31 -64 35 234 7 -182 -84 72 -15 -82 -146
5176a46N4L65j66m0P4L8j86Jj6J03N5j40N0OlJ09k50k16L57r3L80l27j93J51J16
$$ -146 -92 273 107 67 141 179 -7 -6 -22 81 136 -4 46 52 49 158 -92 -308 49 -44 336 9 -184 -33 83
5201H3j68oJ16L2j54J20J24j52KK2j67M15n49K18J22l82N99j34n5l26J79L12j83
$$ 83 -85 -91 25 57 -97 23 147 -5 -3 19 -148 267 -282 -64 58 -324 275 141 86 -240 -61 251 68
5224F8k82K50k70K75o6R3j1n9j4Q9J7j58R9J63j16k77L10l67M25j15m6J89j63
$$ 68 -214 36 -234 41 -25 68 57 -2 -16 73 90 -68 31 194 78 -199 111 -256 169 54 8 197 34
5247C4j08P8p9m8l4J97j32J01p0j20q8K60j97L32J73j92k95J14k00K72J11l4p0
$$ 34 -74 4 -75 -123 -157 40 -92 9 -61 -181 -269 -9 -206 126 299 107 -188 -74 -274 -2 109 75 5
5270En7l34L42J15j25K77k78q2J45km9J38O7L3j62qJ05q6N2j38N9O0j67J15o2
$$ 5 -52 -386 -44 71 -54 223 -55 -137 8 6 -43 95 162 195 33 25 130 44 96 -42 17 77 -90 25 -37
5295c7K66m35J64j28K49k33K21l38L85j00j05%K21J29l60L29n13M87j70K18k76
$$ -37 229 -206 -42 -170 79 -154 67 -271 114 14 -91 -91 130 259 -101 228 -285 202 32 250 -26
5316b6J9J29j31M9k35K95r1o4J90m11M41q5k0j9j33L47k24J64l11K22j38N3O3
$$ -26 -7 122 -9 40 -195 100 9 -55 135 -276 165 80 60 41 -92 255 31 195 -116 106 -32 21 84
5339H4L0k68J80j14K66rk55mJ54m0k07K42j91M96m41M3L7P3k38J87J10m1k5m0
$$ 84 114 -154 26 -88 178 169 -86 -90 64 24 -183 59 -132 364 -77 -34 3 76 -162 25 135 94 69 29
5363B9j22r7P2q3J27oJ54l22m1K41oJ61k00P3P0L3Q9k66K16j81q5J64k75J25M94
$$ 29 -93 -190 -118 -201 -74 -80 74 -248 -289 -48 -54 107 -93 -20 50 83 172 -94 122 -59 -144 20 -255 -130 364
5388C64n18r9L11P7j80N6J6j26j37J77j52Q6O4N5j55N4J03N3J30k51K05m6k15
$$ 364 -154 -253 58 135 -45 11 27 -99 -236 -59 -211 -125 -61 -6 -161 -107 -4 49 179 -72 133 87 -128
5411a28J00M2k56J75M8J13r5k43K28J91k79J2L05k52J2J10P7j15q0L4J03j40q9
$$ -128 -28 14 -242 -67 -19 94 -1 -244 -16 175 -104 -92 213 -39 -27 83 160 45 -35 -1 102 -38 -127
5434a27R7j54J15J96Jp9Pj57J31l8J59k8j12l3K05j1k08M3m6K43j46j39k9L4r5
$$ -127 -30 -184 -69 127 128 49 56 -101 30 -8 151 123 11 -22 183 172 -36 7 -39 204 58 -81 -110 -76 -171
5459a71J92J40Q9j72p7J77J16n34J97R2j4J57j06mP5k75J41k4K26j81j73J85k05
$$ -171 21 161 250 78 1 178 294 -240 -43 49 35 192 86 82 157 -118 23 -1 225 44 -129 56 -149
5482a49M2K43RQk83J31m7L7J52j33j68L13p2k68K35j21O3r3K96k57M8K9J03l00
$$ -149 -107 136 145 153 -130 1 -46 -9 143 10 -158 155 83 -185 50 -71 -8 -101 195 -62 -14 15 118 -182
5506a82K97j11j18J99L1m3K02m45L36p5J75m06P9k5n7K6J2L4M5n0j71J93jPj44
$$ -182 115 4 -114 85 116 73 275 -170 166 91 266 -140 -61 -86 -143 -117 -105 -71 -26 -76 -247 -54 -55 -48 -192
5531a92K70j25j0J27J42m07P3j15L39j64m6J20p1K23m5k26J15L5j5j02M0p8K59
$$ -192 78 -47 -57 70 212 -195 -122 -237 102 -62 -108 12 -59 164 119 -107 8 43 28 -74 -34 -112 147
5554A47k47j31M10l52J48M1%L9j11o3J46r1k6J80Q0j66m4J45l11M34k45m6k23
$$ 147 -100 -231 179 -173 -25 16 16 55 -56 -119 27 -64 -90 90 170 4 -40 105 -206 228 -17 -63 -286
5577b86J10O81l99m4j84N9L4k5j56K69L1K2l6J44k04k5K4k65M40j83K28j57l1
$$ -286 -176 505 106 62 -122 -63 -29 -54 -210 59 90 112 76 220 16 -9 15 -250 190 7 235 78 47
5600D7j94J42j57L89k54jNk02J13K94j96J20J33k99L7p2J65j48N8O0n4P8j63j48
$$ 47 -147 -5 -162 227 -27 -28 -23 -225 -112 182 -14 106 239 -60 -23 -95 70 -78 -20 40 -14 64 -99 -247
5624b47L43j06N0P6p9j60L69l22N0R6k01l0K61j05L7Q6j69k52Q9L31j94K49j22
$$ -247 96 -10 40 116 37 -123 246 -76 -26 70 -131 -161 100 -5 32 118 -51 -303 -214 117 -77 172 50
5647E0J4J52j91r2O1o9q5L31l77L31j14J79j15Q3o6j76J66J86m32J83M0M7r2k31
$$ 50 64 216 25 -67 -6 -75 -160 171 -206 125 11 190 75 158 92 -84 82 268 -164 19 59 106 14 -217
5671b17K59K3P3P8m41J31J73j33K1P2j06o7P2q4L52l39P3j2M04m7j97p8q9J62
$$ -217 42 65 138 216 -225 -94 79 -54 -33 39 -67 -134 -62 -146 206 -133 -60 -72 332 285 88 10 -79 83
5695H3Q2l01K31p4L4k2l57M27J1r0j1q0r9J49K64j82p2O8OJ31l17k5N0J19j47
$$ 83 165 -136 95 21 55 33 -324 103 114 24 13 -67 -166 -17 247 65 -7 61 67 198 -119 -144 -94 25 -122
5720a22J26L50l20J22j33j56K71k23R7j36J19L4j71N3N6J83j13N5j02r6n5p4K26
$$ -122 4 354 34 156 23 -133 138 -85 12 -124 -5 29 -142 -89 -33 150 37 92 -10 -106 -161 -235 -9
5743imo3L0l3j8J40r0j13K69j52O4j56M5k5R1LN4K7j51J6J40O0k56K22j20j01
$$ -9 -13 -76 -46 -79 -97 43 -47 -160 109 -43 21 -135 -90 -115 -24 -21 33 60 -91 -75 65 125 -131 91 -29 -130
5769a30J60J5j10K46j56J26O1j62k4J14J21j92k02J84k21Q1J7K3K24j41k02J68
$$ -130 30 45 -65 181 25 151 212 50 26 140 261 69 -133 51 -170 -89 -72 -49 175 34 -168 0
5791@J64l91K01J52k86K09J56l72l3M34Kk29J06j68%K74m81L84O1M9k14p4K17
$$ 0 164 -227 -26 126 -160 49 205 -167 -200 234 236 7 113 -55 -55 219 -262 122 183 232 18 -56 161
5814A61O4l54J83K4q3J0r2j4J91k28Q1n1O7j9j42O6N2J68M1l83Q2K52r0j0k82
$$ 161 225 -129 54 78 -5 5 -87 -101 90 -138 -57 -108 -41 -60 -202 -136 -84 84 125 -258 -176 76 -14 -24 -306
5839c06M07k95J2K23N9m4p5j55N5J50k10M46o0m14m9L04j01J32j95K76r3N4n1
$$ -306 101 -194 -182 41 100 56 -19 -174 -119 31 -179 267 207 -207 -256 48 -53 79 -116 160 67 121 70
5862G0Jq5J65j2O9J4k85l0%J96j06J94j35j47j13L50j38l0j96K33L51k85k06K49
$$ 70 71 -14 151 139 208 222 -63 -93 -93 103 -3 191 56 -91 -204 146 8 -22 -218 15 366 81 -125 124
5886A24l73J1K07J6J67j59K3j54K65rj9J4j27K33q6j88N8R0p2oj3JN8M9j55K9
$$ 124 -249 -238 -31 -15 152 -7 16 -138 127 118 99 113 -14 219 133 -55 3 93 21 15 2 3 61 110 -45 -16
5912a6MK9M2l13J10N9L2K56k80P4j15q0R9L5j62J01J38J55j31k39L44n6j0j78
$$ -16 -12 17 59 -254 -144 -85 -53 203 -77 -3 -118 -198 -99 -64 -226 -125 13 168 37 -202 142 86 76 -102
5936a02J18j48K61k2J31N5j40k40L01k57p9K00n1l86J70K19k3k55K78k99J25j2
$$ -102 16 -132 129 107 238 293 153 -87 214 -43 -122 78 27 -359 -189 30 7 -248 30 -269 -144 -156
5958a56oM1O0R2j96R4k40L08j79M90j90k64J46j6j49K82j07r3KK2m1J92k3j27
$$ -156 -162 -121 -61 31 -165 -71 -311 -3 -182 308 118 -146 0 -16 -165 117 10 -83 -81 -59 -100 92 69 -58
5982e8R1O6J30j91Kn7J43j62J02j72K47m50N97m01K24k36K01k15J37Q1j90j0N8
$$ -58 33 99 229 38 40 -17 126 -36 66 -106 141 -309 288 -113 111 -125 76 -139 -2 79 -111 -121 -63
6005f3l0j02K79j55J36J0r0k0K08j03J10M6l43J91R7m02J68J02k41K25P1j53O2
$$ -63 -93 -195 84 -71 65 75 -15 -35 173 70 180 226 -117 74 171 -231 -63 39 -202 23 94 -59 3
6028Cj55J68l2N2Q0k21J08K15l77l8L5O7q0K90k45K85j04O1j16q3J08J3j7k21
$$ 3 -152 16 -16 36 116 -105 3 218 -159 -197 -162 -95 -175 115 -130 155 51 112 -4 -87 21 34 17 -204
6052b04M15J34l89k36J40J62n3m0J25KK5j30J25K17l76l1O6J36k15M5J22N9J72
$$ -204 211 345 -44 -280 -140 22 -31 -71 54 56 81 -49 76 293 -83 -114 -48 88 -127 -82 40 99 271
6075B71l50J96L2L0l06J19j09J18J42k88K59j67K07r3k58M09k38R2j95J04j34
$$ 271 -79 117 149 179 -127 -8 -117 1 143 -145 114 -53 154 61 -197 212 -26 66 -129 -25 -159
6096a59J24K9j8j06J12L18k25l5K9J31k46j38M76k59K15n1o50K20M12k52O3mj17
$$ -159 -35 -6 -24 -130 -18 300 75 40 69 200 -46 -184 292 33 248 197 -453 -233 179 -73 -10 -14 -131
6119a31K18J3j08K78l15n7m5R9k4J87j04R3j83K50m08K59J09j25r0J36P1j82K86
$$ -131 87 100 -8 270 -45 -102 -147 -48 -72 115 11 104 -79 171 -237 22 131 6 -84 52 123 -59 227
6142B27l36J05M9K1l19K95k2po7K14k6n6j15k7p9J39P3j73J87j91K64j99J63j29
$$ 227 -109 -4 45 66 -253 42 20 13 -54 160 134 78 -37 -64 -143 -4 69 -104 83 -108 156 -43 120 -9
6166iQ0k00J20J67l75R9Q6Kk17J81r9J79j37J37N6j92Q2K16l02K97q2j51R2n5
$$ -9 71 -129 -9 158 -217 -118 -32 -30 -247 -66 -165 14 -123 14 70 -122 -40 176 -126 171 89 -62 30 -25
6190b5j38J23L4R9j08j75K89k80J41K3j05J78k81K27L1R5j17o2P4rk63M33M2q2
$$ -25 -163 -40 -6 93 -15 -190 99 -181 -40 -17 -122 56 -225 2 33 128 11 -51 23 14 -249 184 226 144
6214A44k01J13j03k39J34K0K22l2J79n06L6K39K8j83J38J77j52J44j36M2k63J58
$$ 144 -57 56 -47 -286 -152 -132 90 58 237 -269 -233 6 34 -149 -11 166 14 158 22 64 -199 -41
6236d1M0N7k0K65m43J96j95L6M1k11K61L7j04Q7P5M3n1J42k25Q4j48J01j65oJ03
$$ -41 -1 56 36 301 -142 54 -141 -105 -64 -275 -14 23 -81 6 81 124 73 215 -10 74 -74 27 -138 -144 -41
6261d1pJ5m9J16j25o1J59k21L09k07L04j05j59J29j04L4K6o4k14M79j52Mj17K49
$$ -41 -48 -33 -82 34 -91 -152 7 -214 95 -112 192 87 -72 57 -47 -13 13 -51 -265 214 62 66 -51 198
6285A98K8j09j14M0Q3j91J45j00L3N2j89J53l7r4J72j05Mr6J09r6m8K55N2j44
$$ 198 226 117 3 43 126 -65 80 -20 13 65 -124 29 -8 -102 70 -35 -31 -127 -18 -114 -162 93 145 1
6309AJ24j66M1MQ6j22j88J70P0N3j61J34j26K94p4m34L21J0kl6J0Q6j17l5K02
$$ 1 125 -41 0 4 90 -32 -220 -50 20 73 -88 46 -80 214 140 -294 27 37 35 -1 9 95 -22 -57 145
6334A45o2N2r3m51M73J50j54p6O7n6j57J24L44j35m5r5j5l9L2K71n11L15P6m0
$$ 145 83 135 42 -409 64 214 60 -16 51 -5 -162 -38 306 171 126 31 16 -23 9 280 -231 84 160 120
6358A20l26K12j8jr2P6k0j07L63n3j69j91L18j26K5J35k10k54J62O5K3K21k7J0
$$ 120 -206 6 -12 -13 -105 -29 -49 -156 207 154 -15 -206 112 -14 11 146 -64 -318 -156 -91 -68 153 126 136
6382A36pj14lk18J72K15j97j66n2K52K7k11L16j96N0L04j60n28O58m34J22m4r6
$$ 136 129 15 12 -206 -34 181 -16 -182 -234 18 45 -166 150 -46 4 308 148 -380 278 -156 -34 -78 -174
6405a74K52k17Q0k8N4j38l8K22J08j96rj29J23K1N0J99k91N7k8om2K47J6k2j1
$$ -174 78 -139 -59 -87 -33 -171 -209 13 121 -75 -84 -213 -90 -69 -19 180 -111 -54 -82 -88 -130 117 133 111 100
6430A00k3k12l9L53k19Q3r3L0q4P5m6J27p3j35K7M38l23q7P1l6J53J12l99L11
$$ 100 77 -135 -174 179 -40 43 -50 -20 -104 -29 -75 52 -21 -156 -129 309 -14 -101 -30 -66 87 199 -200 111
6454A11k10kJ61k02L60m7j59m7M6Q5j04J41q9k66J26J13O1j46mKJ4L67o19L83
$$ 111 -99 -101 60 -142 218 171 12 -35 11 96 -8 133 44 -222 -96 17 78 -68 -72 -70 -56 311 -308 75
6478G5j22j19L49k9j02k47L01Q1j35J9p0K28l62M9J4q0OJ13l0j43o8K27nL2K3
$$ 75 -47 -166 183 154 52 -195 106 187 52 71 1 229 -133 -84 -70 -150 -144 -31 -61 -204 -272 -45 -50 -18 5
6503Em3P0l1k7q3J4Q5K6J0R4J1l60L36r4l0P1k35L29k95J7K53k37l7p0L91n6j84
$$ 5 -38 32 1 -26 -109 -95 -10 16 26 120 131 -229 107 13 -17 54 -181 148 -147 -130 123 -114 -151 -221 170 114 -70
6530g0M4m4J70K3k97L27J95j64j73K0L3N8j33pj19J91J55m37M8K62J24m32K95
$$ -70 -26 -70 100 123 -174 153 348 184 11 31 64 122 -11 -18 -137 54 209 -228 -180 82 206 -226 69
6553F9K03j52k44J77k69M27l04J5n5L55K0k76L3qr7J25J1l13K77n8k8N6K29l50
$$ 69 272 120 -124 53 -216 211 -93 -78 -133 222 242 -34 -1 -9 -106 19 30 -283 -6 -64 -92 -36 193 -157
6577a57n8K31M2K6k73Q4J38j74K70j23q7j64K80J14j31j88Q3j1N6J22n0pK9j26
$$ -157 -215 16 58 84 -189 -105 33 -141 129 6 -81 -245 35 149 18 -170 -87 -98 -42 80 30 23 52 -74
6601g4K19P6k05J19p7K21l35L1j10N3KJ45k30JK4J78N3j04J64j53P0L19m88Q1
$$ -74 145 221 16 135 58 279 -56 -25 -135 -82 -80 65 -165 -164 -140 38 91 -13 151 -2 68 387 -101 -20
6625b0R3Mm0k6j22m4J78k71N0J66K2K45k06j85P2P2n0J01L05n78L03p3j07K40
$$ -20 73 77 37 11 -111 -155 23 -248 -198 -32 -10 235 29 -156 -84 -12 -62 39 344 -234 69 -4 -111 129
6649A29n2No5M7k32K07o5j23J79Rp2Q5n9lj27p8K86j18o4K80k60J16o1J39K9k58
$$ 129 77 82 17 64 -168 39 -26 -149 30 39 -33 52 -7 -10 -137 -215 71 -47 -111 169 -91 25 -36 103 132 -126
6675a26m3PL11k91k16M49l5l6l03L61M0j61N3r9j95L31j43M7K68k51Q4j75j47
$$ -126 -169 -162 149 -142 -358 91 56 20 -283 78 118 -43 10 -89 -284 47 -96 -49 219 -32 52 -123 -270
6698b70J07kK34j8K38o29K26K09k14L52Rk59K84l67K8K01j12j12L53n29J02K21
$$ -270 -163 -165 69 51 289 -340 -114 95 -119 233 242 -17 267 -100 -72 129 17 -95 258 -271 -169 52
6720E2k06L4l8K38j8k29M3K68k23K01k96K24k1J34k46J8l9P6K3K8j13J50M6p2
$$ 52 -154 -120 -158 80 62 -167 -124 144 -79 122 -174 50 29 163 -83 -65 -104 -28 -5 23 -90 60 106 34
6744C4p7j80L84l14N6R7r2J18K40j91L1Q5m3o3j59k73J48K10K86l65L47k84j59
$$ 34 -43 -223 161 -153 -97 0 -92 26 266 75 106 191 148 85 -74 -347 -199 11 297 -68 279 -5 -164
6767a64J20K62l33J1m6K42o6m35M98j39J51Kj91j11K79k2K2m0q9k3j43K26J47
$$ -164 -44 218 -115 -104 -150 92 26 -409 89 -50 101 103 -88 -199 80 58 80 40 -49 -72 -215 11 158
6790A58j50p9K09m20R6j63L56jP4j84K50k20j24L27j40K3j73K13p2J13j59Q9j5
$$ 158 8 -71 138 -282 -186 -349 7 6 80 -104 146 -74 -198 129 -11 12 -161 52 -20 93 -66 23 8
6813Hk28J41J21j40Q6k9j56K11j61J90j73R5k17K35k0M4k75K94K7k26J94r5j05
$$ 8 -220 -79 42 -98 -12 -41 -197 14 -147 43 -130 -35 -252 -17 -37 7 -268 26 53 -173 21 -74 -179
6836a79K00J76l60K87j2j27J11k20L58l50k4J44lj12L67k01j12J17R0j27k15L53
$$ -179 21 197 -163 124 112 -15 96 -124 234 -116 -140 4 1 -111 256 55 -57 60 150 23 -192 161
6858A61j47j6j08m7r9J86J93j52j53L74l22J52k13J21j6K58j48j01j18M62k12
$$ 161 14 -2 -110 -157 -256 -70 123 -29 -182 192 -130 22 -191 -70 -86 172 24 -77 -195 267 55
6879E5Qk0qL7j81J32m2J84j07K0j71J01j17J46j08k9L01k54R6j97K30Pk98M16
$$ 55 63 43 35 72 -109 23 -19 165 58 78 -93 8 -109 37 -71 -100 201 -53 43 -154 76 83 -215 201
6903B01j38k89O1K11Q9l2l24J94L95l22j76LQ1m4j57K65J66O1m10R0l10L40O9
$$ 201 63 -226 -165 46 135 103 -221 -27 368 46 -130 -127 -46 -90 -247 18 184 245 -165 -75 -385 -45 24
6926B4r8kJ33j30p1R3J6J54j41L2O8n1j28P9K22j30l14J66q0R8J46qK1j94K7J0
$$ 24 -74 -76 57 -73 -144 -51 -35 119 -22 10 78 27 -101 -22 200 70 -244 -78 -158 -60 86 78 99 -95 -68 -58
6952e8J16Jn9P4J36m35N6j37M20j78K1J46q8rJ89k69k9J20J2J10l10L79k03k19
$$ -58 58 59 0 74 210 -225 -169 -306 114 -64 -43 103 15 6 195 -74 -103 17 29 139 -171 208 5 -214
6976b14N38l83j71J68o9K39l38J71J98j73j29J82k18K90k43P0K7nJ4J33n0j60
$$ -214 324 -59 -230 -62 -131 108 -230 -59 139 -34 -163 19 -199 91 -152 -82 -55 -60 -46 87 37 -123
6998a23k9K75r2j85K39l29J37qK62j14j02Qj87K28J34k61K94q1j29%L9L9O5J32
$$ -123 -152 123 31 -154 85 -244 -107 -115 147 33 -69 -61 -248 -20 114 -147 147 66 -63 -63 -24 15 80 212
7022B12j34j50O5J73k42J88j77j35J84j89Q0J56p1J16K6K6k41r1J57P1J34l14
$$ 212 78 -72 -7 166 -76 112 -65 -200 -16 -205 -125 31 -40 76 102 128 -113 -204 -47 24 158 -156
7044a56J56j59K38K3j43J9j4P3k00L32j55j36J59O5j48j2K94k56J88o3k39OK69
$$ -156 0 -159 79 102 -41 -22 -36 37 -163 169 14 -122 37 102 -46 -58 236 -20 168 105 -134 -128 141
7067A41m39J43J36J4L9n9J4j83L25j8K9m22L02j99l7L6p7J55L6J78j03J21j06
$$ 141 -298 -155 -19 -5 34 -25 -11 -194 131 113 142 -280 22 -177 -214 -178 -255 -100 -64 114 11 132 26
7090B6j58K20l6q2J93k00J8K85l5j34J49j62jj41M1l9J47p4K70k32J40k10k74
$$ 26 -132 88 52 -30 163 -37 -19 266 231 97 246 84 83 -58 -17 -56 91 17 287 55 195 -15 -289
7113b89M21l14K23R0j60j45K43k14K32j55J29p5J32j73J53n2k39K47o1k7j09j0
$$ -289 132 -182 41 131 -29 -174 69 -145 87 -68 61 -14 118 -55 98 46 -193 54 -7 -34 -143 -153
7135a53L06l8k30Q7Om9m4q1J36K52l36J48o1l6K10k28J93r1J2k06L03l3j33j95
$$ -153 153 115 -115 -28 -22 -71 -115 -196 -60 192 -144 4 -57 -93 117 -111 82 -9 3 -203 100 67 -66 -261
7159b61M14k27QL07j55q8k10J3M08j84j22j81M79k00J44k88r2R8j59K11K42k67
$$ -261 153 -74 -66 241 86 -2 -212 -199 209 25 -97 -278 201 1 145 -143 -235 -137 -296 -85 157 -110
7181a10J30j07J24J76k01J96k72J57k76J71N4j0k04J17L61m08J90k42K30k27J40
$$ -110 20 -87 37 213 12 208 -64 93 -183 -12 42 32 -172 -55 306 -102 88 -154 76 -151 -11
7202a1j27J55JJ09k32k3K67l35J92N3k30K7N21k87j95Q9J7J92j84r8l6mR7l7o9
$$ -11 -138 17 18 127 -105 -128 139 -196 -4 49 -181 -154 367 80 -115 -26 -9 183 -1 -99 -135 -139 -42 -79 -148
7227a48P8KR4K4j23K34j97P8O5j93J09j04J97k32m4J85K7k89L53j86j93J63Q2
$$ -148 -70 -68 26 50 -73 161 -36 42 107 -86 23 -81 116 -116 -160 25 52 -237 116 -70 -263 -100 -18
7250a8j40L32m2k08j51Q0J99l5rl3j72m0J37j4PQ4N4M1j39J74j16M3r0j0m3K58
$$ -18 -158 174 132 -76 -227 -147 52 17 8 -25 -197 -237 -100 -114 -107 -23 31 72 -67 107 -9 34 -56 -66 -109 149
7276A49j20j04J08N2R0j05k47J02J75r7J27j79K16p0k07j51K58j00J49k41K61
$$ 149 29 -75 33 85 175 70 -177 -75 100 3 130 -49 167 97 -110 -261 -3 -103 46 -195 66
7297F6K34l35J12K65m40K46j53p1J45j04P3J20r0k83M7O6nJ12J11j20j16j5K86
$$ 66 300 -35 77 342 -98 148 -5 -76 69 -35 38 158 68 -215 -168 -102 -107 5 116 -4 -120 -135 151
7320A51l96L78m01J91j14J40j1Q1o5k9J21Q8j00j71L3k3M64l18J44j04K9K82m62
$$ 151 -245 133 -268 -77 -191 -51 -62 19 -46 -75 46 134 34 -137 -104 -127 337 19 163 59 88 370 -92
7343i2j04J97Lj1J16K1k32OJ98k6Jk45J48J24j45O3o1L70j99j65J65m6j58J17
$$ -92 -196 1 4 -7 109 130 -102 -96 102 76 77 -168 -20 104 -41 22 -39 331 132 -33 132 86 -72 45
7367D5j45o2M42l62P1K02k02K74l22j00J26J24j40R9K7k18N46l43k68O5O5k26
$$ 45 -100 -162 280 -82 -11 191 -11 263 -59 -159 -33 91 -49 50 77 -141 405 62 -206 -141 -76 -302
7389c02K2M44r0l44L01j03K17p3n6l2K8m2k28M37m28L8K65o1J05j60Q6O2k58J64
$$ -302 -280 164 74 -270 31 -72 145 72 16 -16 12 -30 -258 179 -249 -211 54 -7 98 -62 24 86 -172 -8
7413hJ51j56Q8l5J58O8k85J34m8Oj15j85J70j8j7N0MK11J9r9j46lJ62j25j35J3
$$ -8 143 -13 75 40 198 266 -19 115 67 73 -42 -227 -57 -75 -92 -42 -38 173 192 93 -53 -56 106 -19 -154 -141
7439a41J39L6N8Rk51L07j28l1k10m3L32p0J37k78Mr6L21l9n4o3k7J56j51j5J85
$$ -141 -2 34 92 101 -150 157 29 -2 -212 -255 77 7 144 -134 -130 -226 95 56 2 -61 -88 68 -83 -98 87
7464H7j1n9p6K24j47k1L6J96l01K08j15r1m9j07K11o3Q1J37j8k23J01L12j78r7
$$ 87 76 17 -59 165 18 -3 33 229 -72 136 21 -70 -119 -226 -15 -78 3 140 122 -101 0 312 134 37
7488C7m1J43q1k7l9K54j26l5k46J55j13J76M6j20j12K03l57L73q4K5J55j46J10
$$ 37 -4 139 58 31 -8 246 120 85 -161 -6 -119 57 103 -17 -129 74 -283 90 6 31 186 40 150
7511A50l16J57J10j56O5k8p7K37l36K41l36L81j79K64j70Q0R0p8j11J80k40j60
$$ 150 -166 -9 101 -55 10 -18 -95 142 -194 47 -289 92 -87 177 7 87 177 99 -12 168 -72 -232
7533b32L13j59J53K26j72j97K15p9o5J8j23K72k14J54r5j59J21J35k04q6J69j5
$$ -232 81 -78 75 301 129 -68 147 68 3 21 -102 170 -44 110 15 -144 -23 112 -92 -178 -9 -24
7555b4k07K31K32m81J40KO3J50k48K01j44J26m9J34q5J4k89R5K16j5j22l2K33
$$ -24 -231 0 232 -249 -109 -107 -44 106 -142 59 -85 41 -8 126 41 55 -234 -139 77 62 -60 -92 141
7578A41K4l26J87P1P8l05J04M1q4jm1k9N8J48J12l15K01j01R4rn4J92k16k21k6
$$ 141 165 -161 26 97 175 -130 -26 15 -69 -70 -111 -140 -82 66 178 -137 64 -37 57 48 -6 186 -30 -251 -277
7603b77J19K72L7k13k0m4R4KL0m1J38j38J30j66k1J01j46P5j00p5K09O7q4R5n5
$$ -277 -158 114 151 -62 -82 -126 -32 -30 0 -41 97 -41 89 -77 -98 3 -143 -68 -168 -243 -34 33 -51 44 -11
7628a1n3l2K11J16j97j68J44j32NJ27l6n3J4K34j38K55k40K50k81K5q4Q7j55K69
$$ -11 -64 -96 115 231 34 -134 10 -122 -117 10 -26 -79 -65 169 31 286 46 296 15 40 -44 43 -112 157
7652A57j44n0M5J11l16K43j05L2L9m5J88k04N7J64q2Q5l40O9R6q4K06l30K99p0
$$ 157 13 -37 8 119 -197 46 -59 -27 12 -33 155 -49 8 172 90 175 -165 -96 0 -84 122 -208 91 21
7676B1P4J32m67L40K72p3j99k36J12J10j48j40O6M55k20lj3k32J08P2K22k18j09
$$ 21 95 227 -240 100 372 299 100 -136 -24 86 -62 -202 -136 319 99 96 83 -149 -41 31 253 35 -74
7699g4J91j70P6J0KJ16m5k00K22k36J73m1j24k22J18k1K59J05p2l8j07P5N9N6
$$ -74 117 -53 23 33 35 151 106 -94 128 -108 65 24 -100 -322 -204 -225 34 139 67 29 -78 -3 56 112
7723A12k56K56J39l54J8Q1L74j54l43J68p6K13Nlk65J15O9k32Q8l2J47k79J98
$$ 112 -144 112 251 -103 -85 -4 370 216 -127 41 -35 178 183 180 -85 30 99 -133 -45 -77 70 -209 -11
7746a1o0N9q4N5m3L7K7q8J65j03L5k1o3J46j08N6jL8Q8o7Q9n23L11J32k39n4K48
$$ -11 -71 -12 -96 -41 -84 -47 -20 -108 57 -46 -11 -32 -95 51 -57 -1 -2 36 124 57 146 -377 -66 66 -173 -227 21
7773B1k24M89l96L19j93Q8O1l33J03mj4p3j2J48j2K21m6j33J82k29k00N60k15
$$ 21 -203 286 -110 209 16 104 165 -168 -65 -69 -83 -156 -168 -20 -32 189 143 10 192 -37 -237 323 108
7796A08j61j52K60j4r9K53j51j53J13j07q8J35L9O5m6O2j06L9j74K52J1j94p5
$$ 108 -53 -205 55 41 -58 195 44 -109 4 -103 -191 -56 -17 48 2 64 -42 -3 -177 75 86 -108 -183
7819a83K69n6J0M3m0L22j07j99k16K78J90k68J00k45J4K29j43o8K02m4P0l17K2
$$ -183 86 30 40 83 43 365 258 59 -157 121 311 43 143 -102 -88 141 -2 -70 132 88 158 -159 -137
7842a37q8K15J67k9k65J53K42m40K07K0l95N29j76Q1L3p7k01K32k25K27j34n7
$$ -137 -225 -10 157 128 -137 16 258 -182 25 45 -350 179 3 84 117 40 -161 71 -154 73 -61 -118
7864a18q6K18k3J31j11k4RJ03L7j58K8r3L26j75K5K1P4K03l24j23m8n9K01q8N6
$$ -118 -204 14 -9 122 11 -13 -4 99 136 -22 6 -87 239 64 89 110 184 387 63 -60 -108 -167 34 -54 2
7889Bm3R5O3K0j62J09l1J76k06j08L2K69l73J44j7o1K94m51J65O1L43n81K52K50
$$ 2 -41 54 117 137 -25 84 53 229 23 -85 -53 216 -157 -13 -30 -91 203 -248 -83 -22 321 -260 -8 242
7913B42k87K10k21p1K64k26J67j02K89j79m14K98K24j36k43K23j52l0K50j4k03
$$ 242 -45 165 -56 -127 137 -89 78 -24 265 86 -328 -30 194 58 -185 38 -114 -144 106 92 -111
7934a11j14m7J67O9K01m8P6m22K64j73L94j89l4o8m3J61k81P3L07j12m73L09m6
$$ -111 -225 -272 -105 -36 165 117 193 -229 35 -138 256 67 33 -35 -78 83 -198 -125 182 70 -403 -94 -140
7957a40K33j55q1L59j99kj7k59J82K05k51J66K16k89O4k30K31o0r1k45M45r0J69
$$ -140 93 -62 -143 216 17 15 -2 -261 -79 126 -125 41 257 -32 32 -198 33 -27 -118 -363 82 -8 161
7980A61j94K46l09r9K93j3k63J11q2O4O9N7j11J27J07l36J97M6J85k60J64l47
$$ 161 -33 213 -96 -195 98 85 -178 -67 -149 -85 -16 41 -70 57 164 -172 25 71 256 -4 160 -187
8002a87K55n8n2J84l02N3j2J64J24k33J27N7k31L21j69k47L05l43K81M7m1p5j30
$$ -187 68 10 -42 142 -160 -107 -119 45 169 -64 63 120 -111 210 41 -206 99 -244 37 84 43 -32 -162
8025a62K38j85P6K8k83K54Q6n3J23j15J03m61N95k24j10J65J07j08K7p7o3K3l9
$$ -162 76 -109 -33 -5 -288 -34 52 -1 122 7 110 -351 244 20 -90 75 182 74 101 24 -39 -16 -55
8048e5J63P2j74L1j51j2j02K57m3j76L78l37L63n2j38P9j74J53n4kj90L20J62
$$ -55 108 180 6 37 -114 -126 -228 29 -14 -190 188 -149 214 162 24 103 -71 82 28 26 -164 156 318
8071C18k66r7J83k31J06k41K07J10n9m9j82K76j76J90o8J6P9j07o4o1M9J00L4
$$ 318 52 -45 138 -93 13 -228 -21 89 30 -19 -201 75 -101 89 21 37 116 9 -55 -116 -67 33 67
8094F7Ok18J19Q4k58M43K7j68n9J51p7r4L0O8J9l15K55O6l44M72k51r8J19l32
$$ 67 73 -145 -26 58 -200 243 270 102 43 194 117 23 53 121 140 -175 80 146 -198 274 23 -75 44 -288
8118b88L66Nm3q1R4m9J08M6k54j5M82k77K51m80K09n6K7l4l6k9m3N1J19l2J8k63
$$ -288 78 83 40 -41 53 4 112 158 -96 -111 371 94 345 -135 74 18 45 11 -25 -54 -97 -46 73 41 59 -204
8144b04n1J83J96k56Q9R5J9l05K15m6j76L65L5p7l07o3L09k5K15k55L0J37k06
$$ -204 -255 -72 124 -132 -43 52 71 -234 -19 -65 -241 124 159 82 -225 -288 21 -4 211 -44 -14 123 -83
8167h3N1l20M02o3J65J5r2Q3k22Q2O4O8l61J85q3J65m6m1J86r1k07L95l38l5
$$ -83 -32 -352 50 -13 152 167 75 158 -64 18 82 150 -211 -26 -109 56 10 -31 155 64 -143 252 -86 -121
8191a21
$$ Imaginary data points
##PAGE= N=2
##DATA TABLE= (X++(I..I)), XYDATA
0@%%%%%%%%%%%Qj6J6j6J6k4L2l2M0n0N8p2Q8j04J20j36J55j79K08k40K73l08L48
$$ 0 0 0 0 0 0 0 0 0 0 0 0 8 -8 8 -8 8 -16 16 -16 24 -26 32 -40 48 -56 64 -72 83 -96 112 -128 145 -163 185
34A85l94M44m99N60o28P02p81Q68r62J066j180J302j437J584j745J923k117K332
$$ 185 -209 235 -264 296 -332 370 -411 457 -505 561 -619 683 -754 830 -915 1008 -1109 1223
52A223k573K839l136L471l850M286m791N382o089O955q040R441j1335J4047j8273
$$ 1223 -1350 1489 -1647 1824 -2026 2260 -2531 2851 -3238 3717 -4323 5118 -6217 7830 -10443
67a0443K5798m3122J54477L2454l06559J09082O7398j01968L5822J64461l3980
$$ -10443 15355 -27767 126710 159164 -147395 -38313 29085 -72883 -37061 127400 93420
78I3420j43352o0089P5569N6593R235L2449J010j36509l7785J16973K7116j3087
$$ 93420 -49932 -110021 -34452 22141 31376 63825 64835 -71674 -109459 7514 34630 21543
90B1543O8051o6127j45651L9097J32355J4019m0879j870j0335q5736l1593J52378
$$ 21543 89594 23467 -122184 -83087 49268 63287 22408 20538 10203 -75533 -107126 45252
102D5252R6860j35537o8134O1398m4673k0389J21518M5938q2721p5449j1462L8915
$$ 45252 142112 6575 -61559 -161 -44834 -65223 56295 102233 19512 -55937 -67399 -28484
114b8484M8415L3069R189o0141p8524K9196N2485j72O5577J3701j58043l0562
$$ -28484 19931 53000 62189 2048 -76476 -47280 5205 5033 70610 84311 -73732 -104294
126a04294J29310m093k5705Q2009l2560j29218K989Q9869M4468o211l0223k6075
$$ -104294 25016 20923 -4782 77227 44667 -84551 -81562 8307 52775 46564 16341 -9734
138i734l6334k1086P3617P2725l7823m8575k0546l5653K8972Q6646J0380n0265
$$ -9734 -46068 -67154 6463 79188 41365 -7210 -27756 -63409 -34437 52209 62589 12324
150A2324k6476k4705j5152M5000O7040J3286p1895o8978L6252L8452j4829N1970
$$ 12324 -14152 -38857 -54009 -9009 58031 71317 -578 -69556 -33304 5148 -9681 42289
162D2289L7537j01174o8379O2354N2657K522Q951r595n2476m3026L3985P8108
$$ 42289 79826 -21348 -89727 -27373 25284 27806 36757 27162 -25314 -68340 -34355 43753
174D3753J0971m0238j3206l4181l6554O7464P0582l7231l2733j103m8796l709
$$ 43753 54724 14486 1280 -32901 -69455 -1991 68591 31360 -1373 -2476 -51272 -54981
186e4981Q8054L4969m7181l7832j5515l069J7525M4878L9067m0531p5501K814
$$ -54981 33073 68042 20861 -16971 -32486 -35555 -18030 26848 65915 25384 -50117 -47303
198d7303L8733J4045K8619J6382m9314n2262O445M0940L8084R876k5907l7306
$$ -47303 -8570 5475 34094 50476 1162 -51100 -44655 -3715 34369 44245 18338 -18968
210a8968k7976J0203N4760K9242k0218k2074l2696l0649M3968O2736r748l1200
$$ -18968 -46944 -36741 18019 47261 27043 4969 -27727 -58376 -14408 48328 38580 7380
222G380j4441k9265q380M8403M9890j0260n4424k7176J2436R660K5970M3421j7255
$$ 7380 -7061 -36326 -44706 3697 53587 43327 -11097 -38273 -25837 -16177 9793 53214 35959
235C5959o5244j6806K5664K2513K9439J3908m0052m2768J03K3057L2342K3609
$$ 35959 -29285 -46091 -20427 2086 31525 45433 5381 -37387 -37284 -14227 18115 41724
247D1724j2816l9648l5106R216M8783K4133j0882j2475k9983l2734K4469N4468
$$ 41724 28908 -10740 -45846 -36630 12153 36286 25404 12929 -17054 -49788 -25319 29149
259B9149J4777k4701l1203j9537O17K3487L8406J4785l5874m2549k559J9889K5218
$$ 29149 43926 19225 -11978 -31515 -30898 -7411 30995 45780 9906 -32643 -35202 -15313 9905
272I905K9071n053m5892k5142J0476K0135L1148J8344k7049m3720j3050K4648
$$ 9905 38976 33923 -11969 -37111 -26635 -6500 24648 42992 15943 -27777 -40827 -16179
284a6179L2349J2590j729k0794m1430q343M3934L3246n109j6364k4124k5452R424
$$ -16179 16170 28760 27031 6237 -35193 -43536 398 33644 28535 12171 -11953 -37405 -27981
297b7981M0915K4828j1487k8728k5589n168K2347L5305J5222k5563l4827r051
$$ -27981 12934 37762 26275 -2453 -28042 -33210 -10863 24442 39664 14101 -20726 -29777
309b9777P534K2543L4542J803m0119k8978M437K1195K3609J5104q187l5398k8786
$$ -29777 -22243 300 34842 36645 -3474 -32452 -28015 -6820 16789 31893 23706 -11692 -40478
322d0478J5468L7200J6388l865j6746l0815j5586K7094L5768N264j3353k2106
$$ -40478 -25010 12190 28578 24713 7967 -22848 -38434 -11340 24428 29692 16339 -5767
334e767k5810k39L5750L0397p182k7225j8895p452O338L2427K8263j8930l8343
$$ -5767 -31577 -31816 3934 34331 27149 -76 -18971 -26423 -20085 12342 40605 21675 -16668
347a6668j2243Q598J7775K5813J0260k4344l3549p221J9049K4966J7115m722l1185
$$ -16668 -28911 -20313 -2538 23275 33535 9191 -24358 -31579 -12530 12436 29551 24829 -6356
360f356k6616Q003K7970J8141L613r383l0629k3476K0881L7830Q753j3856j6608
$$ -6356 -32972 -24969 3001 21142 24755 15372 -15257 -38733 -17852 19978 28731 14875 -1733
373a733j8788r606K0819L6265O154k7513k2769q042N886K6081K4619p759k8970
$$ -1733 -20521 -30127 -9308 26957 33111 5598 -17171 -25213 -19327 6754 31373 23614 -5356
386e356j7888j0J3481K7607J7720k2205l5496n386J7415J3964J4591J0617k1093
$$ -5356 -23244 -23254 -9773 17834 35554 13349 -22147 -27533 -10118 3846 18437 29054 7961
399G961l9364j078L5431J7968k903k916j8529k7986N617L5831J9290j1032j7239
$$ 7961 -31403 -32481 2950 20918 18015 15099 -3430 -31416 -25799 10032 29322 18290 1051
412A051j7403j1851J5047L3160J0080k0197k0236r914j877J8588L2469J764l4950
$$ 1051 -16352 -28203 -13156 20004 30084 9887 -10349 -20263 -22140 -3552 28917 30681 -4269
425d269k0151Q881O967J1411K5292n50m0100k2862K2060K2061M552O731n753l0975
$$ -4269 -24420 -15539 -8572 2839 28131 27581 -12519 -35381 -13321 8740 13292 20023 14270 -16705
439a6705j6682K2921K8519N399j0472j6117j8512l660K4563K5854l269j8601j4490
$$ -16705 -33387 -10466 18053 23452 12980 -3137 -21649 -25309 -746 25108 21839 3238 -11252
452a1252j2481M329L0968K0790j8895k4232m517k560P274K9649J2490k5212k6377
$$ -11252 -23733 -19404 11564 32354 13459 -10773 -15290 -17850 -10576 19073 31563 6351 -20026
465b0026j849J2165J5640J4793K09k1612k2977K40K2162J9791K608j1569k0620
$$ -20026 -21875 -9710 5930 20723 20932 -680 -23657 -23417 -1255 18536 21144 9575 -11045
478a1045j4338J0425K4796J0582l657j3465k3092p535K4760K4115l453j1450j0210
$$ -11045 -25383 -14958 9838 20420 16763 3298 -19794 -27329 -2569 21546 18093 6643 -3567
491c567j8057j520L0739K0972j3860j8520r165o850R035K4705J2623j4821k4883
$$ -3567 -21624 -23144 7595 28567 14707 -3813 -12978 -19828 -10793 13912 26535 11714 -13169
504a3169q613R506J3831J5333O126j9531k5273J346J7724J0984J0675J020k8116
$$ -13169 -21782 -12276 1555 16888 23014 3483 -21790 -20444 -2720 8264 18939 19959 -8157
517h157k1171J6975K0791L893L214m418k4169j6000J9467K8638J855j5597r725
$$ -8157 -29328 -12353 8438 12331 15545 11127 -13042 -29042 -9575 19063 20918 5321 -4404
530d404q162p962J4094K8904K566k6464j6032L441M627J2869J9867n045k7062
$$ -4404 -12566 -20528 -6434 22470 25036 -1428 -17460 -14019 -9392 3477 23344 18299 -8763
543h763j1769Q048R754J5334J1762j6460k7125m7J4890Q363J1155M574j9440k3199
$$ -8763 -20532 -12484 -2730 12604 24366 7906 -19219 -19266 -4376 3987 15142 19716 276 -22923
557b2923J803K4141J5393m874r298q563j4885N80K6115J8119j3327j8341p553
$$ -22923 -21120 3021 18414 13540 4242 -4321 -19206 -18626 7489 25608 12281 -6060 -13613
570a3613k606J0085K0280O149j3337j6190r182L846J9445J6233n603j9125j2324
$$ -13613 -16219 -6134 14146 20295 6958 -9232 -18414 -14568 4877 21110 15507 -3618 -15942
583a5942K310Q564J2697J3010o345k5653j2463J4645J7692L964q1n985j9378j0426
$$ -15942 -13632 -5068 7629 20639 14294 -11359 -23822 -9177 8515 12479 12398 6413 -12965 -23391
597b3391J7649K1913J364j0937j2407j1082K243J7758J3525k731j0365j5492q906
$$ -23391 -5742 16171 17535 6598 -5809 -16891 -14648 3110 16635 13904 3539 -11953 -20859
610b0859J3146K1849M774j2254j2936o996K7R969J8474O510j9436k0023K070J2794
$$ -20859 -7713 14136 18910 6656 -6280 -13276 -13249 -3280 15194 21704 2268 -17755 -15685 -2891
624b891R465P812o65j6164j6535L415J7733J2718K32j0928j5543o056R861J5989
$$ -2891 6574 14386 13721 -2443 -18978 -15563 2170 14888 15120 4192 -11351 -17407 -7546 8443
638H443O904m101j1856j5422k588J9566J6468m522j1373p889p479J08J8830J6234
$$ 8443 15347 11246 -610 -16032 -18620 946 17414 12892 1519 -6370 -13849 -13741 5089 21323
652B1323q895j9764o669L570O494J3732Q796j1422j8903m303Q670J1179J0691
$$ 21323 12428 -7336 -14005 -10435 -3941 9791 18587 7165 -11738 -16041 -7371 3808 14499
665A4499N07j5947j5858K922J3591J0077L274l803j4960j3957P885K0314O743
$$ 14499 15006 -941 -16799 -13877 -286 9791 13065 9262 -5698 -19655 -11770 8544 15287
678A5287o573p641j0552p347R958J9945M368j3056j1756m397Q2J1378J6334n67
$$ 15287 8714 1073 -9479 -16826 -6868 13077 17445 4389 -7367 -11764 -11682 -304 16030 15463
692A5463j7300j1291J682O248J0826J1327n737j9747q125Q867J0083P553M087
$$ 15463 -1837 -13128 -11446 -5198 5628 16955 11218 -8529 -16654 -7787 2296 9849 13936
705A3936q631j8088m296J3514J3226K331l182j0517j3462J735J6113J0924k474
$$ 13936 5305 -12783 -17079 -3565 9661 11992 8810 -1707 -15169 -13434 2679 13603 11129
718A1129q205j0372p930O501J8117O764r404j1059n749j412Q277J5831M452j4875
$$ 11129 2924 -7448 -15378 -8877 9240 16004 6600 -4459 -10208 -11620 -3343 12488 16940 2065
732B065j3880M77N892Q643J0188o84j5579j1973M075J0971Q603M478o681j5873
$$ 2065 -11815 -11338 -5446 3197 13385 12701 -2878 -14851 -10776 195 8798 13276 6595 -9278
746i278o269J0101J1506M100L99q457j5604k537J6860J2563l956o523n611r880
$$ -9278 -15547 -5446 6060 10160 10559 2102 -13502 -16039 821 13384 9428 2905 -2706 -12586
760a2586l53J6863J3153p417j4048m975k83M428J3159P870r956j4437l465M386
$$ -12586 -12939 3924 17077 9660 -4388 -9363 -9646 -5218 7941 15811 5855 -8582 -12047 -7661
774g661Q977J0562J343j3659j2343K698Q617O723O397j724j4762j1371P655J5094
$$ -7661 1316 11878 13221 -438 -12781 -10083 -1466 5257 11654 9930 -4832 -16203 -8548 6546
788F546L564k433l981j1164p793R850J5841K539q637q281n917j084J1075J2746
$$ 6546 10110 7677 3696 -7468 -15261 -5411 10430 12969 4332 -3949 -9866 -10950 125 12871
802A2871j679j1200p805l259M088J3370Q313q000j2892l726K360N479J1350M831
$$ 12871 11192 -8 -7813 -11072 -6984 6386 14699 6699 -6193 -9919 -7559 -2080 9270 14101
816A4101j1078j4503j71R197O772M790Q90j0872j2895K948J3492O318n4m329j0458
$$ 14101 3023 -11480 -11651 -2454 4318 9108 9998 -874 -13769 -10821 2671 8989 8935 4606 -5852
831e852p576O758J3713M383n326p060p768l125R774J3437J5j0221o644l425J45
$$ -5852 -13428 -6670 7043 11426 6100 -960 -8728 -11853 -2079 11358 11373 1152 -5492 -8917 -8772
846h772J1200J1564m883j3664m989K163M128R028P519p312j4437l718Q185O927
$$ -8772 2428 13992 9109 -4555 -9544 -7381 -3253 5775 13294 5982 -8455 -12173 -3988 2939
860B939M694K603q296j3344l2J1561P396P65k755q238r629L391J3772O137m581
$$ 2939 7633 10236 1940 -11404 -11436 125 7521 8286 5531 -2707 -12336 -8945 4827 10964 6383
875F383n704o806n602O625J4784K137r801n835k953k639Q285J3439j366j2843
$$ 6383 679 -6127 -11729 -5104 9680 11817 2016 -3819 -6772 -9411 -1126 12313 10947 -1896
889a896p627K492M233N413P875q77j4364q586P687Q761L194K394m052j2788m163
$$ -1896 -9523 -7031 -2798 2615 10490 9613 -4751 -13337 -5650 3111 6305 8699 4647 -8141 -12304
904a2304R800Q871J685j576p426r947J227J1959P563l326m705n697o751K792J3989
$$ -12304 -2504 6367 8052 6476 -950 -10897 -9670 2289 9852 6526 1821 -3876 -10627 -7835 6154
919F154O633p971r370k118j04L760R752N309q864j1963l19O015N811N939j6j0641
$$ 6154 12787 4816 -4554 -6672 -6776 -3016 6736 12045 3181 -8782 -9101 -3086 2725 8664 8648 -1993
935a993p840K828N826O466N405n606j2674k763P225O523L696P3n954r534k564
$$ -1993 -9833 -7005 -1179 5287 10692 5086 -7588 -10351 -3126 3397 7093 7166 1212 -8322 -10886
950a0886R518J1140j710o843l797n240r41J1241Q606m411q454m368j982M452J0366
$$ -10886 -1368 9772 8062 1219 -2578 -7818 -8759 2482 11088 6677 -1777 -6145 -8127 -3675 6691
965F691L805p469p936k406J226N882Q998J343j0863q630K866N377M018N141o09
$$ 6691 10496 3027 -4909 -7315 -6089 -207 8791 10134 -729 -9359 -6493 -1116 2902 8043 7434
980G434j0597q405N095J0621K976k143k158p559o742P481J2038L03n557l941o074
$$ 7434 -3163 -11568 -6473 4148 7124 4981 2823 -4736 -11478 -3997 8041 8344 2787 -1154 -7228
995g228j595J0093P753k272o157n749l019L492Q818O016m552r945l458L467L041
$$ -7228 -8823 1270 9023 6751 594 -5155 -8174 -4682 4136 10152 5600 -4345 -7803 -4336 -1295
1010a295O267N462p153j1670M05O637M381L104J037p544q899J307R353N476n78
$$ -1295 4972 10434 3281 -8389 -7984 -1347 3034 6138 7175 -369 -9268 -7961 1392 6868 6290
1025F290l322o677n619M072J0078L197l531m777o091k063P443Q262M35o153n693
$$ 6290 2968 -3709 -9328 -5256 4822 8019 4488 -289 -6380 -8443 -1000 7262 7697 1544 -4149
1040d149k491R71O809Q240k228j0281l895K356K299N991O011m904j0302l130N224
$$ -4149 -6640 -5669 1140 9380 7152 -3129 -7024 -4668 -2369 3622 9633 4729 -5573 -8703 -3479
1055c479N956L617Q4n143p695k002P382P519R4k747n667o530K431R481L467j980
$$ -3479 2477 6094 6178 1035 -6660 -8662 -1280 6239 6333 3586 -2081 -8611 -6180 3301 6768 4788
1071D788l346o239l949N494R499K178o228n846j615k08L979Q687J667r286o667
$$ 4788 1442 -4797 -8746 -3252 6247 8425 2197 -3649 -5264 -5472 -1493 7194 8861 -425 -7092
1086g092J422L743M542M793k232p733m968J888O309N259Q62m977p498k205O010
$$ -7092 -5670 -1927 2615 7408 5176 -2557 -7525 -5637 672 5931 6793 1816 -5682 -7887 -1877
1101a877N940Q46K93m949q254M27R327N306k045l925m001l542J277P930O072m279
$$ -1877 4063 4909 5202 253 -8001 -7574 1753 7059 5014 1089 -2912 -6454 -5177 2753 8825 4546
1117D546p734k396P58K887P063K637o178o270j319K036N551N878j657p785m829
$$ 4546 -3188 -5584 -4826 -1939 5124 7761 1583 -4687 -6006 -3970 1581 7459 5802 -1983 -6812
1132f812J672M964M014K457j801q128n104N437P387P96r88k718o428k641O695
$$ -6812 -5140 -176 3838 6295 4494 -3634 -8738 -3301 4086 4882 3894 1176 -5252 -7893 -1198
1147a198P122O05m571m771k934R84O066N937j835o440l355j366K881P411L543
$$ -1198 5924 6529 1958 -2813 -5747 -4763 1303 7240 5405 -1035 -4390 -5756 -2875 4536 8079
1162H079n831o279q91J289L248N963J453o156p608P10N705L549J466n5n921o529
$$ 8079 2248 -4031 -4922 -3633 -385 5578 7031 875 -6733 -6023 -318 3231 4697 4642 -1279 -7808
1178g808K823P444K702o07k677o108l033M619O913K046l803m096l105j126N083
$$ -7808 -4985 2459 5161 4554 1877 -4231 -7264 -2645 4268 6314 2511 -1585 -4690 -5816 -733
1193g33P617j073o533k907q65O85N782N424k906p150l233J917L787L869K740l995
$$ -733 6884 5811 -722 -3629 -4494 -3809 1973 7397 4491 -2659 -5892 -3975 -188 3681 6421 2426
1209B426p346j586M842M242J539P37m622o952Q56O741L971l74k592l893m344K023
$$ 2426 -4920 -6506 -1664 2578 4117 4854 232 -6720 -5864 877 4848 4474 1882 -2011 -6355 -4332
1225d332P024L965l135m420l178j292L579O707J337n211m038j800P71M867N486
$$ -4332 2692 6657 3522 -898 -4076 -5368 -1789 4918 6255 1044 -2994 -4794 -4023 844 6330
1240F330j174o409l890J179K972L346L323j510p704l489M463M686J661N09k929
$$ 6330 5156 -1253 -5143 -3964 -992 2354 5677 4167 -3537 -7026 -2563 2123 3784 4293 1364
1255A364o233j269N108N162Q73k377m112l853M61O528M097k167l357k952k769
$$ 1364 -4869 -6138 -1030 4132 5005 2628 -1484 -5337 -4876 1652 5749 3582 225 -2727 -5496
1270e496K228P226K831m929m770q15L92K012N620K088n765n810P36L821K318K667
$$ -5496 -3268 3958 6789 1860 -2910 -3725 -3333 -1321 4299 6387 622 -5188 -4452 -631 1687 4354
1286D354K00n639n003K102M936K849Q02k621n649k348M124N107J006j299l060
$$ 4354 4554 -1085 -6088 -3986 950 3799 4601 1980 -3669 -6017 -1893 3214 4220 2921 -139
1301a39m405j288N607N974j620m079k094j826r8N444M901k366o389j875Q63K569
$$ -139 -4544 -5832 -225 5749 4129 50 -2044 -3870 -3968 1476 6377 4011 -2378 -4253 -3390 -821
1317h21L913K435l729n305j051K417L395L147On059m762J355M231K712J241j050
$$ -821 3092 5527 1798 -3507 -4558 -2141 1254 4401 4407 -652 -5414 -4059 172 2884 4125 3075
1333C075n116m233L092O036J463j978j903l216k672L582O428N76m255l141j397
$$ 3075 -2041 -6274 -3182 2854 4317 2339 436 -2780 -5452 -1870 4558 5134 879 -2262 -3659
1348c659l23M292N121j297n166k550L19J563L874L199k266n786k102K701K582
$$ -3659 -3982 310 5431 4134 -1032 -3582 -3263 -1700 2174 5373 3107 -2679 -4781 -2080 502
1363E02K289J703k893o192n45M845L367j02j26k971m826N86N702L234j943k059
$$ 502 2791 4494 1601 -4591 -5136 -291 3076 2974 2848 -123 -4949 -4363 1339 4573 2630 571
1379E71k542k642K060N335K592l404l737j466JK587M457R96m124m341j35K118
$$ 571 -1971 -4613 -2553 2782 5374 1970 -1767 -3233 -3232 -645 3812 4808 684 -3657 -3792 -1674
1395a674K841L141l95n340l303K023L037J968J835j804n456j855L596L865P43
$$ -1674 1167 4308 3913 -1427 -4730 -2707 330 2298 4133 2329 -3127 -4982 -1386 2479 3222
1410C222n61k517m134n68M307M390l94l073k522j998P63M170L510j355m326j920
$$ 3222 2661 144 -3990 -4558 -251 4139 3745 672 -1850 -3848 -3085 1085 4595 3240 -1086 -3006
1426c006l92K090M433J523l433l991n75J124K416L794L73m776m089J554K624K012
$$ -3006 -3398 -1308 3125 4648 1215 -2776 -3351 -2227 189 3983 4356 -420 -4509 -2955 -331 1681
1442A681J606k54m383l751K190M753J648j030j987k930j683K333M864J087k655
$$ 1681 3287 3033 -1350 -5101 -2911 1842 3490 2460 473 -2457 -4140 -1807 3057 4144 1489
1457A489k725k277k0M034L615j032l173j888j501Q68M617L118l010m585j160J730
$$ 1489 -1236 -3513 -3533 501 4116 3084 -89 -1977 -3478 -2610 2007 5125 2115 -2470 -3630 -1900
1473a900J865K290J695k292n229p01L521K573J030p0l310l580R48L680K464J84
$$ -1900 -35 2255 3950 1658 -3571 -4272 -751 1822 2852 2782 -528 -4108 -3160 520 2984 3168
1489C168j918l632j899K374M171J135j586j913k684j077L018M808r1m047j969
$$ 3168 1250 -2382 -4281 -1907 2264 3399 1813 -100 -2784 -3861 -843 3965 3874 -173 -2142
1504b142m12L32K989L467q93m425k627J433J979K007K023j888m551j189K521K477
$$ -2142 -2554 -2222 767 4234 3341 -1084 -3711 -2278 -299 1708 3731 1843 -2708 -3897 -1376 1101
1520A101J811N26l360l656L31L371K214K90p82k778k959J242M368J866k039j572
$$ 1101 2912 3438 78 -3578 -3247 124 2338 2628 1846 -932 -3891 -2649 1719 3585 1546 -26
1536b6j634j951J834M756R56k925k679r53K31K176L612Q9l885k701N54J439K323
$$ -26 -1660 -3611 -1777 2979 3935 1010 -1669 -2622 -2391 -215 3397 3486 -399 -3100 -2546 -1107 1216
1553A216K459j314m217j732K085K123J307J220k101l892j170L692K618K92r30
$$ 1216 3675 2361 -1856 -3588 -1503 620 1927 3147 1046 -2846 -4016 -324 2294 2586 1656
1568A656j888l176l95M727K836j465k148j496j529O55L928K215k306k907j391
$$ 1656 -232 -3408 -3803 924 3760 2295 147 -1349 -2878 -2223 1705 3920 1614 -1293 -2684
1583b684J91J548L485J289l327l235J87J297J789K429L87l799l225J731K260J155
$$ -2684 -2493 -945 2540 3829 502 -2733 -2546 -1249 540 2969 3356 -443 -3668 -1937 323 1478
1599A478J082m81l966k358K592L730N46q53j204k674j469K818L737j20k071k098
$$ 1478 2560 2079 -1887 -4245 -1653 2077 2623 1770 566 -2108 -3577 -759 2978 2858 787 -1311
1615a311j399M75K892K547q29k896j824j73J516K911J743k341l948n8J572R01
$$ -1311 -2710 -2235 657 3204 2375 -521 -2345 -2518 -1002 1909 3652 1311 -2637 -2695 -1123 -222
1631b22K592Q92l091l332M20K696J392N89J11k669k783J012L410J305m95j367
$$ -222 2370 3262 171 -3161 -2741 -45 1347 1936 2047 -622 -3405 -2393 1017 2322 1827 460
1647D60k073j598K230L208N04j829j289j997l58K534L584p81l268j363L00K06
$$ 460 -1613 -3211 -981 2227 2731 902 -387 -2384 -2742 -208 3376 2595 -673 -2036 -1736 -1530
1663a530K344K929j518l785j322J466J417J447J451j476l627r60K503K197P11
$$ -1530 814 3743 2225 -1560 -2882 -1416 1 1448 2899 1423 -2204 -3164 -661 1536 2247
1678B247k18k449k437J10L358J780n93q48j876k193J251L559J399j935j662j025
$$ 2247 2029 -420 -2857 -2747 611 2391 1798 950 -926 -3119 -1868 1691 3090 1155 -507 -1532
1694a532q53J246L569R68k901k273j21L43J915K497j94l156j971L35J748J577
$$ -1532 -2385 -1139 2430 3398 497 -1776 -1897 -1554 361 2858 2664 -492 -2463 -2128 -380 1197
1710A197J531j124l129j241J611K302O26K54j407k843r71L119K533n25p87j727
$$ 1197 2728 1604 -1525 -2766 -1155 1147 1773 2027 620 -2223 -3194 -75 2458 1933 1146 -581
1726e81j934J84K850K474j168k252j089p27O42K849J956k079k706m25N65J039
$$ -581 -2515 -2331 519 2993 1825 -427 -1516 -2243 -1601 1248 3204 1125 -1581 -2006 -1441 -402
1742d02K737M02k553k963N16J956J041J327q5k760k481J507K500Q16L09p23k434
$$ -402 2335 2737 184 -2779 -2263 -307 734 2061 1976 -784 -3265 -1758 742 1558 1867 1144 -1290
1759a290j905K239K476N88q83j245j998n87K710K212j67k103j260q12L98K063
$$ -1290 -3195 -956 1520 2108 1225 -20 -2018 -2605 105 2317 2150 47 -1213 -2025 -1627 436
1775D36K521j193k935p81M55J119K218J077j923k810l91J497Q52J771J23k040
$$ 436 2957 1764 -1171 -1952 -1497 -378 1840 2917 994 -1816 -2207 -710 142 1913 2036 -4
1791dk658N82K418J019O28n63k268k020J222L025R02j046j055j626j095J859K758
$$ -4 -2662 -2080 338 1357 1985 1422 -846 -2866 -1644 1381 2283 1237 182 -1444 -2539 -680 2078
1808B078L00j989j204p95k43J864K742l64k964j120K00P95J493J837q78l089r35
$$ 2078 2378 389 -815 -1610 -1853 11 2753 2389 -575 -1695 -1495 -700 793 2630 1752 -1337 -2272
1825b272J209J369J081Q81j460k712n72K099J624M42l25j527k289N42K413J800
$$ -2272 -1063 306 1387 2268 808 -1904 -2476 -377 1247 1689 1364 -163 -2452 -1910 503 2303
1841B303p67j227j375j409R74L175N83j655j466m15l33J106K337P29k151k010
$$ 2303 1536 309 -1066 -2475 -1501 1674 2257 602 -864 -1279 -1612 -506 1831 2560 409 -1601
1857a601rO41J428J637m03k220j448N63J251J215J062j035k553q82J613J717J75
$$ -1601 -1610 -969 459 2096 1693 -527 -1975 -1412 -161 1054 2116 1081 -1472 -2354 -741 976 1151
1874A151L06q35k618n43K880J565m28j034p82j440M1K486J655j061j859q48j78
$$ 1151 1457 622 -1996 -2539 341 1906 1478 444 -338 -1778 -1737 749 2404 1343 -516 -1364 -1542
1891a542O81K270R44j642k000j74M24J068K032Q7k317j800N62J134R87R64j03
$$ -1542 -861 1409 2353 711 -1289 -1463 -1039 29 2061 2148 -169 -1969 -1407 -273 714 1678 1575
1908A575k296j941J428K499K67k93p38j486j319J867J981L68j123j418j020O0
$$ 1575 -721 -2662 -1234 1265 1532 1239 501 -985 -2304 -437 1544 1912 789 -629 -1649 -1589
1924a589J894J473k60j090j502p21L48K450J290j437k024l9L42K49J827J111j692
$$ -1589 305 1778 1518 428 -1074 -1795 -1447 1003 2293 856 -1168 -1207 -865 -616 1211 2322 630
1941F30k371j09J488J119M67K50j718j538J17J838J176K32r08j700q52J191J771
$$ 630 -1741 -1850 -362 757 1224 1474 -244 -1782 -1665 173 1349 1581 673 -1027 -1879 -688 1083
1958A083J56l42o31j582q44J716K287j9j883p71j30n37J419K247k56k262j342
$$ 1083 1239 897 266 -1316 -2160 -444 1843 1824 -59 -830 -960 -1497 -78 2169 1913 -349 -1691
1975a691M43J093J014R37r51j819p60Q03J425J291k62j187j885l3J757Q42K22
$$ -1691 -1248 -155 859 1796 845 -974 -1734 -931 494 1785 1523 336 -1549 -1582 175 1017 1239
1992A239n0j505j807O83K338P70r42n58n56j173N16J917J306j717j467r0P6R36
$$ 1239 1189 -316 -2123 -1440 898 1668 726 168 -388 -1561 -1045 872 2178 461 -1006 -1096 -1020 -84
2010h4J269L47j178j594k86P74J532J017q84j651q23O25J065O26J108j022k408
$$ -84 1185 1532 354 -1240 -1526 -752 780 1797 913 -738 -1561 -936 129 755 1863 841 -1567
2027a567k60J642J033L05j63o35j724l47J679K000n59j679m71l24n2J525J215
$$ -1567 -1827 -185 848 1153 990 355 -1369 -1716 -37 1963 1404 -275 -746 -1070 -1122 403 1618
2044A618n37j344q82k39J249J772j45j319r35j62L0J071J484P4j942j567P60R92
$$ 1618 1081 -263 -1145 -1384 -135 1637 1492 173 -762 -924 -894 177 1661 1735 -207 -1774 -1014 -22
2062b2P16M02J5j483j555P46K090N65n69p72j082l39Q95J312M19p74j004r65K91
$$ -22 694 1096 1111 -372 -1927 -1181 909 1474 905 133 -949 -1288 -393 919 1338 564 -440 -1405 -1114
2081a114J801R32p75j026o05o58L72J733J190j036j773l06O96Q37N30Q44r83k242
$$ -1114 687 1619 844 -182 -787 -1445 -1073 660 1850 814 -959 -1265 -569 268 798 1642 659 -1583
2099a583l8J728R06k12j68p20j055J26J018J314k17q13j200m48P52J554M2l94
$$ -1583 -1621 107 1013 801 633 -87 -1142 -1016 2 1316 1099 286 -914 -1362 -610 944 986 592
2117E92p20p31p85J592J575p5j709o71N1J54O24J552N8k047j214P59Q78N92O60
$$ 592 -128 -859 -1644 -52 1523 1448 -261 -932 -881 -727 -103 1449 1507 -540 -1754 -995 -117 475 1135
2136A135m66j492m93Q08R64Q21P6j515j426O28R52R21j36j02p82j538O36J957
$$ 1135 669 -823 -1316 -508 456 1277 1353 -162 -1588 -960 -8 913 777 675 -107 -1645 -1009 948
2154I48N57p33o91n84p26M57J725O26j261j096m34R65L78Q99K51j257j083k68
$$ 948 1505 772 81 -503 -1229 -772 953 1579 318 -778 -1212 -247 131 1030 1281 24 -1059 -1327
2172a327Q53J108O47k29j852m66Q91N63O04K86l33k051k52J442J118l41j33p91
$$ -1327 -474 634 1281 1052 -800 -1266 -375 188 792 1078 745 -1306 -1558 -116 1002 661 528 -263
2190b63o57m09J273J653o63j154m09j66J02J152O28k56j233m49j08O80J498J6
$$ -263 -920 -1329 -56 1597 934 -220 -629 -795 -693 459 1087 831 -402 -851 -959 -279 1219 1235
2208A235j179j222N44L82L81J170J6j587j224N70J404j4J07l0j014j034M18J635
$$ 1235 56 -1166 -622 -240 141 1311 1327 -260 -1484 -914 490 476 583 553 -461 -1495 -1077 558
2226E58O68q19l38r66k58J145O18N12q63o64o12k1J164J196p47j032p8j33K3J404
$$ 558 1226 407 69 -897 -1155 -10 608 1120 257 -407 -1019 -1040 124 1320 573 -459 -537 -670 -647 757
2246G57O35j076j402K72M01N71M04M99o45j369j25J002P99p1k0r86p80K18J342
$$ 757 1392 316 -1086 -814 -413 158 562 1061 416 -953 -1078 -76 723 652 632 -354 -1134 -916 426
2265D26N20j12k71j347k87N36J412R0o92m38l28m15P73J179j47q84q94J14L40
$$ 426 946 834 563 -784 -1071 -535 877 967 275 -163 -491 -906 -133 1046 899 15 -879 -765 -425
2284d25N12Q07r1j198m86J79O75Q11K71n10j306m68Q98P20N52k1j155p74M0J174
$$ -425 87 894 803 -395 -881 -702 -27 784 1055 545 -761 -1229 -331 389 941 920 -235 -1009 -969 205
2304B05N46k00k34p10o48K04J479L48o09p07j38l86M40R19M70q42n81l40K78O47
$$ 205 751 551 317 -393 -1041 -837 642 990 381 -326 -464 -850 -410 509 979 137 -444 -784 -506 141
2324A41Q93j10j329m56J92L32N31N53q2j197m13N45O41L12j42j89q35o74J137
$$ 141 1034 924 -405 -861 -669 -337 194 747 665 -532 -945 -400 241 553 411 222 -613 -1287 -150
2343a50Q43M5l71l16r44K67P02R09j65q27n82l87M01J064N97n32j144j95J67N45
$$ -150 693 738 367 51 -893 -626 76 985 820 -7 -589 -976 -575 489 1086 554 -590 -785 -618 -73
2363g3Q26L4q07p62J1N62N35N20Q2j312o71N33P43M94j56k06r13l00N82N64P86
$$ -73 753 787 -20 -782 -771 -209 326 846 928 -384 -1055 -522 221 715 559 353 -560 -860 -278 286 1072
2384A072o43n20o09J2O57R15j16p59m44k66MP84R31o12q98j58Q8K14Q74K58p26
$$ 1072 429 -91 -700 -688 -31 884 768 9 -435 -701 -697 87 1018 406 -492 -650 -562 -348 526 784 58
2405E8p70J41L99L02M06rn56n70k27P73O34N9k33o21o82J89J087L69k03m60m56
$$ 58 -712 -571 -172 130 536 527 -29 -599 -826 -53 581 640 407 -214 -896 -707 380 749 546 86 -370
2426c70n95O36J008J40q62j49k28o1L39R40K1r64o55K90J15P25M49m30r13k18
$$ -370 -965 -329 679 819 -43 -192 -420 -481 -142 798 819 -145 -800 -510 -395 330 779 349 -564 -782
2446g82L42L35O54l0k81r71R7Q53J38J12M40r11o45Q8O34Q16l62l65o75k45K67
$$ -782 -440 -105 549 519 238 -733 -636 217 355 467 907 -4 -649 -561 73 889 527 162 -513 -758 -491
2467d91P77K95l12o23k08j38P02M35M43p66o09J40k95O46J025n46p54j11j79N74
$$ -491 286 581 269 -354 -562 -700 2 437 880 114 -495 -355 -650 -4 1021 475 -279 -390 -569 5
2487ER8N82j65p71o16O32O95N1j63k11n85k4N74N59ml42n45n19K27P68M15k46
$$ 5 103 685 520 -251 -867 -235 460 511 348 137 -448 -472 102 661 657 315 -230 -749 -522 246 661 415
2509D15o20j34j78L8R05L66n23o64j22K19K54N18K88o02q21M2O52L24pJ63o61
$$ 415 -205 -339 -517 -479 426 792 269 -395 -517 -298 -44 474 762 160 -661 -619 33 357 350 513 -148
2530a48m84L80L54L07M2k22n12k87L12N04J49j14m88j46q1N65K11K60n76l19l00
$$ -148 -632 -252 102 409 451 229 -283 -570 -258 246 395 281 -207 -353 -434 131 342 602 26 -293 -593
2551e93J82M85N52J8p20m88K95J34M88K49o51m33k84O85K90L41k15l74q66N49
$$ -593 -411 74 626 644 -76 -564 -269 -135 353 602 -49 -482 -766 -81 209 550 335 -39 -905 -356
2571c56M01K41K09l38k31m88L99N49M17n01m57k19r8L40O88K03j117k0l1N9L21
$$ -356 45 286 495 157 -74 -562 -163 386 803 302 -155 -374 -472 -132 556 759 -358 -378 -409 -350 -29
2592b9N01o2m09n17J27M77L21Ol45n67j02N77J48N70k00m72m25M1L18O11k69o0
$$ -29 472 410 1 -516 -389 88 409 415 70 -497 -599 -22 126 696 496 24 -401 -360 -42 569 300 240
2614B40k74n14K08N54N58l39m07k01m44L90O48L89n11m30k87J44L06O21N3n90
$$ 240 -34 -548 -340 214 772 433 26 -175 -619 -229 419 808 297 -133 -420 -276 30 651 704 114
2634A14l25p3j56N25M76j76p88J1r0L91M57L38m07n99j82L68K33J06p6k86l24
$$ 114 -211 -284 -440 85 561 385 -403 -392 -482 -91 366 704 297 -302 -484 -116 117 223 147 -139 -463
2655d63k57Q90M97l22l40l28k10L06O79R3m06k52l96Q8L70O98k29m25k45r9J56
$$ -463 -720 170 667 345 5 -323 -533 -227 452 545 139 -113 -509 -421 -51 647 418 -7 -252 -351 -195
2676a95J15K04L42o17l00R1K36K80qL5m84j20j8O84J94J0m29n47L1K57P58k88
$$ -195 -80 124 466 -151 -451 -360 -124 156 148 183 -301 -421 -439 245 439 449 20 -527 -496 -239 519 231
2698B31q1m55l97K95L38P01k28o40j60J86m9L32N43l65n70k12N33k94O48M13o96
$$ 231 150 -305 -702 -407 -69 632 404 -236 -396 -210 -259 73 616 251 -319 -531 2 -292 356 769 73
2719G3n85o4N19K04J59L0l63n41K55O56K02l64k58k85R0K46J75Q7K0n05p3j47
$$ 73 -512 -576 -57 147 306 336 -27 -568 -313 343 545 181 -77 -362 -272 -26 149 236 256 -249 -322 -469
2741d69N46K06N6k21m96K10L1N11K4m8n50j82J11J37K94J29k26l81qM6K51J95
$$ -469 77 283 339 118 -378 -168 -137 374 398 350 -200 -382 -271 -134 160 289 63 -318 -326 -280 -29 166
2763A66K44k06p69J16O62K13r7j27m38p6J88M33L16k91l61k64L6j17P34Mk23m83
$$ 166 410 204 -565 -449 213 426 329 202 -236 -312 -124 309 625 334 -27 -291 -255 -372 362 366 143 -340
2785c40q6N2K90M91k09k31k75J68J56K52L05q2o21l62M20L36m4l3r1m07k27N10
$$ -340 -426 -374 -84 407 198 -33 -308 -140 16 268 573 491 -130 -492 -72 264 220 187 96 -311 -538 -28
2807b8M14K55l09n87J29l65P20M10l47l58L0r9Q5L53Nn68L5N8j97L21J42J78k56
$$ -28 386 641 332 -255 -126 -491 229 639 292 -66 -36 -135 -50 303 308 -260 -225 -167 -364 -43 99 277 21
2830B1k33j62K8M55K94J1m16l89K06J94J14r2J27l62k69L51J87K14J84n47l50
$$ 21 -212 -374 -346 109 403 414 -2 -391 -185 9 123 31 158 -204 -473 -122 65 279 463 -84 -434
2851d34M6K55N88o5k77j01k87K4L18L32k63j23j23o2k2L93L79o83m44K09M83p7
$$ -434 -388 -133 455 390 113 12 -275 -251 67 399 136 13 -110 -172 -194 199 578 -105 -549 -340 143 66
2873F6J97J78n48m32L22R8L34J84k56j95l34L51J03J48J15n38J2k9m7L93K21l97
$$ 66 263 441 -107 -539 -217 -119 215 399 143 -52 -386 -35 68 216 331 -207 -195 -224 -271 122 343 -54
2895e4M4k24j61M34J91J84m27n56K91L33J40J77j57k70l64J97J91K84j64jk55
$$ -54 -10 -234 -395 39 230 414 -13 -569 -278 55 195 372 215 -55 -419 -222 -31 253 89 88 -167
2916a67J95J54N3k72R2O3m38q5N05M24l03j23l63j99N9O80K28l15j51k74N1j47
$$ -167 28 182 235 -37 55 118 -320 -405 100 524 221 98 -265 -464 -405 275 503 188 37 -237 -186 -333
2938c33O26J81o56j33j0J1K26K24J88m76k01J93J93J57J14j0k51l13J29J43K35
$$ -333 293 474 -182 -315 -325 -314 -88 136 324 -152 -353 -160 33 190 304 294 43 -270 -141 2 237
2959B37j25j66j08j85J72L26R1k12j3j77k02L77M27j30l75J21m35J99L43L47m17
$$ 237 112 -54 -162 -347 -175 151 242 30 17 -160 -362 15 442 312 -63 58 -377 -178 165 512 95
2980I5l51J01J29o2L87p7j95n66K33J22K70J43j60l3j32O5K24k02L3J84l30l03
$$ 95 -256 -155 -26 -88 299 222 27 -539 -306 -184 86 229 69 36 -96 -31 193 -9 24 208 -122 -425
3002d25K85K46O8n6k23j25l43M81L28R1m11j26k8R9J6M33j78j49j35J14K34J98
$$ -425 -140 106 174 118 -105 -230 -573 -92 236 327 -84 -210 -238 -139 -123 310 132 -17 -152 -38 196 394
3024C94J01n09j66K29j14K3K10J29k34m52J22M21N4J95j99k62l68J46J64K72P2
$$ 394 495 -14 -180 49 -65 -42 168 297 63 -389 -267 154 208 403 204 -58 -426 -280 -116 156 228
3045B28r7j39j26r6K25K24j88j09L2j48J02K86jn24j59L76k61L89L34k06n01L36
$$ 228 131 -8 -134 -230 -5 219 31 -78 -46 -194 -92 194 193 -331 -490 -114 -375 14 348 142 -359 -23
3067b3k73K27J91M2J79n61j39J59L88p3K68l16j30j58K64L27k22m09j31J47j12
$$ -23 -296 -69 122 164 343 -218 -357 -198 190 117 385 69 -61 -219 45 372 150 -259 -390 -243 -355
3088c55N52J51j84q3J7m53J35M37K8k42j50k0J7J98K21Q4l38m92N90l9q7J58J77
$$ -355 197 348 164 81 98 -355 -220 217 245 3 -147 -167 -150 48 269 353 15 -477 113 74 -13 145 322
3111C22l62L3J23J1P0q1Rl83Q9N5K02nJ75j84l86L15m9L15j63o9k11N7J80J45
$$ 322 -40 -7 116 127 197 116 125 -258 -169 -114 88 83 258 74 -312 3 -46 269 106 37 -174 -117 63 208
3135B08j85P8k5J49k12j52M99l47N3k85R0K8K61N1j4j93k85K46J19N7l4k13k50
$$ 208 23 101 76 225 13 -139 360 13 66 -219 -129 -101 160 211 197 4 -281 -35 84 141 107 -106 -356
3158c56n8K31J95m0P0K4k89P1J68l8J60pN8j73kP5J43l14j50J58K68m70K42K03
$$ -356 -414 -183 12 -28 42 66 -223 -152 16 -22 138 131 189 16 14 89 232 -82 -232 -74 194 -276 -34 169
3182A69r8k07k14L78l87L15K19k74l27K18P4L6Q1J28J5m28L59M1K05j48%j04j08
$$ 169 71 -136 -350 28 -359 -44 175 -99 -426 -208 -134 -98 -17 111 126 -302 57 98 303 155 155 51 -57
3205e7J51J8k5j89K9o4J41K76j91N0N5l88J72J14J57K1N2l55o9L09j3j71L71l29
$$ -57 94 112 87 -102 -73 -137 4 280 89 139 194 -194 -22 92 249 270 322 -33 -102 207 194 23 394 65
3229F5l73L61K33q1M6j68o2j55j66L06J96k01J60j57j42K57Ooj09j80o2L60k49
$$ 65 -308 53 286 205 251 83 21 -134 -300 6 202 1 161 4 -138 119 125 119 10 -170 -232 128 -121
3252a21N5M88n99J99l38M9Q5L89m2k88J60l53M76o5l4J11r1k91J88r0M16n69K04
$$ -121 -66 422 -177 22 -316 -267 -182 207 165 -123 37 -316 160 95 61 172 81 -210 -22 -112 304 -265 -61
3275f1p4K5j83L15j56L66k12j64j83N2M56k30L4J53k57j07L55P7j80j27K62k42
$$ -61 -135 -110 -293 22 -134 232 20 -144 -327 -275 181 -49 -15 138 -119 -226 129 206 26 -101 161 -81
3297h1j04L46K59m87k7j8Q8o7M2K89m47M0J0K40P0K1n5k81M5n4N00j25k58J2p4
$$ -81 -185 161 420 -67 -94 -112 -24 -91 -49 240 -207 -167 -157 83 153 174 119 -162 -117 -171 329 204 -54 -42 -116
3322a16nJ54j13OR0Pk48K11K31m3r9j61M1j76K38O5j5R8l90J39j26J67J65J09
$$ -116 -121 33 -80 -74 16 23 -225 -14 217 174 75 -86 -45 -221 17 82 67 165 -225 -86 -212 -45 120 229
3346B29j50m56K90j23M57j30k2j4k65J08J32J14l34K50r3j27K23J13J42n03J79
$$ 229 79 -377 -87 -210 247 117 95 81 -184 -76 56 170 -164 86 -7 -134 89 202 344 -159 20
3367B0o8oqK76k63j51n4J41J46K18o5l5m28J08K72r1K12k05J21l05qP5J15rK22
$$ 20 -48 -54 -62 214 -49 -200 -254 -113 33 251 186 151 -277 -169 103 12 224 19 140 -165 -173 -98 17 8 230
3392B30j90j4l11N59k19J12j36J82l82K08J27k01L1j97j29Q0K74r9n4J85l08J73
$$ 230 40 26 -285 274 55 167 31 213 -169 39 166 -35 -4 -201 -330 -250 24 -75 -129 56 -252 -79
3414g9K2K87k10J25l56K95k74J12J36J66k38j47J65j01J43L39k35j50L9k17K37
$$ -79 -57 230 20 145 -211 84 -190 -78 58 224 -14 -161 4 -97 46 385 150 0 39 -178 59
3435E9j4J22m7k41rL18k23K38r4j11l42L74N2J23j51k6N5j2l87L49J56L5k44j9
$$ 59 45 167 120 -121 -130 188 -35 203 109 -2 -344 30 82 205 54 28 83 71 -316 33 189 224 -20 -39
3459c9j32J78L9j3O2J35l05l7K68K4N1m31J54J34l24K70P3L7j89mJ07j34J83k9
$$ -39 -171 7 46 33 95 230 -75 -112 156 180 231 -200 -46 88 -236 34 107 144 -45 -49 58 -76 107 78
3483G8N5j4j68J07r2Q0K69l41K25j80Q4J86o3m03J59k04R1J57K09j39n7P0j72
$$ 78 133 119 -49 58 -34 46 315 -26 199 19 103 289 226 -177 -18 -222 -131 26 235 96 39 109 -63
3506f3P2R5jj40j8l5J7K46K3m52J84Q0l8k13L19k2J10j68Q9k71J77K89j90k0r9
$$ -63 9 104 103 -37 -55 -90 -73 173 196 -256 -72 8 -30 -243 76 54 164 -4 85 -186 -9 280 90 70 -29
3531b9K2m6J43j83O1j17k6N1J8OL9l9K77m32L47O0L7k01j10k5m4M03M0j26k15
$$ -29 -7 -53 90 -93 -32 -149 -175 -124 -106 -100 -61 -100 177 -255 92 152 189 -12 -122 -147 -191 212 252 126 -89
3556h9j05o5L4J93n5J51l59K69j66J16L47k45k41l2L64q9k5k1OJ1j8M6r7L05l06
$$ -89 -194 -259 -225 -32 -87 64 -295 -26 -192 -76 271 26 -215 -247 117 28 3 -18 -12 -1 -19 27 -70 235 -71
3581g1O3J24k66K69Q6k55L00k54J28lj43J01o9j21j0J40q4J11J26N2k42n0r8J62
$$ -71 -8 116 -150 119 205 -50 250 -4 124 121 -22 79 10 -111 -121 19 -65 46 172 224 -18 -68 -166 -4
3605dK08l2j29l07M6J86J80j02o5kk18J27J03M96k68k23l0k3n2L30j84j84K1P5
$$ -4 204 172 43 -264 -218 -32 148 46 -19 -21 -239 -112 -9 487 219 -4 -34 -57 -109 221 37 -147 -126 -51
3629e1j60K01O2J4j91q3N3rq4M22lK2k92L0mJ21J21q9j30j66J65m1m5J79m6q1
$$ -51 -211 -10 52 66 -125 -208 -155 -164 -248 174 171 193 -99 -69 -73 48 169 80 -50 -216 -51 -92 -137 42 -4 -85
3655h5n2J99J53m5K16k92k14J25K2J10j91J26j6j2j89J67Q3n2RP9l26LP9L04j04
$$ -85 -137 62 215 170 386 94 -120 5 27 137 -54 72 56 44 -145 22 105 53 62 141 -185 -182 -103 201 97
3680I7j47j95J31K2J52J50j90o6j47K32N9Q4l5j92OK7L40l99K35k69j40M13j30
$$ 97 -50 -245 -114 -92 60 210 20 -46 -193 39 98 182 147 -45 -39 -12 328 -71 164 -105 -245 168 38
3703C8k3K63k23j28J6j54k4K32Q5j98J51l8j5J28k35RJ77j79M7o0N0K81o3j91
$$ 38 15 278 55 -73 -57 -211 -235 -3 82 -116 35 -3 -18 110 -125 -116 61 -118 -71 -131 -81 200 137 -54
3727e4n9k2K92J9k8N3j56j33J34J93p7O7l93n2K38J61J46l72j29J50j71K3K75
$$ -54 -113 -135 157 176 148 201 45 -88 46 239 162 229 -164 -216 22 183 329 -43 -172 -22 -193 -170 105
3750A05j27j50%K06j80Q3K75r0j64j52K71k53K19P5j75j8L2J64k61J2K90k13K22
$$ 105 -22 -172 -172 34 -146 -63 212 122 -42 -194 77 -176 43 118 -57 -75 -43 121 -140 -128 162 -51 171
3773A71p2l06J09J28O7j51n1q8J40K98l11k15P8k3K55pJ05j65j68K92R7lk62J3
$$ 171 99 -207 -98 30 97 -54 -105 -193 -53 245 -66 -281 -203 -226 29 22 127 -38 -206 86 183 180 -82 -69
3797f9j67J95J97j74j4J89j73r2J13j72J87M1r0PQ4Qk62L32Ql71J46j79L45j34
$$ -69 -236 -41 156 -18 -32 157 -16 -108 5 -167 20 61 -29 -22 62 70 -192 140 148 -223 -77 -256 89 -45
3821d5J06j37j09J46K6J92j6J12k67j07J59k94J47J94k81J51j40K13R4M2K0k09
$$ -45 61 -76 -185 -39 -13 179 163 275 8 -99 60 -234 -87 107 -174 -23 -163 50 144 186 206 -3
3843ck48L5K11J19n7Qj24K23j95m1J44J83j43j01p8j41K02K56k45M4l88j0K98
$$ -3 -251 -216 -5 114 57 65 -59 164 -31 -72 72 255 112 11 -67 -208 -6 250 5 49 -339 -349 -51
3866e1J37P4j29j6j27J34J53j90k5J52j31j37M2k6J33M1j0K6J40k59Q2J95j11
$$ -51 86 160 31 15 -112 22 175 -15 -40 112 -19 -156 -114 -140 -7 34 24 50 190 -69 13 208 97
3889I7j90o9Q6LJ26N1k68K00j82l7L62j29j3j7o2j92J21L07R2k42K1j36k28M94
$$ 97 -93 -162 -76 -73 53 104 -164 36 -146 -183 179 50 37 20 -42 -234 -113 194 286 44 65 -71 -299 195
3913A95j16oJ33j97J87l54L44p3j98lK32l84K30qK88k41m5N7l0K93p4l42l1j11
$$ 195 79 73 206 9 196 -158 186 113 -85 -88 144 -240 -10 -18 270 29 -16 41 11 304 230 -112 -143 -254
3937b54n6L34J76J8l64L02l64J23O1K22j72M0j72K77j33R4j45J76k88j2j16L62
$$ -254 -310 24 200 218 -146 156 -208 -85 -24 198 26 66 -106 171 38 132 -13 163 -125 -137 -253 109
3959A09J64m99QK97r2L8J94j91j13N7J92j22R6R0j04r9l9N4J28L4l11K78j58N
$$ 109 273 -226 -218 79 -13 25 219 28 -85 -28 164 42 138 228 124 25 -14 40 168 202 -109 169 11 16
3983A6j1j53L7L06j92p7oJ72o6J94k81k3Q6r3N1O3J8K15l85L8M9J70r2p0k37L63
$$ 16 5 -148 -111 195 3 -74 -80 92 26 220 -61 -84 2 -91 -40 23 41 256 -129 -91 -42 128 36 -34 -271 92
4009I2J6r6nj31L1N2k14K30K41l04K19j6j98k4M5O0P1k93J73K17m76L04K0k0J31
$$ 92 108 12 7 -124 -93 -41 -255 -25 216 -88 131 115 -83 -107 -62 -2 69 -224 -51 166 -310 -6 14 -6 125
4034A25j8n1J23N2k06j1j8j50J56j34K78n3k73J12N0K0r1j21J70o1K77l04M1Q1
$$ 125 107 56 179 231 25 14 -4 -154 2 -132 146 93 -180 -68 -18 2 -89 -210 -40 -101 176 -128 -87 -6
4058fR4j31j89K37J19k40J26k28J27JP6o3L2J4j7Q7q2j44K54M7j24l6j00J1J12
$$ -6 88 -43 -232 5 124 -116 10 -218 -91 -90 -14 -77 -45 -31 -48 39 -43 -187 67 114 -10 -46 -146 -135 -23
4083b3r9K23j09r3m9R9J58J26n6j65q5k01L43N1k89L67l68J03K79k97J62l05J61
$$ -23 -122 101 -8 -101 -150 -51 107 233 177 12 -73 -274 69 120 -169 198 -170 -67 212 -85 77 -228 -67
4106f7K06k91N8J04mP3r1k61K37k7J89Nk94q8J37J32j5P5j01j14J93j17K17k93
$$ -67 139 -152 -94 10 6 79 -12 -273 -36 -63 126 131 -163 -251 -114 18 3 78 -23 -137 56 -61 156 -137
4130a37j02K91j3j3k0J83k59j42M71j53q8l5o8K09k31p6QJ82J6J75Q9n22J37l4
$$ -137 -239 52 39 26 6 189 -70 -212 259 106 18 -17 -85 124 -107 -183 -175 7 23 198 287 -235 -98 -132
4154a32K3KO1O1P0l6M0l3l6o8J41k56J85j35J83J20k00n3k4nJ29Ml02K56J4K48
$$ -132 -109 -107 -46 15 85 49 89 56 20 -48 93 -163 22 -113 70 190 -10 -63 -87 -92 37 41 -261 -5 9 257
4180B57k70J53q0j03k4l9L17j20j17K46j88q0n0k0K06k5n7k1N3M9j59J4on3r6
$$ 257 -13 140 60 -43 -67 -106 211 91 -26 220 32 -48 -98 -118 88 63 6 -15 38 87 -72 -58 -64 -117 -213
4205b13K62K93l87J32o3j23j98L46o5J51k29o2J3J11j29K12O2l13Pj13K32J51
$$ -213 49 342 -45 87 24 -99 -297 49 -16 135 -94 -156 -143 -32 -161 51 113 -200 -193 -306 -74 77
4227G7qP8k54O0l0K92l28R6K75k28K4PJ55k96J59j61J52j5p4J7J33j69q6J78J61
$$ 77 69 147 -107 -47 -77 215 -113 -17 258 30 54 61 216 -80 79 -82 70 55 -19 -2 131 -38 -124 54 215
4252B15j63k41L82j20J09m4j86l6M6P3l1j10j11m2J76J56j13j61K36J30l7r3O8
$$ 215 52 -189 193 73 182 138 -48 -84 -38 35 4 -106 -217 -259 -83 73 -40 -201 35 165 128 35 103
4275A03j66p0Q6j62P9M13k43l5k85Q8N66k11j54K1K36m11J34L2J00j20J62n75
$$ 103 -63 -133 -47 -209 -130 283 40 5 -280 -192 374 163 9 30 266 -145 -11 21 121 1 163 -412
4297d12K75m5K77j44j45J40P8K9Rj96K38P0j56j69K72n59M77J53k91j65J10J09
$$ -412 -137 -182 95 -49 -194 -54 24 53 62 -134 104 174 18 -151 121 -438 39 192 -99 -264 -154 -45
4319d5l8J79l41L17k09J61J04l1k06J95K0N5j59j21J97r0q5J43m6j03J96j15j47
$$ -45 -83 96 -245 72 -137 24 128 97 -109 86 106 161 2 -119 78 -12 -97 46 0 -103 93 -22 -169
4342a69M9O8K48l00J76j47K29l63K9K15n5m7p5J19j83K16j14K43Oj88Q3M6j63
$$ -169 -120 -52 196 -104 72 -75 154 -209 -180 35 -20 -67 -142 -23 -206 10 -104 139 145 -43 40 86 -77
4365g7J19j47O3L3r2J10J39k31J8l7N7p8M15j9m55J09LJ35m7K38k24j58J25J7
$$ -77 42 -105 -42 -9 -101 9 148 -83 -65 -102 -45 -123 292 273 -182 -73 -70 65 18 256 32 -126 -1 16
4389A6r7K32M0p5k38J41j60K69j78Qn6L17j92J00l8K4M4j10Nl95L47L3j21J54
$$ 16 -81 151 191 116 -122 19 -141 128 -50 -42 -98 219 27 127 89 113 157 47 52 -343 4 37 -84 70
4413G0k67R6J30j90N5J73L8m0j66K31j19J07k11j8J03M8L2L1J43j36j5p1LJ92
$$ 70 -197 -101 29 -161 -106 67 105 65 -101 130 11 118 -93 -111 -8 40 72 103 246 110 95 24 27 219
4437B19m57K43o0j02J36q9L8J21O4l1k40lM17j99k12j6r7J18j35J10K67j91o1
$$ 219 -238 5 -55 -157 -21 -110 -72 49 113 82 -158 -161 256 57 -155 -171 -268 -150 -285 -175 92 -99 -160
4460a60O1p9K55J05m40L36m8k9j59K1K51n5j97j45J68J32j2J18p0k53K52l7M5
$$ -160 -99 -178 77 182 -258 78 30 1 -158 -137 114 59 -138 -283 -115 17 5 123 53 -200 52 15 60
4483F0q5J65j48L0NJ08k27K9l2K48p5J6P6l72J72j16L80k80L4K0j82l3L19K3k38
$$ 60 -25 140 -8 22 27 135 -92 -63 -95 153 78 94 170 -202 -30 -146 234 -46 -12 8 -174 -207 112 135 -103
4508a03P9N1k14J04r0j3Q2N79n22q6j73L59l26L57j01j72Q2J49j91K05Rj65o0
$$ -103 -24 27 -187 -83 -173 -186 -104 475 -47 -133 -306 53 -273 84 -17 -189 -107 42 -149 56 65 -100 -160
4531a60K34j81L9L0J32n4j70J11p2LQ6Qk8K76l36K29l25J06L1j92J59q4K24J22
$$ -160 74 -107 -68 -38 94 40 -130 -19 -91 -88 -2 6 -22 254 -82 147 -178 -72 -41 -233 -74 -158 66 188
4555A88k97o3K27m0M8o3j29M66j86k38J4OJ87k62K07k0n3J56l07M23k9j58o9R4
$$ 188 -109 -172 55 15 63 0 -129 337 151 -87 -73 -67 120 -142 65 45 -8 148 -159 264 235 77 8 102
4579A02j44J54j36J94k73L50k16o6O0k8J63l09J2K24J6k4j35j99J63r7M24k69
$$ 102 -42 112 -24 170 -103 247 31 -35 25 -3 160 -149 -137 87 103 79 -56 -255 -92 -189 235 -34
4601c4J97j75k01K2K52J56l66Q3J60q2J80l82K45J1j12J9n5O2R2m6j4N1j94j79
$$ -34 163 -12 -213 -191 61 217 -149 -66 94 12 192 -190 55 66 -46 -27 -82 -20 72 26 12 63 -131 -310
4625c10L72m9j08J52j44J99k34j36L04Pk45J85k07K20K94j93J00k02l2J3J35j67
$$ -310 62 13 -95 57 -87 112 -122 -258 46 53 -192 -7 -214 6 300 107 207 5 -27 -14 121 -46
4647d6J22q1P5r4K44k07j19K03j87J69k01M2J81j92K84r2k55K2J6J17M2l0q6N
$$ -46 76 -5 70 -24 220 13 -106 97 -90 79 -122 -80 101 -91 193 101 -154 -132 -116 1 43 13 -73 -68
4671f8J73O9j33k06j12J67J19O0j22N1J34m7j34l3q4nJ69j4j2r3O3J4J63L8k97
$$ -68 105 174 41 -165 -277 -110 9 69 -53 -2 132 85 -49 -82 -166 -171 -2 -16 -28 -121 -58 -44 119 157 -140
4696a40P4l9J60l55K32K2J94%j73j65K61j99K16j09M9L4j1k54m6J89J91j22K0
$$ -140 -66 -105 55 -300 -68 -46 148 148 -25 -190 71 -128 88 -21 28 62 51 -203 -249 -60 131 9 29
4719B9L4k2L07o33L02J93r5j83J52j57J15k25K16J2j91K18J59l58K19n7m3k25
$$ 29 63 41 348 -285 17 210 115 -68 84 -73 42 -183 33 45 -146 72 231 -127 92 35 -8 -233
4741b33J95j6O2J42J49j04m44L88l62K55j18p5K48j0j07K4j71K8J38O0J3J46r
$$ -233 -38 -54 8 150 299 195 -249 139 -223 32 -86 -161 87 77 -30 -6 -177 -149 -11 49 62 208 199
4764A99k28J65k61oK55j85K77p1l39K08j62L17k88M5L4J50j99L34j09j52m2r2
$$ 199 -29 136 -125 -131 124 -61 216 145 -194 14 -148 169 -119 -74 -40 110 -89 245 136 -16 -58 -150
4786a50o0P3L53k41p3J59J67k52K25r1J00j20p6j73M6LJ25p4J96k09J7J53q8N3
$$ -150 -210 -137 216 -25 -98 61 228 -24 201 110 210 90 14 -159 -113 -110 15 -59 137 -72 -55 98 10 63
4810F3J49k47r0J80o8j5K7j06l41M77j74j9L49q8J07j82L3N2m8Q2k92K44q8j06
$$ 63 212 -35 -125 55 -13 -28 -1 -107 -448 29 -145 -164 185 97 204 22 55 107 59 141 -151 93 5 -101
4834a01qO9K98k49L15m89J6K38j29J58m21L99j35j3m0j14J81J6o3p2J77j4L1k3
$$ -101 -109 -40 258 9 324 -165 -149 89 -40 118 -303 96 -39 -52 -92 -206 -25 -9 -72 -144 33 19 50 27
4858B7l12M06o3Q4j45o8l1J79j96J7R5J84j15j51k7M2J11rn9k27K74j00N0J30
$$ 27 -285 121 58 142 -3 -71 -102 77 -119 -102 -7 177 62 -89 -116 -74 37 28 -31 -258 16 -84 -34 96
4882I6p0j95J46K10j98K1kQ5o7m60M22L7K56l23j12J25J5k27K42K41k52o7K21
$$ 96 26 -169 -23 187 -11 10 8 93 26 -434 -12 25 281 -42 -154 -29 -14 -241 1 242 -10 -77 144
4905A44j19J24k19l7M1kr0R9J15R0J64l77R3J28Rj93J19j51K04j48J06nk7l0j73
$$ 144 25 149 -70 -107 -66 -68 -158 -59 56 146 310 -67 26 154 163 -30 89 -62 142 -6 100 95 68 38 -135
4930a35K05o4K61j22O4j30o0J06p8K86l30j67n1L55l12J22M76m26j31K53j69J49
$$ -135 70 6 267 145 209 79 19 125 47 333 3 -164 -215 140 -172 -50 426 0 -131 122 -47 102
4952A02l5k00J72kl35R3L06k15J96j26j05K42l13L41j71k22L0J13KK34j85q0K94
$$ 102 67 -133 39 37 -298 -205 101 -114 82 -44 -149 93 -220 121 -50 -272 -242 -129 -127 107 -78 -158 136
4975A36l67N38k26l6J32l25J14j7l7K77j97l9R9J2p7j15J54p0k0Q0l23M05j49
$$ 136 -231 307 81 45 177 -148 -34 -51 -88 189 -8 -47 52 64 -13 -128 26 -44 -64 16 -307 98 -51
4998e1J80q3J25j88o2P9K27J56n58J69j42Q8K16k34k25O07j74j2Mr9K1k21p5J88
$$ -51 129 46 171 -17 -79 0 227 383 -175 -6 -148 -60 156 -78 -303 304 130 118 122 23 44 -177 -252 -64
5022f4J86j96Q5j10J8K24j40rN4Q4qJ40j93k34L95k34k0n3q3M18k92n3J63j92
$$ -64 122 -74 11 -99 -81 143 3 -6 48 132 124 264 71 -163 232 -2 -22 -75 -158 260 -32 -85 78 -114
5046a14J37L2p2k4O4j16J79L7l4r5l2J20k88L26k57J07j12K97N4m34L67j55Q0
$$ -114 23 55 -17 -41 23 -93 86 123 89 -6 -38 82 -206 120 -137 -30 -142 155 209 -225 142 -13 67
5069F7kR0q3k46N39m53J80J56j83k7o4J00P2j17qo5k09K18J18Q9j54j0J06o3r7
$$ 67 65 155 72 -174 365 -88 92 248 65 38 -26 74 146 29 21 -44 -253 -35 83 172 18 8 114 51 -46
5094d6KJ39j21R4j84O8K04k85O9j2L13k64j13K92j67J19m16L04N7k15K76l04L64
$$ -46 -44 95 -26 68 -116 -48 156 -129 -60 -72 241 -23 -136 156 -11 108 -308 -4 53 -162 114 -190 174
5117A74l70Q2K5J68j19J2L01j23l4j10P9M9j91L82l77m2R0n7Q8l3K30l23j49L71
$$ 174 -196 -114 -89 79 -40 -28 273 150 116 6 85 134 -57 325 -52 -94 -4 -61 27 -6 224 -99 -248 123
5141A23r1j39J77l01J07K23j49R2l42L03P9J42j58j4k8J86k95k1L02j73j13L33
$$ 123 32 -107 70 -231 -124 99 -50 42 -300 3 82 224 66 52 24 210 -85 -106 196 23 -90 243
5163B43l52j14L3K73Q9oJ9k51j23J64j75J10j72L57j28J82k57L40l43M5J76l25
$$ 243 -109 -223 -190 83 172 166 185 -66 -189 -25 -200 -90 -262 95 -33 149 -108 232 -111 -66 110 -215
5185b15J05J61j7o3l5M2j21P5J66j88J60k8L0j68J1J19K0%j51N6j0J15N4k19J58
$$ -215 -110 51 34 -29 -64 -22 -143 -68 98 -90 70 42 72 -96 -85 34 54 54 -97 -41 -51 64 118 -101 57
5210E7K84k48O4k00K6K30j07j51JJ29N7j61J89r7Ko0J02j7n6j73j1K42p0k01L70
$$ 57 341 93 157 -43 -17 213 106 -45 -44 85 142 -19 170 73 75 15 117 100 44 -129 -140 102 32 -169 201
5235B01k04l6K55j34j35r9J83L2Qq6J25j19l5J48k99L71R7m74K21K05k51J91m2
$$ 201 -3 -39 216 82 -53 -152 31 63 71 -15 110 -9 -44 104 -195 176 273 -201 20 225 -26 165 123
5258A23j06L4N0k14J85J33k83J69M3l9m17K51R2j36J69j61P0k6j7j7l5P1j38J58
$$ 123 17 51 101 -113 72 205 -78 91 134 95 -322 -71 21 -115 54 -107 -37 -63 -80 -97 -132 -61 -199 -41
5282d1O4j74K05o4j89K80l7M1j85K16k29L75k23M9J11l35J65k55J36J85j42J15
$$ -41 23 -151 54 -10 -199 81 44 85 -100 116 -113 262 39 88 199 -136 29 -226 -90 95 -47 68
5304F8j31k00J33L15j59q3O7J51l19j7J39L62j96k58J5J00J3J15K33l18j13J37
$$ 68 -63 -263 -130 185 26 -57 10 161 -158 -175 -36 326 130 -128 -113 -13 0 115 348 30 -83 54
5326E4M2l6j20j9K35Q6k11j8L0j46l6J66J07k6J26k70K2j19P2k0J44j09J3k73
$$ 54 96 60 -60 -79 156 242 31 13 43 -103 -139 27 134 108 234 -36 -14 -133 -61 -81 63 -46 -33 -306
5350c06O23k69pj5j40J02O0L9k41M5L29j18R5k85K58k96q6K24N0q1j48R7J53l4
$$ -306 317 48 41 26 -114 -12 48 87 -154 -109 220 102 197 -88 170 -126 -212 12 62 -19 -167 -70 83 49
5374D9k25J22j04K88j89P2Op9PJ09j57J29J8M6rk11M93k44j35K15m48M17k70L64
$$ 49 -176 -54 -158 130 -59 13 19 -60 -53 56 -101 28 46 92 83 -128 365 121 -14 201 -247 170 -100 264
5398B64r4J70m44K21o3j42M80k65k09k4J63j34K36J69l62J08J0j51K57m04J72
$$ 264 170 340 -104 117 54 -88 392 127 -82 -106 57 -77 159 328 -34 74 84 -67 190 -214 -42
5419d2j06O7L55k30M3K7j49n0o8M31k23j55j11K64M7k60L17Jl18P8M3K3K45k27
$$ -42 -148 -81 274 44 87 114 -35 -85 -153 278 55 -100 -211 53 100 -160 157 158 -160 -82 -39 -16 229 2
5443Bk24K61K26k09r8K51j01k09J85J22k58l3L0J62o9j37m1K29j68nJ17j30P3
$$ 2 -222 39 265 56 -42 209 108 -101 84 206 -52 -85 -55 107 38 -99 -140 89 -79 -84 33 -97 -24
5466b4J56j52k4O0R2j10j27J07j74K66J08r9P4l33J27K0n4K09j12j00O2Q0j27
$$ -24 132 -20 -44 16 108 -2 -129 -22 -196 70 178 79 153 -180 -53 -33 -87 122 10 -90 -28 52 -75
$$ [...]
8191a15
##END NTUPLES=NMR FID
##END=
