##TITLE=1H_Am Ryl Na
 CDCl3,8 sc, 
 6.04.2021
##JCAMPDX= 6.0         $$ Bruker NMR JCAMP-DX V2.0
##DATA TYPE= NMR FID
##DATA CLASS= NTUPLES
##ORIGIN= UXNMR, Bruker Analytische Messtechnik GmbH
##OWNER= root
$$ XWIN-NMR		Version 3.5
$$ Tue Apr  6 11:29:11 2021 Russian Standard Time (UT+4h)  she@DPX200
##.OBSERVE FREQUENCY= 200.131506
##.OBSERVE NUCLEUS= ^1H
##.DELAY= (6, 6)
##.ACQUISITION MODE= SIMULTANEOUS
##.ACQUISITION SCHEME= undefined
##.AVERAGES= 8
##.DIGITISER RES= 18
##SPECTROMETER/DATA SYSTEM= spect
##.PULSE SEQUENCE= zg30
##.SOLVENT NAME= CDCl3
##.SHIFT REFERENCE= (INTERNAL, CDCl3, 0, 15.7039)
##AUDIT TRAIL= $$ (NUMBER, WHEN, WHO, WHERE, WHAT)
$$ ##TITLE= Audit trail, XWIN-NMR		Version 3.5
$$ ##JCAMPDX= 5.01
$$ ##ORIGIN= Bruker BioSpin GmbH
$$ ##OWNER= she
$$ F:/spectra/data/she/nmr/H-F/1/audita.txt
$$ ##AUDIT TRAIL=  $$ (NUMBER, WHEN, WHO, WHERE, WHAT)
(   1,<2021-04-06 11:28:00.70 +0400>,<she>,<DPX200>,
      <created by zg, POWCHK disabled, PULCHK disabled
       configuration hash MD5:
       00 E9 B6 7A A2 85 ED C7 34 08 36 98 17 FE 4E 26
       data hash MD5: 16K
       BE 8B D8 68 D4 59 18 0A 7B 8E 77 BC 58 E5 19 15>)
$$ ##END=
$$ 
$$ hash MD5
$$ 49 D0 75 5F 45 6D EB D2 E0 70 23 51 DE 15 66 3F
##$RELAX= 
##$RELAX= 
##$RELAX= 
##$RELAX= 
##$RELAX= 
##$RELAX= 
$$ Bruker specific parameters
$$ --------------------------
##$DU= <F:/spectra>
##$EXPNO= 1
##$NAME= <H-F>
##$PROCNO= 1
##$TYPE= <nmr>
##$USER= <she>
##$AMP= (0..31)
100 100 100 100 100 100 100 100 100 100 100 100 100 100 100 100 100 100 
100 100 100 100 100 100 100 100 100 100 100 100 100 100 
##$AQSEQ= 0
##$AQ_mod= 1
##$AUNM= <au_zg>
##$AUTOPOS= <>
##$BF1= 200.13
##$BF2= 200.13
##$BF3= 200.13
##$BF4= 200.13
##$BF5= 200.13
##$BF6= 200.13
##$BF7= 200.13
##$BF8= 200.13
##$BYTORDA= 1
##$CFDGTYP= 0
##$CFRGTYP= 5
##$CHEMSTR= <none>
##$CNST= (0..31)
1 1 145 1 1 1 1 1 1 1 1 1 1 1 1 1 1 1 1 1 1 1 1 1 1 1 1 1 1 1 1 1 
##$CPDPRG= <>
##$CPDPRG1= <>
##$CPDPRG2= <>
##$CPDPRG3= <>
##$CPDPRG4= <mlev>
##$CPDPRG5= <mlev>
##$CPDPRG6= <mlev>
##$CPDPRG7= <mlev>
##$CPDPRG8= <mlev>
##$CPDPRGB= <>
##$CPDPRGT= <>
##$D= (0..31)
0 1.2 0 0 0 0 0 0 0 0.06 0 0.03 0 0 0 0 0.0002 0 0 0 0 0 0 0 0 0 0 0 0 
0 0 0 
##$DATE= 1617694080
##$DBL= (0..7)
120 120 120 120 120 120 120 120 
##$DBP= (0..7)
150 150 150 150 150 150 150 150 
##$DBP07= 0
##$DBPNAM0= <>
##$DBPNAM1= <>
##$DBPNAM2= <>
##$DBPNAM3= <>
##$DBPNAM4= <>
##$DBPNAM5= <>
##$DBPNAM6= <>
##$DBPNAM7= <>
##$DBPOAL= (0..7)
0.5 0.5 0.5 0.5 0.5 0.5 0.5 0.5 
##$DBPOFFS= (0..7)
0 0 0 0 0 0 0 0 
##$DE= 6
##$DECBNUC= <off>
##$DECIM= 32
##$DECNUC= <off>
##$DECSTAT= 4
##$DIGMOD= 1
##$DIGTYP= 9
##$DL= (0..7)
0 120 120 120 120 120 120 120 
##$DP= (0..7)
150 150 150 150 150 150 150 150 
##$DP07= 0
##$DPNAME0= <>
##$DPNAME1= <>
##$DPNAME2= <>
##$DPNAME3= <>
##$DPNAME4= <>
##$DPNAME5= <>
##$DPNAME6= <>
##$DPNAME7= <>
##$DPOAL= (0..7)
0.5 0.5 0.5 0.5 0.5 0.5 0.5 0.5 
##$DPOFFS= (0..7)
0 0 0 0 0 0 0 0 
##$DQDMODE= 0
##$DR= 18
##$DS= 0
##$DSLIST= <SSSSSSSSSSSSSSS>
$$ [...]
##$SUBNAM2= <"">
##$SUBNAM3= <"">
##$SUBNAM4= <"">
##$SUBNAM5= <"">
##$SUBNAM6= <"">
##$SUBNAM7= <"">
##$SUBNAM8= <"">
##$SUBNAM9= <"">
##$SW= 16.9725357007746
##$SWIBOX= (0..15)
0 0 2 0 0 0 0 0 0 0 0 0 0 0 0 0 
##$SW_h= 3396.73913043478
##$TD= 16384
##$TD0= 1
##$TE= 0
##$TE2= 300
##$TE3= 300
##$TEG= 300
##$TL= (0..7)
0 120 120 120 120 120 120 120 
##$TP= (0..7)
150 150 150 150 150 150 150 150 
##$TP07= 0
##$TPNAME0= <>
##$TPNAME1= <>
##$TPNAME2= <>
##$TPNAME3= <>
##$TPNAME4= <>
##$TPNAME5= <>
##$TPNAME6= <>
##$TPNAME7= <>
##$TPOAL= (0..7)
0.5 0.5 0.5 0.5 0.5 0.5 0.5 0.5 
##$TPOFFS= (0..7)
0 0 0 0 0 0 0 0 
##$TUNHIN= 0
##$TUNHOUT= 0
##$TUNXOUT= 0
##$USERA1= <user>
##$USERA2= <user>
##$USERA3= <user>
##$USERA4= <user>
##$USERA5= <user>
##$V9= 5
##$VALIST= <valist>
##$VCLIST= <CCCCCCCCCCCCCCC>
##$VD= 0
##$VDLIST= <DDDDDDDDDDDDDDD>
##$VPLIST= <PPPPPPPPPPPPPPP>
##$VTLIST= <TTTTTTTTTTTTTTT>
##$WBST= 1024
##$WBSW= 4
##$XGAIN= (0..3)
0 0 0 0 
##$XL= 0
##$YL= 0
##$YMAX_a= 409227
##$YMIN_a= -307892
##$ZGOPTNS= <>
##$ZL1= 120
##$ZL2= 120
##$ZL3= 120
##$ZL4= 120
##$ABSF1= 10
##$ABSF2= 0
##$ABSG= 5
##$ABSL= 3
##$ALPHA= 0
##$AQORDER= 0
##$ASSFAC= 0
##$ASSFACI= 0
##$ASSFACX= 0
##$ASSWID= 0
##$AUNMP= <proc_1d>
##$AZFE= 0.1
##$AZFW= 0.1
##$BCFW= 1
##$BC_mod= 2
##$BYTORDP= 1
##$COROFFS= 0
##$CY= 11.3945322036743
##$DATMOD= 1
##$DC= 2
##$DFILT= <>
##$DTYPP= 0
##$F1P= 15.9154993809931
##$F2P= -4.1035820241983
##$FCOR= 0.5
##$FTSIZE= 0
##$FT_mod= 4
##$GAMMA= 1
##$GB= 0.15
##$INTBC= 1
##$INTSCL= 1
##$ISEN= 128
##$LB= 0.24
##$LEV0= 0
##$LPBIN= 0
##$MAXI= 10000
##$MC2= 0
##$MEAN= 0
##$ME_mod= 0
##$MI= 1.114404
##$NCOEF= 0
##$NC_proc= 0
##$NLEV= 6
##$NOISF1= 3.799351
##$NOISF2= 2.8
##$NSP= 1
##$NTH_PI= 0
##$NZP= 0
##$OFFSET= 15.70392
##$PC= 1
##$PHC0= -11118.34
##$PHC1= 8.600919
##$PH_mod= 1
##$PKNL= yes
##$PPARMOD= 0
##$PSCAL= 0
##$PSIGN= 0
##$REVERSE= no
##$SF= 200.130013532006
##$SI= 16384
##$SIGF1= 3
##$SIGF2= 2
##$SINO= 400
##$SIOLD= 16384
##$SREGLST= <1H.CDCl3>
##$SSB= 0
##$STSI= 0
##$STSR= 0
##$SW_p= 3612.71676300578
##$SYMM= 0
##$S_DEV= 0
##$TDeff= 0
##$TDoff= 0
##$TI= <>
##$TILT= no
##$TM1= 0
##$TM2= 0
##$TOPLEV= 0
##$USERP1= <user>
##$USERP2= <user>
##$USERP3= <user>
##$USERP4= <user>
##$USERP5= <user>
##$WDW= 1
##$XDIM= 8192
##$YMAX_p= 0
##$YMIN_p= 0
$$ End of Bruker specific parameters
$$ ---------------------------------
##NTUPLES= NMR FID
##VAR_NAME=  TIME,          FID/REAL,        FID/IMAG
##SYMBOL=    X,             R,               I
##VAR_TYPE=  INDEPENDENT,   DEPENDENT,       DEPENDENT
##VAR_FORM=  AFFN,          ASDF,            ASDF
##VAR_DIM=   8192,          8192,            8192
##UNITS=     SECONDS,       ARBITRARY UNITS, ARBITRARY UNITS
##FACTOR=    0.0002944,     1,               1
##FIRST=     0,             0,               0
##LAST=      2.4114304,     0,               0
##MIN=       0,             -307892,         0
##MAX=       2.4114304,     409227,          0
$$ Real data points
##PAGE= N=1
##DATA TABLE= (X++(R..R)), XYDATA
0@%%%%%%%%pJ5j6J6k1K9l2M0n6O4p5R7j18J36j60J92k24K61l05L53m05M63n31
31b84O05o86P76q73R84j107J239j382J540j713J901k110K336k582K852l147L468
48A817l819M206m632N103n626O208o859P595q432R395j0517J1841j3432J5384
62H232j7843K1048k5410L1706m1593N9328j00278L49798J24239p17119N02164
73A94272K1220k54309J18594p531K3995o5340q0515K44973o791j89967m4400K11048
85A65249J9861k66350J22083J36195k55209Q9198J83166j67459o3647Q9043j8161
96C3969O3511n7450j46002J71815K462j42516J65422p6139q6927J33030p3917
107a2742P7312j6233j96344K10589M8023j71883O5861L8167l4898l0249Q7536
$$ plain form
0 0 0 0 0 0 0 0 0 0 -7 8 -8 8 -13 16 -16 24 -32 32 -43 54 -64 72 -88 104 -120 141 -164 189 -216 247 -284
31 -284 321 -365 411 -462 522 -585 654 -728 812 -901 1000 -1110 1226 -1356 1496 -1651 1817
48 1817 -2002 2204 -2428 2675 -2951 3257 -3602 3993 -4439 4956 -5561 6280 -7152 8232
62 8232 -9611 11437 -13973 17733 -23860 35468 -64810 284988 409227 -307892 194272
73 194272 215492 -38817 79777 72246 96241 30901 -49614 195359 188568 -1399 -45799 165249
85 165249 185110 -81240 40843 177038 -78171 11027 194193 26734 -36913 52130 33969
96 33969 97480 40030 -105972 65843 68305 -74211 91211 15072 -71855 61175 -12742
107 -12742 64570 48337 -148007 62582 110605 -61278 4583 42750 7852 -22397 65139
118F5139K4538j74739R0743Q8273r9409O3654o6904k7225J47401j11330j2019
129a1878J15449j51263R787J76784j27048p3992J36099p1381k3646J23282j01218
140I75n2687R8943j0118j9961k703k553o262j487N8674l7800l5789K6961j3475
153B718P8511m8318q8649J33847m9364n6406J31863q4741n7146R0232r206K030
165D5371l0122k6471O1148j9096k0196L6025l6985l1600N4863K0509n6365j5480
177a8399L1857m274q056J8970k8580l4577M9899R016m0655K0146l0517m233O5919
190B6516n4771r017L1393n8599N7275K6247q2461L2783J2017j9346M0537k0806
202a8232k6482J2288J8310J5246k4082m57P28p881M5523j0600m3099K6022O552
$$ plain form
118 65139 89677 -85062 5681 93954 -5455 58199 -8705 -35930 111471 141 -11878
129 -11878 103571 -47692 -37905 138879 11831 -62161 73938 2557 -21089 102193 975
140 975 -51712 47231 37113 17152 14449 11896 5634 4147 62821 25021 -10768 16193 2718
153 2718 81229 32911 -55738 78109 28745 -27661 104202 19461 -37685 52547 43341 45371
165 45371 15249 -11222 49926 30830 10634 46659 9674 -21926 32937 53446 -2919 -18399
177 -18399 13458 9184 1128 20098 -8482 -43059 6840 15856 -24799 -4653 -35170 -39403 26516
190 26516 -28255 -37272 -5879 -64478 -7203 19044 -63417 -30634 -18617 -37963 2574 -18232
202 -18232 -44714 -32426 -14116 1130 -22952 -23409 -22681 -30562 14961 4361 -38738 -12716 -6164
215f164L231J9149l4128N33K4035j9207L1797K510o5227L8657M2360m2899O524
228A171K798j6488K1117K108N959j6680k9667M1117J6893k9492p769k70J6123
241F920l012m108J7640m1703o94N5710k8846j7918J0993j7506K5777Q412l0596
254a8931R589q458k137L4675k1797k3475J4725p86J2832K568k5614J50J0679R461
268f519J594j8663J443N61M527K5219k5790j7921K5610k410Q602N66k7420J7389
282a3212R202o981K0903k4360j5213L6485r24r081J496j2243J1331J2904l802
295F505j846j4520O407K0705o576k945r808j394K2614n069n526L16j5245J9560
309A3178J3473k1816M873n195k948K6952j2509j5860R084l939J1819N103j9195
$$ plain form
215 -6164 -2933 16216 -17912 -17379 6656 -12551 19246 21756 -43471 -4814 37546 -5353 1171
228 1171 3969 -12519 8598 10706 16665 -15 -29682 11435 28328 -1164 -8933 -9203 6920
241 6920 3908 -200 17440 -24263 -24957 30753 1907 -16011 -5018 -22524 3253 11665 -18931
254 -18931 -9342 -17800 -19937 14738 -7059 -30534 -15809 -16595 -3763 -1195 -26809 -26659 -15980 -6519
268 -6519 -4925 -23588 -22145 -21584 -17057 8162 -17628 -35549 -9939 -12349 -3747 -3181 -30601 -13212
282 -13212 -4010 -10991 9912 -14448 -29661 6824 5900 -3181 -1685 -13928 -2597 10307 6505
295 6505 4659 -9861 -3454 17251 10675 7730 -2078 -3472 19142 14073 8547 8863 -6382 13178
309 13178 26651 4835 9708 4513 1565 28517 16008 148 9232 5293 17112 22215 3020
322C020J964J959L912J2941j6153r562Q827L226Q105j0019j1521Q230r39O943
336A0933M145k2852L623J1267l993Q312j4697j1081J9753k406k260Q42j5815Q907
350e322R463o485L569j3048j932J9095l627o140m304j806J3235q90m000L928j2434
365a0698P059J8276j0569o334NM555J3783q357n740Q117q394Q886J2922j5900
379G611l628M739M985R998j3579o242J1111l979N439K502j3598J477K972O152
393A5960J782j7104J920P984l704N898q996j0205J2303j033j645K574j4686K978
407e974J0818m242j400p649k930J1739p0n124l199m833R765J310n417M619j1310
422a3897o2J8790p607j0251K324J584Q512l003o962M909n447K960J0400o834o039
$$ plain form
322 3020 4984 6943 10855 23796 7643 -1919 6908 10134 18239 8220 -3301 4929 3990 10933
336 10933 15078 -7774 -4151 7116 3123 11435 -3262 -14343 5410 3004 744 1586 -14229 -5322
350 -5322 4141 -2344 1225 -11823 -13755 5340 1713 -4427 -8731 -10537 2698 1808 -2192 1736 -10698
365 -10698 -3639 14637 4068 -2266 -2261 2294 16077 7720 1980 10097 1703 10589 23511 7611
379 7611 3983 8722 13707 23705 10126 3884 14995 11016 16455 18957 5359 6836 9808 15960
393 15960 17742 638 2558 10542 6838 12736 3740 -6465 5838 4805 3160 5734 -8952 -5974
407 -5974 4844 602 -798 -8447 -11377 362 292 -4832 -8031 -12864 -3099 -1789 -7206 -2587 -13897
422 -13897 -13959 4831 -2776 -13027 -10703 -9119 -607 -3610 -10572 -5663 -11110 -8150 2250 -4584 -10623
437a0623m149R708J3531j9354n398J7839q703k552J3210q290q961M661J1737J933
451D589j5429r38J3004r0l914o94J798m5o423J3712O662k6229M221K4877j1949
466C152q369P602k503j80L247K473k190j0534N360J0145l633o569o709R525O462
481G279j3797N193L423j5766J0146J0268j4270k835K754J857L352l857n297j384
495a2934N835K598o773J642J14p527J0467O025j5906J241P830k271M351k941p448
510a5697P918K933l263L670k541l776L243R613p07j4494O922J1365q945L055K563
525A859q248P446J204o77M769j0473j88J4186j276j1036m59J1129k682p933J1457
540I078j606j4977J1302J0010j0931m662K910M513K524p496p74P285p539j151
$$ plain form
437 -10623 -14772 -5064 8467 -10887 -16285 1554 -7149 -9701 3509 -4781 -13742 -9081 2656 4589
451 4589 -10840 -11778 1226 1136 -2778 -3472 -1674 -1719 -8142 5570 12232 -13997 -9776 15101 3152
466 3152 -5217 2385 -118 -298 2949 5422 3232 -7302 -1942 8203 4570 -1999 -8708 817 7279
481 7279 -6518 -1325 2098 -13668 -3522 6746 -7524 -10359 -7605 -5748 -2396 -6253 -11550 -12934
495 -12934 -7099 -4501 -11274 -9632 -9518 -17045 -6578 -553 -16459 -15218 -7388 -9659 -5308 -8249 -15697
510 -15697 -7779 -4846 -8109 -4439 -6980 -10756 -7513 2100 1393 -13101 -6179 5186 -3759 -704 1859
525 1859 -6389 1057 2261 1584 6353 -4120 -4308 9878 8602 -2434 -2893 8236 5554 -2379 9078
540 9078 7472 -7505 3797 13807 2876 -1786 1124 5637 8161 665 -109 7176 -363 -1514
554a514J2857o829j2694P565J1350p600j0085R500J017r495J0375l13j0349M088
568b127M13M472o4j1364N248N778m803P96q68j216j071K832M964p542l983P757
584g78K75j290M69l888M66N523j22k497m48j753L339M222l079k506m3L736K642
601D268l472J625k328j638J0578m449n417N880l201K482M215n580O6n12L097L824
617I438n360j317J112K344J821m657J748l62m607P644J249r726P94N991j433k000
633B679L54k290J04J203J471k55o626P63O677k773k735m82r19K783j133N94q25
650a410n512M968K144k936l52l355L443K608l718J425k661p72N893k152q95l6
666c318k603M253K558l826j671J633J881Q39j63j654l93J494K221R33l289j159
$$ plain form
554 -1514 11343 4514 -8180 -615 10735 3135 -6950 2550 3567 -5928 4447 4134 -6215 -2127
568 -2127 -1714 2758 2694 -8670 -3422 2356 -2447 -1651 -2519 -3735 -4806 -1974 2990 -4552 -8535 -778
584 -778 -503 -1793 -1324 -5212 -4746 777 655 -1842 -2290 -4043 -704 3518 439 -2067 -2110 1626 4268
601 4268 796 2421 93 -1545 9033 4584 -833 5047 1846 4328 8543 2963 3029 2517 5614 9438
617 9438 4078 2761 3873 6217 8038 3381 5129 4767 160 7804 9053 -673 121 6112 4679 2679
633 2679 3033 743 847 2050 3521 3266 -3360 -2597 4080 1307 -1428 -1910 -2829 -46 -1179 -585 -1410
650 -1410 -6922 -1954 190 -2746 -3098 -6453 -3010 -402 -4120 -2695 -5356 -6128 -235 -2387 -3282 -3318
666 -3318 -5921 -1668 890 -2936 -4607 -2974 -1093 -254 -417 -2071 -2464 -970 1251 2184 -1105 -2264
682b264L140J710L42k764q2K138j246L901j554n021M444O22j57J576n172J336
698I49L463j799J378k573j649L328m04L78j779k011J876J145L15k318k072K275
714E02M69r16J20k096j281L212J080l171q93O4Q53K057k710n24L33j323L553k2
732f93m369J306Q11J362L05k471O70p5Q62K560k920j100J689Q63J895j894j722
749b921K240l8J249Q66k732N09J921L35N97j121j340K266J282k49o90j199P63
766A738K448q18n06o65n57K709J86j180p27p54K339M58j734J82j568Q82K624k328
784B729o00j41n81K074r67j457k9l32J378O62k388n62M68M92J025j274j704K25
802i82P94J167q96k393J079J076l17N52j528n30J302K22O85j105j651J614J289
$$ plain form
682 -2264 876 2586 2928 164 82 2220 974 4875 3321 -1700 2744 3366 3209 4785 -387 949
698 949 4412 2613 3991 1418 -231 3097 2693 3071 1292 -719 1157 2302 2617 299 -1773 502
714 502 971 55 175 -1921 -3202 10 1090 -2081 -2974 -2910 -2057 0 -2710 -3234 -2901 -4224 -671 -693
732 -693 -5062 -3756 -2945 -1583 -1278 -3749 -3079 -3154 -2292 268 -2652 -3752 -2063 -1200 695 -1199 -2921
749 -2921 -681 -719 530 1396 -1336 -827 1094 1429 2026 905 -435 1831 3113 2864 2174 975 1738
766 1738 4186 3368 2862 2197 1640 4349 4535 3355 2628 1874 4213 4671 2937 3119 1551 2433 5057 2729
784 2729 2129 1988 1407 3481 2514 1057 1028 696 2074 2736 348 -214 254 746 1771 497 -1207 -982
802 -982 -188 979 83 -2310 -1231 -155 -472 80 -1448 -1978 -676 -454 231 -874 -2525 -911 378
819C78n06l03j216R76J483m75M46j314l93K196J76j88p15j247K304J000j244J58
837A516k64k84K168p2j008n99N42J596j64j708L33K96Q56L00j162J55p57M41K028
856D213j629j757R86L29j15K07j537Q3J97j61J025j743r35P19N76J34j498p76
874a682Q93M27m19K49j429n78J645l21j33j004k89J006K73m9j097o59J919l35
892a583m70P64j377O2K550q76j000K93k5J095O59j497n3R94j01L33Q15p77j432
911a626J733J852j775r33J800q25N46P85j813O13K33j80J408o63j951J423J207
928A834r51q86M58M31j124J124Q09k356n7J684k45l00q88l59J345m52n59N2q00
947a240k59O58J016j290j629J386J441j955J24N64j208N51J359j558J16On79J557
$$ plain form
819 378 -128 -431 -1647 -671 812 337 783 -531 -924 1272 1448 1260 545 -702 1602 2602 1358 1516
837 1516 1252 968 3136 3064 2056 1457 1999 3595 3431 1723 2056 2352 3208 3508 2346 2501 1744 2185 4213
856 4213 2584 827 1813 2142 2027 2234 697 780 977 816 1841 98 -837 -118 458 592 -906 -1682
874 -1682 -789 -362 -781 -532 -1961 -2539 -894 -1215 -1348 -2352 -2641 -1635 -1362 -1411 -2508 -3167 -1248 -1583
892 -1583 -2053 -1289 -2666 -2604 -54 -930 -1930 -1637 -1662 -567 92 -1405 -1458 -464 -565 -232 583 -194 -1626
911 -1626 107 1959 184 -749 1051 226 772 1557 -256 357 590 410 1818 1155 -796 627 1834
928 1834 883 -3 455 886 -238 886 1695 -661 -718 966 721 421 -467 -826 519 67 -492 -440 -1240
947 -1240 -1499 -841 175 -1115 -2744 -1358 83 -1872 -1748 -1184 -2392 -1841 -482 -2040 -1924 -1918 -2497 -940
965i40k61j348L37J210l7q30P08n10n81K184k31j626J135l04q2K036j337r03J748
984C68J59o42R84n54p51J363N44o32l42J02L74M52J04j079n2J501j30n06P54j404
1004F13l63J791k69p75l77J94O26m62j10j96o53R13r7k98R2j298N47J168j077
1023c1j217J151J85p41O63k12j080L13J229o52o85l4k3N84J97p04j93R27o42K56
1043g09J013j647l14J471j69k61k5n04R20O01l26m07j52M32K83K36k35o02O71
1062B76M71m7K03n34r2Q35J82m18l50k82Q48L91m93O7n01K24N38p4m62kN2J41
1084I73J08o21l11J08M23Q1l30m51l02M07M79p86m09L61k44K37K49j095o8P81
1104d10m84N21n56o32P04j34M7N8n65R7N68k32j36m87L32K66J82j28m72j6N04
$$ plain form
965 -940 -1201 -2549 -2212 -1002 -1039 -1869 -1161 -1671 -2252 -68 -299 -1925 -790 -1094 -1176 860 -477 -1380 368
984 368 527 -115 869 315 -436 927 1471 839 497 599 973 1425 1529 450 398 1899 1769 1263 2017 613
1004 613 250 2041 1772 997 620 814 1440 978 868 672 19 932 835 537 629 -669 -122 1046 -31
1023 -31 -1248 -97 88 -653 10 -202 -1282 -969 260 -392 -1077 -1111 -1134 -550 -353 -1057 -1250 -323 -965 -709
1043 -709 304 -1343 -1657 -186 -355 -616 -641 -1145 -225 376 50 -357 -509 -77 206 442 207 -395 276
1062 276 747 700 903 369 277 1112 1294 876 526 244 1092 1483 990 1057 556 780 1318 1244 782 780 832 973
1084 973 1081 460 149 257 680 761 431 -20 -322 85 564 -222 -631 -270 -514 -277 -28 -1123 -1191 -410
1104 -410 -894 -373 -929 -1561 -857 -991 -944 -886 -1451 -1354 -786 -1018 -1154 -1641 -1309 -1043 -861 -989 -1461 -1477 -973
1125i73J12R4k14m14O68L08J6k78J01p1N26Oo78O14rL85K46n78j6J94L69K88k26
1148D70m32L18m7N23m00k50N3k9O43k47q03L80L09m5J08m73j06l6J70K30j31p38
1170e33J80L62k71Rl82j39N85J08p20q7p8K29M1n4l59p2K36M81k75k4o79L74O00
1193d68j93k07J20o32P73L81o86l5J78K16L86j52k14J35L90M06n25Q5J5J29L09
1214D11M7l57L63j62M96l1l97j52N24k55J85K40m78Q2K57J45j77J18m58M49K61
1235A111k78j28m07M48J61j38k4n17K85K2j25R8n80K74O29n64J11p7o98N77R6
1256B76m53R3k27J00K85l00n18M04R0J51k63K17j75r2L80l13K01k05L1J20M46
1277B48m09k68K27K01O1L7k14O7K76m0K75J24m01k2J86M3L88l99K48M06k54O8
$$ plain form
1125 -973 -861 -767 -981 -1395 -727 -419 -403 -681 -580 -651 -125 -119 -797 -183 -192 193 439 -139 -155 39 408 696 470
1148 470 38 356 309 832 432 182 235 206 849 602 -201 179 488 443 551 78 -28 -64 106 336 205 -533
1170 -533 -353 9 -262 -253 -635 -774 -189 -81 -801 -888 -966 -737 -696 -750 -1109 -1181 -945 -464 -739 -763 -1442 -1068 -468
1193 -468 -661 -868 -748 -1380 -607 -226 -912 -947 -769 -553 -167 -319 -533 -398 -8 398 -127 -42 -27 102 411
1214 411 458 101 464 302 798 767 370 218 742 487 672 912 434 516 773 918 741 859 401 850 1111
1235 1111 833 705 298 746 907 769 745 228 513 535 410 508 -72 202 831 267 378 301 -397 180 276
1256 276 -177 -84 -311 -211 74 -226 -744 -340 -250 -99 -362 -145 -320 -412 -32 -345 -144 -349 -318 -198 248
1277 248 -161 -429 -202 -1 60 97 -117 -50 226 186 461 585 184 162 348 391 779 380 628 1034 780 848
1299H48k50J23L55k35M8j07L2K93l35K84n62L03k2N0l21p2O8j23R2J53j23j27
1321C72p8J82k64l91K46n2j0J32k63l27J77J55j74Ml33K88rj5K17r4k87J24Q3
1344c17m5r7N5o2J01R5j6k42M5J15J27KR5j62M4L15j44l24N49j3k67M71k55k1
1368D9J46J84k39K10r8l69O59k50K4K18k50M4K91j72k07J33K74j66o0j24j82J86
1390C01J51J07m10N5j71J66j38rk61K44K80k83j47m9q5Q5J78k53j75N2j47k7L25
1413b11k26k85N51j40k29K78l07o4K34q4k00L9L94j27P8k6n38O43j5K45m42J88
1435b44K76k94M49m42K4K94l32K56M3P3m1PL90M6m37N5j65K22L32n8k25M06J8
1458F53m22L22k35J99l1J23k79j63j5J07k4K58n14L54q9J20L0l52k36L04Q1k95
$$ plain form
1299 848 598 721 1076 841 889 782 814 1107 772 1056 494 797 775 825 504 432 500 377 469 622 499 372
1321 372 294 476 212 -179 67 15 5 137 -126 -453 -276 -121 -295 -291 -624 -336 -345 -360 -143 -237 -524 -400 -317
1344 -317 -362 -459 -404 -466 -365 -270 -286 -528 -483 -368 -241 -239 -144 -306 -262 53 -91 -415 134 121 -146 325 70 49
1368 49 195 379 140 350 252 -117 542 292 316 534 284 328 619 447 240 373 647 481 421 297 115 301
1390 301 452 559 149 204 33 199 61 52 -209 35 315 32 -115 -164 -249 -164 14 -239 -414 -362 -509 -536 -211
1413 -211 -437 -722 -171 -311 -540 -262 -569 -633 -399 -483 -683 -644 -250 -377 -299 -325 -863 -220 -235 10 -432 -244
1435 -244 32 -262 187 -255 -231 63 -269 -13 30 103 62 69 459 505 68 123 -42 180 512 454 229 635 653
1458 653 231 553 318 517 486 609 330 167 152 259 235 493 -21 333 244 364 394 42 -194 110 191 -104
1480a04K58l78J67p0J97l27L17n19J77M2Q7j57q6K91m9K2k30P8K5j14j4K10K4
1503a53k6O8K39m71J15J17J9K71k48J53Q6k04J07Q9j51k58M74L0Q7m1q1N4J18
1526C94J19k34j26L22l49K58K4m4j87K26k22J11jk91M25j1R7r7m02oL20r8K8j10
1550A46P3O7k7m22P5R7j28J35p8k71J55M2p7k94K63M3K46j75j25m9l5pJ77R1k52
1575c30k67K32N2J78k32m7K85q2K3K4k00J6K53j49J59r8O7J75M2j72N6nL04m37
1599a53M39l18J25m3ko2J80%N0j93J19N0m2m7K3Q0k13j56K96J70j03j59J64j05
1623A00j98K27j05l2l02K74pN7l39M56j62k48J30j3R0n6O7p1Q7o0k86K15M8k33
1647c61k90K62J50J47j40O0l49Q4L49r0j64p4J27q5N8m7K20J44j43O3N3k31J73
$$ plain form
1480 -104 154 -224 -57 -127 70 -257 60 -459 -282 -240 -153 -310 -396 -105 -154 -132 -362 -284 -259 -373 -387 -177 -153
1503 -153 -179 -111 128 -343 -228 -111 -92 179 -69 84 170 -34 73 162 11 -247 227 257 344 303 222 276 394
1526 394 513 279 153 475 126 384 408 364 177 403 181 292 291 0 425 414 511 414 12 6 326 228 256 146
1550 146 219 286 259 -163 -88 9 -119 16 -62 -333 -178 -136 -213 -507 -244 -201 45 -130 -255 -304 -339 -346 -169 -78 -330
1575 -330 -597 -365 -313 -135 -367 -414 -129 -211 -188 -164 -364 -348 -95 -244 -85 -183 -116 59 101 -71 -15 -20 284 -153
1599 -153 286 -32 93 50 48 -14 166 166 216 23 142 192 150 103 126 206 -7 -163 133 303 200 41 205 100
1623 100 -98 129 24 -8 -310 -36 -43 14 -325 131 -31 -279 -149 -162 -72 -128 -61 -132 -45 -105 -391 -176 -128 -361
1647 -361 -651 -389 -239 -92 -232 -172 -521 -437 -88 -178 -342 -416 -289 -374 -316 -363 -143 1 -142 -79 -26 -257 -84
1670h4nJ99k03O2j34J4J34l0k26J95RL32l93K90k05J32q3J61k63L20p9j67L10
1693B86O9k06J6j16L26l09J79j91j43J66P0l8j17ll2j8J74O3m57K20J29j51J25
1716D2k62J60P9k3k02J90j08j15K19%j15j0J25j22J9j89J83K50j41N2k34n5K27
1739c0j77J84j26r1J82J50P8j80p4P6L5j37l7j7J93j46J77j37Q8K16l07J64n9
1762B5j25K62K8n9M67n73Q2K29j29pl88K75j0K3N2J9l2r0K45N0k99P2J4J81k24
1787H8k0R3j20j5k12K41j47l8J8K18M4p5n3N1o2o8Q8k03Q4O7r3P6p2J26j29M2
1813g1J71j23K28l16J40p6o8P4J46j40k53K82j04k3L4j52K75N4l7l05M32m07K35
1836dj42M34k30jO8O6L0k97j46K11K04l5k1j40K51J04k52N1K27j64k28n6L75k00
$$ plain form
1670 -84 -89 110 -93 -31 -165 -151 -17 -47 -273 -78 -69 263 -130 160 -45 87 4 165 -98 222 143 -24 286
1693 286 355 149 165 49 375 66 245 54 -89 77 147 109 -8 -11 -43 -61 113 176 -281 -61 68 -83 42
1716 42 -220 -60 19 -4 -206 -16 -124 -239 -20 -20 -135 -145 -20 -142 -123 -312 -129 121 -20 32 -202 -257 -30
1739 -30 -207 -23 -149 -240 -58 92 170 -10 -84 -8 27 -110 -147 -164 29 -117 60 -77 11 227 -80 84 25
1762 25 -100 162 190 131 598 25 107 336 207 200 -188 87 77 100 152 171 139 49 294 344 45 117 131 312 88
1787 88 68 161 41 26 -186 55 -92 -130 -112 106 150 75 22 73 11 -57 31 -172 -88 -21 -114 -38 -110 16 -113 -71
1813 -71 100 -23 205 -111 29 -47 -115 -41 105 -35 -288 -6 -110 -133 -99 -251 24 78 41 -264 168 -239 -4
1836 -4 -146 288 58 57 125 191 221 -76 -222 -11 193 158 137 -3 248 352 100 151 378 214 -14 -70 305 105
1860A05M0j90J02n7j10p2j6J28qk9J91k17L33l87J97J31l16m1K02Q0k46K69l06
1883b17L42k06M0j29J49q4J3P9l05K35k17K64j17o4J22l6J92j40k15L71J3n3J18
1906A55m05J80M7l37k3J69J27j06m8L04Q0j67m8Q7P7rq9q5M9nJ26k39J47J9K5
1931C1M9N0j1l56L68r0n8p1J80j29J25J41m08K71j4J08k1k01k6K46L0nKm7j02
1956F2j60M3k9L3K95k28r6K61k18N5j29N9j5m9r2L43l68J5K92o8Q3j88j64J22
1980a41mK4M0p8J33k88O49k94l72L60j35k30L72k95j7M83k08M1k53pP6K30j64
2003g8O7nj07K08o9o0N0K31l94K93m40M88P8k64j53L87j79n9J34O3j60n7L10j40
2027A44q4M9k08L41j71mK46r4k06J06J51k36j04L04n1n5o3M8l22J14J39j17K7
$$ plain form
1860 105 145 -45 57 0 -110 -182 -198 -70 -78 -107 84 -133 200 -187 10 141 -175 -216 -14 66 -180 89 -217
1883 -217 125 -81 -41 -170 -21 -105 -92 -13 -318 -83 -300 -36 -153 -217 -95 -131 61 -79 -294 77 90 37 155
1906 155 -250 -70 -23 -360 -383 -214 -87 -193 -241 63 143 -24 -72 15 92 83 -6 -91 -42 -47 79 -160 -13 6 31
1931 31 80 130 119 -237 131 41 -17 -88 92 -37 88 229 -179 92 78 186 165 -36 -62 184 214 209 211 164 62
1956 62 -98 -55 -84 -51 244 16 -80 181 -37 18 -111 -52 -67 -116 -208 135 -233 -218 74 6 89 -99 -263 -141
1980 -141 -145 -121 -81 -159 -26 -314 335 41 -331 29 -106 -336 36 -259 -276 207 -1 40 -213 -220 -144 86 -78
2003 -78 -11 -16 -123 85 16 -44 6 237 -157 136 -304 184 262 -2 -155 232 53 -6 128 191 31 -26 284 144
2027 144 60 109 -99 242 71 67 313 219 13 119 270 34 -70 234 183 128 65 113 -209 -95 44 -73 -46
2050d6J93r1J04j27j9qk07J47j26J12j81L45j31lk59K81k97K48J53j36J55J01
2072B08r7N2k29O9k8J21j39r1N8M4j10j6NM33J3l12K51j76R9j43J15K03k46n9
2096B5Q9j22K98r0j09J50m13L42L4r2O7L0k57J20J61M9r2j94j74L32Ll23q0n5
2120c01N14l63L21k66k04N12k89N9o9j00R1J12R6k0l8j53j94K76k05J8J12J27
2142C6k53r1J69p4K06j13K03l1k39J41O8l26L95j15n2J79j17k29J77l7k74L78
2164AK00k31J54J68L9l46J22j70J07q7RJ31o0o2N9K38l4k40j27K56k4l1r7k19
2188b44M74j77k75M09k05l3j47o8K20K38l39k2lO0J26Pj19j25M5J93l3j12k20
2211c50K88K49j63k62J0j06O8K46l6j36K45l12K49k4j29K8K26k14J84j16P0K6
$$ plain form
2050 -46 147 56 160 33 14 6 -201 -54 -180 -68 -249 96 -35 -38 -297 -16 -313 -65 88 -48 107 208
2072 208 111 163 -66 3 -25 96 -43 -134 -76 -32 -142 -158 -153 280 293 -19 232 56 155 12 127 330 84 25
2096 25 114 -8 290 200 91 241 -172 170 204 112 179 209 -48 72 233 282 190 -4 -178 154 157 -166 -246 -301
2120 -301 213 -150 171 -95 -299 213 -76 -17 -86 -186 -95 17 113 93 55 -98 -292 -16 -221 -203 -91 36
2142 36 -217 -308 -139 -213 -7 -120 83 52 -187 -46 22 -304 91 -24 -76 103 -14 -243 -66 -103 -377 1
2164 1 201 -30 124 292 331 -15 107 -63 44 -43 -34 97 37 -25 34 272 238 -2 -129 127 103 72 -25 -244
2188 -244 230 53 -222 187 -18 -51 -198 -266 -46 192 -147 -169 -172 -112 14 21 -98 -223 -178 15 -18 -130 -350
2211 -350 -62 187 24 -238 -228 -334 -266 -20 -56 -192 53 -259 -10 -34 -163 -135 91 -123 61 -55 15 41
2233D1J43j84J7k7J89K7j7m10L11L4Qo7J83m4q2Jj01R8j50J36k48K54jK3J52j5
2259B71J05k22K78k17J06l35J35L7oJ14q9j89M7R2rl9K1k0j21L2j11J70l7o3k26
2284b76M75m05L22k47K15j1j29J65j29o4j04O3j4Kj52L99k82K78k25O7m7PQ8M0
2308C6j97P3j25J08L58l85J03P9j22Q5r4L31k89K06K04j01l22J13J10r6K31l81
2330g5L31q2l86K94K8Pl8M0ok51L81K4j89j60L46j1o06K24K69ok00J5k08L78r8
2355B1O4M1j19J5k17J26j10K93j94n6M0m2J72l69K66j41N9J4j07p4K21M3j7j22
2379a93K2j51K76p0j9m7J26J00l4M2j97J32J79j72j09J10k04L7j04L96k19K18
2401A19J8m09N05O4l53P4K5J03j90K47K7p4j50M6J12r0k06R5J20kJ42k22J10k26
$$ plain form
2233 41 184 0 17 -10 179 206 189 -221 90 124 132 65 248 204 122 123 22 120 -30 106 -142 112 111 134 286 271
2259 271 376 154 432 215 321 -14 121 158 152 266 177 -12 35 127 118 79 100 80 -41 -9 -120 50 13 -50 -276
2284 -276 199 -206 116 -131 84 73 -56 109 -20 -84 -188 -125 -139 -137 -289 110 -172 106 -119 -52 -99 -92 -4 36
2308 36 -161 -88 -213 -105 253 -132 -29 50 -72 13 -81 250 -39 167 371 270 -52 61 171 75 306 -75
2330 -75 256 174 -212 82 110 117 79 119 113 -138 243 267 78 -82 264 253 -353 -129 140 134 -66 -51 -259 119 21
2355 21 85 126 7 22 -195 -69 -179 114 -80 -136 -96 -138 34 -335 -69 -210 -151 -137 -244 -318 -97 -54 -71 -193
2379 -193 -171 -322 -46 -116 -135 -182 -56 44 10 52 -145 -13 166 -6 -115 -5 -209 -172 -276 120 -99 119
2401 119 137 -272 233 297 -56 18 43 146 -44 203 230 156 6 52 164 74 -132 -37 83 81 223 1 111 -115
2425a15P8P7j93J52l46K98k00o9L40j80j38J2L73l81R9j10J68l4j9J89k88K1L22
2448E6l83K54O1k09j74J82K05j33J31j53R9n0J56j15J57L6j24L2J19k00R9m6J11
2471A11j92K00j08M8M0j36J2J36M0n9n3L8L2O0L60m09J69j95O5j76M74k62j43
2494E2J16L1j46oj00O7J72k60J28n2j7J11ql47M42q9k54JJ73j28l6J73l3R9k82
2519a93j1R0N5P3J6K4j83j13J66P2n1j41K24k65j58N52p8J06j4l61n1L3l0J86
2543e2Q7J20j99q8L19k84J94pQ9j61K40Q0j67j81r8J2L69k46J22J03m6L7k45J22
2567A20j61J93N5k28J07K12j75n7m0p1Q5J25r0O7k39J75j23J36k87J14O4J81l78
2590b15N3m1Q8J43k31M10m41K43k17L79j96j25p1K22%n3k16J13M0j00M38l22m5
$$ plain form
2425 -115 -37 40 -153 -1 -347 -49 -249 -318 22 -158 -296 -284 89 -292 -193 -303 -135 -169 -188 1 -287 -266 56
2448 56 -327 -73 -12 -221 -395 -213 -8 -141 -10 -163 -64 -114 42 -73 84 120 -4 28 147 -53 46 0 111
2471 111 -81 119 11 59 99 -37 -25 111 151 92 39 77 109 169 529 120 289 94 159 -17 457 195 52
2494 52 168 199 53 47 -53 14 186 -74 54 2 -15 96 88 -259 183 94 -160 -159 14 -114 -150 23 -10 89 -193
2519 -193 -204 -114 -59 14 30 54 -129 -242 -76 -4 -55 -196 28 -237 -395 157 79 185 171 -190 -241 -208 -238 -52
2543 -52 35 155 -44 -132 187 -97 97 90 179 18 258 338 171 -10 -108 -96 273 27 149 252 206 243 -2 120
2567 120 -41 152 207 -21 86 298 123 66 26 -45 40 165 75 142 -97 78 -45 91 -196 -82 -18 163 -215
2590 -215 -162 -203 -115 28 -203 207 -234 9 -208 171 -25 -150 -221 1 1 -52 -268 -155 -115 -215 223 -99 -144
2613a44Q9Nk5j11L85j50l8QJ10k38K65k17L2O1O3j7m5K9%J2rL40n01L51k00J55
2639B10j14m9J95q3j21P7J24k55J8q8L09K0k91J67j70j51J3N05n8l45J4r6k16
2662c85M20N7m18J1M68p8p0j22q8OK82k06J1j3n7L7J61j6o1M1j44M2J14k43L02
2687E1k36R8j99K08k40L20l3K69R6k57R7K2m3k7j18J11p2J79m4J1O1k34p5P2J85
2712B02l39L99j70m4N8p7K15m1M6K8k97J08M3k80m9M36M8o4k59Qj65k9K80J91
2736B48m82K23J85l17J23Jl16M01j94M5M6j1L27l10J16l41K35NJ07j7j23J73m52
2759c28M21Lk80K8J77J79km13K23j01j92J83J46j51M8k3n6J01K90l11L22m04J79
2782C9J49q2pq5J00l6J65j09J4j97M0J86O6k63K6J73r3J6O8k07J91j4M0j42J56
$$ plain form
2613 -144 -55 -50 -75 -186 199 49 11 19 129 -109 156 -61 -29 32 95 78 33 62 62 74 65 405 -96 255 55 210
2639 210 96 47 242 159 38 115 239 -16 2 -86 223 243 -48 119 -51 -202 -189 316 258 -87 -73 -169 -385
2662 -385 35 92 -326 -315 153 75 5 -117 -205 -199 83 -123 -112 -125 -182 -145 16 0 -61 -20 -164 -122 -8 -251 51
2687 51 -185 -87 -286 -78 -318 2 -31 238 334 77 174 196 153 126 8 119 47 226 182 193 254 20 -55 17 202
2712 202 -137 262 92 48 106 29 244 203 249 277 -20 88 131 -149 -198 238 286 222 -37 -29 -194 -223 57 248
2736 248 -234 -11 174 -143 -20 -19 -335 66 -128 -83 -37 -48 279 -31 85 -256 -21 -16 91 74 -49 124 -328
2759 -328 93 96 -184 -156 21 200 198 -215 8 -93 -285 -102 44 -107 -59 -82 -138 -37 253 -58 264 -140 39
2782 39 188 106 99 14 114 78 243 134 148 -49 -9 177 243 -20 6 179 86 102 170 -37 154 140 180 38 194
2807A94k52K2K13j54j21m0M9J21l44P6N7K58k79Q8J1Qj09J04Q6M8j56m6L14q9
2831E9Mm39L84J51m94L76m48M17n3r6J82j70J15lK65l45J55r8K31j02k79K56R6
2854A64k84j10J88R2P7j59K73n51J25M16p1k22Q9N7j25J16j26R1%J23k37J27J27
2877A80L3r3l43L79n6q9K07l47P7L1k08K09O9q7k57L20j42O9j99K51j23J29o9
2900e9o1k7j60N51k51N4n42L54J34k27J7K27k11J08j7l9L77l95n5K45O2l06J07
2923a14K51j58j9P4m8K95l08p8K72l18J62p5M75m39J45k22M23k78K53j69n1K57
2945C30k31pk7j52J92J07j27j36k7L2K80j42j48m4K83j91j34J96J28k92l7j74
2967c21K84O9N2j91q0K50l6Rj92L1K46k13K44k39r1K75j6k77L65O8m35Q1j96O0
$$ plain form
2807 194 -58 -36 177 23 -98 -138 -89 32 -312 -236 -179 79 -200 -112 -101 -93 -202 -98 -12 36 -120 -166 148 59
2831 59 63 -376 8 159 -335 41 -407 10 -43 -139 43 -127 -12 -15 250 -95 60 -38 193 91 -188 68 164
2854 164 -120 -230 -42 50 127 -32 241 -310 -185 231 160 -62 27 84 -41 75 -51 40 40 163 -74 53 180
2877 180 213 120 -223 156 100 11 218 -129 -52 -21 -229 -20 49 -38 -295 25 -117 -48 -247 4 -119 10 -59
2900 -59 -120 -147 -307 244 -7 47 -495 -141 -7 -234 -217 10 -201 -93 -110 -149 228 -167 -222 23 85 -221 -114
2923 -114 137 -21 -40 34 -14 281 -27 -105 167 -151 11 -64 411 -28 117 -105 318 40 293 124 73 330
2945 330 99 92 65 -87 105 212 85 -51 -78 -46 234 92 -56 -100 183 -8 -142 54 182 -110 -147 -321
2967 -321 -37 32 84 -107 -187 63 27 36 -156 -125 121 -92 152 -87 -178 97 81 -196 169 237 -198 -117 -313 -253
2991b53L7o6J55K31j34Q2J57k23K09Jk84k3K91l00K24j17p0K65j61L08k31L8l9
3014I7j06M3R5j08K06k49J72KR4k43Q9k46P4L73n07J97J24j16J54q5J54k6pj53
3038B8J03OJ0j33k48K88l66K06N1J40m15K54K13k43o7p0J85k3R0j44j24J26J37
3061Dm1K55k8l25j06K71k98Q9J92r8K30k81K78qk04j75M58k39L9J88r6j47n1K98
3085B05k1n2j86M%K67n61M61Q8n5j59M2P7j11J95l08K11j46J80k26J52j01J82
3108A38j48J30k05j03J21j89M39k53k25K42l4J33j32O1l0J52kLk55K77k88J3J92
3131C7o9k16K88k19J11n0L3O5%k81K43Pk62J54Q0J30n5K24j07r2k45l9Q5J18J57
3156I7k0j34m1J34N7J02l7l47J50l8J16n1J25m01K10J90J2l0P3j81M1K20q5j74
$$ plain form
2991 -253 -216 -282 -127 104 -30 52 209 -14 195 196 -88 -111 180 -120 104 -13 -83 182 21 329 98 136 97
3014 97 -9 34 129 21 227 -22 150 152 246 3 92 -154 -80 293 -214 -17 107 -9 145 60 214 188 181 28
3038 28 131 137 147 14 -234 54 -312 -106 -55 85 -330 -76 137 -106 -173 -243 -58 -81 9 -135 -259 -133 4
3061 4 -37 218 190 -135 -241 30 -268 -179 13 -85 145 -136 142 134 -70 -245 213 -26 13 201 105 -42 -93 205
3085 205 184 132 -54 -50 -50 217 -344 117 205 150 -9 33 110 -1 194 -114 97 -49 131 -95 57 -44 138
3108 138 -10 120 -85 -188 -67 -256 183 -70 -295 -53 -87 46 -86 -25 -55 97 95 98 -157 120 -168 -155 37
3131 37 -32 -248 40 -179 -68 -118 -85 -20 -20 -301 -58 -51 -313 -159 -79 51 -4 220 113 21 -224 -263 -178 -60 97
3156 97 77 -57 -98 36 93 195 158 -189 -39 -77 39 -12 113 -288 -78 112 124 94 167 -14 27 247 162 -12
3180a2J67j83J92k66K38n9m1L7N0Q7m29L14R8p1l7j51Q7j3M7j19l7K82l47J10
3204e6P2L88k06k11K13l13oJ74r1K14j07n2J8J05j63J60l45J02J0J82j95N0K8
3227b9N2l21L14R4N2Q3J3o4k78J49n8k5K30k51k3J99K4k03J76j70J80j17j54m1
3251a68K62j47J76k21n2l4K53n4k89K47L4J06M2k83j04N65l34q2m6K61k81L93
3273B44m77M9K68r8j82N3k49K38J55k03K86k54J69J00R4k22K2K3k6J20k30K1O8
3296c1j13L04k45O7j77K25QJ21l2n3j35K03k09J92j50K21j63j76P7O8J42J47l11
3319b0q3O6J12j1J74l01J5Q3q6j6J36N1po9m8J92k07J12L17n72J60j09k4K3J87
3344G5k4k06J53k9J2p2N6M5j43J87o8p0J16j56L6%K59k89j19L73k63K08j84l6
$$ plain form
3180 -12 155 -28 164 -102 136 77 36 73 123 210 -219 95 193 122 85 -66 21 8 55 -64 -101 181 -166 -56
3204 -56 16 404 198 -13 200 -113 -119 55 -36 178 71 19 37 142 -21 139 -206 -104 -94 88 -107 -57 -29
3227 -29 23 -298 16 110 162 245 258 194 -84 65 7 -18 212 -39 -62 137 161 -42 134 -36 144 27 -127 -168
3251 -168 94 -53 123 -98 -150 -184 69 15 -274 -27 7 113 155 -128 -232 333 -1 -83 -129 132 -149 244
3273 244 -233 -184 84 -14 -196 -143 -392 -154 1 -202 84 -170 -1 99 193 -29 -7 16 -10 110 -120 -99 -31
3296 -31 -144 160 -85 -18 -195 30 38 159 127 74 -61 142 -67 125 -25 196 33 -143 -66 2 144 291 -20
3319 -20 -103 -37 75 64 238 -63 -48 35 -51 -67 69 120 113 44 -4 188 -19 93 410 -162 -2 -111 -135 -112 75
3344 75 51 -155 -2 -31 -19 -91 -35 10 -133 54 -14 -84 32 -124 -88 -88 171 -118 -237 136 -127 81 -103 -139
3368a39J12J5N9K01k65P0Q6j22O1r5q8K14n0j76K39l40P3J15k4O9L0jn8M4O0j29
3394c9k0J15j92L35j50K3k03K67o1L7No7J33j21k52L40p3N2l24M0M89j18k2k08
3418a4J22r7r3K72l14J13j38J82k30qK68L3j43K09L0j49k0j72J27k31M66m48K73
3441C8J82k78Q7j6N5j44m3J07l2J56K42k01o4o6n1j2j6J65j55N7j24J81J65k97
3465f4K62n7J1p0q9N1nr5J38K22m95K53J57r6j16J89m1k53M3O8r0J39m8K7l1j63
3491a53RJ82o4L6j36J00r9j7J69K0j94J67j10Q8o0j03k54J67J93L09m89Q8K2P0
3515e9o4J40K18l41P8N6K2j23P1j40r9J49m0P7j10K88m75K01L97l03m2K05R9k84
3539g9J37k56J62L6n4J43j1k09j02M78j51j33k07K62J43j27N4j62j1J63o0j25
$$ plain form
3368 -139 -27 -12 47 248 -17 53 139 17 78 -17 -105 109 59 -117 122 -218 -145 -30 -54 15 45 44 -14 30 90 -39
3394 -39 -59 56 -136 199 49 72 -131 136 75 112 117 50 183 62 -190 150 77 129 -195 -155 334 216 194 -14
3418 -14 108 11 -82 190 -124 -11 -149 33 -197 -205 63 96 -47 162 192 43 23 -149 -22 -253 213 -235 38
3441 38 220 -58 29 13 68 -76 -119 -12 -44 112 354 153 89 23 -28 -40 -56 109 -46 11 -113 68 233 -64
3465 -64 198 141 152 82 -7 44 39 -56 82 304 -191 62 219 123 7 196 155 -98 -55 13 -77 62 14 41 10 -153
3491 -153 -144 38 -26 10 -126 -26 -125 -142 27 47 -147 20 -90 -2 -62 -165 -419 -252 -59 250 -239 -151 -129 -59
3515 -59 -123 17 235 -106 -28 28 50 -73 -2 -142 -241 -92 -132 -55 -165 123 -352 -151 246 -57 -99 106 205 -79
3539 -79 58 -198 -36 0 -54 89 78 -131 -233 245 94 -39 -246 16 159 32 86 -76 -87 76 16 -109
3561a09J54K29k85o7K0J32l6k9P1r8N7N4l51J22K32l63L51O5j76n2o4l6J50l2
3585f1p4j03J65j07K66k02Q2J24N4p4n7L28k98Kl54J99J6l6K82j34l7mK04l85
3609b04K06q4p8J24J02J10k24k7Q6j17M3J26j09K7j03J71k1o9J5m4K69k22K7L59
3633C63m40l07M72k83J03K47j98N7J34n1j30R2L0j29J68k94p7K69k48J94K6j00
3655a02LQ2k8R5l7J60k91K93k0k47J88j78Q3k8k41J71J76j66J94n9M3N6k08J2
3679d9J21J00j53M6R1qp7o1j17K55j1N8j45J49l45M2J69k5r3N9J86j14j4l3J86
3704B17j84k98K22J46k00J6J13J7J63q9j58m8K25l7l2L0k77O7J35o2o8K38N8j88
3728Fj50j98K50O0k5J08J64k34k42J36O1p1J07K95j97l2n0P3m09M15K6k13K62
$$ plain form
3561 -109 45 274 -11 -78 -58 74 38 9 80 -18 39 93 -258 -136 96 -267 84 149 -27 -79 -143 -179 -29 -61
3585 -61 -135 -238 -73 -180 86 -116 -34 90 144 70 13 341 43 45 -309 -110 -94 -130 152 18 -19 -23 181 -204
3609 -204 2 -82 -160 -36 66 176 -48 -75 11 -106 -63 63 -46 -19 -122 49 28 -41 -26 -70 199 -23 4 363
3633 363 -77 -384 88 -195 -92 155 -43 14 148 97 -33 59 89 -40 128 -166 -243 26 -222 -28 -2 -102
3655 -102 -99 -17 -45 50 13 173 -118 175 155 -92 96 -82 1 -27 -268 -97 79 -87 107 48 91 147 -61 -49
3679 -49 72 172 19 65 156 148 71 10 -107 148 137 195 50 199 -146 -104 65 40 -53 6 192 78 64 31 217
3704 217 33 -265 -43 103 -97 -81 32 49 212 123 -35 -83 142 105 73 103 -174 -107 28 -34 -102 136 194 6
3728 6 -144 -342 -92 -32 -57 51 215 -19 -261 -125 -64 -135 -28 267 70 38 -12 61 -348 67 93 -120 142
3751A42P6j90m8p4l14L01Rkrj8%k54L04j38p7K89J74O5l19R2j21j2N9J94l72J14
3777a29L74j96N1n6J85l67K88o2k18J67K5l39N31k35o5j17J94K46r1l07P2J15
3799F6p3k7Q3j52J3K04N4j58M7J20k24j2J87l54J89K32j12j83RJ20M1k70K87j37
3823e0K7o4J62j54J70rMo6p4PK13j24lj30K45j50K1nj60J4J87L02l86r2J15o6
3849f6n6Q6j00L21k38k3M45j89k52L9J8j7J81j8j19j60J57j26J69L20m23K03M4
3872A96l03N21n07Q4L3Jmk01K46j51q3J27J11J13k20qp4J35j74J84k30J40M0k75
3896b99J88K24j29J1k79J59K83j50K12l14J05j90M04m26K49k50R4J2O0K47m5l38
3918a72J10j8R3M5R8j43r9K8N8N8k22L31j79J77l97L14j17J73k20ql5J21j35j9
$$ plain form
3751 142 218 28 -20 -94 -408 -107 -98 -100 -109 -127 -127 -381 -77 -215 -292 -3 171 236 -83 9 -112 -124 -65 129 -243 -129
3777 -129 245 49 100 44 229 -138 150 88 -130 37 62 -277 254 19 -46 -163 31 277 186 -121 -49 66
3799 66 -7 -34 49 -103 -90 114 168 10 57 177 -47 -59 128 -226 -37 195 83 -100 -91 29 70 -200 87 -50
3823 -50 -23 -87 75 -79 91 82 86 20 -54 -47 166 42 39 -91 154 4 25 20 -140 -126 61 363 -23 -115 0 -66
3849 -66 -122 -36 -136 185 -53 -76 369 180 -72 -33 -15 -32 149 131 12 -148 9 -117 52 372 -51 152 196
3872 196 -107 414 -93 -9 24 25 21 -180 66 -85 -168 -41 70 183 -37 -45 -119 16 -158 26 -204 -64 -24 -299
3896 -299 -111 113 -16 -5 -284 -125 158 8 220 -94 11 -179 225 -201 48 -202 -108 -96 -36 211 166 -172
3918 -172 -62 -80 13 58 156 13 -86 -58 0 58 -164 167 -12 165 -232 82 -35 138 -82 -90 -125 -4 -139 -158
3942a58J83j23K34j23q2L13j13j98N5K55l17o2K06k14K29l6J92m15J63k4J17j03
3964b1n7J44J0q4J1m7K8n4j01L28P3j01k08m9J91l06L6J81R4l13J41P4m4M9q8
3989a13Q3J83l16K05k30J27R6R1j89M6J45m37L32j11Q0j56K82j30n0P4l2m7J54
4012H7j06Pj5j28J13PJ25j23N5j01o3Q9Q1j1k06K75l67M28lj49M9j27Q5p6O9o4
4038f9M0J44j91O5l2R2J60J05l61Q7l8o4J02n1jj82K00Q3l5n7l3j72mJ20J00o7
4064e9J36l83J54J65j64L6j29L21r5k5J13L6nj89k13L53K02k41r3J60j49L1k8
4087f6L3N9n3J3R4j31o0L73k21J21k72Q1m0q4J08j9q6J80J23m23L28l4K5m4j79
4112a74K01J04j15J07J5j05j27K9L2pK54L0k52l0K00r5J25j09k80j67K69J18N5
$$ plain form
3942 -158 25 -98 136 13 -69 244 131 -67 -12 243 -74 -136 70 -144 85 49 241 -174 -11 -35 82 -21
3964 -21 -78 66 76 -8 3 -44 -16 -70 -171 157 230 129 -79 -128 63 -243 -207 -26 68 -245 -104 -30 -74 -25 -113
3989 -113 -30 153 -163 42 -188 -61 35 126 -63 -17 128 -309 23 -88 -8 -164 118 -12 -62 12 -20 -67 87
4012 87 -19 -12 -27 -155 -42 -35 90 -33 22 -79 -142 -53 28 17 -189 86 -281 147 144 -5 44 -83 2 -74 -5 -69
4038 -69 -29 115 -76 -11 -43 49 209 314 -47 40 2 -62 40 -11 -12 -194 6 89 54 -3 -36 -208 -212 -92 8 -59
4064 -59 77 -306 -152 13 -151 -115 -244 77 -18 -43 70 106 101 -88 -301 52 254 13 -80 80 -69 -38 -66
4087 -66 -33 26 -27 -14 80 -51 -111 262 41 162 -110 -29 -69 -153 -45 -64 -150 30 153 -270 58 24 49 5 -174
4112 -174 27 131 16 123 138 33 -94 -65 -33 -40 214 244 -8 -38 162 67 192 83 -197 -364 -95 23 78
4135G8K71k60n9N0j60q5M63k75N3j97J04j9j47J44K21r9J51l85M39k52J47j80
4157Ck90K31j6J08lN3j95K47j07J38k95o1J51P5J01k00O3O2j84L50k03j69K46
4180A05J18k78O3O6j55o4J51K02m19L37n1j94J73r1J40J23l39K18j19J48l64J70
4202f0J08J01J00l80K66j25O8j97J91p7Q8l0J8P8j65j72O9Q2O1j85M6K16j85j76
4226b60K19l6J24P8k77KJ33q0J46k46l8L63M7k3j98J70j05J50m70N5P5J71J07
4249A07j15j92J33p1L39k63J09J11l37K17l2K10l03J58N3p5k6k11J48rn0L0j22
4272a91J32J42r9p0K72p7p9o0R2j56L5j72L39j62J48k83M24k64Jk8Q2K3K2k09
4296a38L58k22k2j9J29K1J85m36n7J18j4J36j87J67L6j93J10k22K86j84J88K04
$$ plain form
4135 78 349 89 30 80 -80 -165 298 23 76 -121 -17 -36 -183 -39 182 83 234 -151 288 36 183 3
4157 3 -287 -56 -72 36 33 86 -109 138 31 169 -126 -187 -36 39 140 -60 3 65 -119 231 28 -141 105
4180 105 223 -55 8 74 -81 -145 6 208 -211 126 75 -119 54 -37 103 226 -113 105 -14 134 -230 -60
4202 -60 48 149 249 -131 135 10 78 -119 72 -5 83 53 71 149 -16 -188 -119 -37 24 -161 -115 101 -84 -260
4226 -260 -41 -77 47 125 -152 -150 -17 -97 49 -197 -235 128 175 152 -46 124 19 169 -301 -246 -171 0 107
4249 107 -8 -200 -67 -138 201 -62 47 158 -179 38 6 216 -87 71 124 49 23 -188 -40 -49 -99 -69 -191
4272 -191 -59 83 -16 -86 186 109 30 -30 62 -94 -59 -231 108 -54 94 -189 235 -29 -28 -56 26 49 71 -138
4296 -138 220 -2 -24 -43 86 107 292 -144 -201 -83 -97 39 -148 19 55 -138 -28 -250 36 -148 40 244
4318B44l18J66k66p7J2K87l06J44M51n67M17l19L45j18j36J16k13L18j77q1J01
4339B3L1k89J50K4M8o9L77k43l1Q5L8j23J39J09k27j8j8J27n8n0o8kL0P4r3P5
4365D1j45M1N2J33Kj43J2Q5k02j20K78r1p0N5J5J31L1r9j63K31j58K17j8k63J1
4390a37J06J12j66K56j59J82k16k43K13k17J65N7J1Q6k84K36qo4K04j40J11j3
4412I2J03p3k37J90J86l81J89K5K3j97J46N2qo6j65K84j39K22o2k64K03k90K41
4435G4Q1K58m30m8L58n23J23R2J58k92p6J85m8j14m9K22m7jK61j88m5J0J07k15
4459a47Q5N5J71k68P4J99m19L17l5r1O6p6R5O2q1K44l10j8N25o00P3J46j07Q3
4483D3j52J70j52r2K67l26J28L41Rl35J02O2j12M88m97J19j63J96J19o8j82m1
$$ plain form
4318 244 -74 92 -174 -251 -239 48 -258 -114 337 -230 187 -132 213 95 -41 75 -138 180 3 -78 23
4339 23 54 -235 -85 -61 -13 -82 295 52 21 106 144 21 160 269 42 24 6 133 75 25 -43 -45 -15 59 -34 41
4365 41 -104 -63 -11 122 124 -19 -7 78 -124 -244 34 -57 -127 -72 -57 74 105 6 -157 74 -84 133 115 -148 -137
4390 -137 -31 81 -85 171 12 194 -22 -265 -52 -269 -104 -47 -36 50 -234 2 -6 -70 134 -6 105 92
4412 92 195 122 -115 75 261 -120 69 94 117 -80 66 118 110 44 -121 163 24 246 184 -80 123 -167 74
4435 74 155 413 -17 -65 293 -230 -107 -15 143 -149 -225 -40 -88 -202 -251 -29 -76 -77 184 -4 -49 -39 68 -147
4459 -147 -62 -7 164 -104 -30 169 -250 67 32 -59 7 -69 26 88 7 251 -59 -77 448 -152 -79 67 -40 43
4483 43 -109 61 -91 -183 84 -242 -114 227 236 -99 3 65 -47 441 -56 63 -100 96 215 147 -35 -76
4505g6J41o6P4L5L5k87L60m5j54n0P0J18o9l24K82q3p1J36l94O97j77j33J7l5
4529AK71k8k87k7Q8p6J6j31k83L47JK53q6o8J18o7j43m3K45l1k98K80k11P6J27
4554D4J00rk44O1J76j93J29j1r7J35j47J72k10J92n7k50L42N0k13j16pJ72J23
4577A42p9J02k22J21r2q8J09K61k32k6R3nk7K34l51J06qo2m7P0l30M85m21K38
4601b9j36M06O3j49p4j77J89j85L6n6J54j19N6k6l6M8j78J90RN1j30N2J10n7p4
4626f2N2P2p1j10J07L2k95L90k18Q1l5o2J64l5j11J07Q5j9J23R8j44q7j13n8P
4651a02J99r5M4p6k40L30%j11K5j40K55K7k5m0KL3j19P2k31J08L12j98j04K24
4675A50k23l8K80k74r5L08l74K70r8l6j32J60n4J54j57K48j41K53j38j60J57O7
$$ plain form
4505 -76 65 -1 73 108 143 -144 216 171 17 -33 37 155 86 -238 44 -39 -110 26 -368 329 152 19 36 1
4529 1 272 244 -43 -70 18 -58 -42 -173 -456 -109 -108 145 59 -9 109 42 -101 -144 101 70 -228 52 -159 -83 44
4554 44 144 135 -109 -48 128 -65 64 53 -44 91 -56 116 -94 98 41 -209 133 183 -30 -146 -153 19 142
4577 142 63 165 -57 64 -28 -116 -7 254 22 -4 89 84 57 291 -60 46 38 -24 -71 -1 -331 154 -267 -29
4601 -29 -165 241 304 155 81 -96 93 -92 -56 -112 42 -77 -21 -47 -83 -35 -213 -23 -14 37 -93 -41 69 12 -62
4626 -62 -10 62 -9 -119 -12 20 -275 115 -103 -22 -57 -119 45 10 -101 6 91 72 195 293 149 62 -51 -109 -102
4651 -102 97 2 46 -30 -270 60 60 -51 -26 -166 89 116 91 51 53 86 -33 39 -192 -84 228 30 -74 150
4675 150 -73 -111 169 -105 -200 108 -266 4 -94 -130 -262 -102 -156 -2 -159 89 -52 201 63 -97 60 127
4697A27m6J97k95K74j91Q2j21N6l6j68Q8J57m0J3Q7l80O1M1K54l9j21j80L58k11
4721c3kK45n3n9Pm19M16k45K76l01R5J5Nl9J61j02n9J84j62J84q8k05J35K8j77
4746a93K13J93q8j5J66l29J70j43J8j38J72j39L31k14J2o1j76K85k56J15r5l5
4768b07J02J90j84MK45l54J8j81K27m1K05k87L62k01L6j71K97n4k12L23R1q3j17
4791Hn7q1K03K36q1q2K30l28J6r4K95o3k7L1p8k69PJ64j06O3J22N3k19J47R9j17
4817G2k21K56o9J05j2k54J55n1J25n8j22o3J50j8j33m4K36k31K50j02M6k61M6
4840a98K47k7L6o4M2l4j65K48O9j79J41j8k5J12j99P4p2Q2k26L5L35j96j56J38
4864@N2p0O8r2N2j59K37nk7j00l8J03q0L2j53K10k27K79j00J2p5Q7qm1%J96j73
$$ plain form
4697 127 81 278 -17 257 66 148 27 83 47 -121 -33 124 84 97 184 -196 -135 -94 160 121 0 -180 178 -33
4721 -33 -35 210 157 98 105 -314 102 -143 133 -168 -73 -58 -53 -92 69 -33 -92 92 -70 114 26 -179 -44 -16 -193
4746 -193 20 213 125 110 276 -53 117 -26 -8 -146 26 -113 218 4 16 -45 -221 64 -192 -77 -172 -207
4768 -207 -105 85 -99 -95 150 -204 -186 -367 -140 -181 24 -263 99 -102 -66 -237 60 6 -206 117 208 125 8
4791 8 -49 -130 73 309 228 146 376 48 64 -30 265 202 175 206 128 -141 -134 30 -76 -13 109 162 -57 90 189 72
4817 72 -149 107 38 143 131 -123 32 -19 106 48 -74 -137 13 -5 -138 -182 54 -177 73 -29 17 -244 -198
4840 -198 49 22 58 -6 36 2 -163 85 154 -25 116 98 73 185 -14 60 -12 70 -156 -121 214 18 -138 0
4864 0 52 -18 50 -42 10 -149 88 83 56 -44 -82 21 -59 -27 -180 30 -197 82 -18 -6 -81 6 -2 -43 -43 153 -20
4891b0k0k7J38J19j99J2j37L93n55M49k93J95k18J59n6m5P5K2n3K0J00r7K17n5
4915A24J31j13J42k88j44J64k9P4l15Q2J23P4K25j92j74J70j74K23k23J16P0q8
4937b2q6J93J51k49m42O77m11K10P6j2J2j30J38l4q6J41k04k5K4j33M04k59p0
4960a37K0K24k54K7L26k48L14j96k16R1R5j24K27M0j08j3j19J09k7j40p8j72J42
4983b17J90o6J35l6j67N6J79r4M0J34K0j60J12j93p6K92r8o6rM4o7j4J41J46j3
5008B13J6k96RQ4k15K52K6j34K30l5j90J91k15J29K5J68k0k80L51k04j74jk60
5031c30L95M1n7Qq6J5R3N5k72J31J74mj05P7k39P4J79k23J07m6j83K31q8pj2L3
5057c9J72j54K21l55J13n6K54p3k19j4L60j28j67K5p2m2L10k38M3k53J13k2J26
$$ plain form
4891 -20 -40 -67 71 190 -9 3 -134 259 -296 153 -140 55 -163 -4 -60 -105 -30 -8 -61 -41 59 -38 179 124
4915 124 255 142 284 -4 -148 16 -13 61 -254 -172 -49 25 250 58 -116 54 -120 103 -120 -4 66 -22
4937 -22 -108 85 236 -13 -455 222 -189 21 97 85 97 -33 105 71 -15 126 -78 -103 -79 -212 192 -67 -137
4960 -137 -117 107 -147 -120 206 -42 272 76 -140 -49 46 -78 149 189 81 68 -51 58 31 -109 -187 -359 -217
4983 -217 -27 -93 42 6 -161 -105 74 -20 20 154 174 14 126 -67 -143 149 51 -15 -24 20 -47 -61 80 226 213
5008 213 229 -67 -58 26 -189 63 89 -45 185 150 -40 151 -64 65 90 258 238 -42 309 105 -69 -70 -330
5031 -330 65 106 49 57 -29 -14 79 134 -138 -7 167 163 58 135 -104 -30 149 -74 33 -13 -196 35 -53 -60 -72 -39
5057 -39 133 -21 200 -155 -42 -98 156 83 -136 -150 210 82 -85 -60 -132 -174 136 -102 -59 -312 -199 -221 -95
5080i5L6J85j77O5O6j48K8q0P6K6o1Q9m9k03J4J7J44Q0K0J47j33L8Q9j99k38M75
5106B12k30j29J21K92k42L3Q3Kk06K4J49o9k05R8J13jj2J41j59n8J65J65m01J1
5130a03K9j09K13J49p4m12O39j06j68k86J79J26J43k98P5N6J29Q6m41L82j15j61
5152f7l1N1J36l21L45q3j53J12K07j02o42N51M6L3m5k49L77j58O1j78L8j43L74
5175A59j95J41Rm97O09k5m28K74M3j55Q0j76J26NJ18r9k0j51L21j5k7o5j55K45
5199A22l81J57J86k33p0J61J22Q6j30l3J53K2m1j42O8N0j43Q7m1J68j96K61j80
5222E3R0m2j83J59k24Q8P5j13K17k43J32M4k7k19M6j78K62L2M0P2Oj34MJ09k83
5247b17L75k36r3J10Q4J56k60L93k27j69o7J64Q0j07L3J20l29J60j77K01Q7J26
$$ plain form
5080 -95 -59 126 -51 14 80 -68 -40 -120 -44 -18 -79 10 -39 -242 -228 -211 -67 13 33 180 47 85 174 -25 -263 212
5106 212 -18 -147 -26 266 24 57 140 142 -64 -40 109 40 -165 -67 46 45 33 174 15 -43 122 287 -114 -103
5130 -103 -74 -183 30 179 105 -307 332 226 58 -228 -49 77 220 -78 -3 53 182 268 -173 209 94 -67
5152 -67 -98 -47 89 -232 113 30 -123 -11 196 94 -548 3 49 82 37 -212 165 7 68 -110 -72 -215 159
5175 159 -36 105 114 -383 226 201 -227 47 90 -65 15 -161 -35 -30 88 -11 -31 -182 139 124 97 32 -123 122
5199 122 -259 -102 84 -149 -219 -58 64 150 20 -13 140 162 121 -21 47 97 -46 41 0 168 -28 233 53
5222 53 143 101 -82 77 -147 -59 16 -97 120 -123 9 53 26 -193 -147 -325 -63 -31 9 81 87 -47 -43 66 -217
5247 -217 158 -78 -171 -61 23 179 -81 312 85 -84 -151 13 93 -14 19 139 -190 -30 -207 -6 81 207
5269B07kk42J16Pj38J96j98K43p8j83J37k14J79K00k61j40L41l40M35j44j16L5
5291D0lQ0k79J86k95L46j46j0K11q4j56L88l39K94l27J33J44k59m9l6N7o6L2J85
5315D7m8l6j03J51o8K9L6m0n8M0J1o4l4L16j44l02K36j39j4K7J21j11J0M1M7K27
5341A78l48J54RK62l80L39k26J04j61R9O4R7j82M9r0Ok3j60J63J91K4Q3j78o3
5365A1K67m11M2J36j81L05l02J95m22N55j51j38J35l8nJ26j09k00O7J95p5n4Q9
5388C7j98J66J8j38L33m8j78J35k61K19k30p2K77j27O7r7O0L29m50K8J47j25P1
5411c7K87k90k11K05R9n0j73L29k29q3N29k20l84M95j89J04m35L49j94j26L00
5432G6m8m9P8n1j29K23k5p0L1j84J80j71Q3M5R0l90J62M4J75K3P3k30n5L44n23
$$ plain form
5269 207 205 -37 79 86 -52 144 -54 189 111 -72 65 -149 30 230 -31 -171 170 -170 265 121 5 40
5291 40 37 117 -162 24 -271 75 -71 -81 130 46 -110 278 -61 233 -94 39 183 -76 -125 -161 -104 -170 -138 47
5315 47 -1 -37 -140 11 -57 -28 8 -32 -90 -50 -39 -103 -137 179 35 -267 -31 -170 -184 -157 -36 -147 -137 -96 -49 178
5341 178 -170 -16 -7 255 -125 214 -12 92 -69 30 94 191 9 58 -32 -26 -49 -209 -46 145 169 252 74 11
5365 11 278 -133 -91 45 -136 169 -133 62 -360 195 44 -94 41 3 -2 124 15 -185 -118 77 2 -52 37
5388 37 -161 5 23 -115 218 170 -8 127 -134 85 -145 -217 60 -67 0 -97 -37 292 -158 -130 17 -108 -37
5411 -37 250 -40 -251 -46 53 3 -170 159 -70 -153 376 156 -228 267 78 182 -253 96 -98 -224 76
5432 76 28 -21 57 6 -123 100 75 5 36 -148 32 -139 -56 -11 79 -311 -149 -105 70 93 166 -64 -119 225 -298
5457b98J17J32l0j18%K41j48M8j34L59k01j79K15%o9J27k1k70J52m4J35o3J5K4
5481a0o5rL54l83J19k00J54q8L31k73m12L46%J4K16p2m8R8q4j56K47J94l05O4
5505C2jl0K01q4Q0m35L31r1k47M46j46L63l75k32J33J99r6l11L57p2j31P0N8J9
5529C8q0p7J2NJ16M1k04K39l62L22j41q6L00k6j52K2n1l5L26k47j32r8J23m8J73
5554b2n2k99K61j32M31k78J5J39j08J77J54k31P4j00k18q7L43P1o8j02l9K64j93
5577@l0Q0J73j28j0M7nr2K67l38R8j21J66k64K81kP6R3j76m1op1j78K31L8l65
5603b77M04J64j23j68r6Q0O3r2K82j62N5p2k34K01L20m11J51mk53n7K61kj16l1
5627a17J59O7j12k1L9K54l95M1j12K86K7o2k2k0j84lJ49J98mj70o8K07n2j10M7
$$ plain form
5457 -298 -181 -49 -79 -197 -197 44 -104 -56 -190 169 -32 -211 4 4 -65 62 41 -229 -77 -121 14 -49 -34 -10
5481 -10 -75 -84 270 -113 6 -194 -40 -128 203 -70 -482 -136 -136 -122 94 22 -26 72 -12 -168 79 273 -32 32
5505 32 31 1 202 118 198 -237 94 3 -244 202 56 419 44 -188 -55 144 48 -263 94 22 -109 -39 19 38
5529 38 -42 -119 -107 -102 14 55 -149 90 -272 50 -91 -177 123 97 -55 -33 -84 -119 207 -40 -172 -270 -147 -195 -22
5554 -22 -74 -373 -112 -244 187 -91 -76 63 -45 132 286 55 129 29 -189 -276 67 138 70 -32 -71 193 0
5577 0 -30 50 223 95 85 132 127 35 302 -36 62 -59 107 -157 124 122 198 291 115 74 68 -3 -181 50 88 -277
5603 -277 127 291 168 0 -96 -16 47 -45 237 75 130 58 -176 25 345 -66 85 81 -172 -229 32 30 -86 -117
5627 -117 42 109 -3 -24 15 269 -126 -85 -197 89 116 54 32 12 -172 -175 -26 172 168 -2 -70 137 85 -25 22
5652B2J07l95Q8J79j24L45k62J03j03J62k57L25j74J27K1j64J52k29J64l9q0J33
5674A01j17J8l8PM6J37k26J58j62q2L37r4k9n6p7q7J41Q1k09N1L21j21j95R8o8
5699f5k6J12Qn3M8o5K4K97l36J46k47k6P0J49j05J79n4j79J05J26j36L4j86J68
5723a2o0J58l51M13j45O7j00O3qmj57K3J56J12K6Nk83j18K91j79J35O6L8J7j04
5748D9j12M52m13n0Q2Q4p5k29J07K19k53J75J15l94K12J58r4J66l48K14o3K19
5770B21k13p2O8J82j67j27K42j33J26j77KP2q6j6J59k23J49J57k08J34j33J39
5792I6J20k83J23mQ3k92J8l6J84q2L6J69q4k40kk9L5J65nJ98l3j83J02r6q2K99
5818A77l91K13l7n9Q9lj6K69l7k91J84R8q9l76J85k05L78j05M8k33OK12J74l86
$$ plain form
5652 22 129 -266 -178 1 -123 222 -40 63 -40 122 -135 190 16 143 164 0 152 -77 87 48 -32 101
5674 101 -16 2 -36 -29 17 154 -72 86 -76 -158 179 85 56 0 -77 -164 -23 58 -151 -100 221 100 -95 3 -65
5699 -65 -91 21 29 -24 24 -41 -17 280 -56 90 -157 -183 -113 36 -69 110 56 -123 -18 108 -28 6 -180 -12
5723 -12 -72 86 -265 148 3 70 -30 33 25 21 -136 -113 43 155 181 186 -97 -215 76 -103 32 98 136 153 49
5748 49 -63 389 -24 -74 8 92 17 -212 -105 114 -139 36 151 -243 -31 127 33 199 -149 65 2 221
5770 221 8 -64 4 186 19 -108 134 1 127 -50 -48 24 -62 -78 81 -142 7 164 -44 90 -43 96
5792 96 216 -67 56 52 135 -157 -139 -175 9 -73 -37 132 48 -192 -194 -223 -188 -23 -28 170 137 -46 56 -40 -122 177
5818 177 -214 -1 -38 -97 -8 -11 -27 242 205 -86 98 196 107 -269 -84 -289 89 -16 32 -201 -195 17 191 -195
5842a95J44j12K12j85K3l5J4r7K71j62p7L75l45N8K23k85L07r8j47J29j10J2l9
5865a19j37J2Q2K52J3j8q3J3K5m8j26J29j10j01L18j23M50o53Q4M8J50o0K02p2
5889A28m7j7l4k39M18j34N0k55K58J46j14J2j46j8j75P3M9J39q5j6k3j52K79j78
5913h1J30O4l3k16L90n5j38M0J78r2j27j66q5J84p7L11p8np6J05k39J6N3lJ63
5938A63Q1j9k23K0M4k45K37k66K01j73L16k25J07Q0k98K9LK26k1j14p0LJ41r1
5962i4j9L2J01O6l1k99K66j95J07J77j78Q1K23j62o1k49MQ2K75j17j13P5q6M07
5986B92l84J72M6j08K3p3J03n3r1J32J7o2k23M65l13O7N0k04J97J11k09M5M9O8
6010A17j77J9J52j54J7J16p7j17R5q5O6J31J26k86q9N3J40n1n3J05j6j34J04R6
$$ plain form
5842 -195 -51 -163 49 -136 -113 -148 -134 -231 40 -122 -199 176 -169 -111 112 -173 134 36 -111 18 -92 -80 -119
5865 -119 -256 -244 -162 90 103 85 2 15 40 -8 -134 -5 -115 -216 102 -21 429 -224 -140 -92 58 -2 200 128
5889 128 81 64 30 -209 209 75 125 -130 128 274 160 172 26 8 -167 -94 -45 94 9 -7 -30 -182 97 -81
5913 -81 49 113 80 -136 254 199 61 101 279 187 60 -106 -191 -7 -84 227 149 144 68 173 -66 -50 3 0 163
5938 163 244 225 2 22 66 -179 58 -208 -7 -180 136 -89 18 98 -200 -171 -168 58 37 -77 -147 -144 -3 -94
5962 -94 -113 -81 20 86 55 -244 22 -173 -66 111 -67 14 237 75 14 -235 -231 -149 126 9 -104 -29 -115 292
5986 292 -92 80 126 18 41 -32 71 18 -73 59 76 14 -209 256 -57 10 60 -144 53 164 -45 0 49 117
6010 117 -60 -41 111 -43 -26 90 13 -104 -9 -94 -28 103 229 -57 -146 -93 47 -4 -57 48 32 -102 2 98
6034I8L0j52r5K77j92N0j18K5J4L4K16k09p4P8j50L16J07q1j54j07M3j4j86M45
6058B01j26r8K07r8j25M24k82k93M17J10k88n0J53J26l1l23J11L1j66j21K49j31
6080a03K43j00k6o0J26N2k97l7K79k08L02l7mj07l2J76J4l05K23j14M8j28k5p1
6104a91J04O0o0J03o2q4J04j96j14M25j04N7j51q3R5J89j46N9k35K42j28J33M
6127B1L5r1J0J07L6j00j84M02l72K18k19L25j64n6R8J6o8nm9m8M17m14R1j3j00
6152a07N4M6j21K63rl08J57K06m10K89L8k35L9J71L6j51J46k21K09p0q1K08k3
6175A26j47K9J55P5j0k9k11K1j15K08j50l4J2L6J13j08J22J41l87Q4J3j45M0L09
6199A48l21K44j10J00j46p3K81J45l67K65j85J79j15o6Np6J17J16j17l10J52J19
$$ plain form
6034 98 128 -24 -119 158 -34 16 -102 -77 -63 -29 187 -22 -96 -18 -168 148 255 174 20 -87 -44 -58 -244 201
6058 201 75 -23 184 86 -39 385 103 -190 227 337 49 -1 152 278 247 -76 35 66 -100 -221 28 -103
6080 -103 140 40 14 -46 80 132 -165 -202 77 -131 171 134 130 23 -9 167 181 -124 99 -15 33 -95 -120 -191
6104 -191 -87 -27 -87 16 -46 -130 -26 -222 -336 89 -15 42 -109 -192 -97 92 -54 5 -230 12 -116 17 21
6127 21 56 -35 -25 82 118 18 -166 236 -136 82 -137 188 24 -32 66 82 14 9 -40 -88 329 -85 6 -7 -107
6152 -107 -53 -7 -128 135 126 -182 -25 181 -229 60 98 -137 -98 73 109 -42 104 -117 92 22 -59 149 126
6175 126 -21 8 163 238 228 199 -12 9 -106 102 -48 -82 -70 -34 79 -29 93 234 -153 -69 -56 -201 -161 148
6199 148 -173 71 -39 61 -85 -158 123 268 -99 166 -19 160 45 -21 -16 -92 25 141 24 -286 -134 -15
6221a5K04j84j81K16k34J95K42m15J99j66K71k24J22j76j9K13Q2k16Q0JQ7l41
6243b59N4L28l15K55j67Q3o1O8J63M6O0k83R6n8L2K2j06O3J24Q9k67jj63L42j23
6268B2L30l70j32K62j75o8L0J15j44R2J00m8K47k74J44j82lJ59k4p0k46K25j56
6291a66J67L28l72L0R3qj76J17J99k42J87r4p4N7L5o2rk4R3j54j54K81j34p0J06
6316d6J32j00k49K72j11J28j50J53J69l10J54j72K17k10L08k41O0k16J69R4M5
6337I6r6J72l15L58jk45Q9Pj97L04m43L95p7k00K40k6K21n80O0J04L57k94j15
6360a86K20l60M25oJ84k44rJ41k26L5J13R7q6nj7L6j70L42m96K59qj11K59n3j43
6385iR9n9Q7L0l34L03j86K35k14J29P3j42lj37K25j42R2r0rj50K40Q8p7j16N7
$$ plain form
6221 -15 189 5 -176 40 -194 1 243 -172 27 -139 132 -92 30 -146 -165 48 130 -86 -6 -5 82 -259
6243 -259 -205 123 -192 63 -104 -21 -82 -14 149 195 255 -28 68 10 42 64 -42 21 145 234 -33 -34 -197 145 22
6268 22 352 -18 -150 112 -63 -131 -101 14 -130 -38 62 14 261 -13 131 -51 -54 105 81 11 -235 -10 -166
6291 -166 1 329 -43 -13 80 72 -104 13 212 -30 157 63 -11 46 81 19 10 -14 79 -75 -229 52 -82 -152 -46
6316 -46 86 -14 -263 9 -102 26 -124 29 198 -112 42 -130 87 -123 185 -56 4 -212 -43 51 96
6337 96 0 172 -143 215 214 -31 58 65 -132 172 -271 124 47 -153 87 61 282 -298 -238 -134 223 -71 -186
6360 -186 34 -326 99 93 277 33 24 165 -61 -26 87 184 98 93 76 112 -58 284 -212 47 39 -72 187 134 -9
6385 -9 90 31 118 148 -186 117 -69 166 -48 81 154 12 9 -128 97 -45 47 -43 -52 -202 38 126 49 -67 -10
6410a0J18k21J81R7l86J27Oj1j75L32l57J91P5Ol2R2j50j29L94j16j3j06J66k32
6434a53P0N5R1R6m9J07k60r0K16J8J0j19N6J05j39j51K2J9k64L98J01k89J58k59
6458b51M3J37J86j80K9P1K26j43K6l60N9K53j52J38J8j66m6k7j71L08k14NK73
6481F2j58j67L67l98K82jl8j26kK56j34r7J41j57k6K94o4n5N4k63L26p6j1K2K50
6506B81m99L05j54j49J22K75m24L75j35p3J33K7j09P8n1J5K11j68O8k77K72j4
6528A09mR6k34l9J13j34K2q1K0K82k20o0J92j1J7j57J66p2J53k05nj2m5P9J42
6553A12k61L40j66J4j41j36K31k77J61K42j56J7j48L43l77J29j32J93O5l18M55
6574A90m7j80j9K07j02n2m3R3qj2M9r8J69j62k1J55j12%k21K33J85m36L30m2j9
$$ plain form
6410 -10 108 -113 68 165 -221 -94 -88 -99 -274 58 -299 -108 -33 -27 -59 33 -117 -246 148 32 19 -87 79 -153
6434 -153 -83 -28 63 159 110 217 -43 -133 83 101 111 -8 48 153 14 -137 -115 -96 -360 38 139 -150 8 -251
6458 -251 -208 -71 115 -65 -36 35 261 118 144 -216 -157 96 -56 82 100 -66 -112 -139 -310 -2 -216 -211 62
6481 62 -96 -263 104 -294 -12 -13 -51 -177 -179 77 -57 -154 -13 -170 -196 98 34 -21 33 -230 96 20 9 31 281
6506 281 -218 87 -67 -216 -94 181 -243 132 -3 -76 57 84 -25 53 2 17 228 60 128 -149 123 109
6528 109 105 201 -33 -72 41 -93 -71 -152 -132 150 -70 -130 62 51 68 -89 77 5 158 -47 -52 -64 -109 -30 112
6553 112 -149 191 25 39 -102 -238 -7 -284 -123 119 -37 -20 -168 175 -202 -73 -205 -12 53 -265 190
6574 190 143 -37 -56 151 49 -3 -46 47 39 27 76 -22 147 -15 -36 119 7 7 -214 19 204 -232 98 56 37
6599C7j60j3J16L8J37l9J06k85K28o4l5Q0k44K41j1j15q8o7J04Jm2L54j07k49
6623g7M5p5K3K6p1P0J16j05L4K9l5j05J70Q1n5p5J08l30K07q9J57o3J22r2Qn3
6649b9r5K39L1k53R8m2M0l74M34J34l06L56l82L28j41J66m12q4N66n66K18O3J12
6672A01o0R2q0j71Q2L28r6j60k75L38O2l79M65m89J98P4j21j03K29m1P6j01K91
6695B60q5m95J59K64l14K15Pj49NJ24J17l07M08k46j30L13j31m9K11o1j51K24
6717A89M3j69j34J42m3L7n2o4l5J55k57M47n37K72J42N1k70J99k06k0O0p6J26
6740@j57J81j65J89k24OJ6K18N7k64K51j26J22k3k1k39K78j4J3k33J47M8l1Jk09
6765a79O2RJ42q1J53j46l7L78k89j32J79o6J58k49q4J04j0J24j46J15q7M4N3j32
$$ plain form
6599 37 -123 -136 -20 18 155 116 222 -63 165 101 66 146 -98 143 132 17 -71 -138 -34 -33 -75 279 172 -77
6623 -77 -32 -107 -84 -58 -129 -59 57 -48 -14 15 -20 -125 45 126 71 -4 104 -226 -19 -108 49 -14 108 16 24 -29
6649 -29 -124 115 146 -107 -9 -51 -11 -385 49 183 -123 233 -149 179 38 204 -208 -292 274 -292 -74 -11 101
6672 101 41 133 53 -118 -36 292 196 36 -239 99 161 -218 247 -242 -44 30 -91 -194 35 -6 70 -31 260
6695 260 175 -320 -161 103 -211 4 11 -138 -133 -9 108 -199 209 -37 -167 146 15 -34 177 116 -35 189
6717 189 232 63 -71 71 28 65 13 -51 -86 69 -188 259 -278 -6 136 187 -83 116 -90 -110 -50 -126 0
6740 0 -157 24 -141 48 -176 -170 -154 64 121 -143 108 -18 104 81 60 -179 99 85 98 -135 12 60 29 30 -179
6765 -179 -117 -108 34 -47 106 -40 -77 301 12 -120 59 -7 151 -98 -182 -78 -88 36 -110 5 -82 -38 15 -117
6789a17J64J44l45l1QJ03J5J61J72j93j79OQ5k7L43l74N8j5J6k1J05j11J2j34
6813a55J36Q4l5r4M8j33K63j40R8j62M3L06o7k65lK4j1J78n4N9J17k15q3R9M5
6838H3O4j77J14L1k16J86LJ10k25J09J08m28K88J03j27J38k37m7K08j13k9Q9k77
6861b42R9J99K26q3k10Pr0l7j19K40p8K09p8l5K78l52J00j21KJ0K32m3k37K38
6885A15j51N8Q7l14J44n3L10j89jo2J30J01k98M2m4J33J28j48K00m29K96J66l52
6908a31K42j36K86m19L13l25N7K78J5m95K40k8J58j16M4j42K75P7j16q6N7p8j00
6931a30J48J97k15j19J14K8J14l00J76J3L8j58L30n32K80j8J68M9j90K7j05M3
6953d2J98k48J4r9%J06J90m55L16nj63Q6Q3j05J82j53q0N8o7L56l70q5J99R9j10
$$ plain form
6789 -117 47 191 -154 -185 -177 -74 -59 102 274 81 -98 -92 -7 -34 309 -65 -7 -22 -6 -27 78 -33 -21 -155
6813 -155 -19 65 30 -64 -16 -149 114 -26 72 -90 -47 259 192 -73 -76 -52 -63 115 61 120 237 22 -61 38 83
6838 83 147 -30 84 115 -101 85 88 198 -27 82 190 -238 50 153 26 164 -73 -120 88 -25 -54 35 -242
6861 -242 -143 56 282 199 -11 -4 -94 -131 -250 -10 -88 121 43 8 286 -66 34 -87 -85 -75 157 114 -123 115
6885 115 -36 22 109 -205 -61 -114 196 7 6 -56 74 175 -123 -81 -125 8 136 -12 188 -241 55 221 -131
6908 -131 111 -25 261 -158 155 -170 -113 165 180 -315 -75 -103 55 -61 -17 -159 116 193 77 -9 48 -30 -130
6931 -130 18 215 0 -119 -5 23 137 -163 13 26 64 -94 236 -296 -16 -34 134 183 -7 20 -85 -42
6953 -42 156 -92 -78 -177 -177 -71 119 -336 -20 -25 -188 -102 -19 -124 58 -95 -175 -117 -184 172 -198 -283 -84 15 -95
6978i5K79M8k34J41K6m37J31K61J19l61K63j32N1K49j88j04m6J60m2n2J38k90
7000a15J53n6J44k50m4L71j51o2N8k47K72j54J49M1q8lr2L27m20J99K86m17q9
7023a88J23J1K75k78L80p1K5m35q7K95Mq2j23J11k5N8j57J92r2K40j62P7Qk45
7047a46K61r7L6q3l09M03n7K1M7M3Pk87R2J96k80J35j08J46o7k68oK94r8J26N5
7072E6k10M5J36L3k14K69j85J9K58m17K14M5j26o2J85q1J50k11p9n3K20M6j87
7095a49J06K07j74j88K52J03l61J18L55k70p7L8P5k31oM7J80k8j17O9J12p4p0
7118h3J39j19J40j17M9j21PL19k34LqM7QJ83k73O0N9n7mO0k16K60n0m9L2J01p
7145A29J31j41L5j77Q0j43o7m7J23Rj3M6k3J96Rj47j0j49M04j80j90j5L04k66
$$ plain form
6978 -95 184 232 -2 139 165 -272 -141 120 239 -122 141 9 60 309 121 17 -29 131 89 37 175 -115
7000 -115 38 -18 126 -124 -168 203 52 -10 48 -199 73 -81 68 109 21 18 -74 253 -167 32 318 -99 -188
7023 -188 -65 -54 221 -57 323 252 277 -158 -245 50 54 -28 -151 -40 -65 -7 -164 28 -64 176 14 91 99 -146
7047 -146 115 18 54 -29 -338 65 8 29 76 119 126 -161 -69 127 -153 -18 -126 20 -47 -315 -321 -27 -125 1 56
7072 56 -154 -109 27 60 -154 115 -70 -51 207 -210 4 49 -77 -139 46 -35 115 -96 -175 -228 -8 38 -149
7095 -149 -43 164 -10 -198 54 157 -204 -86 269 -1 -78 -40 35 -196 -202 -155 25 -3 -120 -51 61 -13 -83
7118 -83 56 -63 77 -40 9 -112 -105 214 -20 -17 -25 22 30 213 -60 0 59 2 -2 58 -158 102 52 3 35 136 129
7145 129 260 119 154 -23 57 -86 -153 -200 -77 -68 -81 -35 -58 138 147 0 -10 -159 245 65 -125 -140 164 -102
7169a02K96n1r7Q0m6j94O4j31L0Rl0j9K4J36J15l0M2j88R7R4j52K1P5j31N7j29
7195a60K65l07L15q9k09K59k89L54l51J56j88K44j02j16K91r8p8j57K67k15L85
7216A77j24l3K67k68K97j62k36L45l16J47j91J04l53J14K56k6R2l88M79m28M84
7237B37m45L55k31Oj55J47J00m2O0k1Pk8J91m59L03j54J68j34j69M41l6k57k93
7260d09J52J51J65j63l0J8R1j57K44J56k27opN8p5Q1j46J43l26L38k48J20J85
7283A08j7J80J80m42J22k20J1k72K69m1l7Q7J79mJ30o0k39J79o6l01N08r6k46
7306h8k1P5j0j55K71r3l57K77J44j66K13k85N1J59K01j38j75J26k49J23L9q0K04
7329F6k18K86N5k32J08j43o2J44o0J10j52j3R1j8j25r1L12k75J31k8J83L7n7r3
$$ plain form
7169 -102 194 143 46 126 80 -114 -50 -181 -151 -142 -172 -191 -167 -31 84 54 96 -92 5 99 -53 -32 43 -88 -31 -160
7195 -160 105 -202 113 24 -185 74 -215 139 -212 -56 -244 0 -102 -218 73 -25 -103 -260 7 -208 177
7216 177 53 20 287 19 316 154 -82 263 -53 94 -97 7 -346 -232 24 -2 90 -298 181 -247 237
7237 237 -208 147 -84 -78 -233 -86 14 -28 32 11 18 -10 181 -278 25 -129 39 -95 -264 177 141 -116 -409
7260 -409 -257 -106 59 -104 -134 -116 -25 -182 62 218 -9 -15 -22 36 -39 42 -104 39 -287 51 -197 -77 108
7283 108 91 271 451 9 131 -89 -78 -350 -81 -122 -159 -72 107 103 233 173 -66 113 47 -254 254 158 -88
7306 -88 -109 -34 -44 -199 72 -21 -378 -101 43 -123 90 -195 -144 15 216 78 -97 29 -220 -97 -58 -138 66
7329 66 -152 134 189 -43 65 -78 -140 4 -56 54 -98 -111 -20 -38 -163 -254 58 -217 -86 -114 69 106 49 -44
7353d4L1k00L09m8k33K65J76l23J2K3k71K99q1Q7J12P2k70K21j51J99m63P6l5
7376b37L69r2p2K38k90N4O0j43J85j48K8K21j61J26j43rK33l61j80L13K10k02
7398aK5M3j57R8o7n4K9L11k83k01K33L2j38M9J72k89R3j13k32N01j29J84k62J18
7422c8r9K16j23J1J34R5k05R2j39j06Q4J43O1j09r2J52j59J74j95Q0L4n0rq0K55
7447A27j23O5j33K09J7k07K74l97M9J58j00M8K00q3qN4l23Q9p6J88Q9N0l5M7K01
7472C80n81J51j79K01M7q9K38k24K3j02J65R6j71o5K07k57K63k86J93M5K8k39
7494a56O2K13O4j88J1L9q9m0Q4j26J78L1p6j68n8J46J27j32M9j7j32O5K12j27
7518b8j70L16k09K5J36l5J47L4q4k15j91K63R7r0J66k63O8j43J83R1m30N69j80
$$ plain form
7353 -44 -13 -213 96 48 -185 80 256 -67 -55 -32 -303 -4 -85 2 114 186 -84 137 -14 185 -278 -202 -237
7376 -237 132 40 -32 206 -84 -30 30 -113 72 -76 -48 173 12 138 -5 -14 219 -142 -322 -9 201 -1
7398 -1 24 67 -90 8 -59 -113 -84 227 -56 -257 -24 8 -130 -81 91 -198 -105 -218 -450 51 -78 106 -156 -38
7422 -38 -137 79 -44 -33 101 196 -9 83 -56 -162 -78 65 126 17 -75 77 -82 92 -103 -23 11 -39 -48 -128 127
7447 127 4 69 -64 145 162 -45 229 -168 -119 39 -61 -13 187 104 96 150 -173 -84 -160 28 117 167 132 179 380
7472 380 -201 -50 -229 -28 19 -70 168 -56 -33 -135 30 126 -45 -110 97 -160 103 -183 10 55 83 -156
7494 -156 -94 119 183 -5 6 45 -44 -84 0 -126 52 83 7 -161 -219 -73 54 -78 -29 -46 -178 -113 99 -28
7518 -28 -198 118 -91 -66 70 35 182 216 132 -83 -274 -11 86 -4 162 -101 -33 -176 7 98 -332 237 57
7541E7k47L40p6k21L55j71l21M44j0j61o2o0J40o0j52L03k05J12J35k50m7L38
7563A81l88K60k25J18J19R9j55k5O4q3M6Q5j56j05K5p9L11m5J46j28j30J45O9
7586A49l34j00K62Q5j33r2Q8K6J61J7k8O8j00j49J86lj47K1rj37J59j02O2J51
7610A01j14n4J19k31K54j08p8K38l9j27J77o8l38L05jj92J20j29j32K84qn6q1
7633a58J34o0J82j71n0K85j66k15J34P1o7R0j44P0K40j44k54k9M65k40j19J63
7655A7o6N8rQj3l25K98j85K3J99l7o4M46n60O1M9n0J09L09j91p9K7n8J8J83k81
7681a13L22j66m0j7k2K6K29j92n5kp2K13j86L55l05j27R8P1l7q8P5j99J85m7P9
7706a5M4j3J29k32J82K4p4j37J09O7j58J41j40P5p1j1q3K68j24K23j64j47k09
$$ plain form
7541 57 -190 150 74 -147 208 37 -284 160 150 -11 -73 -133 7 -53 -205 98 -107 5 140 -110 -157 181
7563 181 -207 53 -172 -54 65 164 9 -16 48 -35 11 96 -60 -165 -140 -219 92 47 193 65 -65 80 149
7586 149 -185 -285 -23 62 -71 -163 -75 -49 112 129 101 169 69 -80 106 103 -44 -23 -32 -169 -10 -112 -50 101
7610 101 -13 -67 52 -179 75 -33 -111 127 88 -39 138 70 -268 37 36 -156 -36 -165 -297 -13 -21 -77 -158
7633 -158 -24 -84 98 -73 -123 162 -4 -219 -85 -14 -81 9 -135 -65 175 31 -223 -252 213 -27 -146 17
7655 17 -49 9 0 8 -5 -330 -32 -217 -194 5 -32 -96 350 -210 -149 -100 -150 -41 268 77 -2 25 -33 -15 168 -113
7681 -113 209 43 3 -14 -36 -10 219 27 -28 -30 -102 111 -75 280 -25 -152 -54 17 -20 -108 -33 -232 -47 -94 -15
7706 -15 29 16 145 -87 95 119 45 -92 17 84 -74 67 -73 2 -69 -80 -163 105 -19 204 40 -107 -316
7729c16J43K92k2rJ1p9kJ89l26J83q2J69J2k60K26K4r9j74RL34j18q0J29on4j61
7755f7J12R7l5L6j15M4M1r4Lp6n4m2L37q6j24j38L76j12q7J51l17J72L5j78N8
7780f3J48j41K52l3l00L28k54j50K20n2M2q4N7P4j17O3K4j12l5K06k6l3j69K15
7804F0k18j0M6Q8J43k31J90oNJ05J3k81n2K6M2J35J51m78K71K6n6M8J07K6q9j66
7830a05K50k39O9OLK02j39o3K23l09L09k80j12K72r0j35K57j8k66J53M1k1j57
7853a49J47J28j35Q7n0j80J42j43L08m0j49J50m0k88K92j64J80O9k19J16K6j51
7875f3J71o2k9j77j7L8K46j62J11Rj57K77l8r9j71J63k76M1K99j0p4Kk24L25l50
7900b27L55K00k81j85J69q2KK09j43K21k9j38k02MN9K18Q6p5j55j94L34M0k27
$$ plain form
7729 -316 -173 119 97 88 99 20 18 207 -119 64 -18 151 163 -97 129 153 54 -120 -111 223 105 25 154 148 94 -67
7755 -67 45 142 107 143 28 72 113 19 22 -54 -108 -150 187 101 -23 -161 215 103 16 167 -150 22 57 -121 -63
7780 -63 85 -56 196 163 -137 191 -63 -213 7 -45 -3 -87 -30 44 -73 -10 14 -98 -133 73 47 14 -155 60
7804 60 -158 -168 -122 -34 109 -122 68 62 67 172 185 -96 -148 -122 -80 55 206 -272 -1 25 -31 17 124 150 61 -105
7830 -105 145 -94 -25 -19 -16 186 47 -16 207 -102 207 -73 -185 87 -3 -138 119 101 -165 -12 29 8 -149
7853 -149 -2 126 -9 78 28 -152 -10 -153 155 115 -34 116 76 -212 80 -84 96 165 -54 62 88 -63
7875 -63 108 46 17 -160 -177 -139 107 -55 56 65 -92 185 147 48 -123 40 -236 -195 104 94 20 22 -202 123 -227
7900 -227 128 328 47 -138 31 -51 -49 160 17 238 209 71 -131 -127 -68 150 236 161 6 -188 146 186 -41
7923d1K27k07J55P5k88J21m2M7Okk40O5k4K75k86K12k20K55j34J17j14J74k50
7946a19j29M30m71L84qj16J00m5J27l65K84r7k24K52k80M77j47n2j06R1O7k9o0
7969c6J39j53j02J38R0l73L98K4ok77L36j25Rl0j28J6J56r3j78J59R0o9J52k14
7993g7L0K11l2j91qK72j80J50j21j36L37j88J13j22j37K69k86J30j0j04J58k21
8015a43K03J90m31l9J81J44k48J83n5k06K48m3M9M5k11J7J89J06k60L74m22R1
8037c8l29N45k34J62j36nj5k48L48OJ98j26j36j19j9l4O8M93l72o4K19Lk41J64
8061I0r3j89Q8L53k41k44O7K69j42m2M50k93Q6j57K64k99K84j65p6j88J23Q7n7
8084b5J57k77J45n4J2j33L16j7j00j88J9J37K20k54j41K63j98J7J61j25j12m7
$$ plain form
7923 -41 186 -21 134 209 -79 42 0 47 53 51 -189 -124 -148 127 -159 53 -167 88 -46 71 -43 131 -119
7946 -119 -248 182 -289 95 87 -29 71 26 153 -212 72 -25 -249 3 -277 200 53 1 -105 -14 53 24 -36
7969 -36 103 -50 -152 -14 76 -297 101 125 119 -158 178 53 62 32 -96 -80 76 -17 -195 -36 54 -15 137 -77
7993 -77 -47 164 132 -59 -67 205 25 175 54 -82 255 67 180 58 -79 190 -96 34 24 -80 78 -143
8015 -143 60 250 -181 -220 -39 105 -143 40 -15 -221 27 -16 33 78 -133 -116 73 179 -81 293 -129 -38
8037 -38 -367 178 -56 106 -30 -35 -50 -298 50 56 254 128 -8 -127 -146 -180 -112 381 9 -55 164 167 -74 90
8061 90 -3 -192 -104 249 8 -236 -169 100 -42 -84 366 73 159 2 266 -33 251 86 10 -178 -55 32 -25
8084 -25 132 -145 0 -54 -42 -175 141 124 24 -164 -145 -8 212 -42 -183 80 -118 -101 60 -65 -177 -224
8106b24J97k09M04k11Mj40K15j63J01K44j69j09j11K61j66MLp4NM2K33r1J39j92
8130gj51K35j38K15j06J18j04j11J37k10J34Oj3L7l23r6J92K50k66K1J16K30P
8153A73j00p9l0Q3J34j30K60l57J57k11p5J23J47M6j14j48K85j63jNj03K83m03
8176b18J92N1M9J60k53Qj84J61m2J18q0M4j36L3o8
$$ plain form
8106 -224 -27 -236 168 -43 -39 -179 36 -127 -26 218 49 -60 -171 90 -76 -72 -69 -143 -138 -96 137 46 185 -7
8130 -7 -158 77 -61 154 48 166 62 -49 88 -122 12 18 5 42 -281 -377 -185 65 -201 -180 -64 166 173
8153 173 73 -6 -36 47 181 51 311 -46 111 -100 -175 -52 95 141 27 -121 164 1 0 5 -98 185 -218
8176 -218 -26 25 74 234 -19 -11 -195 -34 -76 42 -38 6 -130 -97 -165
8191a65
$$ Imaginary data points
##PAGE= N=2
##DATA TABLE= (X++(I..I)), XYDATA
0@%%%%%%%%oJ4j6J6j6K4l2M0n6P0q3J01j20J44j74K06k40K80l30L84m43N11n89
31c15O72p65Q71r86J114j255J409j581J768j970K192k436K703k992L309l657M034
48B115m446M899n397N946o552P221p964Q799r742J0811j2037J3459j5134J7142
62I120j9599K2691k6715L2199m0181N3065p8507K19689m10692J95972M16309m95552
74a22201J54197M8861l7373j4540p1632J56149L7243k50135l687J64898N6053
85A17833k63011M3558K20429k04420k2104K43689j56550j18459J39969J2825j8070
96d311J123j28786J23521R8175j84868J01194M1877j59327J46840r872m3282O4678
108D6962j71820J27923J43093k23220L3598R6220n4301j8730M3831M2301j43310
$$ plain form
0 0 0 0 0 0 0 0 0 0 -6 8 -8 8 -8 16 -16 24 -32 38 -45 56 -64 80 -94 112 -128 152 -178 206 -237 274 -315
31 -315 357 -408 463 -523 591 -664 745 -836 932 -1038 1154 -1282 1421 -1571 1738 -1919 2115
48 2115 -2331 2568 -2829 3117 -3435 3786 -4178 4621 -5121 5690 -6347 7112 -8022 9120
62 9120 -10479 12212 -14503 17696 -22485 30580 -47927 171762 -238930 -42958 373351 -122201
74 -122201 31996 80857 43484 28944 -42688 113461 150704 -99431 -103118 61780 117833
85 117833 -145178 -101620 118809 -85611 -107715 135974 -20576 -139035 934 13759 -4311
96 -4311 -3188 -131974 -8453 89722 -95146 6048 47925 -111402 35438 25566 -17716 46962
108 46962 -124858 3065 146158 -77062 -43464 52756 -1545 -20275 23556 65857 -77453
119g7453K8744J56203j23084m01K4974p3522J35214m7465j00129J36235q2123
130b2807o0309J82786p7964j37585J47828j919r1787J15153m7856r8138J18150
141B5552J1483n8903R158j092P201l219L4602j4946o0027M6789L243K2641k140
154B0342j07481J02559K8150j18242J10272k2550j08866J07773R700m6140l341
165b7824k9249N3139L698m8744L1408j3221l6207M8668K4626n9034j9610M5583
177b6767N766k0873J1542j0105k9168M2201K6618n1960R217J0071j9462O0156
189G236k5932m6056N8866l1594J4249N6095q3065J0374N5210l4163K5330k271
201D279l6774K5311J9545O122k0924j0975J9234o848K5066K279n0976K2677K6821
$$ plain form
119 -77453 -48709 107494 -15590 -15991 8983 -64539 70675 23210 -76919 59316 -22807
130 -22807 -83116 99670 21706 -115879 31949 30030 -61757 53396 5540 -92598 25552
141 25552 37035 -21868 -12710 -13802 -6601 -9820 24782 9836 -50191 -3402 -159 22482 20342
154 20342 -87139 15420 43570 -74672 35600 13050 -95816 11957 21657 -24483 -27824
165 -27824 -57073 -3934 -236 -48980 -17572 -30793 -67000 -18332 6294 -52740 -72350 -26767
177 -26767 -21001 -41874 -30332 -40437 -69605 -27404 -786 -52746 -43529 -33458 -52920 7236
189 7236 -18696 -64752 -5886 -37480 -23231 32864 -50201 -39827 15383 -18780 6550 4279
201 4279 -32495 -7184 12361 18483 -2441 -13416 5818 -1030 24036 26315 -24661 -1984 24837
214B4837j5831J1799k1934j3659L6568j3137Q55J5689n5174J8321O0235m8558
226A1j6990K4824j8291J4835P532j2204n275k3349L1005K5464m1172j0293J2860
239a1043J1472K512j5892J1985j7948j4239N6086j7475m1205K6255m439Q381J7910
252A2360l4840K611J4322j0085K6616j0428l2992K3733J0299o77M865k2466M91
265a6191K1180L541j496j5323P0J3862m80J5664j4626k4871L1538P531r246N620
279A6773k1646R745K3174j6051Q355p614k2074L6051O110k4838M327m566N923
292A3669J5411j0789o883n657K413K0857q730j3221m89k266J8522j803j8330N599
306H303p266Q513J7576k5292m585J0306q095J9165n776k5937J3967L783O35O234
$$ plain form
214 24837 9006 20805 -1129 -14788 21780 8643 9498 25187 -29987 -11666 48569 11
226 11 -16979 7845 -10446 4389 11921 -283 -5558 -28907 2098 27562 -13610 -23903 -11043
239 -11043 429 2941 -12951 -966 -18914 -33153 22933 5458 -35747 -9492 -13931 -5550 12360
252 12360 -22480 -19869 -5547 -15632 10984 556 -32436 -8703 1596 919 5784 -16682 -16191
265 -16191 4989 8530 7034 -8289 -8219 5643 5163 20827 6201 -18670 12868 20399 11153 16773
279 16773 -4873 4872 28046 11995 20350 12736 -9338 26713 32823 7985 12312 7746 13669
292 13669 29080 18291 11408 5751 8164 29021 20291 7070 6581 4315 22837 21034 2704 8303
306 8303 1037 9550 27126 1834 -2751 7555 -540 18625 12849 -13088 879 4662 5297 11531
320A1531j9357j373J1638j451P088j1888j3495J4825M856q70n892j2691J0646
333f433N299k383M326j7221r36K0275o324q64l884j2914K0691M428j2836M628
347d148q782M502J6308r726j719k513l899K0012j454j3251K342O04J0757K106
361A1139j0516M352m224R43J8630j0752j2813P265L331Q706o457j2456J0074k549
375D673p13J2572j5442q981J1487J423L546j0486j1011J3687n53l908L685j2772
389a2793l69Q878q4P5j3629j218J4490n157n32k696j0630J2761M613q564L404
404a1451p560M1J5194m874n627j264j700J2204J445r411M1k80P076M804r192L168
420g386k385l184J7672m194j5633P193M895M004j202r178M982J280j451J0183
$$ plain form
320 11531 -7826 -9199 2439 988 8076 -3812 -17307 -2482 2374 1504 -4388 -17079 -6433
333 -6433 -1134 -3517 809 -16412 -17348 2927 -3397 -4261 -8145 -21059 -368 4060 -8776 -4148
347 -4148 -12930 -8428 7880 -1846 -3565 -6078 -9977 10035 8581 -4670 -2328 -1724 9033 11139
361 11139 623 4975 751 1694 20324 9572 -3241 4024 7355 16061 9604 -2852 7222 4673
375 4673 3960 16532 1090 -7891 3596 5019 8565 -1921 -12932 755 202 -3706 -21 -12793
389 -12793 -13162 -4284 -4368 -4293 -17922 -19140 -4650 -9807 -10339 -13035 -23665 -10904 -6291 -14855 -11451
404 -11451 -19011 -18970 -3776 -8650 -14277 -15541 -17241 -5037 -3592 -13003 -12962 -13242 -6166 -1362 -10554 -7386
420 -7386 -9771 -12955 4717 523 -15110 -7917 -3022 982 -220 -9398 -4416 -3136 -4587 5596
434E596o484p919K623O540J0686j4743j0877K0648j809j0306J2838m573j0752
447h532P980R297m08j3528k149J5494J03q279j88J602J724l781N396P879k1214
462h604k289K7844r458j7805J1000O99l779M089o39k272p253K980J1427o216q355
477h631j844O897Q072j2861j849J0505j2400L742J4460j4485n543Q735J926J948
491a328l302m445K252N591L098o226p88M966m382N427Q720j3916j860J3791k227
506E371q63J075p176O733O470o163J379J33l664M323N770p02j2622L404J4841
521A8309r108m261O973p945L572N391o491L037n577l204J3364j734j2577m31J0523
536I841l23j0709O707L364j4476O820J2923j2813p052O603L926L76o353l131P875
$$ plain form
434 5596 -888 -8807 -6184 356 11042 -3701 -14578 6070 4261 -6045 6793 2220 -8532
447 -8532 -552 8745 8337 -5191 -7340 8154 8257 -22 -210 1392 3116 -665 4731 12610 -8604
462 -8604 -10893 16951 7493 -10312 688 1387 -2392 1697 1058 -1214 -8467 -5487 5940 -276 -8631
477 -8631 -10475 -3578 4494 -8367 -10216 289 -12111 -8369 6091 -8394 -13937 -5202 -3276 -1328
491 -1328 -4630 -9075 -6823 -1232 1866 -4360 -5148 -182 -4564 863 9583 -4333 -6193 7598 5371
506 5371 4508 5583 -1593 5140 11610 5447 6826 6959 3295 7618 13388 12686 64 3468 18309
521 18309 9201 4940 11913 3968 7540 12931 6440 9477 3900 696 14060 12326 -251 -682 9841
536 9841 9518 -1191 5516 8880 -5596 1224 14147 1334 -5718 885 4811 5187 -1166 -4297 3578
551C578l194n149J0849l729j3108P702J1640p185j1252Q119O629j0817N570M995
565D648j2233L815N564p94J116r058L100R719n730j530J307j261J232J645L896
580E436n270n224R050K126m761J000j496L16N029j15l844L2M41J955L775l729
596D721l400J783L205K078m681k34J120k986P681j317r948O240M93k200M787n619
612A723k010K204P43L339n580l447L728J102O09m058j193K744l567L908L012j0116
628f859J50P839j832l834R14q44k6K013K37o06m170j49P575j875n391J956M02
645d500K125Q3j562J023l727L771M628n067Jl73J565M545m102l26J282j737N530
662C159p27l909K567j641K987L059m552j574L137J512k68o95j543J17J805J244
$$ plain form
551 3578 384 -4765 6084 2355 -10753 -3051 8589 1404 -9848 -1729 4900 -5917 -347 4648
565 4648 -7585 -3770 1794 1000 2116 -6942 -3842 5877 147 -1383 -76 -1337 -105 1540 5436
580 5436 166 -5058 3992 6118 1357 2357 861 1177 6206 6091 2247 2279 2720 4675 8450 4721
596 4721 1321 3104 6309 8387 3706 3472 4592 1606 9287 7970 -1978 4262 4755 2555 7342 1723
612 1723 -287 1917 2660 5999 419 -3028 700 1802 2411 -1647 -2840 -96 -3663 245 3257 -6859
628 -6859 -6709 1130 -702 -4536 -3622 -4466 -4492 -2479 -2242 -2848 -7018 -7167 408 -1467 -6858 -4902 -4500
645 -4500 -2375 -2292 -3854 -2831 -6558 -2787 1841 -3226 -3225 -3598 -2033 2512 -1590 -1916 -634 -2371 3159
662 3159 2432 -1477 1090 -551 2436 5495 943 -631 2506 4018 3750 3055 1512 1629 3434 4678
678D678m7k930j319L558J383j499k190r72L211j097N29j8n082K979L044l359J235
695B104l578pM567k492p74o45k236L410J95j841o81k028K516J266j251j281j698
712d454K221J883j922k60m34j053L036J745l542r47J708J269J264j756j731K504
728d69o35K009J195m624J402K783L9J97k181O66J727N8J737j790j956K908M73
745C539P99j082k440K694P30j79O12k465j5K660l72r17l10j192J455J244j311
762C450r45r37R11J646j041j626J4p09J952J05k509j56n11J690O56k824M8J68
780f18j93K026j895k159J501k04J428l39k617N64M90Q46P02k249l42J285N90M12
798g72j463q73J363P30K92Mj810O00J991m77J58j071l91K033J98j04k23j374J535
$$ plain form
678 4678 4631 1701 382 3940 5323 3824 1634 662 3873 2776 3305 3287 -1795 1184 4228 869 2104
695 2104 -1474 -1481 3086 594 -180 -825 -3061 349 544 -1297 -1978 -4006 -1490 -224 -1475 -2756 -4454
712 -4454 -2233 -350 -2272 -2532 -2966 -4019 -983 762 -2780 -3727 -2019 -750 514 -1242 -2973 -469
728 -469 -1104 905 2100 -2524 -1122 1661 1700 1897 -284 382 2109 2167 3904 2114 158 3066 3539
745 3539 4338 3256 816 3510 4240 4061 4673 2208 2193 4853 4481 3564 3254 2062 3517 4761 3450
762 3450 2505 1568 2479 4125 3084 1458 1472 763 2715 2820 311 155 -356 1334 1990 -834 -786 -618
780 -618 -811 1215 -680 -2839 -1338 -1542 -114 -453 -3070 -2506 -2016 -1170 -468 -2717 -3059 -1774 -1184 -772
798 -772 -2235 -3108 -1745 -1015 -723 -719 -2529 -1929 62 -415 -257 -1328 -1719 314 512 408 185 -1189 346
817C46J915j518m12m64O87K019j199r4o77m56K248K85j580j97n70J664Q83k252
835F28J78L58p35J575k90j797k16L68J418l02k272L23N69r3K49j146k77m16K60
854a618J584j370k364J510Q94p66j59p09k28Q33R2J45q58j233J742O51o64n35
872c053r76J456P49r76N23l69m82J742O0p60j15l2J437O00p94l20j16J446J67
891A87j017P65m21k64K324m69j660M89P34J84R38j473k84J183L31n79J13m54o32
910eP61J788j984j303J568j61m25J012j668o0Q98m57O92o61j710J192J525j315
928c13j165M29R30o16j9O53j637n92J933jj134m12j96J209J52r14K28n9m25P95
948a154P24q49j208J219J594j414o66J317p13J87J562j272l35J069k69R33p1j554
$$ plain form
817 346 2261 743 331 -133 554 2573 1374 1280 603 147 2395 2680 1100 903 333 1997 2880 628
835 628 806 1164 429 2004 1714 -83 -299 69 1487 1185 -1087 -764 -195 -288 -39 -1185 -1462 -1878 -1618
854 -1618 -34 -1404 -3768 -2258 -1364 -2130 -2289 -2998 -3226 -2393 -2301 -2156 -3014 -4247 -2505 -1854 -2518 -3053
872 -3053 -4029 -2573 -1824 -2800 -2277 -2646 -3128 -1386 -1326 -2086 -2201 -2233 -796 -196 -990 -1310 -1426 20 187
891 187 -830 -65 -486 -750 1574 1105 -555 -66 668 852 1790 317 33 1216 1547 968 1081 627 -5
910 -5 756 2544 560 -743 825 664 239 1251 -417 -477 421 -36 656 -5 -1715 -523 1002 -313
928 -313 -1478 -1049 -119 -735 -754 -101 -1738 -2330 -397 -398 -1532 -1944 -2140 -931 -779 -1693 -1465 -1524 -1949 -1154
948 -1154 -430 -1279 -2487 -1268 326 -1088 -1754 -437 -1150 -963 599 -673 -1008 61 -208 725 654 -900
966i00R18J500l68o76O63Nq30J570L09k183J264Q22r63J412q54j465J544O85j057
985A396N03m78m72Q66K98q60n57M28K47Pk05r96J4R56l74n27K60o67n45J194j12
1006C76j436L29K24M40m59p22M04l48M64N31j317K08k1j04J689r14j454J223L93
1025d94m48M03k44o15N40P45m7r21K54K54M99L57q05j14Q16q4j75R21j173k82
1045f13J841l03m02o0l00N02N93m22k17j74N31K99k46k57n71N94O17n66k37K2
1065F31o05Q45l4m35l06l7M57K93q87o5l28J07M89k05q80J06M86k08N9n99l58
1086a474N61J70J00m73n72J55O70K12n92p01N63M47k9L9r34P46L88k78J75M5q08
1107a590J269Q9l20J00l70L02L41L02n11n0N12K18j03j41m9L00M35j39n8k38J8
$$ plain form
966 -900 18 1518 1150 474 1137 1142 312 1882 2191 8 1272 2094 1131 2543 1689 224 1768 2453 1396
985 1396 1899 1421 949 1815 2113 1253 696 1124 1371 1378 1173 177 191 1147 773 246 506 -161 -706 488 376
1006 376 -1060 -731 -507 -67 -526 -1248 -844 -1192 -728 -197 -1514 -1306 -1327 -1431 258 -656 -2110 -887 -494
1025 -494 -942 -539 -783 -1398 -858 -113 -160 -1081 -827 -573 -74 283 -522 -636 180 96 -79 842 -331 -613
1045 -613 1228 925 523 463 163 665 1258 836 619 445 976 1275 1029 772 201 795 1412 846 609 631
1065 631 26 871 837 402 96 59 516 809 -78 -143 -471 -364 125 -80 -960 -854 -368 -576 -517 -1116 -1474
1086 -1474 -913 -743 -643 -1116 -1688 -1533 -863 -651 -1243 -1944 -1381 -934 -963 -924 -1858 -1112 -724 -1002 -827 -782 -1590
1107 -1590 -321 -232 -552 -452 -822 -520 -179 123 -388 -438 74 292 189 48 -1 299 734 595 537 299 317
1128C17N64M72o40p4K9Q9K82O9n95L04m4m3L96o4n08K63q1l3j55k01j11J19K29
1151E84j59m12P5Q5J4j00l24o9N69o01L51l25n59M39J7K16l43l74K85M56l02k54
1173g31K2Q3K30K05l59J85k16M40J52J1j51j84M57K97k64J53l02n1R02l46k46
1194B87J27J26R5O65n27J25K68j28L87l12k76r5N75QK1n91L70o4K42K7o38J01
1216G93J48L7L24m99l82J28M35m76J74m33K9O05r1n36q6l00M29N6m12Pm6J31J80
1239B15l22k10r4R1L96m42J53m75R2N72k99p9J3k77M24K30k66k58P4J40J33K3
1261a66m3J88K23k58J55m2n20M13L58N1l51J15K79j26K47P3j86q3L20j41j4j41
1283C51j20M95j41or4k80M40j03q7k37J56K42k4j84j13k44MM16j52j73k63K10
$$ plain form
1128 317 881 1353 713 639 668 757 1039 1108 513 817 773 730 1126 1062 554 817 736 703 548 347 236 355 584
1151 584 425 13 88 173 187 87 -237 -306 263 -338 13 -312 -871 -432 -415 -199 -542 -916 -631 -175 -477 -731
1173 -731 -709 -626 -396 -191 -550 -365 -581 -141 11 22 -129 -313 144 441 177 330 28 -23 879 533 287
1194 287 414 540 635 1300 773 898 1166 1038 1425 1113 837 742 1317 1325 1346 755 1125 1061 1303 1330 692 793
1216 793 941 978 1302 803 421 549 984 508 682 249 278 883 792 256 170 -130 299 355 -57 -50 -96 35 215
1239 215 -107 -317 -411 -320 76 -366 -213 -688 -596 -24 -323 -402 -389 -666 -242 -12 -278 -536 -462 -322 -189 -166
1261 -166 -209 -21 202 -56 99 57 -463 -50 308 359 8 123 402 276 523 596 410 327 647 506 492 351
1283 351 231 726 585 579 485 205 645 542 455 218 374 616 592 408 295 51 55 471 319 146 -117 93
1305I3n4o7j76l41O4J60O8j51k16R1j81K10K22n71J10J02j0K33l66M0%J63l5k12
1329h24n6L91J00k02J64p9p3Q0J06RM4l2K4K59k55j9K68K9R4m5J1K1M0K05j62
1354I8K4O2j53M30M8k38j96K39N4q3O2N1k17J70J89j43l06o0J86K74n1l39l81
1377b80M99j74kJ12k54M2p4J27j69O4j20l24L44Q6m05j6L61p1j22j72m0J89o9
1400d68k58J70K34L8K4J89n82L8K84J39j82R3J32k00K49K89o16M00j97K53K69
1421B98l15L08k39L64j4q1k49L52l06O1L50l5k37J56mK63j54l10K98L9j00k36
1443B09K00l66M38Jq1j65J01J07J2j73j45m83P82p4j26J0n92J95L17j66R0k51
1465a60q9J03R9J3l01QJ97l53P6o1r3QN45k91k59L09k8J84r9m8l5n1M4J57j39
$$ plain form
1305 93 39 -28 -204 -545 -481 -321 -253 -404 -620 -529 -710 -500 -278 -849 -739 -637 -647 -414 -780 -740 -740 -577 -612 -824
1329 -824 -880 -489 -389 -591 -427 -506 -579 -499 -393 -384 -340 -372 -348 -89 -344 -363 -95 -66 28 -17 -6 15 55 260 98
1354 98 122 184 31 461 509 271 75 314 368 285 347 398 181 351 540 397 91 31 217 491 440 101 -280
1377 -280 219 45 43 155 -99 -57 -131 -4 -173 -109 -229 -553 -209 -123 -528 -544 -183 -254 -376 -548 -588 -399 -468
1400 -468 -726 -556 -322 -284 -260 -71 -653 -615 -331 -192 -374 -281 -149 -349 -100 189 -427 -27 -224 29 298
1421 298 -17 291 52 416 402 321 72 424 118 179 529 494 257 413 409 672 518 208 506 545 445 209
1443 209 409 43 481 482 401 236 337 444 456 283 138 -345 437 363 237 247 -345 -150 167 1 91 -160
1465 -160 -249 -146 -47 -34 -335 -327 -130 -483 -407 -468 -561 -553 -8 -299 -558 -249 -277 -93 -192 -240 -275 -326 -282 -125 -264
1490b64l9m6J63J44mm13M16K56j6j66QP4%Q1n3l52K04m9K65j8lNJ29%q0J7k93
1517c4L08J64r8l88L00j17M6O9j04n7L5O9j84L08l70l6J40k15J88O1l19O1P0j07
1541b10k51P1M1J37K05l52j2m4k01L47M2o1j27K16k08j4j33J53j38K08k6M5J64
1564a48o9l1R3j66L4KP5j02K44k53o1L93j35J13M0k76n9M63K30l20r5J31J16J24
1588C43k79J00l6q8J2J35k35Q6K99l4k96nL4J63Q2o3k47j9p3K95k6o3l21L39k30
1613a27m5M97m64J01j14N6J13j71j26J88oq8j87M5J76j51J39l8j97K07n1J9j74
1636c98L2R2j9l0K55j8j33J10j3P2j39PQ1J13J45n2l48L25N0j6J81m03K37l5L02
1661C98m02m6L26n2l8P3k33J27J59J33l70L64n2k10K49k02k6O8J33k57M6j26p1
$$ plain form
1490 -264 -303 -349 -186 -42 -46 -459 -43 213 197 31 39 113 113 194 141 -211 -7 -56 209 191 188 193 322 322 242 259 -34
1517 -34 274 438 340 -48 252 135 181 250 146 89 124 193 9 317 -53 -89 51 -164 24 85 -234 -173 -103 -210
1541 -210 -461 -390 -349 -212 -7 -359 -371 -415 -616 -269 -227 -288 -415 -199 -407 -421 -554 -401 -539 -331 -357 -312 -148
1564 -148 -217 -248 -155 -321 -287 -285 -210 -312 -68 -321 -382 11 -124 -11 29 -247 -306 157 387 67 -28 103 219 343
1588 343 64 164 128 40 52 187 -48 38 337 303 7 2 36 199 281 218 -29 -48 -121 174 148 85 -236 103 -127
1613 -127 -172 325 -139 -38 -152 -96 17 -154 -280 -92 -98 -186 -373 -328 -152 -303 -164 -202 -399 -192 -243 -224 -398
1636 -398 -366 -274 -293 -323 -68 -86 -219 -109 -122 -50 -189 -182 -101 12 157 105 -243 82 132 116 297 -106 131 96 398
1661 398 -4 -50 276 224 186 259 26 153 312 445 75 439 387 177 426 224 198 266 399 142 188 62 -9
1684iL07O8k96R2J48r4k63R8k0n7L02j55J19j02k98P1j5K9Q7j42qL52j81j06j2
1709h5K2p1J32J39m11L87k35OO1J2l2j1K8j58K66m9K4k88L61o3m5Pj19L04j19
1734F3j0j76J09K41j7j34K6j2M3R4k42J63q9J88N8m5k02j12L84j0j77J35p4k4
1758A80J01k74L39l78K37k2r6l0l2Q9J10l09J34j93K66j39K0J33j25J58k53K03
1780A19k66K46K05l36j59J00O3j32k6o8J62J63l82L02j50K45R9k26r8J26p7m5
1802a35j54M38k90l9J72N2j37n9L13l56o1L47J0r3J22o7N4m42L62%m5K44j90J47
1826A93l20K60P3j35p4K16j82j39L81l88J56Q8Ro2q7o1J40M4R6j21J49J2l47K2
1850g7j28P3L20%k95P9N5k26M39k51L9j74K56q4p3p5O3O0j47j33%L11j89Q5Oj13
$$ plain form
1684 -9 298 366 70 162 310 216 -47 51 31 -26 276 121 240 138 -160 -89 -104 -75 12 -130 -138 214 33 -73 -85
1709 -85 -63 -134 -2 137 -274 113 -122 -116 -55 -43 -75 -86 -58 -216 50 1 25 -263 98 35 -10 -3 -122 182 63
1734 63 53 -123 -14 227 210 76 102 90 133 227 -15 148 59 247 305 260 58 -54 330 320 143 278 204 180
1758 180 281 7 346 -32 205 183 87 57 25 114 224 -85 49 -144 122 -17 3 136 11 169 -84 119
1780 119 -147 99 304 -32 -191 -91 -28 -160 -186 -254 -92 71 -311 -9 -159 86 185 -41 -139 -13 -90 -135
1802 -135 -289 149 -141 -180 -8 44 -93 -152 161 -195 -256 91 101 8 130 63 117 -325 37 37 -8 236 46 193
1826 193 -127 133 206 71 -3 213 31 -108 273 -115 41 129 138 76 -11 -72 68 112 208 87 236 248 -99 -77
1850 -77 -205 -132 188 188 -107 -28 27 -199 240 -11 28 -146 110 26 -47 -122 -59 1 -146 -279 -279 32 -157 -72 -66 -179
1876a79J06J69j70k14L31J01j33j59R8L3j99K19J84n19N01j51k25K47P5J85l83
1897h3n2m2o8j7O0L88j46j32P3J31K46m17J39KJ24l81K65J02o2o8L7J81K1j02
1921A99J7k81K11k5R7k33K33m03J4M13m3k30r9J03J07o3K6L4j42O7k9K84l44K13
1945A26pk70J27oJ25Oj21J9j46Q1o1k64M83j52j8m2M5n5J13O1j54K23m69L29j28
1970a55Q5j35K54J58j55k28J27J58o3J21j51J49K16l34L51l23j5q4N2Q1k53J09
1992c5r9J83L16j15k40m4J19Q8p9p3K28M8k35K4R3l9K3K2kj9j82J50l94L70K7
2017A35J21l15K20l2j22j42M68m32l3R9j76J90Q6k06L5Q4j02L40k12j67J62j77
2039a76K55l03P6K3j13J89K17j30k41Q8q3M15l52J64J45l92J34n3N1J7j0J61k4
$$ plain form
1876 -179 -73 96 -74 -288 43 144 11 -148 -50 -17 -216 3 187 -332 169 18 -207 40 115 300 -83
1897 -83 -135 -177 -245 -262 -202 186 40 -92 -19 112 358 -59 80 82 206 -175 90 192 130 62 99 280 301 199
1921 199 216 -65 146 121 218 -15 218 -185 -171 242 199 -31 -130 -27 80 17 43 77 -65 2 -27 257 -87 126
1945 126 119 -151 -24 -30 95 101 -20 -1 -147 -66 -127 -391 92 -60 -78 -120 -75 -130 -17 44 -110 113 -356 -27 -155
1970 -155 -70 -205 49 207 52 -176 -49 109 46 167 16 165 381 47 398 75 60 -24 28 109 -144 -35
1992 -35 -134 49 365 250 10 -34 85 173 94 21 249 297 62 86 179 140 163 185 183 164 -18 132 -262 108 135
2017 135 256 -59 161 129 7 -135 333 -99 -132 -33 -209 -19 67 -139 -104 -20 -122 218 6 -161 1 -176
2039 -176 79 -224 -148 -125 -238 -49 168 38 -203 -115 -198 217 -135 29 174 -218 -84 -137 -86 -69 -79 82 58
2062E8j14j90K88k0J61j47QP7j02P9o2j49j3L81j28l58M45j14M7R4j22J63l00
2085a8L80m00N9q3K04qj3J2M8j42j94J80q7K72l39J16j40J39K64l46J19j33N9
2108e1oK73k10q7j00q8k4K80m5j42J63j97L6j95K36J03l05LJ97J75P6j32N1j54
2132a43J01p7k39O22k61l01m5K63j4J93k62q2M34m14K53q5Q3O1l1J91j31K4k52
2155a12N5mo8JL16r5j41L31p1R2l54L8j06J74j65J84q2j49J65k14L68l37K91k32
2179a15Q6k58J89J40M1k20J94j34O1P4q7k4J38k00k58L23M3J66k54J9j45L7J25
2202e9j58J7L09l46K23n2k81K14J57m39M07j1Rl93M87%R6k96R0M5L1J17j40L5
2226F2J78j19n0O1m7l0P1n3M9O2l3P8J86j15m05M14k96L0MQK6O2j21k1J5R1j03
$$ plain form
2062 58 -56 -246 42 22 183 36 44 121 19 98 36 -113 -126 255 127 -231 214 100 147 241 119 282 -18
2085 -18 362 -38 21 -62 142 134 121 133 181 39 -155 25 -62 210 -129 -13 -153 -14 250 -96 23 -110 -51
2108 -51 -57 216 6 -81 -181 -269 -293 -13 -58 -200 -37 -234 -198 -393 -157 -54 -359 -356 -159 16 92 -40 11 -143
2132 -143 -42 -119 -358 264 3 -298 -343 -80 -94 99 -163 -245 189 -225 28 -57 26 87 56 247 116 140 -112
2155 -112 -57 -61 -129 -128 188 93 -48 283 212 304 -50 -12 -118 56 -109 75 -7 -156 9 -205 163 -174 117 -115
2179 -115 -29 -287 -98 42 83 -137 57 -77 -16 58 -29 -53 85 -115 -373 -50 -7 159 -95 -76 -221 -184 -59
2202 -59 -217 -200 109 -237 -14 -66 -347 -133 24 -415 -8 -19 -10 -403 84 84 180 -116 -26 19 50 167 27 62
2226 62 240 121 71 132 85 55 126 73 122 184 151 229 415 300 -105 309 13 43 47 55 81 143 22 1 16 107 4
2253Dl1J33n93M61Q1K2k73R3J51l37J54q9J21J72l64J41M3k4n7K27j41J5J22k41
2277b10r5K82j53J17J22J15j79P3p8l21M07kj47n4J64k54R3P9Q4J1K7j74J4R2
2301A3J77j50R4o1K0J7j40J41o3N9j39p4J0J99L47m13L8K9l7K1R6j39j33J80n3
2326C9p6N6N1L9j90l3O9o1J64l9j74j43J3K19P9j71R7j00J2l02J83J12r9j2J68
2351i9n7p6J03j60J31q5K78j34m8k4J20k9n0j43K1K0J21j08K77j80k6j92n1N02
2375A11l09J96L9j1J85m53K40M9J15r3q3K2j98K11N1K57n7j59j2L24l86j42J22
2398A9J90n1j15J91l52L23j29m9J14L1jl87K26j65L0J77ok99j48M09J09k41m7
2421a71J59k58J48j41L16l41K70k50K11j16J02k14J15N0j10M36m17J0KJ14K6j53
$$ plain form
2253 4 -27 106 -487 -26 55 77 -196 -103 48 -289 -135 -224 -103 69 -295 -154 -111 -135 -192 35 -106 -91 31 -210
2277 -210 -305 -23 -176 -59 63 178 -1 72 -6 -327 80 78 -69 -123 41 -213 -120 -41 43 54 81 -93 -79 13
2301 13 190 40 134 73 93 110 -30 111 48 107 -32 -106 -96 103 450 37 75 104 67 88 184 45 -88 92 39
2326 39 -37 19 70 109 -81 -114 -45 -106 58 19 -155 -298 -285 -66 13 -158 -61 -161 -149 -451 -268 -156 -255 -267 -99
2351 -99 -156 -232 -129 -289 -158 -243 35 -99 -147 -171 -51 -80 -130 -273 -252 -232 -111 -219 58 -122 -148 -340 -391 111
2375 111 -198 -2 37 26 211 -242 -2 47 162 69 -14 8 -190 21 72 329 272 113 101 425 39 -103 19
2398 19 209 158 43 234 -118 205 76 27 141 172 171 -216 10 -155 -125 52 46 -253 -401 8 117 -124 -171
2421 -171 -12 -270 -122 -263 53 -288 -18 -268 -57 -173 -71 -285 -170 -120 -230 206 -211 -201 -199 -85 -59 -212
2443b12K78j37j3jj17K44j4j56p1J50Q5j1l00N78k67P9J72J5k99K49m3K2j05m1
2467H5R1J0J55k22J39j19O3j08J04J47j05j54J34k84J71J00k33K48N7k45J21k30
2489g5m4J5rnQ2J19m02L37P5k01J14j18J23J25j65M4J0o5k10j2j03M33j67K01
2513A02j47P7Jp7J15j99OM0k41L44L2Jk35K11j10Q4J92k24J67j76j65K03J04j8
2537H7k68J89L5J56k5j95J98k68J75Q5Oj86J93j80K04p6l39J70J66j70J64j04
2559A7o9J22P2M8j20k6p1N1j38K08p7j4j31Q4q8q4j3O5R5Qj52l4p2l2lJ43m5J29
2587a27J9k5LQ7J31K60l46j46N1K14l31J97K3J88j06l6j56j51K18Q8k7M8k45K89
2611A20k19J86J37Mm36L56j59J19j71K15R1j09J83j91k21J42J98l5j39j13J10
$$ plain form
2443 -212 66 -71 -84 -85 -202 42 28 -128 -199 -49 36 25 -275 303 36 115 287 302 3 252 209 231 126 85
2467 85 176 186 341 119 258 139 202 94 198 345 240 86 220 -64 107 207 -26 222 279 34 155 -75
2489 -75 -119 -104 -113 -118 -36 83 -319 18 93 -108 6 -112 11 136 -29 15 25 -40 -250 -262 -365 68 -99 102
2513 102 -45 32 33 -44 71 -128 -122 -82 -323 21 53 54 -181 30 -80 4 196 -28 139 -37 -202 1 105 87
2537 87 -181 8 43 199 174 -21 177 -91 84 169 175 -11 182 2 206 130 -209 -39 127 -43 121 17
2559 17 -52 70 142 190 70 44 -27 24 -114 94 17 3 -128 -44 -132 -216 -229 -164 -69 -61 -213 -247 -319 -351 -354 -211 -256 -127
2587 -127 -108 -133 -130 -43 88 348 2 -144 -93 121 -210 -13 10 198 92 56 -100 -251 -33 55 28 76 -169 120
2611 120 -99 87 224 228 -208 148 -11 108 -63 152 243 134 317 126 -95 47 245 210 71 -42 68
2632F8j45p4J02L05l41J52n3K4j8l01M30m8l05k9J4J07J84j99K47l36J53q5o8
2655b16J51j56J98jl2J04J37j35j81K1R9n4j2J06q8O3k2M1J51p0J05k16k04J6
2679a95R6R1l2K85oj15j01K56M35o67J37%K9k41J29K21j26k50K16N7k23j12L56
2702B40j83m9J10Q0Mk26K4K12j58J3N0N0j76J74k57l2o7N4J55J55k19K7k89K43
2726f5j35K66j58O1n8J93j39j38J93l3j5k10L18lj31M2j32Q9n2j37J84K0K3J64
2750A47k0m5J0j3j17o5K58j60K48k16j71M17l21J08J56j50O0j74j2K25o2J91l85
2773i1M2J89j8k7r4J7J74j06j8j97j23K52k24L85j97l2K52k89k4K07P4l3m49K69
2797f1r0K87l42K21o0k88M97l75n6J32k38L34l08R7Q9J0j16J33J59q0o4Ol2N8
$$ plain form
2632 68 -77 -151 -49 256 -85 67 14 38 20 -281 149 101 -204 -233 -219 -112 72 -127 120 -216 -63 -148 -216
2655 -216 -65 -221 -23 -24 -56 48 185 50 -131 -110 -11 -65 -77 29 -59 4 -18 23 174 104 209 -7 -211 -195
2679 -195 -99 -8 -40 245 239 124 23 279 714 47 184 184 213 -28 101 322 196 -54 162 219 -4 -116 240
2702 240 57 8 118 198 202 -24 0 212 54 67 117 167 -9 165 -92 -124 -191 -137 18 173 -46 -19 -308 -65
2726 -65 -200 66 -92 -31 -89 104 -35 -173 20 -13 -28 -238 80 77 -54 -12 -144 -55 -107 -244 -60 -40 -17 147
2750 147 127 82 92 79 -38 -103 155 -5 243 27 -144 273 -48 60 216 66 126 -48 -60 165 103 294 -91
2773 -91 -49 140 122 95 1 18 192 86 68 -129 -252 0 -224 161 -36 -68 184 -105 -129 78 152 119 -330 -61
2797 -61 -151 136 -206 15 -45 -333 164 -211 -267 -135 -373 -39 -347 -250 -161 -151 -267 -134 25 -55 -119 -113 -145 -87
2821h7j68J90J20m5J1k27J97j30K33q9o7K05K12l85J60J42k07k30K22L8j39J33
2843H9K1k06K48l1l4J0n0M2J33m5K7q4j99M6J85p8j2n5j29N6J77O1j37k48K10
2868cl7J29k27J07k14K71kp5r5J19j6M3q2j57k0L31nk85K30l0q0Q5Q6m8O7o5j75
2895a48M4j7J53j32J6qk8NJ54p3J90j51J71k64N06l76j03K18k68K16J27j03l51
2918b22M04j74L45o6o4O1k30M1L4r8J44k13J10J66j19j13J67o9l89M62j91j3J01
2941G4R6l13M4J84m2p3j51J30kq3p7L0K84k41J25j46l3J65J3K0pl20M13l06L29
2966A13j77n3K9J31j55nK13p7o5J56l59L61k20k2Ro1K62J1j7j51M8P2l26M67j00
2991H4r9J43m7o0N2J14k01k3J17O3j04jQ5k86P6L2n3J56L0J12k44L0j65L18P5
$$ plain form
2821 -87 -255 -65 55 10 21 -206 -9 -139 94 5 -62 143 355 -30 130 272 65 -165 57 95 -44 89
2843 89 110 -96 152 121 87 97 47 89 222 177 204 120 -79 -33 152 74 62 7 -122 -66 111 172 35 -213 -3
2868 -3 -40 89 -138 -31 -245 26 24 -51 -146 -27 -43 0 -82 -239 -259 72 67 -218 12 -18 -98 -13 73 25 92 27 -148
2895 -148 -104 -121 32 -100 -84 -92 -120 -115 39 -34 156 5 176 -88 418 42 -61 157 -111 105 232 129 -222
2918 -222 182 8 353 287 223 284 54 95 129 31 175 -38 72 238 119 6 173 104 -285 177 -14 -27 74
2941 74 170 -143 -99 85 43 -30 -181 -51 -53 -136 -213 -183 101 -140 -15 -161 -194 -29 -16 4 -3 -323 90 -216 113
2966 113 -64 -117 -88 43 -112 -117 96 19 -46 110 -249 112 -108 -130 -121 -182 80 91 74 -77 -29 43 -283 184 84
2991 84 -15 128 81 21 73 187 -14 -37 80 143 39 38 123 -163 -87 -55 -108 48 78 190 -54 -24 -189 129 204
3016B04j27j86k5L60k19Kmj46J44p1P4o9Q5r1Kl2K01m44K00N3Nj9K75l09j4n4
3042b05L53k54J87o8l7K20m04K97j02Q2o8Mk0L20n40L38p8q9J44J88L1j08j40
3065E1k2Q9j98L00k82J19Q2k3k90K83k3l60L55m8J15n9k3q4j25L19j46J56j20
3088F6R9j52K46j63l32L17j21q7J55K28l58q7K40j49M1N7j53P6J33j46L3j2n0
3111a19R0O0J49l13R9J51j67J5LJ47j94j4N2l9j4J25J08o8N2j83J06q4j47j3J81
3136a7rL15l05J43P5k67J14Q0R7j85L9k41L19j56P6J11k26R7N8l48K42L6J68J7
3160B33K8n54K07p1K16j33o8K30k2M7k15p5L6N5M1K8o0Nj7P5J88j47J05j09p5
3185e2K89l05J9rJ48l73R0L08k31p5r8J23N2l6K14q1m8j69N0J56r3K10k24j4J73
$$ plain form
3016 204 77 -109 -134 226 7 9 5 -141 3 -68 6 -63 22 -69 -67 -99 102 -342 -142 -89 -84 -103 172 -137 -151 -205
3042 -205 148 -106 81 13 -24 196 -208 89 -13 69 1 5 -15 305 -235 103 25 -64 80 268 299 191 51
3065 51 29 118 -80 220 -62 57 139 116 -174 109 86 -274 81 33 148 89 66 -18 -143 176 30 186 66
3088 66 165 13 259 96 -236 81 -40 -127 28 256 -102 -189 51 -98 -57 0 -153 -77 56 -90 -57 -69 -119
3111 -119 -29 31 180 -133 -34 117 -50 -35 -32 115 -79 -93 -41 -80 -94 31 139 71 123 -60 46 -38 -185 -198 -17
3136 -17 -26 289 -16 127 202 -65 49 129 226 41 80 -161 158 2 78 189 -37 60 118 -230 12 48 216 233
3160 233 261 -293 -86 -157 59 -74 -142 88 66 113 -102 -177 -141 -86 -45 -17 -77 -72 -89 -14 174 27 132 23 -52
3185 -52 237 -68 -49 -58 90 -283 -193 115 -116 -191 -289 -166 -114 -150 64 -17 -65 -234 -184 -28 -121 89 -135 -149 24
3210B4j59L69m64L52p9p7Q8%J96l57L11k91R9L16l35L15k02L91o28K16k19L96
3232B62j34p7k95K67J51r0j93K29j76j6pr1K57j75N0jj04L4N4M7J84l42J10k20
3256b76K05j31K02lj75J07r0j9K93l11J74K0k07M1o7L99j78m5l39O1K81k03M28
3279A67j99J04k20J17J42j99K82j54l0m6m1o0K38j49R2k4J00j3j61J11n6j70L16
3302A47j80P1L19k49j29n2Q7J11j25n5K06r6J04k86K42j69j7J97j91L3l06L51
3324A3J17m4n6L05q8l19K77l75O5K76l43J63J5j77K44Nj11l10K71k5K10j67K34
3347A80k53J9p0k69M21j31Q9M44m58j02J61k1n6K30k06km4n3p8J34J28Q4j00J54
3371B01jk36J1k9p4K89Q1j92L4k9Nr6J88k34k05L53j68K11K8k36J8l2J71m6k55
$$ plain form
3210 24 -135 234 -230 122 43 -34 54 54 250 -107 204 -87 12 328 -7 308 106 497 -131 85 -134 262
3232 262 128 51 -244 23 174 84 -109 120 -56 -72 -79 -170 87 -88 -38 -39 -143 -109 -55 -8 176 -166 -56 -276
3256 -276 -71 -202 0 -3 -178 -71 -161 -180 113 -198 -24 -4 -211 -170 -237 162 -16 -61 -400 -339 -58 -261 167
3279 167 -32 72 -148 -31 111 -88 194 40 10 -36 -77 -137 101 -48 44 20 120 107 -54 57 1 -169 147
3302 147 -33 38 357 108 -21 -73 14 125 0 -55 151 55 159 -127 115 -54 -71 126 -65 -32 -338 13
3324 13 130 86 30 335 247 -72 205 -170 -105 171 -172 -9 6 -171 73 78 -33 -343 -72 -97 113 -54 180
3347 180 -73 -54 -124 -393 28 -103 -14 430 -28 -130 31 10 -46 184 -22 -24 -68 -121 -199 -65 63 147 47 201
3371 201 200 -36 -25 -54 -128 161 242 50 84 55 60 -36 152 -82 -287 66 -102 109 137 -99 -81 -113 58 12 -243
3396b43P5J23n9Pq8L53j19j22j07p3r8K07J52j14N7J45j29J3p9K1J18j21j06L16
3420A29p5k27M99n36n2M48k21k7K7M3n3L0J87j83n8J38R4k15j3L55j89l10J71
3443c8K55j29k07J09M1rJ6O8p5m4j21L69k15J55k36rJ34K39k66j36K50r9j04J10
3467E8nj19Q1r8k17K88K20j10R7r8l94M5q7K18P4M5K1k64K27k82L29ro2n8J51
3492E1o2O7j81J86n2O3l02j5N27m99J10J77O8m4l2k88L1J73j83M8O9K22k81pQ5
3517f9k12N69k42K10l46J86K5k25J19J60k01o1J35r3J83p8QJ30qj64n7P0J19j80
3541b2k3r7NJ58q3K63p0p1k47J67L0J49r4j69o9J56K11l09J66k73L42l5j03Lk13
3566b28K28k24j15K63J35m15K72J03j91l8J32J26n0J8J42r9m5J01j66K12j38N
$$ plain form
3396 -243 -168 -45 -104 -97 -185 168 49 -73 -180 -253 -351 -144 8 -106 -49 96 -33 -20 -99 -78 40 -81 -187 129
3420 129 54 -173 326 -210 -262 186 -35 -62 -35 8 -45 -15 172 -11 -69 69 163 -52 -65 290 101 -209 -38
3443 -38 217 88 -119 -10 31 22 38 106 31 -13 -134 235 20 175 -61 -70 64 303 37 -99 151 52 -52 58
3467 58 53 -66 15 -83 -300 -12 208 98 195 97 -297 -252 -339 -121 -47 -2 19 -245 -18 -300 29 20 -42 -100 51
3492 51 -11 56 -125 61 9 72 -230 -245 282 -217 -107 70 138 94 62 -226 -195 -22 -205 -157 -88 134 -147 -154 -69
3517 -69 -281 288 46 256 -90 96 121 -104 15 175 -26 -87 48 -45 138 60 68 198 190 26 -31 39 158 -22
3541 -22 -45 -142 -137 21 -62 201 131 60 -187 -20 10 159 65 -104 -173 -17 194 -115 51 -222 120 85 -18 -15 -228
3566 -228 0 -224 -339 -76 59 -356 -84 19 -172 -210 -78 48 -2 16 158 59 14 115 -51 161 23 28
3588B8q4J31%qL0J54j87k02j87K36M8K02O6m31J59o0J60rJ28j59K9j62O9o5l7
3613a51K28O9J3k91N5j4J25L3K65k88q7N8K0J43j98p1J33l23L89j98L8j51k9L65
3637A33k87Q8O2o3L5N9l4J14j18NJ28k02K9K43l5j31j94K60o3j63J04m9J50o2
3661IK07l10R9J18j02j49J56R0j45l2K51j83k5J45j18k03J66L06j48Ll91K64J30
3684A38j54J22m0j36J50k45J47J02n9j23L2J60p0M2m0o1k81L07k9j41L61k88J52
3707D6n1J8j57ro8J87j2k49M78j63j81M1P8P0l74M90Nk29K39k29P8rM3j68L3n8
3733a51L56l76K09r1J6J12J47j9k82LL0J36j59O9M1J05p5L6N1j04p7M5N8j87K24
3758A17j83RK03k81J94l3j85r6K16k1j68K86O3k00m9P2L46m32J05n4J10J48k5
$$ plain form
3588 28 -56 75 75 67 97 251 64 -138 -325 -89 -41 161 227 -204 -45 -105 55 46 174 15 44 -118 -49 -114 -151
3613 -151 77 146 159 -132 -77 -91 34 67 332 44 -43 15 35 178 -20 -91 42 -281 108 -90 -52 -203 -232 133
3637 133 -154 -66 -4 -67 -32 27 -7 107 -11 -6 122 -80 -51 192 157 26 -168 92 29 -134 -30 -79 71 9
3661 9 216 -94 5 123 21 -128 28 118 -27 -59 192 9 -16 129 11 -192 -26 280 132 135 -256 8 138
3684 138 -16 106 66 -70 80 -165 -18 84 25 -98 -66 94 24 66 26 -35 -316 -9 -38 -179 182 -106 46
3707 46 -5 13 -144 -153 -221 -34 -46 -295 183 20 -161 -120 -42 28 -346 144 149 -80 159 -70 8 -1 42 -126 -93 -151
3733 -151 205 -171 38 -53 -37 75 222 203 -79 -76 -46 90 -69 0 41 146 71 107 158 54 -23 22 80 -107 117
3758 117 -66 -57 146 -135 59 26 -159 -255 -39 -60 -228 58 121 -79 -128 -56 290 -142 -37 -91 19 167 142
3781A42J01k36r6j6K30j14J8m6K18l24P4k74J39K72J7k9l61K32J36j10n3q7J57
3804a0O3R7Ok27J90l53L23k8m1k11K25m7r0j5N8l8L65l41L08j81l42J81K9O9L0
$$ plain form
3781 142 243 7 -89 -105 125 11 29 -17 201 -123 -49 -323 -184 88 105 76 -285 -53 83 -27 -80 -167 -10
3804 -10 53 150 156 -71 119 -234 89 61 20 -191 34 -13 -103 -118 -60 -98 267 -74 234 53 -289 -108 -79 -10 20
$$ [...]
8191i1
##END NTUPLES=NMR FID
##END=
