##TITLE=1H_AADA-NCS
 CDCl3
 8 sc, 
 29.06.2022
##JCAMPDX= 6.0         $$ Bruker NMR JCAMP-DX V2.0
##DATA TYPE= NMR FID
##DATA CLASS= NTUPLES
##ORIGIN= UXNMR, Bruker Analytische Messtechnik GmbH
##OWNER= root
$$ XWIN-NMR		Version 3.5
$$ Wed Jun 29 15:05:48 2022 Russian Standard Time (UT+4h)  she@DPX200
##.OBSERVE FREQUENCY= 200.1313499994
##.OBSERVE NUCLEUS= ^1H
##.DELAY= (6, 6)
##.ACQUISITION MODE= SIMULTANEOUS
##.ACQUISITION SCHEME= undefined
##.AVERAGES= 8
##.DIGITISER RES= 18
##SPECTROMETER/DATA SYSTEM= spect
##.PULSE SEQUENCE= zg30
##.SOLVENT NAME= CDCl3
##.SHIFT REFERENCE= (INTERNAL, CDCl3, 0, 15.7039)
##AUDIT TRAIL= $$ (NUMBER, WHEN, WHO, WHERE, WHAT)
$$ ##TITLE= Audit trail, XWIN-NMR		Version 3.5
$$ ##JCAMPDX= 5.01
$$ ##ORIGIN= Bruker BioSpin GmbH
$$ ##OWNER= she
$$ F:/spectra/data/she/nmr/H-F/1/audita.txt
$$ ##AUDIT TRAIL=  $$ (NUMBER, WHEN, WHO, WHERE, WHAT)
(   1,<2022-06-29 15:04:18.51 +0400>,<she>,<DPX200>,
      <created by zg, POWCHK disabled, PULCHK disabled
       configuration hash MD5:
       00 E9 B6 7A A2 85 ED C7 34 08 36 98 17 FE 4E 26
       data hash MD5: 16K
       87 20 E6 B4 A6 AF F4 B7 E1 94 22 9E 48 FE 68 87>)
$$ ##END=
$$ 
$$ hash MD5
$$ 89 73 11 90 A9 87 ED 3F 10 46 41 91 76 C7 23 8F
##$RELAX= 
##$RELAX= 
##$RELAX= 
##$RELAX= 
##$RELAX= 
##$RELAX= 
$$ Bruker specific parameters
$$ --------------------------
##$DU= <F:/spectra>
##$EXPNO= 1
##$NAME= <H-F>
##$PROCNO= 1
##$TYPE= <nmr>
##$USER= <she>
##$AMP= (0..31)
100 100 100 100 100 100 100 100 100 100 100 100 100 100 100 100 100 100 
100 100 100 100 100 100 100 100 100 100 100 100 100 100 
##$AQSEQ= 0
##$AQ_mod= 1
##$AUNM= <au_zg>
##$AUTOPOS= <>
##$BF1= 200.13
##$BF2= 200.13
##$BF3= 200.13
##$BF4= 200.13
##$BF5= 200.13
##$BF6= 200.13
##$BF7= 200.13
##$BF8= 200.13
##$BYTORDA= 1
##$CFDGTYP= 0
##$CFRGTYP= 5
##$CHEMSTR= <none>
##$CNST= (0..31)
1 1 145 1 1 1 1 1 1 1 1 1 1 1 1 1 1 1 1 1 1 1 1 1 1 1 1 1 1 1 1 1 
##$CPDPRG= <>
##$CPDPRG1= <>
##$CPDPRG2= <>
##$CPDPRG3= <>
##$CPDPRG4= <mlev>
##$CPDPRG5= <mlev>
##$CPDPRG6= <mlev>
##$CPDPRG7= <mlev>
##$CPDPRG8= <mlev>
##$CPDPRGB= <>
##$CPDPRGT= <>
##$D= (0..31)
0 1.2 0 0 0 0 0 0 0 0.06 0 0.03 0 0 0 0 0.0002 0 0 0 0 0 0 0 0 0 0 0 0 
0 0 0 
##$DATE= 1656500657
##$DBL= (0..7)
120 120 120 120 120 120 120 120 
##$DBP= (0..7)
150 150 150 150 150 150 150 150 
##$DBP07= 0
##$DBPNAM0= <>
##$DBPNAM1= <>
##$DBPNAM2= <>
##$DBPNAM3= <>
##$DBPNAM4= <>
##$DBPNAM5= <>
##$DBPNAM6= <>
##$DBPNAM7= <>
##$DBPOAL= (0..7)
0.5 0.5 0.5 0.5 0.5 0.5 0.5 0.5 
##$DBPOFFS= (0..7)
0 0 0 0 0 0 0 0 
##$DE= 6
##$DECBNUC= <off>
##$DECIM= 32
##$DECNUC= <off>
##$DECSTAT= 4
##$DIGMOD= 1
##$DIGTYP= 9
##$DL= (0..7)
0 120 120 120 120 120 120 120 
##$DP= (0..7)
150 150 150 150 150 150 150 150 
##$DP07= 0
##$DPNAME0= <>
##$DPNAME1= <>
##$DPNAME2= <>
##$DPNAME3= <>
##$DPNAME4= <>
##$DPNAME5= <>
##$DPNAME6= <>
##$DPNAME7= <>
##$DPOAL= (0..7)
0.5 0.5 0.5 0.5 0.5 0.5 0.5 0.5 
##$DPOFFS= (0..7)
0 0 0 0 0 0 0 0 
##$DQDMODE= 0
##$DR= 18
##$DS= 0
##$DSLIST= <SSSSSSSSSSSSSSS>
$$ [...]
##$SUBNAM2= <"">
##$SUBNAM3= <"">
##$SUBNAM4= <"">
##$SUBNAM5= <"">
##$SUBNAM6= <"">
##$SUBNAM7= <"">
##$SUBNAM8= <"">
##$SUBNAM9= <"">
##$SW= 18.0517283424941
##$SWIBOX= (0..15)
0 0 2 0 0 0 0 0 0 0 0 0 0 0 0 0 
##$SW_h= 3612.71676300578
##$TD= 16384
##$TD0= 1
##$TE= 0
##$TE2= 300
##$TE3= 300
##$TEG= 300
##$TL= (0..7)
0 120 120 120 120 120 120 120 
##$TP= (0..7)
150 150 150 150 150 150 150 150 
##$TP07= 0
##$TPNAME0= <>
##$TPNAME1= <>
##$TPNAME2= <>
##$TPNAME3= <>
##$TPNAME4= <>
##$TPNAME5= <>
##$TPNAME6= <>
##$TPNAME7= <>
##$TPOAL= (0..7)
0.5 0.5 0.5 0.5 0.5 0.5 0.5 0.5 
##$TPOFFS= (0..7)
0 0 0 0 0 0 0 0 
##$TUNHIN= 0
##$TUNHOUT= 0
##$TUNXOUT= 0
##$USERA1= <user>
##$USERA2= <user>
##$USERA3= <user>
##$USERA4= <user>
##$USERA5= <user>
##$V9= 5
##$VALIST= <valist>
##$VCLIST= <CCCCCCCCCCCCCCC>
##$VD= 0
##$VDLIST= <DDDDDDDDDDDDDDD>
##$VPLIST= <PPPPPPPPPPPPPPP>
##$VTLIST= <TTTTTTTTTTTTTTT>
##$WBST= 1024
##$WBSW= 4
##$XGAIN= (0..3)
0 0 0 0 
##$XL= 0
##$YL= 0
##$YMAX_a= 498869
##$YMIN_a= -709016
##$ZGOPTNS= <>
##$ZL1= 120
##$ZL2= 120
##$ZL3= 120
##$ZL4= 120
##$ABSF1= 10
##$ABSF2= 0
##$ABSG= 5
##$ABSL= 3
##$ALPHA= 0
##$AQORDER= 0
##$ASSFAC= 0
##$ASSFACI= 0
##$ASSFACX= 0
##$ASSWID= 0
##$AUNMP= <proc_1d>
##$AZFE= 0.1
##$AZFW= 0.1
##$BCFW= 1
##$BC_mod= 2
##$BYTORDP= 1
##$COROFFS= 0
##$CY= 11.3945322036743
##$DATMOD= 1
##$DC= 2
##$DFILT= <>
##$DTYPP= 0
##$F1P= 2.36226072786647
##$F2P= -0.459571619588291
##$FCOR= 0.5
##$FTSIZE= 0
##$FT_mod= 4
##$GAMMA= 1
##$GB= 0.15
##$INTBC= 1
##$INTSCL= 1
##$ISEN= 128
##$LB= 0.24
##$LEV0= 0
##$LPBIN= 0
##$MAXI= 10000
##$MC2= 0
##$MEAN= 0
##$ME_mod= 0
##$MI= 1.114404
##$NCOEF= 0
##$NC_proc= 0
##$NLEV= 6
##$NOISF1= 3.799351
##$NOISF2= 2.8
##$NSP= 1
##$NTH_PI= 0
##$NZP= 0
##$OFFSET= 15.70392
##$PC= 1
##$PHC0= -18048.22
##$PHC1= 15.60069
##$PH_mod= 1
##$PKNL= yes
##$PPARMOD= 0
##$PSCAL= 0
##$PSIGN= 0
##$REVERSE= no
##$SF= 200.130013532006
##$SI= 16384
##$SIGF1= 3
##$SIGF2= 2
##$SINO= 400
##$SIOLD= 16384
##$SREGLST= <1H.CDCl3>
##$SSB= 0
##$STSI= 0
##$STSR= 0
##$SW_p= 3612.71676300578
##$SYMM= 0
##$S_DEV= 0
##$TDeff= 0
##$TDoff= 0
##$TI= <>
##$TILT= no
##$TM1= 0
##$TM2= 0
##$TOPLEV= 0
##$USERP1= <user>
##$USERP2= <user>
##$USERP3= <user>
##$USERP4= <user>
##$USERP5= <user>
##$WDW= 1
##$XDIM= 8192
##$YMAX_p= 0
##$YMIN_p= 0
$$ End of Bruker specific parameters
$$ ---------------------------------
##NTUPLES= NMR FID
##VAR_NAME=  TIME,          FID/REAL,        FID/IMAG
##SYMBOL=    X,             R,               I
##VAR_TYPE=  INDEPENDENT,   DEPENDENT,       DEPENDENT
##VAR_FORM=  AFFN,          ASDF,            ASDF
##VAR_DIM=   8192,          8192,            8192
##UNITS=     SECONDS,       ARBITRARY UNITS, ARBITRARY UNITS
##FACTOR=    0.0002768,     1,               1
##FIRST=     0,             0,               0
##LAST=      2.2672688,     0,               0
##MIN=       0,             -709016,         0
##MAX=       2.2672688,     498869,          0
$$ Real data points
##PAGE= N=1
##DATA TABLE= (X++(R..R)), XYDATA
0@%%%%%%%%%Lj1J6j6K4l2M0n4O2p2Q9j11J34j59J89k18K53k98L46l98M60n27O00
32C20o83P73q75R88j110J246j398J560j736J933k148K378k631K912l216L545l908
49b050M308m744N227n762O352p013P758q599R560j0669J1966j3510J5384j7710
63i502K0688k4666L0280l8859N3766q6957K96247j50472n60558K70552M70540
74B71059K27810k67025l05527r0717K35067K43968j2888l73668l12835J43180
84b41576N08154K04574l69522m93428j5111L64862K51000j17188k44116r8173
94b50524J16730J80915O1602j62813k29571k729L02092K56246j20637l27597p9414
105b55700K39405K01706o7233j59602k1319J08405R4123K405q4244j11788k5859
$$ y = [0, 0, 0, 0, 0, 0, 0, 0, 0, 0, 3, -8, 8, -8, 16, -16, 24, -30, 32, -40, 49, -62, 72, -87, 102, -116, 137, -161, 185, -213, 247, -280, 320, -363, 410, -465, 523, -587, 659, -739, 821, -915, 1018, -1130, 1248, -1383, 1529, -1687, 1858, -2050, 2258, -2486, 2741, -3021, 3331, -3682, 4076, -4523, 5037, -5632, 6334, -7176, 8208, -9502, 11186, -13480, 16800, -22059, 31707, -55250, 240997, 90525, -470033, -199481, 271059, 498869, 231844, -73683, -164400, 70667, 314635, 301747, -71921, -384756, -241576, 266578, 471152, 101630, -391798, -406909, -42047, 208953, 91765, -152351, -250524, -133794, 47121, 108723, -54090, -283661, -286390, 15702, 271948, 151311, -176286, -255700, -16295, 185411, 118178, -41424, -62743, 45662, 139785, 142190, 57946, -53842, -79701]
116g9701J35688J60516m8444k20998q1142J66912J40854j05957j86272m095J49930
127B7291Q6898n8991j11324p3051l077Q5293J12641j2061j56152q3288J34594
138e1227J63158o1167k00878m9339J61454J54891p453j05674q4565j7534O3683
149c4651J20326N7063r7702j28412M3454J70813M3167j54369j30569N9727J48154
160I7001O3175m7355q8102q2980k9875P8401J23647M601j41164r2387Q6208J19401
172I0571l3152j29907n1101O2229Q0242L9937o742p3904j10948j6791J36997J33847
184A21278m8377j55579l6906J15447Q7781m0989q3769k6650L4383P0365P2941
195A09925o885j26083j15103O2304J80898N9148j38745j34567M2220J28183L6617
$$ y = [-79701, 55987, 216503, 168059, -52939, -134081, 32831, 173685, 67728, -118544, -122639, 27291, 114189, 55198, -56126, -129177, -132254, -46961, 65680, 53619, -102533, -185821, -51227, 111931, 50764, -150114, -199453, -37999, 116892, 109439, 3765, -80800, -98334, -34651, 85675, 142738, 45036, -83376, -39922, 130891, 174058, 19689, -110880, -51153, 97001, 160176, 112821, 24719, -58261, -88136, -9735, 113912, 118513, -22651, -115038, -28830, 90571, 57419, -72488, -123589, -61360, 18882, 58819, 52077, -21827, -132775, -149566, -12569, 121278, 72901, -82678, -119584, -4137, 83644, 42655, -41114, -67764, -33381, 36984, 109925, 103040, -23043, -138146, -75842, 105056, 164204, 25459, -109108, -66888, 61295, 97912]
206I7912p4281q2672k2460N0280R6284M8289q9429j52377j9312J59247J27459
217A38940p9761j65695j9782J30080Q7687m9223r6948l7634M2416Q8864O3763
228A02707m4511j28891n3279J15556J40600l4507j60410n2399J24117J15173m3130
239H1026j21245m6004N5327Q5784M3153m3272j05907n3152Q7398J30090j5904
250I7294j58267p9456J18993J49743k6768j56312p9831P1579J17509M3823n9824
261C8483j06461m6504Q3780J33166M685j56141j13655R9003J89522K3758j66632
272a6996j31920N3690J47081P0545n8893j15073n7933O6225J33479L8799j29378
283c74j43784M3093J88431Q2652j31798j64339N953J38322R2752l6414j03396
$$ y = [97912, 23631, -59041, -81501, -31221, 65063, 113352, 23923, -128454, -147766, 11481, 138940, 59179, -106516, -126298, 3782, 91469, 42246, -54702, -92336, -49920, 38944, 102707, 58196, -70695, -123974, -8418, 132182, 97675, -62735, -115134, 8983, 124156, 81026, -40219, -86223, -30896, 54888, 98041, 54769, -51138, -104290, -16892, 113198, 97294, -60973, -140429, -21436, 128307, 101539, -54773, -134604, -63025, 54484, 98307, 38483, -67978, -114482, -30702, 102464, 107149, -48992, -162647, -63644, 125878, 149636, -16996, -148916, -95226, 51855, 122400, 63507, -51566, -109499, -43274, 90205, 129004, -374, -144158, -101065, 87366, 170018, 38220, -126119, -120166, 18156, 110908, 74494, -28902]
294b8902o7547L1705J09545O7594p4932j42446k0904J43355J19400o7143j54779
305h5054l6775J05053R6631j1508p6775n8147N320O8738P0916j7313j03402n8365
317a00681P9197J16698q078j16112n8634O5548Q1930m28n2823l5890k389K5904
329e758M4630J6113n0830o4447J6873Q3877K7553p0673o2324L0814O2609L295
341C1732l7966j6268M119M66J2399K7986k770m8214k3824M7816N1551k3492n6761
354c3226q86M5962J5421k2417p944Q312r787r535K7675L0573k7220n4543M973
367c2642O0705K3220m4171l9250J4806K7895K701k511l61k2353k6534K3988N6925
380D2418j01p2444m1666N2938P0423r548o4385k7644K8161L5511J6547n466l5272
$$ y = [-28902, -96449, -64744, 44801, 112395, 37463, -104983, -125887, 17468, 136868, 69725, -85054, -121829, -16776, 79855, 68347, -8428, -66575, -61255, 7483, 78399, 61086, -42316, -100681, -21484, 95214, 87136, -28976, -87610, -22062, 59868, 59440, 6617, -29273, -31662, -5758, 38872, 54985, 4155, -60292, -43419, 40458, 68011, -2662, -64986, -34172, 28437, 31732, -6234, -22502, -18383, -17917, -5518, 22468, 19698, -28516, -52340, -4524, 47027, 23535, -33226, -34112, 11850, 27271, 4854, -3090, 5222, -4565, -14100, 13575, 44148, 16928, -37615, -32642, 28063, 51283, 7112, -32138, -17332, 10563, 13264, 10753, 10392, -11961, -38495, -14507, 42418, 42317, -30127, -71793, -18855, 51568, 42020, -22365, -50009, -21848, 13663, 30210, 24744, -10528]
393a0528m1060J6720P6115L4850o9870q3702K4057R9049L5229o8563p1523Q812
405e0414N9288M1398n541m8349n4691L939Q0846O2141n3200j09040j3218J05539
417A8698P8348n2383j03023k0010P0751O7412o12n7952o1253k187P5946P4340
429H8075l1927j12369m3501R2962J05821k5690j17211n1230O7960Q7726P889o5349
441C156o5863l764O8528P4995j5297j05225o4325P1609J20446N606j15774p8832
453a04740N5014J05915K5125o9262p4867n413O7095P6747j488r3833p9698M7239
465e2166J26152L9123j02680j05713K8306J14280N0273o2373q6730j8021N8631
476a0918P4773J3378p4002q7433J0584J07699O6353o8159j12891r317R7036O9221
$$ y = [-10528, -51588, -34868, 41247, 76097, 6227, -77475, -53418, 45631, 80860, 12297, -59226, -50414, 8874, 50272, 44731, -3618, -58309, -54370, 26476, 88617, 35417, -73623, -86841, 18698, 97046, 44663, -58360, -78370, -7619, 59793, 59181, 1229, -60024, -62211, 13735, 88075, 56148, -56221, -99722, -6760, 99061, 73371, -43840, -95070, -27110, 60616, 68505, 3156, -62707, -66471, 2057, 77052, 61755, -43470, -107795, -36186, 84260, 89866, -25908, -104740, -49726, 56189, 81314, 12052, -62815, -68228, -1133, 75614, 74126, -19707, -99405, -52166, 73986, 113109, 10429, -95284, -66978, 47302, 97575, 35202, -51528, -69549, -10918, 63855, 77233, 3231, -84202, -73618, 34081, 100434, 32275, -80616, -89933, 7103, 76324]
488G6324l7776q1364k9558M0019O1524K5696l8974p1105j9059P0041P6195k0913
500E1050r0141l5000O4361P0480j1385o1523k8473K4985M0040K1534j1625m1239
512f936l0890K6220N8232R879n6888m3733K9769N2838k579m6548k2572J9099K1878
525G769L364n240j3276k2746l858L0264K3317k1097l3943Q253L6576M824l1813
538a7606j5946K0983K1390j849m415M061p259j4269R685K8607N301k4819j0562
551f698K2234J7068j5780k1189L895J4473J394r13P149q239l0299j0565L1362
564C892K7934k0050l9856l077L0344J6714j5339k3205r989M957K1376K8102l263
577A8540m7524l4183L5346O5419P378n8756m1241K9519N7791J8850l3331m4712
$$ y = [76324, 38548, -42816, -72374, -32355, 29169, 54865, 15891, -55214, -74273, -4232, 71963, 51050, -39091, -74091, -9730, 60750, 49365, -12158, -40631, -15646, 24394, 45928, 34303, -6936, -37826, -11606, 46626, 56505, -383, -44116, -14347, 38491, 35912, -10636, -33208, -14109, 7769, 11133, 5893, -7383, -30129, -33987, -3723, 19594, -1503, -35446, -27193, 9383, 14207, -17606, -33552, -12569, 8821, 6972, 2557, 6618, -641, -14910, -5225, 23382, 28683, 3864, -6698, 15536, 32604, 16824, -4365, -470, 14003, 15397, 14484, 21633, 13394, -16905, -27470, 3892, 31826, 11776, -28080, -31157, -813, 15901, 562, -22643, -32632, -27675, -6299, 21803, 18540, -28984, -63167, -27821, 37598, 44976, -13780, -55021, -25502, 32289, 51139, 17808, -26904]
589b6904j2201L6101N8206J6655n8134p0372J1928Q5428M5547n5978q1892l323
601e4939P1521N4085k4228p2486m5549K6507P5704M5129m6816r4591k6008P9759
613a1912Q1395k5109r3998l7999O2404P9006K679o9538o1879J0154P4471O5366
625G5040j7444q6645n1851N2963R0578P868p8983n3747M1576P6797J4616n8032
637A2736n9556l55N5348N5183k925o4091n4527K4592P1951J8852o2050n3587K9220
650b9209O8565J3369n6270n3920O121N0750M0382p660m8462l9289K0479O1022
662B5878J8966n5562n4233K8115P7652K4011n9378o3078Q254O1703M3269j4499
674D1098n0939l4453K1900O0610K5944n2068o8452R480Q1514M7175m8752p9865
$$ y = [-26904, -39105, -3004, 55202, 71857, 13723, -56649, -44721, 40707, 86254, 30276, -51616, -54939, 16582, 70667, 46439, -26047, -71596, -45089, 30615, 75744, 28928, -65663, -91671, -11912, 69483, 44374, -49624, -87623, -25219, 53787, 56466, -13072, -74951, -64797, 9674, 75040, 57596, -29049, -80900, -27937, 62641, 70509, -8474, -62221, -20645, 56152, 70768, 12736, -46820, -47175, 8173, 63356, 60431, -3660, -58187, -33595, 38356, 57208, -4842, -58429, -29209, 39356, 52725, -3545, -57465, -51344, -594, 39788, 32128, -16334, -55623, -35144, 25878, 44844, -10718, -64951, -36836, 40816, 64827, 5449, -57629, -49375, 12328, 55597, 41098, -9841, -44294, -22394, 38216, 64160, 12092, -56360, -46880, 34634, 81809, 33057, -46808]
686d6808j4498N7221N4296m801n0028m2986O653N3529M1606k9176p3959k4891
698g3842O1838P0126j0678p1994m1417L0852N5545J8949k6441l9225j3891K9744
710a0434M7948Q025n0443m8812K0030O6284K9439l7910n0243o129L0375K6482
722B4612L083j6430k2960o470K4027K8248j1007m4705k0625L1885M1455J545l1079
735A579k5203k954J1392J7568J4374o824k5485r431K3642K2042j6029l2814j390
748b9533L1526K5284m595k1554j9217o673J3916K8738J3555k1651k8586O418L1359
761A8987N904l0157k0838J8075L1577P096j9219k3709j0855R550K4753J4577j6720
774I021k8967N68L1079J2246l1040l1008J4998M2074J3737k7614l1468m772K1999
$$ y = [-46808, -61306, -4085, 50211, 45410, -4618, -47604, -40951, 12578, 54184, 25008, -48951, -73842, -12004, 58122, 47444, -24550, -65967, -35115, 20430, 39379, 12938, -26287, -40178, -10434, 37514, 45539, -4904, -53716, -33686, 32598, 62037, 24127, -26116, -32245, -1870, 24612, 27695, 11265, -11695, -18165, 5862, 34110, 23103, -21602, -42227, -10342, 31113, 32658, 1579, -23624, -26578, -15186, 2382, 16756, 9932, -15553, -24984, -1342, 20700, 4671, -28143, -29533, 1993, 27277, 22682, 1128, -18089, -24762, -10846, 17892, 31447, 9796, -18790, -12372, 18987, 24891, -5266, -26104, -8029, 23548, 30644, 11425, -12284, -23139, -13589, 11164, 25741, 9021, -19946, -19378, 11701, 23947, -7093, -38101, -23103, 18971, 32708, 5094, -26374, -31146, -9147]
787i147K5369L792k3448k5784Q733M1245J8751l8071m7454J1231N8700L1526l3012
800B2431n2403r570L7697M0747J001m0133l9677J1482N6996L4423m0217p1680
812d8903j2859O8449O1187k2624p3610l5629L9052O1646J4126m8012n8152j460
824e6789O3310N7758k1475q3308m2584N3665Q3414R523o9420n7847K0706O6935
836B3888L4735l3704o1524k0808M8923O8703O689o9730o4657K2117Q0865L7313
848G2810m7575o5504m697N2456M0968j5763n1177l0263K4972N5688K2536m3420
860A1031o2182m759N8960M5327k3368n4862j4776L6423L5182o311l4780k2038
872c6153J4633L8357K1453k2681m4380j1360L9399L9975j0651m2068j4642K8663
$$ y = [-9147, 16222, 20014, -3434, -29218, -20485, 20760, 39511, 1440, -46014, -34783, 23917, 55443, 22431, -29972, -39542, -1845, 38902, 39903, -230, -39907, -28425, 28571, 62994, 22777, -48903, -61762, 6687, 67874, 45250, -28360, -63989, -24937, 36709, 50835, 2823, -55329, -56789, 6521, 64279, 42804, -40504, -83088, -29423, 53991, 63514, -5906, -63753, -43047, 23888, 58623, 24919, -36605, -57413, -8490, 60213, 66902, -2828, -67485, -45368, 35497, 72810, 25235, -40269, -44966, 7490, 48458, 32695, -18482, -48745, -23773, 31915, 54451, 11031, -51151, -55910, 3050, 48377, 25009, -29853, -44629, -8206, 26976, 20665, -14115, -36153, -21520, 16837, 38290, 15609, -28771, -40131, -732, 39243, 28592, -13476, -28118, 545]
884E45K8747o894k9334j5590J3365K7067J3925j6104l2965j3021K5914L3803l907
897B5551l6341j9285K1596K9634j687k7615j8979Q640K3424J5933p430k6058j8295
910c0912J3943L3274R908k6689k7838Q488L1352J3635j6747k3202n657J4432K0795
923A4782R101j4006k6169o945K4820K6802o640l1225j4426J7844K5196M371j7258
936F247k0917o854J5026K5629Q355k4550l0790K465L3636K0852j8310l2545o496
949b8252K3245K5338K065k3405k7118j713L1189L2285p931m2327k3959K6118M2568
962B8103N229l5868k9120J0008L5214K1092j4835l7065j9542K4495M4789J0826
974D3326m0878m3145J0376M9909K4608l0089m4041m320L5504L2447o297l8144
$$ y = [545, 29292, 22398, -6936, -22526, -9161, 17906, 31831, 15727, -17238, -30259, -4345, 29458, 25551, -10790, -30075, -8479, 21155, 19468, -8147, -27126, -18486, 4938, 20871, 13441, -12617, -30912, -16969, 16305, 26213, -476, -28314, -19826, 11526, 25161, 8414, -14788, -20445, -6013, 14782, 23883, 9877, -16292, -23237, 1583, 28385, 21745, -9480, -23906, -6062, 19134, 23505, 6247, -14670, -21524, -6498, 19131, 27486, 2936, -27854, -25389, 8247, 29099, 10789, -21756, -28252, -5007, 20331, 22396, -1009, -28127, -29840, 1349, 33634, 25703, -16624, -40583, -14465, 28103, 33332, -2536, -31656, -21648, 13566, 34658, 19823, -17242, -36784, -12289, 32500, 43326, 2448, -40697, -30321, 19588, 44196, 14107, -29934, -34254, 1250, 33697, 27400, -10744]
986a0744k9471J4737M6269K2837l2617n0196l398M9522L7600k1461n0038j4700
998d1660L5206L9836n45l7791l3171R889M4852K8818k5140n2449j3137M6074M6645
1011D7427j3607n5110k5558L3840M8186M699m0953l8849O523M5429L3732k0598
1023B5161n4327k2013M1922N4655l219n7235l7932K8591N6637J5231m0436m5575
1035c8540j04M4182L9286j1348n1936l1391K9948N7361J1636m9790m8088J4170
1047c4614N5533K6832l0941m7885j0344L6132M0421Q3m2053l7271J4370N1114
1059B1377K4750l4530m9983j531M7106L4650j8173m4036j6871K6369L7051P909
1071C4088l0142l5199J788L9605K9790j8794m4815j3038L4434L5850o999l6880
$$ y = [-10744, -40215, -25478, 20791, 43628, 11011, -39185, -42583, 6939, 44539, 23078, -26960, -41660, -6454, 33382, 32837, -4954, -38125, -28236, 16616, 45434, 20294, -32155, -45292, 782, 47427, 33820, -21290, -46848, -13008, 35178, 39877, -1076, -39925, -33402, 12027, 45759, 25161, -29166, -51179, -9257, 45398, 42179, -15056, -52988, -24397, 32240, 47471, 7035, -38540, -38644, 5538, 44824, 33476, -18460, -49851, -19903, 37458, 49094, -696, -48784, -34614, 20919, 47751, 16810, -31075, -41419, -5287, 35134, 35217, -6836, -44107, -29737, 21377, 46127, 11597, -38386, -39917, 7189, 41839, 23666, -20370, -37241, -10872, 26179, 34088, 3946, -31253, -29465, 10140, 39930, 21136, -23679, -36717, -2283, 33567, 26568, -10312]
1083a0312k0452J6178L0462J1130j8097k8995p620K5332K9370l911l4293k0970
1095c2178J9031L3474M618k5977k2122O118K2191J3842o548k0307j3654J0350
1107a1162K5628R814k0722k5853K682K6737J6249j2475k2204n683J2499J5214
1119A0724N073j0453j7420n241J6721K0877l178k4771j4774J3816K3384M448j6375
1132B831j6540j053J2915J5265K773j6169j9822K327K5241J6206j5169k7425m819
1145b3439K2203K0882l917k0759j4773M775K0625J6000q345k6956j2723K0979
1157e448L0189m04l0633k1220J4375L0026R548j9378k4198l430K0577K3306j294
1170B2016k7910k2471J3386L4835J1175k8620l2042N172L3868J9169j6962l0138
$$ y = [-10312, -30764, -14586, 15876, 27006, 8909, -20086, -27706, -2374, 26996, 23085, -11208, -32178, -13147, 20327, 24945, -1032, -23154, -17036, 5155, 18997, 12449, -7858, -21512, -11162, 14466, 24280, 3558, -22295, -19613, 7124, 23373, 10898, -11306, -16989, -4490, 10724, 15797, 5344, -12076, -17317, -596, 20281, 17103, -7668, -22442, -8626, 14758, 19206, 2831, -13709, -14762, -1847, 13418, 16191, 22, -19800, -17473, 7768, 23974, 8805, -18620, -23439, -1236, 19646, 15729, -5030, -19803, -15028, 5597, 21597, 13252, -13704, -26427, -5448, 24741, 24337, -6296, -27516, -13141, 16885, 26433, 7055, -17143, -20573, 4, 23310, 22016, -5894, -28365, -14979, 19856, 31031, 2411, -29631, -24459, 9409, 28578, 11616, -18522]
1182a8522q637K0964K6488J745k7012k5773R361L6927J8468k5445l7998j540L6777
1195E803K7916j4001l5395j3508K2249L1382M555k8585l0007N866L9069K5378
1207D0722k2640m5060j1199L7310L8284q261m2389k4261K1130L9025J1181k9555
1219D287l8150j854M0843L6316j4163n0627k5043L2054M9152N901m2124l6465
1231c9873J1874M3885K3349k2468m2387j4104L3434M4063K101m4477l8178J5519
1243b7262M9187K1668l0011m2145l474L5467L0863q085l7133k4755J6295M0154
1255B0769J7166k7974l9974l413L6299K9085j3205l5780j3468K1825K8366K833
1267B2529k4121k3488K527K6862K1016r671k9685j1765K0137K5005k010k3763
$$ y = [-18522, -27159, -6195, 20293, 22038, -4974, -30747, -21386, 15541, 34009, 8564, -29434, -30974, 5803, 33719, 19718, -15677, -29185, -6936, 24446, 29001, 416, -29591, -23725, 15344, 40722, 18082, -26978, -38177, -867, 37417, 29156, -13233, -37494, -16364, 22661, 33842, 4287, -33863, -35717, 5126, 41442, 27279, -23348, -48391, -16337, 32815, 38716, -3408, -39873, -27999, 15886, 39235, 16767, -25620, -39724, -6290, 37773, 39874, -4603, -42781, -27262, 21925, 43593, 13582, -28563, -32037, 3430, 34293, 26208, -10925, -35680, -19385, 20769, 37935, 9961, -30013, -33426, 2873, 31958, 18753, -17027, -30495, -8670, 19696, 22529, -1592, -25080, -22553, 4309, 25325, 15654, -14031, -25796, -5659, 19346, 17336, -6427]
1279f427j2572J2943K0210L750j4458j5762j103J4557J5520j081j7288j2064Q936
1292d839J6559N59j5829j0234R501J5311K436j1970j2732j993Q840J1851K946
1305A0406j1095j1727K163J3688N336j1529j2588M322J6460Q480p031j4216p226
1318a4557N193J4255J0691m647j6385o952J1793J5475j953j7660r054J0841J7982
1331A5022M938j3121j8771o689J2766K2355O296j9325k3176N83K3514J5513j2808
1344G097k4420n521J9665K1936j10k3469k3281K368K9545K4758r193l3677j7062
1357c1364K0925L2390L786k8308k4245R514L1549J7986j5324l3796j4673K2742
1369h818L6585P026l1628l2498O808L6561J8939k1267l4275n805K8132K8468l713
$$ y = [-6427, -18999, -6056, 14154, 17904, 3446, -12316, -13419, 1138, 16658, 15577, -1711, -13775, -4839, 11720, 12279, -3550, -13784, -4283, 11028, 13464, 1494, -11238, -13231, -4391, 7460, 10406, -689, -12416, -10253, 3435, 8771, -2758, -15346, -11024, 5436, 13916, 6885, -7331, -14557, -9364, 4891, 15582, 10935, -5450, -12402, -609, 14866, 12913, -4747, -13801, -2960, 15022, 19960, 6839, -11932, -18621, -5855, 16500, 22796, 3471, -19705, -19122, 4392, 19905, 7097, -17323, -22844, -3179, 18757, 18647, -4822, -28103, -25735, 3810, 28568, 19375, -14302, -31364, -10439, 21951, 25737, -2571, -26816, -17302, 14247, 32233, 16909, -16887, -31560, -8818, 27767, 34793, 3165, -29333, -22525, 14036, 32975, 11708, -22567, -28372, -240, 28228, 24515]
1382B4515l1732k5610R584L4673J9252k0108l4280n150K9612K5202j1027l1659
1394a6728j2625K1220K8908M439k3828k4904J397K6475K0394j0228k7365q555
1406b1400K2331K3617p516k8481j3418J8583K6969M108k1508k1937J382K1718
1418D448J6270r667k3907p047K1212K3063p792l1733j5711K0286L1308N329k4941
1431A118k4713K127K4566J7571r664k6156j0032K2116K9027k246l3195k5005J5320
1444a9166L6822J5401k1491l0783n829K3417K4349k246k6008j8691J2582L1470
1456A9827J1446k5553l2724p76L2064K5868q255l0657j6812J2361K4628R090j5844
1469D663k3204j700K2686K0519q109k7987j4281J6248K6181O556j7676j9416j066
$$ y = [24515, -7217, -32827, -23243, 11430, 30682, 10574, -23706, -28856, 756, 25958, 14931, -16728, -29353, -8133, 20775, 25214, 1386, -23518, -22121, 4354, 24748, 14520, -12845, -21400, 931, 24548, 17032, -11449, -24867, -6284, 20685, 24793, 3285, -18652, -17270, 4448, 20718, 11051, -12856, -19903, 1309, 24372, 16580, -15153, -30864, -10578, 20730, 26059, 1118, -23595, -21468, 3098, 20669, 11005, -15151, -25183, -3067, 25960, 23714, -9481, -34486, -19166, 17656, 33057, 11566, -19217, -25046, -1629, 22720, 20474, -5534, -24225, -11643, 19827, 31273, 5720, -27004, -27780, 4284, 30152, 21897, -8760, -25572, -13211, 11417, 20507, 4663, -18541, -20241, 2445, 22964, 14855, -13132, -27413, -11165, 15016, 21572, 3896, -15520, -16586]
1482a6586J5549J4666j791j5108j1421P081J7960P773j3975j6919j278J4966J2476
1495A3393j523j1932q422J271Q831P603k778j1240n790P449J2137J051j1366j0276
1509a1592K310J0136O879j248p069o618Q02P759N377m482r242n21J0080Q406n282
1524E695j1594m730P320R602K747n571p375j823O321O446l538r966j964J0504
1538B074J0210l515j5279p645Q263J3432L445q869j0992J32J0738P994n006j5167
1552a0185m855J5031J7614k891k0846j4374Q906K2061Q702j3924j8656k157J6874
1565A300J6757n328k2628j3565J5532K7166N816k4229k6193L972K8523J9300j2552
1578A3871k7565j1320J9457K6189K220k5985k4072Q274L1973J7929j9269l3166
$$ y = [-16586, -1037, 13629, 11838, -3270, -14691, -7610, 10350, 18123, 4148, -12771, -14049, 917, 13393, 11870, -62, -8484, -7213, 1618, 9221, 6443, -4797, -10587, -3138, 8999, 10050, -1316, -11592, -9282, 854, 7733, 6485, -584, -7202, -6400, 1359, 6736, 2254, -6988, -7509, 2571, 10977, 5695, -5899, -10629, -3309, 6293, 9040, 3469, -3906, -5729, 592, 7038, 3500, -6466, -8430, 2074, 12284, 8769, -6510, -14155, -5892, 7540, 10985, 2116, -8876, -8744, 1994, 9988, 4982, -10185, -15040, -9, 17605, 14714, -6132, -20506, -11600, 10461, 19163, 5239, -13417, -15574, 1300, 18057, 12729, -9899, -23464, -7932, 19234, 25050, 821, -25372, -21400, 7123, 26423, 13871, -13694, -25014, -5557, 20632, 22852, -3133, -27205, -18931, 13042, 30971, 11702, -21464]
1590b1464p329K6643K8276m024k8958k0039J2061K9378J2195j9977k9057l601
1602b5896K7493K5796p429l1584j6972J7338K9533O020k3218k3093L854K4825
1614F667J7025j0712k6194j0614J8016K5384J942k4159j9205P995K5045R370j6112
1627D448k0415q62J9068J6010o349k0518j0874J2006K0598M584j7420j7343M429
1640a2638J9719J0073j2343j7773j186J5531J3676l481j6401j0778P783J7248
1652I430O401j2605j6123L46J6468J1122q521j5988m493J1953J3530J46j3461
1665a795j1688L008J4542R364o972j4987n003J1826J2986j626j3222r003O319
1678f251J3038M688p380j1354l459Q880J1563J169j0709j0371K876J2315N743
$$ y = [-21464, -28793, -2150, 26126, 22102, -6856, -26895, -14834, 14544, 26739, 6762, -22295, -25896, 1597, 27393, 19964, -11620, -28592, -11254, 18279, 24299, 1081, -22012, -18158, 6667, 23692, 12980, -13214, -23828, -5812, 19572, 21514, -2645, -21850, -13855, 11190, 20560, 4448, -15967, -16829, 2239, 18249, 11900, -8618, -19492, -7486, 13112, 17696, 276, -17067, -12638, 7081, 17154, 4811, -12962, -14148, 1383, 15059, 11578, -4823, -15601, -7818, 9430, 15831, 3226, -12897, -12551, 3917, 15039, 6518, -9470, -13963, -2010, 11520, 11666, -1795, -13483, -10475, 4067, 13431, 6459, -8528, -13531, -1705, 11281, 9655, -3567, -12570, -6251, 6787, 11475, 4095, -7259, -10718, -1838, 9725, 10894, 185, -10186, -7310, 5005, 10748]
1691A0748o259j0570k964P470Q960J018q427q328n65R694R328l018j2021o573
1705a1507O304J1346L402q398r502o15Q653R270q17j0745q725M097J3550P256
1719A3569r238j4312j424J2542J1429l164j2902q841O276J3541O116r474j4858
1732a0740k156J4081J3732m362j7759q877J0583J7301K546j4576j4301K337J6421
1745D230J1490p219j8210q209J3644J8584J018j8549j5543P681K1097Q365j3300
1758E079j9374k442J7471J6677l404k0500j2710J0423K2361O899j7796k1027K292
1771a6051K2453J5491j0560k3529q075J7051K1023L89k0790j7644N938K4033J2246
1784B1975j4206k4787l792K1218K0279n918k4209j2973J3059K3086N741j7677
$$ y = [10748, 4489, -6081, -9045, -1575, 7385, 8403, -24, -8352, -8917, 777, 10105, 7087, -4934, -11507, -5203, 6143, 9545, 1147, -8355, -8970, -317, 8953, 8136, -2609, -11334, -7237, 6313, 13569, 4331, -9981, -11405, 1137, 12566, 9402, -3500, -12341, -6065, 7476, 13592, 4118, -10740, -12896, 1185, 14917, 10555, -7204, -16081, -5498, 11803, 14349, -227, -14528, -12191, 4230, 15720, 8501, -9709, -17918, -4274, 14310, 15328, -3221, -18764, -11083, 10014, 18379, 5079, -14295, -16737, 734, 17411, 14007, -6493, -19203, -8780, 13581, 20480, 2684, -18343, -16051, 6402, 21893, 11333, -12196, -20271, -3220, 17803, 18192, -2598, -20242, -14304, 9729, 21975, 7769, -17018, -20810, 408, 20687, 14769, -9440, -22413, -9354, 13732, 19473, 1796]
1796A796k0714J210K1620J6956q542k3519j0160J6745K2237P22k0837j6788P905
1809a1369K1153R961j2477j9606l937J6215J7663k932k0186j2570J0426K0543
1821A2884M414j6568j7198L085J7832J1015q007j7947n793J2375J5866N23j6154
1834c673j2968O492J8265P821j2424j6663l95J5729J2383m991j5540p497R226
1847d235J4606L277j2122j3574J741J5077J0916p105j6887n192J0524J4045P34
1860A1805j2829j0302K327J2589Q061o303j3464n420R595J3898J674j3325j1118
1873a2812K852J3101Q122n310j1593n243P162J1582K930r855j1570J426J2030
1886B822J0247m242j4033p151P248J2800M479q266j2188k070J0287J0839j679
$$ y = [1796, -18918, -17708, 3912, 20868, 12326, -11193, -21353, -4608, 17629, 18351, -2486, -19274, -11369, 9784, 19745, 7268, -12338, -16275, -60, 17603, 14671, -5515, -18085, -7659, 12884, 17298, 730, -16468, -13383, 4449, 15464, 7457, -10490, -16283, -3908, 11958, 12481, -3673, -16641, -10149, 8116, 15937, 3513, -13150, -13545, 2184, 14567, 9576, -5964, -13461, -4235, 10371, 13648, 1526, -12048, -10307, 4770, 15686, 8581, -8306, -13498, -2974, 11071, 11805, -1024, -11326, -8999, 3590, 11651, 5348, -8116, -13536, -3941, 9957, 11631, -1694, -12812, -9960, 3141, 11263, 5953, -5640, -10883, -3721, 7861, 10791, 936, -10634, -9208, 2822, 13069, 8827, -5206, -12357, -5109, 7691, 12170, 3904, -8284, -10354, -67, 10772, 9093]
1899I093j2978r145O244J4822N870j0090j4313k811J2204J1958m28j2331j0363
1912a2268L577J4367P023q675j4400k617J3439J3036k991j5401r566O707J5089
1925G320O000j0141j2629j041J2050J0999m643j5131o578J0619J5582P25j4324
1938a192j1944M137J4934P209q174j3439k636J2180J1247l617j5936p998R897
1951e332J7092K717j5203j4203L273J7217Q574q750j6556l251J4173J5197k933
1964A2015j8975j1692J0036K1477O269j5918j9255O95J9735J4797q788k0952q142
1977a8698J5874K0703J43k0708j9077O418K4573J4052j3681k4737n616J8887K0692
1990A8825l134k3004j4476J1024K4005R450j7836k4321k186K2195K0852m321k4094
$$ y = [9093, -3885, -13030, -6786, 8036, 13906, 3816, -10497, -13308, -1104, 10854, 10426, -1905, -12268, -8691, 5676, 12699, 4024, -10376, -12993, 446, 13482, 10491, -4910, -14476, -7769, 7320, 13320, 3179, -9450, -10491, 1559, 12558, 7915, -7216, -13794, -3175, 12407, 13132, -1192, -13136, -8999, 5935, 13144, 4970, -8469, -11105, 1075, 12322, 8705, -7231, -15229, -5332, 11760, 14477, -726, -14929, -11656, 5561, 14135, 5385, -11171, -14422, -249, 14948, 12015, -6960, -18652, -8616, 12861, 19130, 3212, -16043, -15348, 4387, 19184, 10396, -10556, -18698, -2824, 17879, 18022, -2686, -21763, -15345, 9228, 23280, 9599, -15138, -20754, -1867, 18825, 15691, -7313, -21789, -10765, 13240, 22690, 4854, -19467, -21653, 542, 21394, 17073, -7021]
2003g021j4543J1777K3076N824j7062j9448K153K1138J4838q103k2507j1184J3411
2016g651K1637M961j6409j7354J952J6960J0606q657j5902m529J3102J4361l88
2029A2689j5663j2010N157J4683Q018p423j2576k438R657Q337l207r730l965O629
2043a842R295J096q289q273O60Q536O437l012p716k453N129N678k052o657k905
2058f368M763O525J583n470o559j90O228M698j329o507k270M211O205k34o932
2073a646n367K348Q135M041l450p064m660M410P472K019n539o274M79P921N042
2088G867m126r530m409P236R828L586p414j0928j810Q577R772m13j0932p098M985
2103d809J2540M391j0182j2787j802J2930J3639j137j5612j1755M016J5907Q462
$$ y = [-7021, -21564, -9787, 13289, 19113, 2051, -17397, -15244, 5894, 20732, 12629, -9878, -21062, -7651, 13986, 18947, 2538, -14816, -12864, 4096, 14702, 6045, -9857, -14386, -1284, 13077, 12689, -2974, -14984, -9827, 4856, 12874, 5451, -7125, -9563, 94, 8431, 5224, -4506, -8471, -1842, 7453, 8549, 260, -8013, -7353, 1183, 7620, 4608, -3108, -5561, -432, 5246, 3194, -3463, -6368, -1605, 4920, 6503, 1033, -5526, -5716, 512, 5210, 3881, -2626, -4896, -685, 5520, 5286, -1646, -7013, -4665, 3470, 7511, 4061, -3003, -7663, -3253, 4219, 6238, 699, -5575, -5096, 2825, 7867, 3741, -5789, -10198, -2962, 6866, 10452, 3038, -7890, -9700, -1123, 8649, 8236, -2696, -9794, -4809, 7731, 12122, 1940, -10847, -12649, 281, 13920, 12783, -2829, -14584, -10568, 5339, 13801]
2116A3801q286j5229l238J3153J3442l031j6435j1342P851J8926Q520j1597j8868
2129a2333m868J5451J6104r50j7463j1571Q494J7505N607j3576j6989j08J7400
2142B703J4745m725j8325j1623R589J7563N076j3564j4521K180J5976R710q240
2155F544j6923m856J2538J5313O82j5035j2394M829J5580O720r538j3526o88J3733
2169B979R863n424j4902o212J0381J3816J337j2189j1156L707J4002O213r782
2182B633j3630l87J4238J0917n881j5607o876R866J5142K494j3844j1860L734
2195i061J5067Q106r159j6024k880J4428J4908l203j7424j0993P999J6710O228
2208A4702j0967j5948m88J4983J2381n221j7026q661J0811J7572L449j4402j5177
$$ y = [13801, 5515, -9714, -12952, 201, 13643, 10612, -5823, -17165, -9314, 9612, 18132, 6535, -12333, -17201, -1750, 14354, 13404, -4059, -15630, -7136, 10369, 15976, 2400, -14589, -14697, 2703, 17448, 12723, -5602, -17225, -7636, 9927, 15003, 1439, -13082, -10902, 5074, 14784, 6544, -10379, -15235, -2697, 12616, 13298, -1737, -14131, -9302, 6278, 12998, 3460, -10066, -10754, 2979, 12842, 7418, -7484, -13696, -3315, 10501, 11838, -351, -11507, -7800, 6202, 12415, 2633, -10997, -11384, 2854, 13771, 7890, -7717, -14593, -4727, 10415, 12909, -935, -12795, -9061, 6006, 14112, 4953, -11071, -13951, 477, 15385, 12182, -5242, -16235, -8236, 8474, 14702, 3735, -12213, -12701, 2282, 14663, 9442, -7584, -16245, -5434, 12138, 15587, 1185, -13992]
2221a3992M44J5883J1879n389j5303p123R735J3970K219j2935j2918L049J5159
2234D678J0094p073j5070o195R194J3067K676j0780j0203J509J1434O784n385
2247D730j1041m110P796J0764J243r396q855J215R491N910k532q131m414M444
2261b886P797J609n985o792R33P251N332k542p904l675L958O668K457m975n912
2276d666m0N140M826j828o536l341M397O477J382n735o076J152O635M023k810
2291C000o488k433M881O405K48o848n725K893Q369L713n540q085j839P941P013
2306G505j499r020n753M829J0082K824q319r720N84J0764Q343m735j1564n430
2320a1109Q008J1534J345j0708j0312L345J3196P414p396j4167l845J1570J3072
$$ y = [-13992, -13548, 2335, 14214, 8825, -6478, -13601, -3866, 10104, 12323, -612, -13530, -10481, 4678, 14772, 7699, -7371, -13566, -4372, 8695, 11371, 591, -9612, -8103, 3331, 10115, 4730, -6311, -10421, -2625, 8139, 9382, -14, -8869, -7654, 1837, 7747, 5215, -2916, -7330, -2886, 4911, 6520, 535, -6257, -5324, 1927, 7259, 4717, -3187, -6862, -2904, 3764, 6221, 1246, -4666, -4706, 434, 5260, 3432, -3104, -6445, -2048, 4429, 5811, 76, -6000, -4848, 1787, 5810, 3000, -3488, -5921, -1040, 5365, 5613, -1235, -6960, -4067, 4302, 8015, 2475, -5610, -7449, 492, 7505, 6006, -3014, -8767, -3938, 6144, 8968, 649, -9071, -8487, 2277, 10620, 5885, -5679, -11109, -3101, 8433, 9778, -930, -11242, -7897, 5299, 12713, 5317, -8850, -12695, -1125, 11947]
2333A1947r23j3637j0569N929J4850N830j0286j4148j304J3591J1984l388j6166
2346f290q863R051J6252M152j3422j3837J645J4774J0520o140j5571o165J0985
2359b909J4826O53j4579j1385L953J5978Q356r445j5511k764J2808J2309k320
2372I970j3864r569O948J4730M468j0699j3285L02J3759R959n630j4141n790R974
2386b868J3266Q7j2351r178L915J3065O272q565j2346j875J1311J0349k991j2172
2400d081p053P276J1675K094r745r674Q58J1567P505n346j0666m521Q084J0630
2414H603rr739p568L074J0059N295o749r169k091Q866P005m10q937o446M953P645
2430D382L687o425p879k73P344O505k539p658m540M547O653K562n859n994J36
$$ y = [11947, 11024, -2613, -13182, -7253, 7597, 13427, 3141, -11007, -12311, 1280, 13264, 9876, -6290, -15153, -6102, 10150, 14302, 880, -12957, -11312, 3462, 13982, 7842, -7729, -13894, -2909, 11917, 12570, -2009, -13394, -9441, 6537, 14893, 5448, -10063, -12827, -19, 12290, 9970, -3894, -13463, -6515, 8215, 12683, 1984, -11301, -10999, 2760, 12719, 7089, -7052, -12842, -2868, 10398, 10485, -1866, -11044, -7129, 5936, 12208, 3643, -8703, -10578, 733, 11082, 8091, -4081, -11134, -3858, 7817, 9911, 166, -9508, -8650, 2917, 10422, 5076, -5590, -10111, -2027, 8603, 8594, -1145, -8713, -5639, 4420, 9715, 2966, -6203, -8294, 572, 7577, 7167, -1770, -8216, -3263, 4382, 8069, 1644, -6235, -6508, 836, 7341, 4802, -2856, -7396, -2849, 3804, 6366, 507, -5487, -5351]
2445e351N987M714j718n181m508L722N773J644m082n125J35M975L607j063n209
2460a680l312K784M844K320l138n119r80M452M031p71m588l526J928M748K274
2475D267k150n759q60L956M889l07n406m210K910N305K937l973n606j047N421
2490C67N938j771n933m940L213P220K883n306p299n7P126O069k321q791n013N537
2506c078Q984J404p027q426R54R675O115l668j0537m931Q590J0370P61j0610r180
2521a0604K851J2428O885o708j2714k567R254J1083j074j1470r056N384J3865
2534G557M682r477j2703j034J1977J0714l482j3267o770P068J2561L062j0180
2547G08j1814K363J1716J0111o177j3759m831R041J1990N91j0947r947M226J1654
$$ y = [-5351, 636, 5350, 3632, -1549, -6057, -2335, 3438, 5082, 1000, -4125, -3990, 985, 4592, 3529, -1680, -4992, -2208, 2636, 4956, 1818, -3301, -4281, 171, 4202, 3431, -1157, -4683, -2755, 1993, 4267, 2117, -3642, -4502, -546, 4343, 4036, -1370, -5580, -2670, 2635, 5572, 1599, -4007, -5054, 367, 6305, 4534, -1399, -6339, -3126, 4094, 6977, 1671, -5628, -5685, 1441, 7510, 5189, -3602, -8615, -3078, 5906, 7310, 283, -8143, -7189, 2486, 8601, 4933, -5604, -10535, -1945, 8425, 9186, -1424, -10604, -7753, 4675, 11560, 4852, -7862, -10429, -1175, 9908, 8834, -2636, -11692, -6308, 7557, 12239, 2762, -9941, -10975, 1002, 11716, 8234, -5033, -11803, -4735, 7826, 10888, 708, -11106, -8743, 2973, 13084, 6907, -6852, -11683, -2642, 9348, 9939, -1008, -10955, -6729, 4925]
2561D925O204q047j1280j152J0037Q961k529j1133o802N934J1668K797r157q378
2575g952J541R002O295n365j0010k207P917R328j556r430o497M936R355K548o544
2590A361q483J168Q796O086n260r186l071P438Q821n38r233o629L656R017L242
2605G185n620q037m90P987O995l333q675n202M671J0573K663o759r053N27Q105
2620A537N861k464q264l740N072P786J896p058p773P23P890O232k513q327m112
2635g254M283P046J865n110o372L78N976N371j664p024m389L004P024L603l906
2650B831o675j895M112O036N72n308m737J261O039L894k503p067l245M100P202
2665D617J900m778o495r53N421N400j212n704l686L030O205K131n100o569l49
$$ y = [4925, 11129, 3082, -8198, -9350, 687, 9648, 7119, -4014, -10816, -4882, 6786, 9583, 426, -7952, -6411, 2591, 8886, 3521, -6489, -8696, -779, 8549, 6993, -2437, -8934, -3998, 5357, 7905, 1361, -7122, -5954, 2842, 8928, 3668, -5518, -8589, -1151, 7670, 7132, -2101, -8730, -5074, 3943, 7185, 1565, -6472, -6962, 1025, 8020, 4687, -3988, -9190, -4519, 6054, 8717, 1958, -7095, -6568, 1537, 7398, 4934, -3330, -7070, -1998, 5788, 7684, 626, -7147, -6424, 1466, 7698, 5185, -3142, -7254, -2971, 4075, 5940, 830, -5542, -5164, 812, 6183, 4519, -2505, -6894, -3890, 3134, 6737, 2831, -3844, -5739, -1627, 4409, 4981, -327, -5064, -3803, 2236, 6130, 3627, -3440, -6685, -2585, 4617, 6517, 1739, -4756, -5709, -288, 5112, 3900, -1804, -5490, -2460, 3745, 5876, 776, -5793, -6142]
2680f142O572N821r30o916m423K629O371K329m550n165L30N960M150l223o919
2695d106k377M884O782N05n737n298J477O031K776m006n498L48O162M250k909
2710C284p247k974N231P205P40o671n686K087P296L171n334p531L08Q097O555
2725H531l330r952m839O110R949J889q223q568J762J0175N870n883j1152k275
2739i936R653J0897j369j2050r098M882J2752N832p904j1786j568J0534J0102
2752A0941l030j2853p317P160J3329M188j0268j2497p45J1873J0449l445j2548
2765d763o372P192J1972K121j0185j0768J540J2133Q722m882j2234n314P329J0757
2779G248J516q613q147K239R621N096n544r443k341P483Q347j65q105o381K388
$$ y = [-6142, 430, 6251, 5321, -1595, -6018, -3389, 2982, 5311, 761, -4404, -4074, 1886, 6036, 2813, -4106, -6483, -1599, 5183, 5688, -49, -5347, -3870, 2161, 4937, 931, -4567, -4219, 1943, 6193, 3284, -3963, -6937, -1706, 5499, 6239, -432, -6118, -4031, 3265, 6436, 1102, -6429, -6121, 1976, 8531, 5201, -4751, -9590, -3480, 6469, 8358, 135, -8433, -6671, 3504, 9374, 3491, -7661, -9936, -283, 10614, 9245, -2805, -11903, -7021, 5731, 11563, 3659, -8127, -9695, 839, 10941, 7911, -4942, -12259, -5099, 8230, 12418, 2150, -10347, -11092, 781, 11230, 7785, -4763, -11135, -3943, 8029, 10150, -35, -10803, -9263, 2870, 11592, 6710, -5524, -10838, -3509, 7248, 8764, 151, -7996, -5757, 3864, 8960, 3416, -6027, -8368, -885, 7462, 7297, -808, -7189, -4801]
2794d801P482L227m392n836m27N723M354k394n993l113L885O101J391m549m454
2809c796M21M025K659k317l332j65L561K917j714m328k223K578M661J071k922
2824A096l769q7L175K159j437l206r12L226L217m01m023l331J205M358L195j948
2840B517m504j725K729L784L30l400l612R31M997K877k452n407k566L506N835
2855C840J692m401n633m27N226M777j461o096l652L513P063K166n285p360p01
2870f739O767P031r66q052n535L419Q402L451o038q106q85Q208P497j981r399
2885b926o409M425R858M346o816r378j089Q530P477k199r712n513N855J0004K641
2900I094p824r556J43R501P557l074r894m492O166Q981R53q124p645K568R583
$$ y = [-4801, 2681, 5908, 1516, -4320, -4747, 976, 5330, 2936, -3057, -6170, -2285, 3816, 5207, 658, -3796, -3375, 650, 3309, 992, -2340, -2505, 1056, 3973, 2259, -2069, -4292, -1714, 2947, 4018, 1096, -2673, -2760, 415, 2574, 1137, -2069, -2981, 245, 3462, 3061, -962, -4293, -3088, 1270, 4465, 2517, -1987, -3712, -983, 2801, 3131, -269, -3881, -2950, 2047, 4924, 2472, -2935, -5501, -1995, 3840, 5532, 1131, -4502, -4929, 297, 5074, 3613, -2483, -6135, -2622, 4441, 6607, 1322, -6038, -6739, 28, 7059, 6093, -1959, -7494, -4075, 4327, 7778, 1740, -6366, -7251, 957, 8454, 6473, -2926, -9335, -4910, 4948, 9294, 2478, -6900, -7989, 541, 8018, 5819, -3893, -9406, -3551, 6453, 9094, 1270, -8286, -8143, 1358, 8915, 5841, -4053, -8545, -2379, 6602, 7555, -569, -8214, -5646, 3937]
2915C937N502n769r543k606P454Q465p72q709n989M125Q733K516o860p963Q99
2930f580Q805O253m124r316l386O614Q376R5q190o136L358Q894L208o656q160
2945f945J51Q610O922l147r971m113O058R143R37q338p460K514R502M839n884
2960B818r515j809Q300Q605j508r845o419M466J0354L393p130r083k58R199P336
2975H904l231r803n104O114R784J841p897q565J256R066O012l918r268l237O127
2990a919Q359N29p824o508J879Q087M682l908p640k457N609O624p4o407n303K293
3006c978O831L396l809o500j502M964N406l87n100m185J707N285K585k997n080
3021c364j085M099M397k63m690l484J634M508K552k644m200j374L317M016p4l961
$$ y = [3937, 9439, 3670, -5873, -8479, -1025, 7440, 6668, -2041, -8030, -3905, 4828, 7344, 484, -7479, -6580, 2225, 8478, 4354, -4962, -8348, -1734, 6642, 6737, -1453, -7589, -4231, 4663, 7871, 1215, -6945, -6794, 1816, 8738, 5591, -4380, -8493, -2435, 6708, 7645, -693, -8153, -5639, 3863, 8702, 2818, -6697, -8506, -206, 8399, 6891, -2954, -9373, -4907, 5447, 8840, 1710, -7373, -7631, 1568, 8904, 5673, -4130, -9234, -3120, 6664, 8505, 608, -7957, -6701, 2365, 8377, 4459, -4809, -8046, -1919, 6440, 6969, -855, -7363, -5484, 2603, 7285, 3377, -4263, -6720, -1111, 5513, 5439, -968, -6271, -3978, 2853, 6249, 2440, -4060, -5562, -598, 4808, 4421, -679, -4864, -3157, 2128, 4713, 1716, -3364, -4449, -350, 4047, 3784, -906, -4390, -2756, 1752, 4304, 1660, -2540, -3914, -597, 3419, 3345, -616]
3037f16k817J184L972K347k527m272q66L207L693L2l925l368J310M271K343k702
3053A266m282j201L909M307m18m652l940K208N338K504l508n505q68N071M877
3068E106r76n762m054K956O528K191m893o027m59O303N418k073p517l583M247
3083b595P501J524o287o618J042P479N158l615q210k831O083P603K72p576o589
3098g659K798Q590M448n466q499j613P617P455j484r017n332M722Q809K538o940
3113I67q380P24Q579O505l797r384l842O481Q891N51q398p191K664R457M714n824
3129B717r204j399Q123P949k163r173n456M937R505K613p466q517O72R373O158
3144H669m207r611l242P000Q568p8q669o908L113R559M195n762q988j574Q214
$$ y = [-616, -3433, -2249, 1723, 4070, 1543, -2729, -3595, -388, 3305, 3337, -588, -3956, -2646, 1625, 3968, 1266, -3016, -4217, -308, 3999, 3581, -1071, -5011, -2803, 2535, 5039, 1531, -3974, -4842, 229, 5106, 4130, -1632, -5686, -2730, 3798, 5989, 1096, -4931, -5390, 913, 6331, 4258, -3259, -6842, -2595, 4906, 6430, 143, -6475, -5433, 2046, 7204, 3589, -4621, -7452, -1369, 6234, 6506, -1070, -7659, -4861, 3729, 8177, 2711, -5788, -7401, 216, 7671, 6187, -2830, -8162, -3440, 5369, 7907, 967, -7413, -6689, 1890, 8395, 4598, -4786, -8628, -2147, 6744, 7295, -1103, -8294, -5630, 3827, 8541, 2717, -6487, -7886, 237, 8186, 6023, -3150, -8606, -3669, 5836, 8449, 983, -7534, -6862, 2511, 8669, 4462, -5149, -8391, -1391, 7177, 7099, -1570, -8478, -5365, 4194, 8389, 2627, -6361, -7935, 279]
3159B79P418j788q949n339M555R292K608p117p906M00Q435O009k961q731l815
3174g610N205Q415Q68p105o547J538P650M556l657p510k651N807O475q8o294n341
3190f289K286O875L058l815o200j204N315M838m63n851l625K365N347K088l477
3205A248m734k84L933L632j109m259k254K212M204J080l270l685J55L790K275
3220B934r71l351j686J991L142O08k501l016O83L226K263j554l303j493K190L315
3236B477Q3k671k446N85L048J871j688l328j195K781L275L07l701k941Q82L905
3252A244K308k018l917j186L007M037K0m491l624J626N460K747l127n479j459
3267d852M119N349k5n408m427J996O212K804l936o565j324N817O310q84p126n014
$$ y = [279, 7697, 5909, -3040, -8379, -3824, 5468, 8076, 959, -6947, -6547, 1888, 7897, 4936, -3795, -7610, -2405, 6010, 6878, -227, -6774, -5236, 2414, 6970, 3313, -4197, -6848, -1041, 5434, 5346, -948, -6289, -4003, 2872, 5930, 2115, -4085, -5289, 26, 4864, 4401, -1450, -5075, -2710, 2637, 4725, 1248, -3486, -3770, 163, 3795, 2686, -1573, -3827, -1615, 2589, 3669, 399, -3286, -3131, 659, 2934, 1963, -1388, -3074, -1083, 2059, 2667, 166, -2850, -2167, 1059, 3322, 1768, -1535, -3028, -838, 2477, 2560, -111, -2557, -1972, 1076, 2947, 1259, -2069, -3264, -483, 2792, 3099, -602, -3543, -2661, 1244, 3552, 1534, -2383, -3569, -562, 3475, 3495, -996, -4620, -2994, 2466, 5213, 2086, -3393, -4852, -733, 4616, 4591, -817, -5244, -3248, 2964, 5768, 1832, -4733, -6057, -240, 6070, 5186, -1940, -6954]
3283f954K608P824L023m571p143r55O610O037j330p907m929M055Q650K603n846
3298A775p994k77P129O485k179p941m074M372Q099J346o660p043J134P980N232
3313G384l470p886l094N110P396K66o723n269K237P290L326m671o976j029O409
3328C00N782j379o752l772L329O442J130n056m978J343O231L076l825n965j239
3343e333M950N433r02o053l240L091N428J025m842m593J589N863L355l503o236
3358c968j435M790N690o92n578l890K438O187J724m879n339J67O171N091k618
3373C859o631l656L992O387J633n063n567P23N778L996k670o340k361M522O246
3388D848P67n613n351P29N855M209k198n516k596L564M975O72m315m429O99N140
$$ y = [-6954, -4346, 3478, 6501, 1930, -5213, -6168, 442, 6479, 5149, -2758, -7687, -3632, 5018, 7621, 1775, -6219, -6496, 633, 7118, 4939, -3002, -7076, -2704, 5395, 6741, 81, -6962, -5828, 2152, 7384, 3914, -3972, -7066, -1956, 5440, 5706, -1017, -6286, -4049, 3241, 6567, 1896, -5080, -6109, 300, 6082, 4703, -2049, -5821, -2492, 3950, 5080, 24, -4954, -3611, 2620, 5696, 1871, -4094, -5333, -383, 5050, 4148, -1905, -5145, -2054, 3374, 4399, -443, -5036, -3447, 2416, 5771, 2268, -3968, -5403, -613, 5077, 4385, -1193, -5083, -2645, 3542, 5266, 387, -4952, -4785, 1386, 6477, 3859, -2772, -6428, -2436, 3951, 5584, 521, -5046, -4323, 1455, 5451, 2781, -3559, -5920, -1398, 4848, 5615, 2, -5349, -4620, 1235, 5444, 3246, -2270, -4866, -1302, 3673, 4345, 30, -4399, -3700, 1440]
3404A440L454j960n101k823K685M667J550k938m018k37L411L083o84m086k276
3419c833J933M015J774k426l877j143K611L563N98l024k991O47L143K005j705
3434A290l208j165K360L305O73l151l245L13L117K364p99k908j457J728K837J8
3450B072k552k161P10L250J583j512l092j071K092K863O3k535j846J380K688L24
3466B256k467k631N59L609K127j871l787r74K695L246m04l488k247K210L857Q82
3482C572l874l799M52M951L373j698n343k428L592N023L01m863m127J841O049
3497C022K838m014o260j438N651N959p78o447m658K653O878K538m796o340l42
3512e534O553N384j996p351m124L965P725K248n661o725K7O755M937k365o996
$$ y = [1440, 4894, 2934, -2167, -4990, -2305, 2362, 3912, 974, -3044, -3281, 130, 3213, 2529, -1557, -3833, -1900, 2115, 3889, 1463, -2414, -3557, -946, 2617, 3215, 191, -2800, -2153, 990, 2995, 1290, -1918, -3083, -723, 2582, 3255, 104, -3141, -2828, 289, 2653, 1854, -1054, -2511, -783, 2054, 2072, -480, -2641, -1931, 1319, 2902, 1390, -1702, -2773, -681, 2182, 2245, -290, -2136, -756, 1932, 2256, -211, -2842, -2283, 1326, 3453, 1582, -2205, -3179, -484, 2762, 2358, -1130, -3377, -1167, 2690, 3572, -302, -4101, -3649, 1302, 4675, 2977, -2366, -4794, -1202, 3821, 4122, -741, -4868, -3027, 3022, 5860, 1846, -4414, -5852, -201, 5758, 4980, -1467, -6125, -3472, 3406, 5944, 1148, -5192, -5534, 1019, 6403, 4407, -2944, -7068, -3103, 4622, 6870, 1209, -5516, -5489, 1266, 6203, 3838, -3158]
3527c158l203M699O774J071o165o110J157O774M369l041o678k212M365N665J52
3542D459n352m295K096N664K537l293n405j091M632M241p50m819k905K371M406
3557B496J088l289l737Q05L862K246j813l610j599K680L661k68k904k452J068
3572a766L392J030k569k675L3L346J969j384k948j499K148K823N45k531k124R68
3588a242K694J182j884k810l66K498K610m74k914j827Q58K855J094j504k551k27
3604b008K110K264n94k822j652J123L042J320j733k944q64K258K703K74k547k333
3620b403O96K836J664j255l128j344K144L270O02k644l300K1L195K678r34l565
3636a467j855J984L406J054k746l251k28L544L319j243l869k479K133M038J585
$$ y = [-3158, -6361, -1662, 5112, 6183, 18, -6092, -4935, 1839, 6208, 3167, -3511, -5723, -1358, 4307, 4459, -893, -5188, -3092, 2572, 5109, 1816, -3589, -4680, -48, 4193, 3443, -1376, -4281, -1910, 2496, 3584, 295, -3442, -2637, 1225, 3471, 1658, -1952, -3551, -871, 2790, 2522, -382, -2834, -1766, 1626, 2656, 87, -2588, -2555, 791, 2760, 1376, -1572, -3071, -923, 1900, 2445, -86, -2210, -1242, 1452, 2634, 750, -2060, -2426, 72, 2682, 2208, -706, -2533, -1675, 1180, 2274, 770, -1781, -2008, 102, 2366, 1772, -1050, -2702, -1579, 1463, 2783, 1050, -1894, -2758, -500, 2203, 2477, -70, -2403, -1707, 1129, 2793, 1538, -1590, -2934, -790, 2480, 3082, 438, -2862, -2841, 354, 3032, 2098, -1467, -3322, -1338, 2068, 3122, 376, -2875, -3103, 441, 3760, 2517, -1352, -3831, -1698, 2340, 3925]
3651C925l060l882k23L909L435j588m200k159K495M080J209l679l896M07M159
3666I32K999j952m184j729K898M178L28m008l404J054M536K543k682m312j059
3681c862L782L884q31m355k735K523M492J204l751m110L69M613L095k042m786
3696b510j553L424M234j63m406l321J907M675J845l050m754k62M398L707j234
3711B937m920k330K848M730J003m253l994P36M783L033k600m891j461L871M602
3726D094l30m786l596K046M896K233l433m740l81M350L943j245m911k606K600
3741a866M845J073l639m124M06M248L170j811m384j694K886M264P9l790l235R49
3757b623M079K143k212l968n93K846L246j99l407k693J694L234J364k144l226
$$ y = [3925, 865, -3017, -3240, 669, 4104, 2516, -1684, -3843, -1348, 2732, 3941, 262, -3634, -3227, 932, 3931, 1979, -2205, -3934, -1036, 3142, 3470, -538, -3942, -2888, 1648, 4191, 1509, -2803, -3862, -80, 3804, 2973, -1382, -4117, -1594, 2898, 4102, 351, -3759, -3390, 1223, 4318, 2276, -2510, -4063, -639, 3595, 3432, -974, -4295, -2388, 2287, 4132, 1082, -3672, -3934, 464, 4171, 2937, -1983, -4313, -1465, 3265, 4268, 15, -3979, -3243, 1540, 4573, 1973, -2918, -4379, -508, 4094, 3764, -1022, -4618, -2572, 2324, 4557, 1124, -3616, -3997, 353, 4296, 3051, -1860, -4466, -1866, 2979, 4052, 413, -3711, -3305, 943, 4113, 2302, -2082, -3776, -890, 3374, 3453, -337, -3572, -2623, 1456, 3599, 1387, -2581, -3174, -328, 2918, 2719, -688, -3381, -1687, 1547, 2911, 767, -2459]
3772b459j2K600K560o91l273j532J644L060Q00k372k684J30K755K056r13l040
3788a371j178J716K706K76k139k222J43K503J805p02k700j191J504K459O04k116
3804I7k138P4K417J812q03k481j307J389K586O90k041k367J00K260K181o01k831
3821i63j547J415K738Q39k147k524j44K674K458r74l121j693J774L226P58k189
3837E80l173O6L161K242j100k948j627J551L544N39k774k645J74L496J896j109
3853A873l583j584K530L465J84l195l062J104L453K265k497l397j051L466L016
3868B987n60l716k059J907L378J243k592l277l14M103K471j662l910j319K813
3883e07L616j93l690k793J532L987J829k847m038k05L850L076r97m532k140K542
$$ y = [-2459, -2471, 129, 2689, 1998, -1275, -2807, -1163, 1897, 2697, 325, -2359, -2229, 526, 2582, 1669, -1371, -2549, -833, 1873, 2149, 10, -2212, -2069, 434, 2239, 1537, -1163, -2354, -850, 1609, 2213, 97, -2041, -1967, 450, 2262, 1459, -1022, -2329, -940, 1646, 2336, 295, -2072, -1972, 288, 2469, 1868, -963, -2510, -1095, 1643, 2482, 335, -2189, -2333, 341, 2799, 1825, -1296, -2989, -1215, 2011, 2769, 580, -2593, -2527, 634, 2876, 1776, -1172, -2799, -1248, 2296, 2835, 61, -2584, -2410, 1086, 2982, 1873, -1710, -3294, -764, 2701, 2885, -310, -3372, -2268, 1185, 3450, 953, -2444, -3495, -29, 2987, 2427, -1289, -3348, -1441, 1937, 3180, 588, -2689, -3003, 1100, 3571, 1909, -2001, -3320, -507, 3109, 2916, -774, -3567, -2035, 1952, 3781, 934, -3104, -3309, 541, 3617, 2620, -1912, -4052, -1510]
3899a510M481N69l798l474R70M014K122j119n604n23L324M210r04l663l038J079
3915b864M878K022k533m659p41M055L276o38l976l047K304M557J892l833m395
3930c702N3M136L456j302m293k105K308M037R65l228l675O36L618K743j567l870
3946a790j697K370L767J69k344l139L07L246K146j651l308r53K278K660L56k575
3962a58k176N58K398J451j092k139o85J656J815r4j979j411R43J909R52j486j551
3979a089k98J347J278k27j440r70R27J484J75j145j318J66J280J173n23j594o19
3996a393Q22J522P9j222r82M02J662N60r66j597l49J296J620Q5j587j309K16J886
4014G45J040j206k019k75J697J814n4k272j945P60K936J312j440k815p44K162
$$ y = [-1510, 2971, 3540, -258, -3732, -2762, 1252, 3374, 2255, -3349, -3872, -548, 3662, 2758, -905, -3943, -2864, 2014, 4036, 1503, -3156, -3897, 158, 3434, 2796, -1180, -4227, -1923, 2634, 4526, 693, -3702, -3649, 487, 3943, 2641, -1652, -3757, -1449, 2588, 3553, 325, -3350, -2714, 904, 3647, 2080, -1790, -3487, -1117, 2650, 2819, 475, -2664, -2357, 889, 3035, 1384, -1924, -2877, -599, 2061, 2417, -158, -2334, -1776, 622, 2073, 981, -1158, -1843, -187, 1628, 1534, -445, -1856, -913, 996, 1948, 462, -1089, -1387, -40, 1238, 1011, -429, -1399, -472, 1012, 1187, 42, -1276, -1110, 170, 1343, 820, -774, -1393, -571, 951, 1030, -192, -1174, -772, 890, 1450, 484, -1113, -1462, -166, 1454, 1539, -48, -1357, -1141, 745, 1785, 579, -1440, -1715, -18, 1796, 1742, -530, -2475, -1715, 1221, 2533, 1093, -1722, -2466, -304]
4030c04K589j49k590k300J335K964J704k065l782l11K615L113J88l397k541Q25
4046b106L747J687k557l790j20L014L708l44l815l329J237M672K202k971m204
4061b969r00L861L479p18m160k626K545M222J447l416m155K2L741L485j337m152
4077a631k031K851L361L58k794l269Q37L958K041k125m002n63K655L006j8l500
4093h66k111J486L562O99k174k826j18L210K138j985l124p40K747K638o26k209
4109b99k167P27L026J090k526k354O24K804J893j448l488o76K118K331O73k963
4125f35k141J050L507J317j725l817k10L046K927r46l257k689K137L345J089k083
4141I15m040M43K969K869q03m104j700K246L360J126k735l387L54K640K899j092
$$ y = [-304, 2285, 2136, -454, -2754, -1419, 1545, 3249, 1184, -2598, -2909, -294, 2819, 3007, -390, -2931, -2106, 1641, 3328, 771, -3019, -3139, -125, 3583, 3239, -576, -3905, -2668, 2004, 4206, 1235, -2969, -3869, -8, 3471, 2753, -1407, -4033, -1488, 2734, 4181, 765, -3390, -3368, 373, 3858, 2521, -1631, -3662, -811, 2550, 2908, 114, -3155, -2318, 1640, 3681, 1556, -2446, -3009, -354, 2652, 2634, -866, -2977, -1491, 2071, 2770, 596, -2230, -2348, 862, 3000, 1015, -2109, -2849, -102, 2536, 1910, -299, -2466, -1739, 1287, 2377, -149, -2503, -1879, 925, 2818, 1370, -2118, -2794, -676, 1655, 2328, -635, -2776, -1726, 1781, 3098, 1373, -2444, -2654, 392, 3319, 2373, -884, -3573, -1436, 1909, 2998, 915, -3125, -2682, 287, 3156, 2353, -1751, -3451, -1205, 2155, 3281, 546, -2841, -2487, 153, 3052, 1960]
4157A960l466j454J813L763J29k265k890k51L220K204k62l807j774J612L213N23
4173B268j963k404Q7K361J943n46k966j463J610K625R31j887k521j90K182J545
4189A612k83k181j184J365K093M24j346j991k37J935J501l57j583j415J007J636
4205I96K54r43j543j55J723O88l86j264j317J750R40O23j139j551J93J262J185
4222A316p32j747l29J388J558j07j840j268O90K115Q51j363k091QK048J266n57
4239A206k298r31J477K221L87k215k090M89K594J428j282k617q52K257K462j46
4255B090k947k023J358L241J369k229l177m51K962K480l43l410j990J767L468
4270B165R62k602l406M6L490K535r76l737j963K201L642O57k713l221M01L303
$$ y = [1960, -1506, -2960, -1147, 2616, 2745, 480, -2410, -2661, 559, 2763, 2501, -1306, -3080, -1468, 1745, 2268, 305, -2099, -2012, 349, 2292, 1746, -1220, -2683, -1073, 1552, 2483, 596, -1925, -2115, 67, 1612, 1329, -852, -2036, -671, 1422, 1846, 500, -1491, -1728, 207, 1708, 1351, -232, -1647, -640, 996, 1250, 307, -1236, -1391, 332, 1020, 634, -630, -1947, -197, 743, 1366, 227, -1324, -1131, 131, 1316, 584, -1163, -1492, -104, 1454, 1347, -493, -1761, -1071, 1044, 1895, 532, -1559, -1551, 497, 1763, 1206, -1092, -2023, -546, 1675, 2062, -153, -2243, -1754, 840, 2268, 986, -1631, -2483, -226, 2236, 2090, -857, -2880, -1522, 1719, 3088, 859, -2318, -2769, 193, 2673, 2330, -1080, -3070, -1303, 2165, 3127, 525, -2881, -2835, 655, 3190, 2214, -1523, -3486, -1285, 2357, 3014, 301, -2920, -2519, 784]
4286G84K361j598l518j343K571L285M01l138k779Q79L237J947j739l454o24K582
4302a46K770m01l040k017J324L135J165k074k833r3K473K128r42k548j349J552
4318h96K662K38k045k078O75K294J296j068k389n21J795J899l53k010j398J036
4334h63K087Q09j756j977K18J721J594p03k107q66J272J914J81j698j680N36K037
4351G19R73q81j875n59J567J599k74j321j519N09K057P72j141j745l48J477J601
4368A611l49j716j121N52J969P32j263j537n20J510J480n6j700j375O39J814R91
4385A661j067j772k84J343J535n2j673j276N98J715J111j107j949l27J307J808
4401A571k21j591j426N40J912Q80r86j710q04J735J512r3j698j309O10J825J002
$$ y = [784, 3145, 1547, -1971, -3314, -743, 2542, 2943, -195, -2974, -2095, 1142, 3089, 1350, -2104, -2728, -146, 2624, 2223, -817, -2834, -1510, 1625, 2790, 716, -2117, -2210, 263, 2391, 1449, -1099, -2448, -896, 1766, 2004, -41, -2119, -1444, 850, 2146, 1078, -1311, -1832, -37, 1862, 1509, -501, -1899, -863, 1224, 2033, 277, -1700, -1482, 239, 1833, 1130, -977, -1843, -571, 1343, 1524, -174, -1854, -1318, 719, 1692, 811, -1064, -1623, -56, 1543, 1269, -52, -1571, -1062, 995, 1767, 626, -1119, -1467, 10, 1611, 1262, -454, -1575, -1023, 946, 1678, 415, -1122, -1642, -132, 1348, 1292, -408, -1783, -1144, 670, 1661, 594, -1178, -1462, -119, 1416, 1364, -309, -1585, -987, 728, 1839, 732, -1217, -1544, -237, 1571, 1350, -241, -1667, -1127, 785, 1665, 679, -1031, -1835, -100, 1412, 1319, -379, -1688, -1078, 747, 1749]
4418A749j260j915k79J746J626l52j981j133P64K214N93j320j840j93J862J557
4434A838o77j988j219J263K220L81j728k102L63K326J484j284k214r19K048K030
4450A822m6k336j718J190K275Q99j500k246l56K211J957o29k124j532J390K391
4466A648N34j960k268M18K050J771j066k361j072J764K262L82k381j964P52K429
4482I38J442j451k598k90J750K149j89k383j474J178K272P92j749j977R3J979
4498D82J385n72k321r82J462J909L35j702j930O12J950J263j087k045l73J495
4514a19J651k06j803j028Q59J548M69j235j401l06J794K047j239k125m43J695
4530A58J037j01j199j817J083J875K34r90j364l7N90J455L37j789j100O56J588
$$ y = [1749, 489, -1426, -1705, 41, 1667, 1315, -666, -1799, -1035, 1179, 1772, 452, -1388, -1581, 281, 1838, 1161, -827, -2046, -783, 1437, 1818, 90, -2012, -1649, 677, 2161, 877, -1337, -2256, -208, 1822, 1776, -560, -2278, -1088, 1187, 2086, 586, -1660, -2016, 195, 2152, 1523, -601, -2133, -743, 1648, 2182, 222, -2046, -1628, 422, 2193, 1127, -1234, -2306, -542, 1720, 2102, -279, -2243, -1491, 938, 2380, 929, -1669, -1959, -209, 1940, 1751, -632, -2106, -928, 1344, 2136, 387, -1590, -1497, 482, 1867, 1295, -1026, -2008, -546, 1363, 1698, -4, -1934, -1322, 628, 1891, 804, -1241, -1614, -119, 1532, 1326, -477, -1505, -646, 902, 1371, 136, -1265, -1571, 223, 2270, 1031, -1094, -1537, 158, 1195, 1094, -105, -1922, -839, 1036, 1270, 280, -1084, -1121, -531, 924, 1261, -528, -1628, -972, 616]
4547F16Q43p16j709k17J098J071j87j221q63M95J624R89j029k158l35J522J473
4564A296j56j429j264O22J793L32p38j674k5Q68J579k60j082j106K30J343Q34
4581A163k91j679l16Q95J275L37j437j165K47J314J179p67j454n45Q31J424L37
4598A348j682q75O7J588Q37o86j455o22R98J386J18j104j330J96J822P80o52j783
4616a049k69J091J346Q7j570q63M99J378Q40r83j578QJ247J036m00j482n14Q38
4634c38J179L78j505j233N27J531R84j067j646k25J353J523l63j816r72J298J656
4651A264K37j464j594L14J794J079o37k082o05J453J950j72j806j496N93K278
4667A106P63j308k120l22J839J998m47j998j703J186K384P11j699k268N3K128
$$ y = [616, 1459, 743, -966, -1183, -85, 986, 799, -422, -1285, -790, 834, 1823, 794, -1364, -1699, -177, 1296, 1140, -289, -1553, -931, 862, 1194, 456, -1218, -1243, -375, 1204, 944, -138, -1244, -1014, 329, 1163, 872, -807, -1123, -228, 1047, 1384, -53, -1218, -971, 343, 1522, 755, -699, -1244, -413, 1011, 1348, -334, -1209, -1142, 446, 1283, 597, -858, -1480, -482, 904, 1022, -82, -1412, -1216, 606, 1386, 734, -1049, -1318, -227, 1119, 1206, -364, -1227, -728, 650, 1490, 507, -1071, -1063, 184, 1220, 820, -662, -1176, -338, 841, 1219, -286, -1519, -992, 539, 1523, 456, -1190, -1415, -62, 1461, 1098, -718, -1690, -392, 1264, 1501, 37, -1557, -1243, 551, 1630, 993, -1089, -1694, -241, 1709, 1537, -269, -1765, -1172, 1106, 1869, 561, -1559, -1881, -42, 1956, 1509, -489, -2192, -1006, 1378, 2089, 390, -1878, -1825, 303]
4683C03J908p43k384j240J262K114P31j588k275K81K042J436o24k294j001J447
4699f25K280L8j664j941L55J987J492p26k071q72J285J701K58j631j517O01J434
4716C84J064n67j787l49Q47J456Q8j164r58K17J148O77q86r24m19J096R36k19
4734F40j082m55L48R27K79n68o36o1O67P98o55n65m81Q55P67j73p58n79K96N70
4754A34M16k16p78pN13N84p8j054k02M28O77M01o33j012QQ98O98l33o61m68M85
4775b00Q41J01o52j054j9J180O88p4j320p46Q65J201M83r75j356R3J140J331o01
4794I26j724o66Q49J652N34j215j776j06J621J473m52j842j070J036J818L86j347
4811I7j535r9J831J531n96j856j179J152J878M97j578j565mJ836J242n01j999
$$ y = [303, 2211, 1468, -916, -2156, -894, 1220, 1951, 363, -1912, -1631, 411, 1847, 1223, -1071, -2072, -625, 1655, 1693, 29, -1912, -1557, 430, 1922, 1196, -875, -1747, -462, 1239, 1497, -134, -1651, -1050, 384, 1448, 881, -906, -1255, -408, 1048, 1136, -28, -986, -769, 379, 1056, 170, -754, -1173, -77, 859, 640, -442, -897, -549, 378, 657, 89, -547, -608, 59, 857, 202, -363, -844, 11, 778, 605, -153, -732, -436, 134, 550, 334, -444, -451, 62, 646, 568, -486, -688, -260, 417, 818, 185, -827, -819, 79, 777, 444, -217, -685, -200, 641, 742, 90, -964, -983, 197, 885, 811, -509, -1255, -390, 811, 1294, 319, -1037, -944, 196, 1527, 926, -798, -1464, -615, 1037, 1571, 356, -1420, -1526, 95, 1568, 1116, -726, -1796, -760, 1058, 1444, 97, -1438, -1537, 294, 1825, 1229, -627, -1806, -654, 1224, 1721, 143, -1422, -1426, 410, 1652, 1151, -848]
4828h48j034J318J888M53j634j883L87J736J161n60j926o88J528J362qj604j216
4845a568P19J693N16r14j427k30J202J310k75j657p73P36J588Q9j014j123K18
4862i10J530N73p14j298j84J055J002l18j172q26R13J437K40j438j147J59J498
4879D00P99o03j410k95J043J148j42j159j072N08J575O55j152j637J21J304J279
4896A362m65j524o78N25J653N14j205j261q7J342J322m85j991o94J278J386N05
4913A497j307j137l45J424J338p93j286o98P61J463N69j210j391L5J097J228k84
4930I61j534o25P84J212M71j228j078%J200R51j81j409n10L20J299K73o32q73
4948e99j54J027O79l71q72p84N29J212K63o18j049M7O88P64m14o68m95N57P78
$$ y = [-848, -1882, -564, 1324, 1777, 143, -1740, -1353, 383, 1544, 984, -942, -1630, -102, 1260, 1252, -352, -1568, -849, 844, 1360, 446, -981, -1211, -9, 1301, 1026, -631, -1404, -668, 920, 1009, -5, -1128, -910, 620, 1193, 479, -819, -1003, 52, 1054, 736, -436, -1262, -349, 1088, 1328, -110, -1257, -1098, 400, 1199, 596, -814, -1109, -66, 1082, 940, -219, -1291, -783, 792, 1447, 295, -1342, -1221, 83, 1362, 897, -627, -1305, -780, 873, 1387, 182, -1079, -1166, 176, 1498, 1013, -978, -1672, -394, 992, 1497, 190, -947, -1292, 132, 1470, 677, -609, -1307, -546, 917, 1486, 276, -1115, -1080, 17, 1245, 961, -573, -1198, -414, 798, 1269, 41, -1037, -1037, 163, 1114, 933, -476, -986, -666, 633, 906, 274, -599, -753, 274, 953, 582, -290, -1074, -545, 667, 930, 312, -737, -690, -2, 762, 348, -320, -815, -258, 520]
4967E20L26o40r73k3R85P05k55r49o15N92J082J28q46o31nR51O67o33j033j03
4987g50O77O73J68p27r28N63O81O60j056q38K38R26N62k01j193o76R39J241q3
5006H76r15r52o0J579P59n21j529n01J259R73j15j339r15M07J807N38j107j438
5024a194l47J595J146j55j510q68O79J479P02j184j578R5J340J615q10j700q40
5041a535Q53J965Q6j392j276O5J764R75q74j494m21J073J572j80j402j089M02
5058i08J732N25q68j573k27J444J027k46j613o89Q52J519M00j083j398J54J320
5075C68Q67m16j530n60Q17J415K52j425j122O18J192N04o69j212k93J040J226
5092A072k44j518l55Q29P76N86q35j130J73P52Q91k13j189m99P28J124k12p30
$$ y = [520, 846, 206, -767, -790, 195, 900, 645, -304, -919, -327, 755, 883, 37, -594, -599, 352, 1019, 386, -647, -750, -73, 600, 768, 41, -887, -324, 357, 1017, -39, -877, -639, 287, 849, 648, -545, -1221, -282, 959, 876, -39, -991, -1051, 528, 1287, 766, -763, -1264, -5, 968, 853, -486, -1401, -994, 813, 1351, 244, -1194, -1541, 54, 1200, 1045, -465, -1333, -654, 825, 1527, 343, -1235, -1140, 200, 1815, 1005, -695, -1535, -682, 1283, 1369, -23, -1299, -1234, 530, 1505, 631, -863, -1284, -211, 1361, 1181, -221, -1310, -908, 824, 1349, 481, -1092, -1319, 125, 1152, 906, -707, -1396, -544, 975, 1375, 292, -1106, -952, 368, 1235, 819, -711, -1271, -454, 961, 1213, -212, -1334, -716, 476, 980, 311, -901, -1194, -154, 1072, 828, -690, -1045, -216, 560, 1146, 311, -819, -646, 106, 997, 784, -405, -904, -176, 948, 736, 6]
5110Fp82J31J087L04r0j344l65O75J068r2n64p38O8Q72N53n64q71k14O38R46j47
5131E77o27n39J56M70P78n35r02j83Q04P73j69n68n57N3O52O42l92p46k64K23
5151c54R35M5r76o41M41R78M33p27r51m3Q14O19q2r08k21N70R43O6q82n42o0N96
5173E3M70l1p66n56N44P84L76o18j063kR53P91m18o53p12J13J535L02j472n61
5193i31K35R65M91J23j557k16R59O42N14j539r20P26J388P2n93j333l63Q53J459
5212I75j03j017j083O82Q25P26r28j078p5R34J030O8j396n49L89J623J35q36j283
5231i61m9R58J085j85j474m47P01J440j1j186p99L25Q43R73m97j235n62R52J197
5250A068m34r25o53M41Q66O05p87r30L90M94P76J09r90r44O30J318l41o80j032
$$ y = [6, -776, -645, 442, 746, 656, -688, -1053, -378, 690, 598, 34, -704, -636, 236, 789, 225, -646, -860, -222, 724, 577, -50, -589, -433, 37, 815, 280, -622, -805, -1, 772, 603, 35, -522, -469, 183, 825, 433, -313, -577, -354, 581, 626, -350, -991, -550, 428, 861, 134, -817, -860, -46, 573, 491, -417, -638, -68, 875, 941, 59, -483, -543, 53, 523, 492, -274, -830, -286, 498, 874, 256, -807, -809, 144, 935, 517, -136, -848, -735, 800, 1102, -370, -931, -696, 269, 760, 883, -674, -890, 69, 711, 1225, -314, -1234, -508, 880, 952, 359, -974, -1337, -484, 975, 872, -145, -1228, -546, 279, 1005, 77, -1001, -1076, -142, 888, 956, -440, -989, -600, 1023, 1158, 322, -961, -1010, -52, 1033, 848, -626, -1073, -372, 1068, 1057, -129, -928, -603, 240, 1213, 716, -519, -1081, -129, 1068, 634, -291, -944, -503, 363, 968, 181, -749, -359, 135, 911, 1020, 30, -914, -284, 1034, 693, 13, -1019]
5269a019N64O55P02q62n80l56M79J264k32n69r38P09O83J69p88o27K92M76N10
5288E32m0o36n65N84P29K11q80o92M5R50O04o90o62k04R28L66k29o45q09N90R15
5309D02M09r81o21L39O28O66lj028o38N22R78q5j22j187L1N62R97l49m94o55J06
5330e23J208K00m96j085k04J228J60K0l65j013M23O91K17l49o19l00R40L66j83
5349C16L32j436N58Q52l38M80j265k91P09R47j67q90l75M81Q20l21L62q41l81
5368d48j86K029j092j82o57k68R35m1j51n26j99O87Q81n7j078n79N82M50M02j077
5388e75R42j498J315N50l71p68J40k64J047J63j232L12j65J285M5r08j193L06
5406h69O70M96k55m67n07J020J095o76p03j102R15P69K36m63q75j2Q51Q29k00
$$ y = [-1019, -455, 200, 902, 40, -540, -896, -417, 847, 615, 46, -892, -183, 500, 669, -119, -746, -454, 22, 532, 492, -144, -709, -125, 604, 815, -65, -757, -712, 238, 842, 152, -510, -714, 214, 580, 351, -294, -1103, -513, 402, 811, -170, -791, -452, 176, 842, 839, -189, -827, -305, 673, 588, 466, -721, -690, -128, 869, 520, 26, -629, -523, 685, 885, 389, -696, -900, 328, 488, 508, 143, -870, -447, 244, 461, 112, -507, -807, 133, 499, 316, 648, -788, -230, 622, 284, 764, -501, -792, -83, 864, 697, -193, -568, -87, 733, 412, 774, -67, -448, -634, 1395, 303, 121, -536, -804, 131, 90, -61, -587, -786, -99, 782, 725, -353, -932, -350, 100, 502, -575, 367, -1131, 184, 734, 363, -405, -265, -529, 518, 681, -551, -239, -404, 881, 926, 18, -1175, -869, -199, 297, 42, -425, -932, 88, 1183, 507, -196, -1298, -383, 386, 622, 159, -716, -728, 123, 952, 752]
5425G52j126q56J001Q82M36p73j436N76Q75J101m45j510k77L4J963l30p28j150
5443a011P9J631N87j077l93r29N91J247l0j037o89J12J099O47j97j509Q5J192
5461C98J046o07o14j180J03P20Q42m73q36n35J115N70J33r03l85N48L80N43o79
5480A86r06j18J181L56q34k90M57p00J109k28k6l17m74P94N9N24q52j16K96j95
5500i4O33n82L20q00J046M9j217J56O69m14P23m8q26j24K59M45l4K37r74N04N26
5521D54j46m8n59J47m98J235J10o38m62L63J3M72o39l49Q60k32K93j04J44j084
5541f68j89J105L81k48p24n50L69R36K07o02q23P09K45P60m55o04n09M01J133
5560H74R6j065o65l00R38J024K25j810O1M77O90N03j216o08J95J383k51Rp88k46
$$ y = [752, -374, -1230, -229, 653, 1089, 316, -1120, -544, 331, 1432, 987, -523, -800, -766, 1197, 867, 139, -1011, -932, 699, 1286, 209, -184, -1113, -522, 725, 695, -342, -1031, -919, 180, 827, 630, -879, -794, 398, 1444, 837, 223, -957, -854, -134, 708, 235, -601, -1136, -21, 549, 682, -221, -606, -58, 322, 865, 186, -720, -838, 343, 699, -135, -425, 32, -668, 441, 213, 187, -130, -604, 190, 249, 773, -79, -195, 101, -94, 539, -43, 277, -523, 523, 572, -645, -489, 180, -234, 489, 441, -385, -509, -250, 195, 161, 398, -576, -72, 454, 308, 260, -299, -152, -650, 585, 695, 57, -405, -42, -29, 443, -196, -545, 315, 83, 376, 272, 416, -668, -857, 248, 629, 381, -343, -893, -524, 412, 619, 17, -806, -97, 148, 908, 453, -151, -660, -259, 874, 970, -95, -760, -1060, -122, 902, 1127, -683, -622, -145, 545, 1048, -168, -776, -581, 802, 551, 560, -228, -474]
5580d74k65J224J21o89o45K56R77J12m28p27M9M82O32m8q11m22n2Q76N61o28q55
5601g54l6O60P94k88q47j95J07R56K93l40n46j3n1O94l7q64l41J010J13K52j04
5622D63p65k5P39J29p07m14J79O97N0R5j102l22O61R84J4l77q90j12O33M66q7
5643C09q23r9R25L89Q1q43k21N3J084m7p59o34j24R16M20k6j100l29J20J198j
5664D89n32n80K35R74L13q62l03k59M40M67k13n69k26M77N92J23n65nm58L05M49
5685B92j12l0r63M59M91O39k18j068o4MP95N10j071j47J58M50M55j42j126j91
5705h79J005M11k97p36M02K3N15j66j49j09m83J43P51M2m12m34K23J16M12o37
5725b59n6j92O82m4K45n27k78K87K77L39l91l73m06M20N73M7o80K7K43n8O27o9
$$ y = [-474, -739, 485, 606, -83, -728, -472, 505, 617, 189, -538, -489, -7, 625, 577, -234, -656, -708, 168, 729, 101, -754, -790, -130, 664, 376, -471, -666, -559, 397, 690, 350, -196, -209, -260, 434, 397, -467, -808, 202, 315, 567, 463, -302, -327, 412, 541, -166, -580, -401, 296, 346, 441, -661, -983, -322, 662, 676, 299, -591, -703, -70, 396, 309, -514, -613, 312, 701, 782, -61, -282, -229, 855, 808, 49, -585, -709, 207, 627, 601, -499, -828, -708, 490, 489, -43, -623, -388, 586, 899, 37, -266, -525, -85, 382, 169, -400, -626, -149, 443, 566, 1, -4, -462, -157, 292, 180, 150, -813, -354, 137, 776, 558, -510, -574, -570, 225, 735, -336, -483, -325, 125, 580, 438, -688, -879, 126, 537, 240, -496, -94, -71, 444, 278, 129, 20, -463, -320, 431, 473, 61, -373, -150, -34, 378, -259, -315, -507, 175, 131, 376, -151, -429, -142, 135, 474, 83, -290, -696, -276, 297, 344, -336, -309, -66, -124, 503, 434]
5747D34j011P68o8M30m24o84QN67K30J60l12l99J5M93M55l30n90m24K87J236k35
5768F06n48m79j50J179Q7k23j053j63P03Q34l64n23j68Q1O47Q6l32q30j74Q50
5788F6N31k71q20j82N95M23O62j048l54l21Q46K20K41n96q62P88P45J50j061l21
5808e69M53N11ml23o35J05P44N33j02n35n79O8P22J36k60r95r9J331K52j00j039
5829c85m18K81J488l32n72o98M41K85P54l83j039k0M15N28ro92p2M39N88k51l45
5850Cm29J09N02M32j15n83j94k54J042J63o42m52q2K37N37j64l63k52M51P26k67
5871D05n17k75J37J44N40m42p49Q9Q37l17N17o98J24M5K93M96P9o97l91J62P87
5892E69l35p52q3L52J88K89K78r59P13p22Q16L97r43j89k00N09L57J47p45J41
$$ y = [434, -577, 191, 123, 553, 129, -555, -547, 20, 250, 410, 98, -301, -286, 207, 662, 332, -258, -682, -395, 841, 606, 58, -421, -571, 608, 695, 472, -581, -744, -41, 793, 429, -94, -262, -181, 466, 552, 220, -610, -784, 66, 597, 326, -494, -676, -81, 342, 1004, -44, -398, -719, 127, 347, 588, -8, -870, -82, 663, 813, -248, -569, -116, 395, 391, 68, -567, -462, 282, 815, 713, 178, -401, -333, 389, 525, 265, -730, -829, 502, 754, 654, -385, -803, -522, 966, 634, 62, -636, -195, 90, 844, 461, -578, -598, -183, 345, 336, -356, -428, 11, 599, 348, 3, -426, -317, 185, 617, 502, -81, -275, -529, 513, 676, 34, -418, -500, -263, 274, 110, -253, -505, -54, 672, 405, -112, -387, -250, -106, 434, -8, -757, -668, 169, -148, 369, -329, -205, -160, 133, 629, 708, 11, -380, -218, 569, 234, -518, -601, -249, -61, 228, 506, -453, 260, -462, 354, 751, -192, -381, -581, -72, 285, 432, -313, -172]
5912a72L9L75m94J08K1m73P93j64o47k73R56k49O97k60n43m87R0P33N47p35l71
5933e09K06P67l25m6K04k84n17J293r13l88m98Q13N85n1k67p99R1J128j13K17
5953E94j253m6N13j41J149q39m04m09J181K19j22m61r54R97P64j21n75r70N27
5972c51K45J017k32j093K9k7J160r9j58n30p47N54P58m93o85J25M63P99n86l92
5992b43n51L35M52N95k91l56p36O65Q93J34r89r39L89J023K39l98j23o35Q00N75
6012H39l40o01n27M01O34Q4l01q45J48P91K87k14o96l31N26N32j9m23n07J49N87
6033A74M98o41m89j10O02L80m5l36o24N22N55N8m38o30K20O68r4m17k53N9K08
6054a33L04K82m15l77J97K75O8O5j110M45L12N84j79m02m69K19N88J11j14o12
$$ y = [-172, -133, 242, -252, -144, -123, -596, 197, 33, -614, -887, 69, -180, 517, 257, -286, -773, -683, 50, 597, -138, -509, -303, 464, 139, 93, 297, 13, -504, 789, -124, -512, -1010, -197, 388, 337, 70, -729, -638, 490, 377, 594, -659, -705, -192, -333, 816, -23, -427, -836, 345, 564, 442, -19, -973, 24, 788, 667, 92, -878, -351, -106, 911, 679, -414, -385, -412, 748, 649, 491, -39, -786, -232, 526, 33, -652, -527, -64, 735, 149, -243, -794, -459, -7, 588, 297, -59, -795, -130, 763, 897, -92, -1031, -642, 381, 620, 222, 99, -536, 264, 839, 499, -102, -629, -228, 406, 490, 189, -656, -508, 283, 570, 356, -340, -671, -145, 387, 368, -55, -562, -413, 174, 672, 31, -458, -568, 34, 414, 369, 33, -591, -69, 486, 544, 106, -524, -304, 364, 270, -147, -400, -341, -133, 171, 453, 38, -339, -142, 133, 201, 266, -844, -399, -87, 497, 318, -84, -553, -334, 254, 365, 251, -361]
6074c61r6Q11J57j16o24n49N56P86k51m26j88l28O04L39r5l07j96k53R21Kn97
6095b11k79J9P28k24M46k19q02L63P4Q89n17n71k42L17J095jj117n24K63O28N44
6116F59o72j7n01M39R9J06j54k28j28M70L15j26o89j82M08O33j84j55n38M48N16
6137E19J05n74l43k12K76P83n99j80l29L92mL07m16k0R1L02M44m78l44K22J56
6158I8L77j83n13p8J45N17J36q56J32k38K44O14l98P9k41l4P35p31L06n53j11
6179e53Q10J58J67j451M35P23M40R7j227r83N31J365n8m78o49j00J210K90j52
6198E75p05p22L08J056J74l01j151j50R47N32m85n59j39K40R98J83r43p60N49
6217c53N41N61m05q54J41K05O70P1n03q63L08Q03M57n29o31j7M65N41k86m80m99
$$ y = [-361, -457, 354, 511, 395, -229, -778, -222, 564, 313, -113, -301, -629, -25, 314, 219, -88, -284, -537, 384, 386, -211, -490, -471, 257, 33, 479, 260, -542, -179, -105, 784, 267, -304, -546, -229, 866, 865, -252, -776, -513, 115, 659, -13, -30, -531, -92, 7, 113, -41, -269, -397, 73, 388, 262, -427, -609, -201, 432, 248, 93, -445, 3, 519, 624, 50, -293, -505, -229, 554, -45, -225, -554, -162, -166, 141, -275, -295, -204, 98, 542, 64, -280, -58, 98, 475, 292, -221, -299, -154, 363, 499, -357, -225, -463, -219, 395, -3, 76, -165, -199, 536, -195, 111, -442, -553, 257, 415, 582, -869, -434, 289, 729, 826, -401, -1384, -853, 512, 454, -24, -673, -773, 437, 727, 575, -130, -852, -544, 512, 686, 385, -766, -916, 31, 563, 78, -481, -620, -380, 618, 801, -142, -902, -353, 188, 749, 344, -510, -369, -164, 506, 577, 74, -789, -481, 322, 779, 250, -381, -398, 67, 608, 322, -158, -657]
6238f57K76P71J80l03p38l2M95K17K32p96rL08K56J98m45l54Q8J091n23L8r82
6259f89N2k43Q25l17K54K36m29Q3P02K7r59j60J385q46L95q31K9L82O85k09n57
6280a85K91j21j53L19j24o89P33n9K82j3n02m95O16K29K35n06L4j61J15K56L57
6301D59l33k23L27M62P6j76r47n16Q26J206r60r37J095j852J233J205n39j604
6319a198J390r2J035j008q9q60J75M44J109m78n68k83M06K94Q6q99n09J266k16
6338EL62m21n74K55J50R81m56o87j17K94N08P55o71r90k7L89K75k36J91l67k2
6359d03Q37Mk04p23k66M94O67j8m73p05P17O60j58k51l03q2M37M17m67n40j79
6380e39N73P60l14p29j50J25O21L08m62o97n8N69M66j64n19l17M98N49q8l49o16
$$ y = [-657, -381, 390, 570, 267, -471, -503, -8, 209, 441, -355, -364, -56, 200, 398, -47, -401, -313, 778, 255, 293, -689, -637, -880, -55, -372, -118, 118, -311, -228, 474, 501, -458, -618, 767, -79, 316, -515, -486, -104, 581, 372, -185, 106, -15, -168, 151, 27, -662, 71, 12, 294, 281, -221, -716, -100, 129, 364, -142, -108, -269, -154, 102, 459, 126, -97, 230, 692, 768, 592, -355, -871, -45, 1161, 201, -736, 359, -1493, -260, 945, 406, -1198, 192, 100, 1135, 127, 38, -822, -647, -203, 906, 428, -140, -423, -17, 277, 363, -536, -1045, 221, 5, 367, -54, -628, -373, -223, 758, 302, -385, -502, -208, 300, 1055, 384, -606, -633, -244, 31, -205, -14, -381, -403, 434, 438, 234, -489, -755, -261, 406, 388, -85, -790, -73, 587, 429, 178, -125, -207, 230, 647, 180, -360, -539, 34, 794, 480, -249, -399, -274, 347, 655, 193, -504, -562, 7, 473, 309, -210, -527, -29, 520, 432, 83, -533]
6401e33K34M92M61l19p56j09N36M51r3m19m91L89M21L11m17r17L29N68M00j84
6421C54n78l37M69N05o2m26k55J38K38N43r6o47l23L04N95k9m85l07J43M80K26
6442D50k99m22j27L66N24p2m93k95M4M13L96l27m51k21M56L19n6k66j22M1K93
6463A51L09k73l31k52O10Q4L3n21k38L82J50K78l28m33Q2L09K56Ol79o6m6N21
6485C04l1j26m55J96L52l0j10k28k22L10K58J62l77m23J67K62K65k20k56r2J13
6506a81L61K18k35m02K0K91J82j38k66l01M06M39M8n46k35J21L54L02k40m15j84
6527d01J28N57j2j99m23l4N54K56k10l66l29L61L78P8m41l49J83M69K15j30o67
6548c82j06N17M00j30l15m10L22N06J9o55R6j58O21K28o43j72j0Q3P21%j061J44
$$ y = [-533, -299, 193, 654, 335, -421, -530, 6, 457, 364, -55, -546, -157, 264, 575, 158, -759, -430, 138, 538, 354, -224, -561, -92, 413, 351, -75, -330, -192, 46, 589, 493, -154, -477, -173, 422, 393, -92, -399, -256, 224, 450, 151, -271, -398, -32, 492, 420, -73, -368, -324, 89, 485, 158, -293, -514, -58, 261, 205, -61, -183, -142, 151, 460, 187, -144, -396, 214, 298, 331, -190, -428, -46, 104, 382, 54, -379, -297, 12, 268, 274, -105, -171, -217, 304, 273, 147, -308, -112, 240, 210, 100, -128, -350, -40, 218, 380, 3, -420, -253, 9, 274, 54, -202, -294, -181, 180, 398, 163, -239, -219, 72, 254, 116, -150, -451, -45, 394, 442, -104, -339, -218, 136, 438, 198, -217, -401, -273, 284, 272, 73, -350, -384, 170, 426, 216, -150, -479, -118, 260, 338, -103, -452, -269, 200, 415, 285, -382, -488, 29, 429, 299, -16, -426, -104, 402, 421, -234, -138, -296, 325, 553, -90, -262, -272, -189, 532, 532, -529, -385]
6570c85J15K52O45l07q19kL08Q47k22j020P4J73O12j03o5n40K12N18K80n0j057
6591e34k8L13Q15k41n21k01j13N00O03o21m35Q3K56J111q24k73j04l10P12O08
6611G96j036k43j92P44K63l73O5l81O00l2M1j28r51N72L64J60n99L31l72J93J60
6632a8N59n55j47j81N09L74o9p55m64O20K99J82n40m56J88R90K19o68q03P38J05
6653A27P4J46l44m22J99M93j21j4l42M18m7k15N8L08m59R1j1J70m55J87o2J89
6675c2K05L41n13Q5l82M05Q2l38n3k30M79K36j63m2L09m80K60k80K50n55j01R46
6697D29j19k54m53J42L15j47O30m47l54J25K33K84j26l29n88L68O66P9o47J81
6717a2k41N13mk07m70k39M12L91j07j27p35J93R61q0L58q79k90M04R27l80p20
$$ y = [-385, -270, -18, 627, 320, -499, -501, -193, 654, 432, -588, -514, -341, 271, 168, 103, -437, -225, 293, 573, 523, -534, -562, -249, 566, 325, -196, -397, -510, -10, 593, -28, -463, -380, -124, 987, 163, -110, -214, -524, 188, 796, -240, -483, -675, 69, 332, -41, 24, -357, 243, 211, 252, 124, -827, -255, 109, 269, -330, 1, -371, -178, -18, 541, -14, -161, -342, 167, 541, 472, -283, -747, -127, 172, 354, -186, -642, -454, 536, 755, 87, -716, 22, 127, 201, 347, 3, -419, -220, 273, 152, 138, -204, 214, 167, -48, 10, 318, -141, -50, -61, 109, -346, -159, -221, -32, 173, 514, 1, 86, -296, 109, 191, -147, -200, -430, 49, 285, 122, 80, 389, -91, 169, -111, 139, -416, -517, 429, 310, 56, -397, -255, 60, -87, 543, 96, -258, -133, 100, 384, 258, -71, -659, -291, 375, 454, -193, -12, -253, 260, 256, 49, -421, -660, -248, 143, 36, -91, -826, -633, 328, 248, 606, -273, -563, -159, 768, 388, -332]
6738c32k51J2R87K06l95o92l60R37J3M24j08j032K31Q18K07r10l47l2P07N56M3
6759F82q61m03M56O75k27j8p55J28N49j58K34n45O4J55M95l55j84j76L0L11Rk09
6781a03n08M5L85M97o2n88Q4j48Q38J81l28l65k03P14m86L41p13J72J21O50m68
6802E6k95m68L44J55Q66n8j275j68R48L42M14r46k43N9M67K7k5o43J89L27P9n20
6824c68k8q5L43N83j42n25o78O09O57N78q72k34J22p8O85j37r89j23P62j52M35
6845C63j63o23L28M40J55n15q53N80K74M32l04j03j01m65O24K04L78m91j010N53
6865b97N20K72o27l80J85K14P12l70j67n04J84N12K24l54m16k0K47K85J43l89
6885b6k05k4N17J27o5k18k17N4L31J38k45m49J80L04J56o8n04l4K27K49P7l70
$$ y = [-332, -583, -571, 416, 622, 227, -465, -825, 112, 125, 549, 441, -591, -360, 458, 665, -245, -592, -624, 83, 639, 682, -179, -582, -126, 549, 322, 304, -451, -323, 226, 68, 302, -243, -179, -24, 471, 116, -68, -244, -214, 97, 106, -103, -611, -566, -181, 316, 254, -334, -250, -398, 440, 621, 293, -72, -275, 439, -47, 294, -419, -247, -126, 524, 56, -239, -707, -363, -208, 658, 600, -675, -843, 105, 447, 861, -85, -328, -269, 198, 225, 200, -443, -254, 73, 152, -368, -396, -481, -138, 445, 303, -222, -900, -291, 366, 944, 72, -162, -40, -118, 567, 430, -559, -682, 80, -72, 363, 200, -423, -95, 345, 500, -15, -868, -288, -14, 418, 114, 11, -90, -555, 69, 273, 651, 160, -850, -297, 223, 495, -132, -512, -327, -113, 599, 229, 62, -442, -258, 254, 478, 124, -292, -312, -65, 220, 363, -26, -231, -255, 262, 389, 324, 106, -111, -57, 274, 412, 167, -282, -102, 202, 358, 290, -214, -248, -21, 228, 305, -65]
6907f5j58P5K27J74j82k21p2K20L76n6n03j14L72K53Ol52k57K36K21J16k94l40
6929c38j93P60L3p4k36m85M79N63l01j48m35r0O00J84q1o62J73K85L82J76p47
6950a55l44O0O85K99m46m26r6N26L25J22p34o95N70M74K19k15o19l0N29L73M3
6971D65q05j07K39O21K97o92k92j23M62N16q4o87j62K1M20M51q47pl56J128J07
6992E65o60l82l62P51N15Km19p58K88L95O20m13l22j59L17M99L0l67m77L70J76
7013B09k29j74k98q0L05O43l66j10l87M47k75M04J66n13N4K49J70J32m85j0K34
7034H6K68p8l52k36K24L73l01N20q66q3%N42j86P2n07O29J98j86k73L61l70J56
7056iO31j15p15q2K52Q0N2j80l59J29M02O1J50m50j17M51P5Q3m34j77K3J04L40
$$ y = [-65, -223, -148, 79, 253, 71, -150, -222, -2, 374, 318, -185, -299, 73, 326, 332, -20, -277, -41, 180, 296, 2, -338, -531, 229, 262, 188, -48, -533, -54, 509, 208, 60, -375, -465, 135, 319, 238, -424, -251, 34, 416, 592, -155, -499, -439, 246, 545, 99, -327, -423, 103, 428, 550, -184, -879, -309, 165, 384, 169, -450, -480, 49, 422, 465, -340, -447, -208, 413, 710, 18, -274, -397, 65, 581, 497, -190, -352, -331, 89, 540, -307, -314, -670, 458, 565, -95, -477, -839, -88, 427, 429, 10, -748, -460, -65, 555, 142, -180, -339, -22, 477, 507, 140, -337, 33, 209, -20, -194, -492, -572, -267, 376, 10, -100, -487, -40, -315, 89, 255, -258, -204, 45, 215, 347, -138, -148, 86, 354, 276, -76, -312, -88, 285, -16, 504, -362, -445, -445, 97, -89, -17, -524, 105, 303, 117, -156, 205, -165, -9, 622, 507, -208, -290, -38, 42, 94, -86, -445, -316, 86, 147, 297, -153, -270, 181, 256, 339, -95, -272, -249, -145, 195]
7079A95N3o00k01K37O78j33j60l38j38L17N02j20m75k81K76N01k2j19m32k7M24
7100A37K27p2n23j54J93O08n6m72j00o6L62K78l56j42k13L52N06m02k97k70K11
7121b49M78J26k19l91k1M53K61k35m29k35L30M29J41l73m97J65L74L57j48o31
7141c14j08J79O94n0m82m50J14O79K93m98m40K0L13N26j02o62j57J11O96J45l35
7162A72n64q0O13M51l15o35j08L15M76J63n13m01J53M16K80j98n04j17L49M65
7182D18%m59l92K16L14L36m22k75n8K05M33J23o46j74K67K33L18m65m30J22M43
7203A07K24n1o06j60L60M66j4n10j51PM09K50k82l61Q9J55M38j71m17l3Q7L68
7225B04K12k70m98P5L14M21k85l74j16J86M62l7k86m04J63J50L66j88j51l45M60
$$ y = [195, 248, -352, -553, -316, 362, 229, 69, -269, -407, -90, 412, 292, -183, -464, -188, 313, 291, 172, -260, -287, 137, 364, 292, -231, -385, -192, 416, 360, -112, -212, -278, 84, 362, 6, -136, -349, 3, 509, 107, -190, -460, -249, 229, 355, 136, -255, -276, 177, 438, 203, -226, -461, -131, 298, 439, 66, -431, -266, 108, 465, 317, -314, -422, -243, 451, 401, -81, -531, -417, 262, 555, 57, -383, -363, -50, 476, 374, -288, -445, -334, 362, 507, 172, -392, -472, 141, 592, 277, -358, -466, -151, 325, 488, -25, -426, -273, 143, 423, 225, -279, -396, -47, 418, 418, -41, -433, -217, 97, 433, 11, -264, -322, -117, 316, 439, -207, -381, -114, 119, 437, -28, -458, -336, 107, 331, 280, -326, -486, -126, 340, 326, -184, -335, -328, 81, 331, 49, -312, -223, -68, 370, 199, -218, -251, -164, 204, 416, 146, -352, -277, 37, 458, 173, -201, -317, -131, 331, 294, 8, -396, -233, -83, 283, 95, -56, -401, 59]
7246E9K43J52l82n33K21L86K43l09l33j13K39L69P9k70l64J56L23J65o2l28l64
7267d23L41M25n6j10o05J48L89J74k23l32j58J93M66P1l74j58j48N47K24q9l87
7288h5k62K87K61M2k56k74j6N08K65m22k10j48O9N03P2m20l37J36N36L0r2l85
7310a98l1J60L98r3m32j48K08M51J96m92k74KL19K28j99k77j59L28J91J85l54
7331Il46R5N66Rk75l75R7L25L05j93n26j75K26O39N5l07n42O1O68Kl69j35l85
7354e71M57N05ql70m86L00P1N85k75n73l78O95N88k33n73j82K13O17J04k86o99
7375d99J22L59M59j86l68l59K91L68K45k72n57j00O09L57j60o36r3J76N67J59
7395D82l76o42N0N79K25r8n52J90K37K55l88N04q09M01j42L09qj1l19NJ47j33
$$ y = [59, 302, 454, 72, -461, -240, 146, 389, 80, -253, -366, -127, 242, 321, 51, -313, -157, 166, 331, 269, -59, -423, -82, 343, 287, 177, -428, -280, 109, 283, 60, -272, -430, -237, 229, 300, -74, -232, -380, 167, 391, 302, -85, -347, -60, 201, 243, -13, -287, -303, 205, 470, 48, -162, -310, -241, 262, 334, -86, -423, -287, 249, 279, 187, -198, -229, -69, 329, 236, -196, -344, -136, 315, 511, 19, -255, -253, 66, 294, 95, -182, -341, -13, 178, 363, 9, -337, -242, 324, 333, 58, -317, -220, 105, 410, 217, -309, -484, -258, 381, 436, 129, -413, -352, 316, 318, -51, -186, -571, -114, 391, 383, 13, -473, -173, -102, 483, 208, -365, -743, -48, 540, 307, -266, -448, -235, 382, 486, 200, -499, -377, -18, 441, 255, -113, -472, -181, 187, 432, 160, -397, -497, 112, 469, 309, -327, -420, -244, 323, 482, 106, -536, -486, 93, 318, 220, -332, -142, 95, 350, -38, 466, -343, 58, -84, 225, 217, 206, -113, -108, 39, -94]
7417i4o4N6P6k7K73N6o13R7K07K61k53R6m41L68k81K22j05j41J10N34j84m6p7
7440C0l99K57M86j26o21L81N0n7K64l54l14J13M00J92j38k48l48M10J21L13n65
7461a53J53q4J23r2L47k64k53J44J52O26o64p24M07M67J48J40p93j67L24M61J17
7482D15n72j36j97M31L11j1l83m68N07L63K09m36m40k4P03J66j76n71k48L58N46
7503C47M7l23l11j86M07M76j78m25l04K76N03J13n39l19Q1L80N24l32m49l42M85
7524f9L59O7l69l99J24L65L19j29m93j37L04L91Jk88l64J10M60J2k89j49k82O31
7546A75J16k14l38K01p9L89O9l87r3l2M85m2j8o05K52K58J53k12r2j08J38J23
7568A39P4m21k8j16P36ol59m49L44m9O22j53n01j52N1P47l96R0l80k96K50Q06
$$ y = [-94, -158, -102, -26, -53, 220, 276, -337, -240, -33, 228, -25, 71, -370, -2, -283, -61, -166, -307, -197, 337, 153, 107, 30, -369, -112, 374, 248, -373, 8, 58, 1, 265, -89, -403, -290, 110, 302, 164, -84, -432, -22, 99, 412, -153, 0, -84, 39, -53, 294, 30, -223, -79, 73, 699, 35, -689, -282, 185, 333, 473, -320, -487, -163, 298, 415, -157, -293, -490, -59, 252, 241, -142, -610, -103, 260, 469, 33, -407, -431, 272, 438, 262, -309, -557, -199, 347, 394, 71, -240, -426, -19, 457, 279, -146, -450, -174, 329, 442, -97, -416, -335, 45, 569, 237, -212, -554, -69, 290, 357, -12, -411, -287, 78, 397, 268, -225, -362, -58, 333, 334, 46, -318, -208, 252, 264, -25, -174, -456, 175, 291, 77, -261, -60, -139, 250, 319, -68, -161, -193, 292, 250, 232, -373, -121, 137, 290, 78, -14, -122, 16, 139, 213, -208, -236, -352, 384, 378, 19, -430, -86, -135, 487, 334, -167, -319, -268, 479, 83, 173, -207, -503, -253, 553]
7590E53M2n64o89M25O00P1m00q5K0o6L93k69K8p03R32J20k53O6o67q2N05K58m8
7613A87k51l50J02M57M37l51r55N23O90kl35k68k43J07L09n0L19o55l94J320l31
7634B66j07m36M0N9K15Q60r30l31m6L74L33n23Q8m44J85P24n29M64J33p99M67
7655F3K97K15p37J52n80M55K10L9n27M54J56j8J90n30r4j0O86j04J77k41o74M94
7677G3K74l11l22oL89N24r5j260P16j66L32M51o46k02M77J11N63j94j014j28K93
7698a41L93K08o23o2j71M47M00l51o49j30Q72J84l73r9m81K49O47J23k15m43l72
7719e87N29M98j85n25q2K13M45L6l75l77j18N94K99k10l74j89L1O08Q8l42n53
7740e76L92K29M53k18o24rQ9N75Q7m89j78M9M76J48m22j23l28M01N04j23m56j90
$$ y = [553, 595, 31, -658, -233, 367, 438, 38, -47, -27, -93, 300, 31, 59, -644, 288, 408, 155, 221, -446, -528, -23, 235, 187, -64, -414, -312, 145, 582, 231, -724, -201, 489, 487, 152, -116, -359, -252, 57, 7, 326, -329, -723, 597, 266, 159, -277, -237, -178, 37, 897, -33, -364, -410, -36, 297, -226, -138, -582, -397, 327, -202, 262, 395, -404, 63, 360, 575, -162, -10, -590, -135, 75, 114, -413, 41, 197, 179, 369, -161, -255, -265, 421, 317, 494, 253, -421, 73, 347, 36, -286, -292, 97, 621, 526, -734, -18, -184, 148, 599, -47, -249, 228, 339, 902, 708, -306, -434, -141, 252, 460, -163, -225, -396, 51, 451, 100, -549, -679, 193, 377, 4, -95, -576, -327, 320, 443, 228, -215, -587, -58, 440, 255, -270, -352, -139, 306, 342, -33, -410, -528, 66, 365, 155, -219, -408, -377, 231, 319, -23, -576, -184, 45, 498, 280, -344, -353, -264, 311, 398, -91, -269, -220, 256, 404, -18, -141, -469, -68, 436, 313, -143, -333]
7762c33K10K81J00j79l58PL25K91m6m98j75J72L65L0l13q1o3L52L28l31k32j11
7784b59K30K04J84l67j85K0K33K88j24n57M6K67R9J69l86j88J17L38Q8j36l37
7805b56m3M10J89k52m0k50J86K28L81o25l08J48L39M64l12n83J26l25P94k94N2
7826B9j48O2K27L59k39k57k44Q6L53j45J92l71j57L8M28p8m00N4l02Q31R1n43
7848a34k4K2K95j61M60m84J37j33N21j33p38k4J56M65L35l64j81j68M13K3k26
7869E7j62N4k7K02K59k88l58J2M01J47J22p70k5K21L89P5m90k66K15M46M1j87
7891F8k59k66N11K33J05l82l20K1O70N4m38j67k34M95M58k95k50m61L29M77L9
7912C88l32l38p4O16J86j85m63k40K54M93J8l76n21J23N55L24l16n40Q3K58M97
$$ y = [-333, -123, 158, 258, 79, -279, -272, 53, 344, 298, -200, -375, -203, 162, 192, -121, -202, -265, 87, 415, 84, -148, -259, -29, 175, 359, -8, -193, -173, 60, 348, 224, -333, -287, -20, 79, 248, -138, -326, -209, 129, 217, 81, -256, -299, 111, 300, 48, 8, -242, -56, 172, 553, -72, -380, -232, 107, 571, 259, -324, -198, -523, 271, -23, 29, -119, -57, 170, 529, 290, 33, -211, -125, 228, 83, 275, -96, -253, -215, 213, 135, -265, -211, -513, 318, 409, -134, -158, -136, 159, -2, 458, -26, 111, -22, 499, 366, -372, -396, -240, 225, 560, 196, 15, -153, 260, 283, 57, -105, -51, -78, 124, 383, 95, -263, -251, 150, 297, 419, -351, -376, -155, 234, 309, -181, -447, -232, 214, 255, 68, -191, -457, 54, 287, 392, 10, -310, -289, 381, 435, -3, -170, -404, 91, 549, 254, 4, -457, -128, 349, 388, 56, -282, -356, 260, 446, 261, -202, -442, -188, 305, 323, -53, -574, -451, 104, 428, 112, -428, -345, -87, 410]
7933D10p7l43l20PO07K32j87n56j30N08J71p0l44k39K14J58K66k68l64M6L35K24
7955B80q7l07j15J16K36J0j52l16J72K72J9n3k81k6J57M09j35l60j87L98K60l
7977C07l32k89J29J98K05L1k73k65J85K60J05k93l24K30L05K1p4k46k03J76O26
7998D79k10m05o7j23N93j09p8m61M0L26L71p3l27l25K36M28m8k16k42j5Q9M33
8020B96P9k96l98J26K84M53m50l55j32K51L95J08k79m04k6M38J76j45l58j5Q9
8041a63L61K46n14l74J59N30J92k22m16k18R0Q09o6o67p6o7N68O8j78k54j04J61
8063a35K75K78n45l37L22L88J20j92m83J17J07L19Q5m37n7O3K18J90m09j67J36
8084a44K65K66k21m12j7K60K64k6l89m1J86K85J29l18k25j19N14j7j38k92k01
$$ y = [410, 333, -10, -330, -323, 284, 516, 329, -227, -357, 151, 322, 252, -92, -331, -117, 41, 307, 39, -325, -279, 56, 280, 193, -114, -229, -113, 123, 133, -19, -335, -163, 109, 128, 75, -206, -232, -75, 334, 199, -161, -348, 50, 310, 307, -25, -314, -185, 13, 218, 249, -24, -289, -104, 156, 261, -32, -356, -126, 179, 200, 126, -120, -323, -147, 479, 269, -136, -203, -326, 267, 158, 80, -381, -341, -15, 356, 283, -44, -369, -133, 295, 247, 31, -211, -226, -137, 296, 375, 79, -319, -193, 91, 544, 94, -261, -393, -142, 253, 361, 82, -322, -348, 90, 266, 121, -237, -252, -163, 198, 444, -70, -444, -285, 245, 437, 215, -201, -419, -329, 480, 414, -253, -329, -396, 172, 240, 62, -192, -296, -135, 140, 418, -127, -464, -142, 246, 366, 174, -309, -192, -85, 234, 319, -118, -175, -112, 106, 296, -113, -280, -144, 121, 387, 166, -246, -263, -3, 261, 235, -154, -195, -9, 276, 405, 87, -138, -257, 257, 240, 102, -190, -391]
8105c91M26J76J01l68k82P6O01J70m08m52j00M04M22o4m95k68K57L60K44m02l87
8126c80R9M74K91l7q77l8K70N85J25m71n54O4M62M49j12n77k31M14M19Q3m54l01
8148b97j8M22L81l47m42l11L75N45J65n62l59K67M61K15m63k39l15L53M91J08
8168D30k62m21M16J76l78L42l27m15L22M88l96j77Q2J83L87m89P0L96k52q5K84
8189C74n05J12
$$ y = [-391, 35, 211, 312, -56, -338, -262, 339, 509, 101, -351, -451, -47, 375, 311, -184, -452, -195, 165, 409, 7, -380, -281, 193, 484, 447, -430, -468, -198, 387, 512, 41, -513, -449, 13, 462, 350, -227, -458, -44, 375, 458, 4, -297, -315, 107, 488, 141, -301, -612, -237, 308, 473, -89, -448, -181, 280, 495, 32, -207, -522, -169, 322, 430, 168, -253, 163, 339, -39, 303, -24, -439, -117, 371, -25, -202, -120, 63, 450, -39, 31, 427, 175, 90, 374, -131, -19]
8191a9
$$ Imaginary data points
##PAGE= N=2
##DATA TABLE= (X++(I..I)), XYDATA
0@%%%%%%%%%qJ6j6J6j6K4l2M0m8N6p2Q2r7J19j36J58j88K18k51K91l35L82m35
32b32M94n59O33p13P99q97J005j118J244j385J535j700J882k079K294k530K789
49A462l072L384l728M109m536N012n548O157o855P667q624R772j1178J2946j5248
64h280J8389k2943L0174m3485P5991l04803m54059N20216N27332N9957m03077
75d588k64833P7279L17621J77887j20760l34801j29937K95160M55538J7206m83093
86B679l98163J81484M59034J61560k56317k80040j8756J79430J37613m1538k02824
97g5838j60416Q7483K83980J25506k39473l25627J2680L00591J63491j46459j85582
108a59664K1148J44663O9791m9886r4184n2943M9598J49646J06839r5870j99332
$$ y = [0, 0, 0, 0, 0, 0, 0, 0, 0, 0, -8, 8, -8, 8, -8, 16, -16, 24, -24, 32, -40, 42, -55, 64, -72, 86, -102, 116, -135, 156, -179, 203, -232, 262, -297, 336, -377, 422, -475, 530, -588, 656, -729, 806, -894, 988, -1091, 1203, -1327, 1462, -1610, 1774, -1954, 2155, -2381, 2631, -2917, 3240, -3615, 4052, -4572, 5200, -5978, 6968, -8280, 10109, -12834, 17340, -26145, 49846, -254957, -709016, -188800, 338532, 398489, -4588, -269421, -192142, 125479, 303366, 182606, -152195, -282132, 13028, 468566, 485772, 2679, -395484, -214000, 245034, 406594, 150277, -129763, -148519, 30911, 168524, 126986, -75838, -236254, -148771, 135209, 260715, 21242, -304385, -291705, 8886, 172377, 25918, -159664, -138516, 6147, 75938, 26052, -68132, -121075, -71477, 78169, 185008, 89138, -110194]
119a10194j4835K05372J20908j36610j67037N4308J77142M8751j14761j18663
129e5619j8519N8577Q8677N7454o3625j53354m5665J43588J19335j10457j94699
140a74307M779J91624J09441r2559j51000n4090M7501R1852Q4904o89j14400r4110
152a51054P8149J59914L521j64753q3262J23442J60479J2827j04012q9388k1957
163g6094M2063J01212Q8525m0044j43757n5611J14856J08165o3486j32517j2248
174f8936J01553P2422j4794o1432p8314o2158L5074J36352P8825j03437j59850
185a24695j453J38729O7664p9873r0658P487O8543N9559K1049m8201j08930n0268
197a41047J11024J64483J837j68355j05134R3078J41052K415j04536o4279K9330
$$ y = [-110194, -125029, 80343, 201251, 64641, -102396, -48088, 129054, 177805, 63044, -55619, -74138, -15561, 73116, 130570, 66945, -86409, -132074, 11514, 130849, 20392, -174307, -169528, 22096, 131537, 38978, -112022, -166112, -118611, -26759, 58145, 57456, -56944, -151054, -72905, 87009, 90530, -74223, -157485, -34043, 126436, 139263, 35251, -54137, -76094, -34031, 67181, 155706, 115662, -28095, -83706, 31150, 139315, 75829, -56688, -68936, 32617, 105039, 90245, 28813, -49501, -111659, -76585, 59767, 138592, 35155, -124695, -126148, 12581, 80245, 372, -90286, -82799, -14256, 45303, 66352, 18151, -90779, -141047, -30023, 134460, 136297, -32058, -137192, -44114, 96938, 99353, -5183, -69462, -40132]
208d0132P6954O5660q026j07709j08862M0277J66754P7045j28569j59148K5772
219i9984J52272N6767r5818j02306K518P6529P1110Q838p8051j04272m19J33997
231B1181J03874p7989j57377r158J49852Q9782q6377j25052j350R8352P7290m842
243G8186p3240q2313j647J06701R6769n6296j51217l0854J47223J19784p9331
254G3765j65201l0862J22067J09590j4055j00670q6747P408J05224R5275m6089
265F9705j55230n9628J37710J59907m2725j92856q6081J18374J55068J4785j12152
276F877j05321o91J01297J04942j7242j42438r4611R6039J78695K0836j72239
287b3856j34261P2234J65397N2723r2792j10629k0859P4679R8515J8163j01809
$$ y = [-40132, 36822, 102482, 94456, -13253, -122115, -81838, 84916, 161961, 33392, -125756, -99984, 52288, 109055, 13237, -89069, -86551, -10022, 61088, 69926, -8125, -112397, -112816, 21181, 125055, 47066, -110311, -119469, 30383, 120165, 33788, -91264, -92614, 5738, 83028, 78186, 4946, -77367, -79014, 27687, 124456, 68160, -83057, -113911, 33312, 153096, 73765, -91436, -122298, -231, 109359, 95304, -5366, -92113, -84705, 20519, 115794, 69705, -85525, -145153, -7443, 152464, 109739, -83117, -169198, -50824, 104244, 119029, 6877, -98444, -99135, 2162, 107104, 89862, -52576, -147187, -51148, 127547, 148383, -23856, -158117, -85883, 79514, 132237, 39445, -71184, -92043, -17364, 81151, 99314, -2495]
298b495j12479L1152J53271P3869j14363j49074J2556J38137P5991n9609r6498
309d9542k9923M3979P1310L5513m9183r4605k0457R8417R3670m5311j23346k8050
321i7528R6159P8007l0647p1722k2057K6220L6975K8130n904n1849m1192L7690
333a7718P8708N511q1358m8058N1193O5392j2616n2807j3718J9495R787N971J2179
346B1961j1783m1384j0718M9773L7964l7822n6493J0590N3445J0266l3903j3045
358b1149J4542M06o044K0428J9958k8815m2064J9002O1210J0391n4165l3677K9822
371a0155L6388l670j5976m185j1331j0850K6228M1566j5552o8738k1322O5561
383G964N8052l3680p2812j1860M8367L5783n126k4624l0162j7421L1100O2096
$$ y = [-2495, -114974, -83822, 69449, 143318, 28955, -120119, -107563, 30574, 106565, 46956, -49542, -79465, -35486, 35824, 71337, 22154, -72451, -92908, 5509, 99179, 53868, -69478, -97528, -1369, 76638, 45991, -25731, -47788, -21568, 15407, 43537, 37633, -14216, -55408, -17718, 60990, 66501, -14857, -62915, -11722, 53670, 41054, -11753, -25471, -5976, 3811, 9782, 21961, 10178, -31206, -41924, 7849, 45813, 7991, -48502, -37912, 15533, 25799, -8104, -21149, -6607, -6201, -12245, 8183, 28141, -674, -42738, -23736, 37474, 47865, -6300, -39977, -10155, 26233, 22563, 6587, 2402, -8929, -19779, 6449, 48015, 32463, -36275, -57597, 7964, 66016, 32336, -40476, -52336, -3969, 31814, 26688, 2064, -28098, -45519, -14419, 47677]
395D7677O978p7943o0688N1713R7357O631q8845n8151M0614P1319J9825l6304
407B0183n1225k6352L1698P4264K8482p3320r0262K2743J14009M7996q4241r7661
419h3686J6182R3744M9547l8004p0717l4300L2651P6067L9557o0127r9751l805
431h2642J11156P9858o3407j19031j4192R8970P6687l0604q4865m2485L3856P5299
443C8600M1820m8456r7897k4917R5809R7990l6750j27343m6918R0482J00138j4144
455F8414r4992n6588L3892P9259M5033l9553r4219m0462P8534J11160m414j22195
467c6131p7177P0109J19284J4934r3616p5209K3039Q1232N2937k4744q2150n3830
479h1322M8058J05856K8971r5057r6853K9544J11316M3187p1597q3345R05O4603
$$ y = [47677, 54655, -23288, -83976, -32263, 65094, 71725, -17120, -75271, -34657, 36662, 56487, 20183, -31042, -57394, -25696, 48568, 77050, 3730, -86532, -63789, 50220, 98216, 13975, -83686, -67504, 26240, 75787, 37783, -32934, -67234, -34583, 41484, 81041, 20914, -78837, -82642, 28514, 108372, 44965, -74066, -88258, 10712, 87399, 56795, -28070, -70555, -36699, 38600, 80420, 31964, -65933, -90850, 4959, 102949, 66199, -61144, -108062, -17580, 82558, 68414, -26578, -83166, -49274, 29985, 75018, 35465, -58754, -99216, -20682, 90478, 86064, -36131, -113308, -43199, 76085, 91019, -2597, -77806, -54767, 26465, 79402, 54658, -27492, -81322, -33264, 72592, 101563, 6506, -90347, -60803, 50513, 93700, 22103, -61242, -60337, 4266]
491D266N0535q421n7759n4671J0845P6293M9910m9563q9319q567Q1443N7274l8204
504B4062p0385j0720M6204L9607P33k8044l3856p703L9212N0049p403n9331k7265
517d4840M5923N1603j4794n1352j0761L3987K4800p517j6797j2362j0871N246
529g735K7373J2327k8865l1570J3055L4241l706l6694j2291K6433J9570j1981
541A57j5881k31k655p887J1259K3683j449k6253o634K5331J5583j7303j7317J2610
555f987K2376K928o383K025m971j8104J671L3662J9909k7868l6349P780L5887
568B5576R149k5572k3398R63J5275J6477Q602j8774m3305j6158M4257N1494j7105
581B7481o7763k6499M6617N3280n254m9826l4555J4371M8218M0393j1347o3018
$$ y = [4266, 54801, 46380, -11379, -66050, -55205, 21088, 70998, 21435, -67884, -76451, 4992, 62266, 24062, -46323, -57043, -10839, 28768, 29501, 1457, -32399, -40102, -890, 49159, 41756, -17575, -44840, 1083, 52686, 37892, -13460, -24221, 9766, 34566, 27049, 10252, -2110, -12981, -7735, 19638, 31965, 3100, -28470, -15415, 18826, 15120, -21574, -33865, -7432, 12138, 157, -15724, -15955, -18610, -26497, -15238, 8445, 6996, -19257, -25891, -560, 15023, -2280, -19597, -6987, 15389, 18317, 11934, 13959, 8988, -9116, -7445, 26217, 46126, 18258, -18091, -10311, 25576, 34725, 9153, -14245, -13282, 1993, 18470, 27072, 8298, -35007, -51165, -6908, 44586, 27481, -40282, -66781, -20164, 33116, 27862, -21964, -56519, -42148, 6070, 46463, 35116, -27902]
593b7902m3801M1196Q6445J9352p4550o6824K9302Q3580L2426n1904o9687j1096
605e3463N6147O7759Q217p0432p7976J0771R3361N7090n7219r5631q994Q1388
617A1018O1452l3966q3300l7202M3989P6369L0222n2742q4713j8788P6074P7989
629F6402k1755q8670l2562O4406P0645j2787p1490l9874L3564O6477L2949l1976
641C5329o6129k8194M8098O9141j287o9603l7721M7332O3431r316o7888l7664
653e4471L3057N7348J9486l3192n1616j8812L6239N2230k129o1697l8624M3903
665a8278O8368m082p4234m7174L6629O9142K1190m0532n2091j0951M0672N2665
677D1324J817n9549m7610L5486Q1533K0005p0002o8261J8319P5489L9782l2483
$$ y = [-27902, -71703, -30507, 55938, 75290, 740, -66084, -36782, 46798, 79224, 27320, -42367, -53463, 2684, 70443, 78660, 8228, -69748, -58977, 34384, 91474, 34255, -61376, -70370, 11018, 72470, 38504, -44796, -81998, -38009, 38360, 68582, 15840, -68873, -87661, -11587, 66402, 44647, -44023, -76585, -12179, 58466, 45679, -25811, -65685, -32121, 34356, 67305, 35329, -30800, -58994, -10896, 58245, 56958, -12645, -50366, -3034, 60397, 51081, -16807, -54471, -21414, 35934, 55420, 22228, -29388, -48200, -11961, 40269, 38140, -23557, -62181, -18278, 50090, 46008, -28226, -75400, -38771, 30371, 51561, 11029, -41062, -52013, -11341, 41324, 43141, -16408, -64018, -28532, 53001, 73006, 3004, -65257, -46938, 28551, 68333, 35850]
689C5850n7633k2114L0966N2728J7290m6612o2223L017P3034M9595m0810p8924
701d5836j9319N4105N3497n224m5448l3533O140L7583L3205j3391n3504k9113
713f0838M0514O3456N691n6045m4313J6233M5365K1571j2436k3379j4233O398
725a2016K5996J8104j9540l8082l259M2550L3949j6956m1465j7708J4061K1399
737G033J3580J095j5261k2675k597K4318J5170k1775k8565Q889L4770J4525k0907
750G600k7907r622R291K1039K0814j56k7745k2847J4690L1448K50l0627j2015
763b5787K7118K8772n842k8916j8197M963K0431K1280L208k2696k3699Q189L0445
776A9269N321l2525k1745K4959L8711j923l8733k7037J1275K9824J7199r888k7645
$$ y = [35850, -21783, -43897, -12931, 39797, 57087, 10475, -51748, -48731, 24303, 73898, 33088, -45836, -65155, -11050, 42447, 37223, -8225, -41758, -35618, 1965, 35170, 21779, -31725, -60838, -20324, 43132, 48823, -7222, -51535, -35302, 10063, 31634, 19198, -4181, -18414, -12016, 13980, 32084, 12544, -25538, -28797, 13753, 47702, 30746, -10719, -28427, -14366, 7033, 20613, 21708, 6447, -16228, -18825, 5493, 20663, -1112, -29677, -20788, 13982, 28507, 7600, -20307, -29929, -20638, 401, 21215, 21059, -6686, -29533, -14843, 16605, 16855, -13772, -25787, 1331, 30103, 24261, -4655, -22852, -17889, 2542, 23822, 27030, 4334, -19365, -11176, 19269, 24590, -7935, -29680, -4721, 33990, 32067, -6666, -33703, -22428, 7396, 24595, 14707, -12938]
789a2938j7134J7777L5306K951m2440l3719K7475N7169J1251m9925m6182J2219
801c8190M9972K9614j8856m4114k0803K9563N1710J2535n2009n8252J8100P7130
813C6400L9359m9066p3228q621O1052N3235j3139o0132l9994K4800O5919L0497
825F7082m8397p7479j1424P4372O8410k4733q3549l7894M7238O7668Q011n4231
837d926n2624Q498O1394M8549k3707p5391l7407N1058Q0099J0328o8229n5797
849e8155K1944O3899K6097l5455m9572p331M2130M7002k698n5518m6385K1244
861c2798O5422K7590m4216n5344J885M6884K6720k2869l8381r134K7139L2617
873B5515K526l4824l6051P038M6265K8267k5856m3630k883L7508K3927j7727l0472
$$ y = [-12938, -30072, -12295, 23011, 25962, -16478, -50197, -22722, 34447, 45698, -4227, -50409, -38190, 11782, 41396, 22540, -21574, -42377, -12814, 38896, 51431, -578, -58830, -40730, 36400, 75759, 26693, -46535, -55156, 5896, 59131, 45992, -14140, -54134, -29334, 36585, 67082, 18685, -58794, -70218, 4154, 72564, 47831, -35718, -73612, -26374, 41294, 49305, -4926, -57550, -49052, 12342, 60891, 37184, -38207, -75614, -24556, 55543, 65871, -2358, -58155, -36211, 27688, 53785, 18330, -31242, -38573, 3557, 50559, 47861, -7657, -54042, -32798, 32624, 60214, 15998, -39346, -37461, 9423, 36143, 13274, -25107, -34241, -7102, 25515, 28041, -6783, -42834, -35796, 10469, 38736, 12880, -30750, -33633, 3875, 27802, 10075, -20397]
886b0397l795K4190K4402M44k4581k5543K674L3161K5917j5686l7397r004L0635
899E020K5994j2693l1333r804J9232K3454L608j8391k4346o309K2438K7757k750
912B1877l3094k0492J8362L1918K989k5904k0598N525K1412J5773k979k0121j9615
925b4947M960K8594J8491j6622l1055l944K7056K2205o795k3271j4671O302K1134
$$ y = [-20397, -24192, -2, 24400, 24844, 263, -25280, -22606, 10555, 36472, 20786, -16611, -25615, 5020, 31014, 18321, -13012, -22816, -3584, 19870, 23478, 5087, -19259, -25568, -3130, 24627, 21877, -11217, -31709, -13347, 18571, 21560, -4344, -24942, -19417, 1995, 17768, 14789, -5332, -24947, -19987, 8607, 27098, 10476, -20579, -24523, 2533, 24738, 17943, -5328, -19999, -13697, 7437]
$$ [...]
8191a92
##END NTUPLES=NMR FID
##END=
