##TITLE=1H_92-Eth
 200.13MHz, CDCl3,
 8 sc
 
 28.1.2025
##JCAMPDX= 6.0         $$ Bruker NMR JCAMP-DX V2.0
##DATA TYPE= NMR FID
##DATA CLASS= NTUPLES
##ORIGIN= UXNMR, Bruker Analytische Messtechnik GmbH
##OWNER= pz
$$ XWIN-NMR		Version 3.5
$$ Tue Jan 28 16:19:09 2025 Russian Standard Time (UT+4h)  she@DPX200
##.OBSERVE FREQUENCY= 200.1313
##.OBSERVE NUCLEUS= ^1H
##.DELAY= (6, 6)
##.ACQUISITION MODE= SIMULTANEOUS
##.ACQUISITION SCHEME= undefined
##.AVERAGES= 8
##.DIGITISER RES= 18
##SPECTROMETER/DATA SYSTEM= spect
##.PULSE SEQUENCE= zg30
##.SOLVENT NAME= DMSO
##.SHIFT REFERENCE= (INTERNAL, DMSO, 0, 14.3821)
##AUDIT TRAIL= $$ (NUMBER, WHEN, WHO, WHERE, WHAT)
$$ ##TITLE= Audit trail, XWIN-NMR		Version 3.5
$$ ##JCAMPDX= 5.01
$$ ##ORIGIN= Bruker BioSpin GmbH
$$ ##OWNER= she
$$ F:/spectra/data/she/nmr/H-C/1/audita.txt
$$ ##AUDIT TRAIL=  $$ (NUMBER, WHEN, WHO, WHERE, WHAT)
(   1,<2025-01-28 16:18:12.51 +0400>,<she>,<DPX200>,
      <created by zg, POWCHK disabled, PULCHK disabled
       configuration hash MD5:
       00 E9 B6 7A A2 85 ED C7 34 08 36 98 17 FE 4E 26
       data hash MD5: 16K
       D9 82 14 FD 1F E5 5D A1 B7 F0 CC F8 7F AF 66 A9>)
$$ ##END=
$$ 
$$ hash MD5
$$ 9C F4 51 6B 84 12 10 31 C9 A3 68 35 E6 10 E5 B2
##$RELAX= 
##$RELAX= 
##$RELAX= 
##$RELAX= 
##$RELAX= 
##$RELAX= 
$$ Bruker specific parameters
$$ --------------------------
##$DU= <F:/spectra>
##$EXPNO= 1
##$NAME= <H-C>
##$PROCNO= 1
##$TYPE= <nmr>
##$USER= <she>
##$AMP= (0..31)
100 100 100 100 100 100 100 100 100 100 100 100 100 100 100 100 100 100 
100 100 100 100 100 100 100 100 100 100 100 100 100 100 
##$AQSEQ= 0
##$AQ_mod= 1
##$AUNM= <au_zg>
##$AUTOPOS= <>
##$BF1= 200.13
##$BF2= 200.13
##$BF3= 200.13
##$BF4= 200.13
##$BF5= 200.13
##$BF6= 200.13
##$BF7= 200.13
##$BF8= 200.13
##$BYTORDA= 1
##$CFDGTYP= 0
##$CFRGTYP= 5
##$CHEMSTR= <none>
##$CNST= (0..31)
1 1 145 1 1 1 1 1 1 1 1 1 1 1 1 1 1 1 1 1 1 1 1 1 1 1 1 1 1 1 1 1 
##$CPDPRG= <>
##$CPDPRG1= <>
##$CPDPRG2= <>
##$CPDPRG3= <>
##$CPDPRG4= <mlev>
##$CPDPRG5= <mlev>
##$CPDPRG6= <mlev>
##$CPDPRG7= <mlev>
##$CPDPRG8= <mlev>
##$CPDPRGB= <>
##$CPDPRGT= <>
##$D= (0..31)
0 0.7 0 0 0 0 0 0 0 0 0 0.03 0 0 0 0 0 0 0 0 0 0 0 0 0 0 0 0 0 0 0 0 
##$DATE= 1738066691
##$DBL= (0..7)
120 120 120 120 120 120 120 120 
##$DBP= (0..7)
150 150 150 150 150 150 150 150 
##$DBP07= 0
##$DBPNAM0= <>
##$DBPNAM1= <>
##$DBPNAM2= <>
##$DBPNAM3= <>
##$DBPNAM4= <>
##$DBPNAM5= <>
##$DBPNAM6= <>
##$DBPNAM7= <>
##$DBPOAL= (0..7)
0.5 0.5 0.5 0.5 0.5 0.5 0.5 0.5 
##$DBPOFFS= (0..7)
0 0 0 0 0 0 0 0 
##$DE= 6
##$DECBNUC= <off>
##$DECIM= 32
##$DECNUC= <off>
##$DECSTAT= 4
##$DIGMOD= 1
##$DIGTYP= 9
##$DL= (0..7)
0 120 120 120 120 120 120 120 
##$DP= (0..7)
150 150 150 150 150 150 150 150 
##$DP07= 0
##$DPNAME0= <>
##$DPNAME1= <>
##$DPNAME2= <>
##$DPNAME3= <>
##$DPNAME4= <>
##$DPNAME5= <>
##$DPNAME6= <>
##$DPNAME7= <>
##$DPOAL= (0..7)
0.5 0.5 0.5 0.5 0.5 0.5 0.5 0.5 
##$DPOFFS= (0..7)
0 0 0 0 0 0 0 0 
##$DQDMODE= 0
##$DR= 18
##$DS= 0
##$DSLIST= <SSSSSSSSSSSSSSS>
$$ [...]
##$SUBNAM0= <"">
##$SUBNAM1= <"">
##$SUBNAM2= <"">
##$SUBNAM3= <"">
##$SUBNAM4= <"">
##$SUBNAM5= <"">
##$SUBNAM6= <"">
##$SUBNAM7= <"">
##$SUBNAM8= <"">
##$SUBNAM9= <"">
##$SW= 18.0517328524113
##$SWIBOX= (0..15)
0 0 2 0 0 0 0 0 0 0 0 0 0 0 0 0 
##$SW_h= 3612.71676300578
##$TD= 16384
##$TD0= 1
##$TE= 0
##$TE2= 300
##$TE3= 300
##$TEG= 300
##$TL= (0..7)
0 120 120 120 120 120 120 120 
##$TP= (0..7)
150 150 150 150 150 150 150 150 
##$TP07= 0
##$TPNAME0= <>
##$TPNAME1= <>
##$TPNAME2= <>
##$TPNAME3= <>
##$TPNAME4= <>
##$TPNAME5= <>
##$TPNAME6= <>
##$TPNAME7= <>
##$TPOAL= (0..7)
0.5 0.5 0.5 0.5 0.5 0.5 0.5 0.5 
##$TPOFFS= (0..7)
0 0 0 0 0 0 0 0 
##$TUNHIN= 0
##$TUNHOUT= 0
##$TUNXOUT= 0
##$USERA1= <user>
##$USERA2= <user>
##$USERA3= <user>
##$USERA4= <user>
##$USERA5= <user>
##$V9= 5
##$VALIST= <valist>
##$VCLIST= <CCCCCCCCCCCCCCC>
##$VD= 0
##$VDLIST= <DDDDDDDDDDDDDDD>
##$VPLIST= <PPPPPPPPPPPPPPP>
##$VTLIST= <TTTTTTTTTTTTTTT>
##$WBST= 1024
##$WBSW= 4
##$XGAIN= (0..3)
0 0 0 0 
##$XL= 0
##$YL= 0
##$YMAX_a= 77379
##$YMIN_a= -87751
##$ZGOPTNS= <>
##$ZL1= 120
##$ZL2= 120
##$ZL3= 120
##$ZL4= 120
##$ABSF1= 10
##$ABSF2= 0
##$ABSG= 5
##$ABSL= 3
##$ALPHA= 0
##$AQORDER= 0
##$ASSFAC= 0
##$ASSFACI= 0
##$ASSFACX= 0
##$ASSWID= 0
##$AUNMP= <proc_1d>
##$AZFE= 0.1
##$AZFW= 0.1
##$BCFW= 1
##$BC_mod= 2
##$BYTORDP= 1
##$COROFFS= 0
##$CY= -3
##$DATMOD= 1
##$DC= 2
##$DFILT= <>
##$DTYPP= 0
##$F1P= 0
##$F2P= 0
##$FCOR= 0.5
##$FTSIZE= 0
##$FT_mod= 4
##$GAMMA= 1
##$GB= 0.15
##$INTBC= 1
##$INTSCL= 1
##$ISEN= 128
##$LB= 0.25
##$LEV0= 0
##$LPBIN= 0
##$MAXI= 10000
##$MC2= 0
##$MEAN= 0
##$ME_mod= 0
##$MI= 1.114404
##$NCOEF= 0
##$NC_proc= 0
##$NLEV= 6
##$NOISF1= 3.799351
##$NOISF2= 2.8
##$NSP= 1
##$NTH_PI= 0
##$NZP= 0
##$OFFSET= 14.38212
##$PC= 1
##$PHC0= 253.0641
##$PHC1= 8.992229
##$PH_mod= 1
##$PKNL= yes
##$PPARMOD= 0
##$PSCAL= 0
##$PSIGN= 0
##$REVERSE= no
##$SF= 200.129724274929
##$SI= 16384
##$SIGF1= 3
##$SIGF2= 2
##$SINO= 400
##$SIOLD= 16384
##$SREGLST= <1H.CDCl3>
##$SSB= 0
##$STSI= 0
##$STSR= 0
##$SW_p= 3205.1282051282
##$SYMM= 0
##$S_DEV= 0
##$TDeff= 0
##$TDoff= 0
##$TI= <>
##$TILT= no
##$TM1= 0
##$TM2= 0
##$TOPLEV= 0
##$USERP1= <user>
##$USERP2= <user>
##$USERP3= <user>
##$USERP4= <user>
##$USERP5= <user>
##$WDW= 1
##$XDIM= 8192
##$YMAX_p= 0
##$YMIN_p= 0
$$ End of Bruker specific parameters
$$ ---------------------------------
##NTUPLES= NMR FID
##VAR_NAME=  TIME,          FID/REAL,        FID/IMAG
##SYMBOL=    X,             R,               I
##VAR_TYPE=  INDEPENDENT,   DEPENDENT,       DEPENDENT
##VAR_FORM=  AFFN,          ASDF,            ASDF
##VAR_DIM=   8192,          8192,            8192
##UNITS=     SECONDS,       ARBITRARY UNITS, ARBITRARY UNITS
##FACTOR=    0.0002768,     1,               1
##FIRST=     0,             0,               0
##LAST=      2.2672688,     0,               0
##MIN=       0,             -87751,          0
##MAX=       2.2672688,     77379,           0
$$ Real data points
##PAGE= N=1
##DATA TABLE= (X++(R..R)), XYDATA
$$ [...]
1623H5j45L54k37k2l4j86j35R9J24J80l94j61M25P3j55L21k79j6M27j63m1M8M9
$$ 85 -60 294 57 35 1 -185 -320 -221 -97 83 -311 -472 -47 26 -129 192 -87 -103 324 161 120 168 217
1646B17j71o1L7J70m07J13L7O8n77N46k3l5j12L13J51l16J24J55n3j27M01k43
$$ 217 46 -15 22 192 -215 -102 -65 3 -574 -28 -51 -86 -198 115 266 -50 74 229 176 49 450 207
1668B07j86O5J38k27j91j25K49N7m30L76J6m50L24J25m7K34N4j78J71j85K52j34
$$ 207 21 86 224 -3 -194 -319 -70 -13 -443 -67 -51 -501 -177 -52 -99 135 189 11 182 -3 249 115
1690A15j92N13o4l43Q5j01j02k31%J08n2O7K20p1R0K31k51J25K0j16L19M4k50
$$ 115 -77 436 372 29 114 13 -89 -320 -320 -212 -264 -197 23 -48 42 273 22 147 167 51 370 414 164
1713A64j93J81k40RO2r0k64J81M8J38j96J8K20l14N6R1L40j59K24p5k04L35r9
$$ 164 -29 152 -88 -79 -17 -107 -371 -190 -142 -4 -200 -182 38 -276 -220 -129 211 52 276 201 -3 332 233
1736B33o7k7k39R3j45j59L26o4k62J25m1o2J61J07l1J04K47l5j04j58L19q9j86
$$ 233 166 139 -100 -7 -152 -311 15 -49 -311 -186 -227 -289 -128 -21 -52 52 299 264 160 2 321 232 46
1759D6K66k71k47n3K85q2l7k56K86J40l85J90M5L6K00mj24J37j6j16P1k9m5R0
$$ 46 312 41 -206 -259 26 -56 -93 -349 -63 77 -308 -118 -73 -37 163 159 35 172 156 40 111 82 37 127
1783A27j99O5Q5l41j22J06J01Jr2K26m9J5J86J4j56l6L99k19M7m0j12J51l00R8
$$ 127 -72 -7 78 -263 -385 -279 -178 -177 -269 -43 -92 -77 109 123 -33 -69 330 111 158 118 6 157 -143 -45
1807d5k12o3J13J39r7q9J67j03R1K64j86K88j66Q1Jl1K19m34L64k98P7j29L5r2
$$ -45 -257 -320 -207 -68 -165 -254 -87 -190 -99 165 -21 267 101 182 183 152 371 -63 301 3 80 -49 -14 -106
1831a06k50K48j59j09J22P4mN7J45J12j82P8M20j42k23L53k39K9l62J23R6l61
$$ -106 -356 -108 -267 -376 -254 -180 -184 -127 18 130 -52 26 446 304 81 434 195 224 -138 -15 81 -280
1853b80L57k63J6J50O0j7j97m1M48m61M70P3k94J29j5N1L9Q6k13J13Q7n07K75
$$ -280 77 -186 -170 -20 40 23 -174 -215 233 -228 242 315 21 150 135 186 225 311 98 211 298 -209 66
1876F6k28j33M25k35j36K22m0j79L72k46K95l16J34K12k35N5J63r7j32j04J62
$$ 66 -162 -295 130 -105 -241 -19 -59 -238 134 -112 183 -133 1 213 -22 33 196 99 -33 -137 25
1897B5J90k86r2k0J37r7J78Ol4J35k22m5L09m3j67L35k10k36K28jq1p8K01n5k21
$$ 25 215 -71 -163 -183 -46 -143 35 41 7 142 -80 -125 184 141 -26 309 99 -137 91 90 9 -69 132 77 -144
1922a44J7k4k8j73K83j33N1J70nK38K66l04k71J1R8J04n7l15k7J37j89J68pn4
$$ -144 -127 -151 -179 -352 -69 -202 -151 19 14 252 518 214 -57 -46 52 156 99 -216 -243 -106 -295 -127 -134 -188
1946a88J76N0j56J69m5l6j24J74K73l30J55L24m14R1n9L5J98m25K1J49k02j76
$$ -188 -12 38 -118 51 6 -30 -154 20 293 -37 118 442 28 119 60 95 293 -132 -111 38 -164 -340
1968c40N8P4j72K73J29j0r3J23Mm7J02R5K09n28L86j56l83L22K81n62J84q8L4
$$ -340 -282 -208 -380 -107 22 12 -81 42 46 -1 101 196 405 -123 263 107 -276 46 327 -235 -51 -139 -105
1991a05j83J25O4J47l32J51K49j14K07n6M7N0j85R7O6o1j13k10J38j63K23j21
$$ -105 -288 -163 -99 48 -284 -133 116 2 209 153 200 250 65 162 228 167 54 -156 -18 -181 42 -79
2013g9Q6j38k42N15j35rr5K50j36n5K94k37R8L1P5r8j00r3o4j39J92K71k11m1
$$ -79 7 -131 -373 142 7 -2 -97 153 17 -38 256 19 117 148 223 125 25 -68 -132 -271 -79 192 -19 -60
2037f0M6o9k59K83J20o1q5J40J37l53L02j65O0Kj61J14Q7k13N3K7j02J57Kk13
$$ -60 -14 -83 -342 -59 61 0 -85 55 192 -161 141 -24 36 38 -123 -9 78 -135 -82 -55 -157 0 2 -211
2061b11M6J63p6K09Q3j71M2K23l24R9p7L62l64r8K67o1j76j49K93o8k06O6nL4
$$ -211 -165 -2 -78 131 214 43 85 308 -16 83 6 368 4 -94 173 112 -64 -213 80 12 -194 -128 -133 -99
2085i9j90L18J95l21P8K01p0L3q0j68Q8ok04K70j9j53N4j44J78j11o1P8K06j94
$$ -99 -289 29 224 -97 -19 182 112 145 65 -103 -15 -21 -225 45 26 -127 -73 -217 -39 -150 -211 -133 73 -121
2109a21J59K0r7L59k27J66j76l9j61J36P8K4k76J74j07O7l27L2L73j40j6R4J63
$$ -121 38 58 -39 320 93 259 83 44 -117 19 97 121 -155 19 -88 -21 -348 -316 57 -83 -99 -5 158
2132A58r1n8J55n9l7K28J04l51j18R3n7l3j6Lj14J14k06L05k00J51J70l07K28
$$ 158 67 9 164 105 68 296 400 49 -69 24 -33 -66 -82 -79 -193 -79 -285 20 -180 -29 141 -166 62
2155F2L64l95K7QJ19k60J70k05J70n0J15o4k34K0N3l5k12K74PQ1Q0l7M4m8J9J06
$$ 62 426 31 58 66 185 -75 95 -110 60 10 125 61 -173 -153 -100 -135 -347 -73 -66 15 95 58 102 54 73 179
2181A79p6j6O8j50J71rl20j77L94r7O4j73R3J11r8L5J55j85k9K75n6l1Qo9J1J35
$$ 179 103 87 155 5 176 167 -153 -330 64 -33 31 -142 -49 62 -36 -1 154 -31 -60 215 159 128 136 67 78 213
2207B13l07M7j64J36J45j13Op6j39p8K72j63K91j54K34j69J77r1m8K07r5j4k1
$$ 213 -94 -47 -211 -75 70 -43 -37 -113 -252 -330 -58 -221 70 -84 150 -19 158 67 19 226 131 117 96
2230I6k32J39J1Q4j85J20k66P7K36k11J96j62J25j62M1K55j02k8%N9k24N2P7Q0
$$ 96 -136 3 14 98 -87 33 -233 -156 80 -131 65 -97 28 -134 -93 162 60 32 32 91 -133 -81 -4 76
2254G6j17j87L64k32j16J13K35l89J66j35Q4R9Q0J28k93K1K52L3l13J26JK9o6
$$ 76 -41 -228 136 -96 -212 -99 136 -253 -87 -222 -138 -39 41 169 -124 -103 149 182 -131 -5 -4 25 -41
2277d1J01J9o7j42JJ90j1k9j23NJ87K3L8j68K07j33r8J12L0jk39O3J08l8J43k43
$$ -41 60 79 12 -130 -129 61 50 21 -102 -97 90 113 151 -17 190 57 -41 71 101 100 -139 -76 32 -6 137 -106
2303a06Qj2K2l2L6p3P3j20J76J0Kn8K70q9q5k45K95r5J3k17RK96j03M1K0j64o8
$$ -106 -98 -110 -88 -120 -84 -157 -84 -204 -28 -18 -16 -74 196 107 22 -223 72 -23 -10 -227 -218 78 -25 16 36 -128 -196
2330a96OL1K41j5j3K41p3m20K57K14l37J33J04j76J8J93k91P4jJ6j71p1J44K91
$$ -196 -190 -159 82 67 54 295 222 -198 59 273 -64 69 173 -3 15 208 -83 -9 -10 6 -165 -236 -92 199
2354A99j04l7J5L5m4Q3r7L9q9NP5j46O9jrq2q5R3Q7j64j1L29k05n2J96j09rJ69
$$ 199 95 58 73 108 64 147 50 89 0 5 80 -66 3 2 -7 -89 -174 -81 6 -158 -169 160 -45 -97 99 -10 -19 150
2382A50j86J84P2k55J03J26k11K02m41R2J88l41J48J58pJ2q4L0L7K76j60j6K4
$$ 150 -36 148 220 -35 68 194 -17 185 -256 -164 24 -317 -169 -11 -18 -6 -90 -60 -23 253 93 77 101
2405A01j32J63m1n7Q9k32J90j89p8J55j7j22K19j55P3J50j33J05j8l7J77k8k39
$$ 101 -31 132 91 34 123 -109 81 -108 -186 -31 -48 -170 49 -106 -33 117 -16 89 71 34 211 183 -56
2428e6K38M3r5o4L2l23K12K7j90J93l19K07J27n1L0l2N2j61K51j57J54L4o6N8
$$ -56 182 225 130 66 98 -225 -13 14 -176 17 -302 -95 32 -19 11 -21 31 -130 121 -36 118 152 86 144
2452A44k99J37R6j24J9K07j49o3M3k27P7Q2M3L9J48q8j39K20j71k4pmJ66m3J8
$$ 144 -155 -18 78 -46 -27 180 31 -32 11 -216 -139 -57 -14 25 173 85 -54 166 -5 -29 -36 -40 126 83 101
2477A01l07K82j34RM7N3j99Q6k4r3J56O6MO5j60O4pj08J78J00j28J15k60J4om2
$$ 101 -206 76 -58 -49 -2 51 -148 -62 -86 -179 -23 43 47 112 -48 16 9 -99 79 179 51 166 -94 -80 -86 -128
2503a28Q5l7j9l5J59J58l05LK00J34k69O5%J04j10K0J93k53J29j38N8p2K69n30
$$ -128 -43 -80 -99 -134 25 183 -122 -119 81 215 -54 11 11 115 5 25 218 -35 94 -44 14 -58 211 -319
2527c19K73Nn3J21k07K27J7k19J92r2J70k99L77l2j19O6j50P3j72m3L13n38K79
$$ -319 -46 -41 -94 27 -180 47 64 -155 37 -55 115 -184 193 161 42 108 -42 31 -141 -184 129 -409 -130
2550a30J66k05J55q3Q7r0n0j23M07j07K12n6j04MK9j1k0P1p6j19k0P0m4j21j26
$$ -130 36 -169 -14 -97 -10 -100 -150 -273 134 27 239 183 79 83 112 101 81 152 76 -43 -63 7 -37 -158 -284
2575b84J70J29n1J65k5k00K09J47j61q2M8j96K13M6N7j36j79QN2j21R6P9j05J21
$$ -284 -114 15 -36 129 104 -96 113 260 99 17 65 -131 82 128 185 49 -130 -122 -70 -191 -95 -16 -121 0
2599@P0k80L15j19J23qJ7J26j6j43K59m03j2M2Kj04NJ21q9P3J66r4k28k3J03m9
$$ 0 70 -210 105 -14 109 101 118 244 228 85 344 -59 -71 -29 -27 -131 -126 -5 -94 -21 145 51 -177 -200 -97 -146
2625a46L64o7k29K51j09J25l97J10K67k96J36j43J61p4j5L4n6J46j71OJ81nk7
$$ -146 218 151 -78 173 64 189 -208 -98 169 -127 9 -134 27 -47 -62 -28 -84 62 -109 -103 78 73 46
2648D6Q5l6j68K43mn3j02l4l0j8j7j50J82J10k05K9J09k89K53p0j86J01R6K76
$$ 46 131 95 -73 170 166 113 11 -23 -53 -71 -88 -238 -56 54 -151 -122 -13 -302 -49 -119 -305 -204 -108 168
2672A68j36k16K35J47k51r7J53l9JJ34j52p5M8j56K91j02jj41J86L18j07k91J16
$$ 168 32 -184 51 198 -53 -150 3 -36 -35 99 -53 -128 -80 -236 55 -47 -48 -189 -3 315 208 -83 33
2695C3k6k5J7j98J25n1L20j80pk26J04J04j46J90j58K08q9jO7k2p1JJ84j50J25
$$ 33 7 -18 -1 -199 -74 -125 195 15 8 -218 -114 -10 -156 34 -124 84 -5 -6 61 39 -32 -31 153 3 128
2720A28j09J17j00l6k8Lj32K57k14j9lN0J75j14j74L2J54O9k01K80j72j19K80
$$ 128 19 136 36 0 -28 -25 -157 100 -114 -133 -136 -86 89 -25 -199 -167 -13 56 -145 135 -37 -156 124
2743A24P8mj07j44J18j34r0K64r3n8o6j03J78RN3j83K82j98J4J57M5k17Q3J63
$$ 124 202 198 91 -53 65 -69 -159 105 12 -46 -112 -215 -37 -28 25 -158 124 -74 -60 97 142 -75 8 171
2767A71j25n7N9k0k05K34j63J8j58N07k05m3j24O5J31j55J81k58K27o0J26n8p1
$$ 171 46 -11 48 28 -177 57 -106 -88 -246 261 56 13 -111 -46 85 -70 111 -147 80 20 146 88 17
2790A7j2j06R4L2j99J18l4K87j98o2j37K54j88Q2J06K5j29L5Q2o1K5K78l73J08
$$ 17 5 -101 -7 25 -174 -56 -90 197 -1 -63 -200 54 -134 -52 54 79 -50 -15 67 6 31 309 -64 44
2814D4p6n3j4K01j82l5j95M24ml30J95p8J93N2q5J73k34N2k5J91k03K1k10K45
$$ 44 -32 -85 -99 102 -80 -115 -310 114 110 -220 -25 -103 90 142 57 230 -4 48 23 214 11 32 -178 67
2838F7m8O0j56J64n3k82J66Q9J56j43L3k21K0Q3R5J95n9k17K12j10J90l95L32
$$ 67 19 79 -77 87 34 -248 -82 7 163 20 53 -168 -148 -65 30 225 166 -51 161 51 241 -154 178
2861A78j33%K6k90M7K55j74J45l2L4M4j17K7J79J6r2j29K06m54K85j59J32J52
$$ 178 45 45 71 -219 -172 83 -91 54 22 56 100 -17 10 189 205 113 -16 190 -264 21 -138 -6 146
2884A46k19J08k66L83l58K02j92J95K12k64Q7j11Ok8k1Q2K97k84Q8P7j85K7PM9
$$ 146 -73 35 -231 152 -206 -4 -196 -1 211 -53 34 -77 -71 -99 -120 -38 259 -25 63 140 -45 -18 -11 38
2908C8j87K57l51K10J87o4p9O2r0J66P6j70l9J32R4p1rj84J01k92J00j1J3OJ61
$$ 38 -149 108 -243 -33 154 90 11 73 -17 149 225 55 16 148 242 171 162 -22 79 -213 -113 -124 -111 -105 56
2933E6k2k39N9K23k21K00pL4j13QP0p5R5j9J1j36J74k8R9r6k01L2K75k41K1j19
$$ 56 34 -205 -146 77 -144 56 49 83 -30 -22 48 -27 68 49 60 -76 98 70 169 73 -128 -96 179 -62 -41 -160
2959a60J89M9n9R7k01J33j28m0P6o6J0R6J00m14L54p5o3K00q3M7K0M2k22P6n1
$$ -160 29 78 19 116 -85 48 -80 -120 -44 -110 -100 -4 96 -318 36 -39 -102 98 15 62 82 124 -98 -22 -73
2984g3K19j25o5J65J09m57L31k46J53J87k86K98l59J86j21J64o6R3j30Q1k8Q7
$$ -73 146 21 -44 121 230 -227 104 -142 11 198 -88 210 -149 37 -84 80 14 107 -23 58 30 117
3006A17r9P3n0Lm1j12O8P6k18K02m4k6J49n0q0m2K47l70J73j06O5Nk7J54L4lj62
$$ 117 18 91 41 44 3 -109 -41 35 -183 19 -25 -51 98 48 -32 -74 173 -197 -24 -130 -65 -60 -87 67 101 98 -64
3033f4kQ1l0J40j44P2q6P4Kj00J80n9k58R4J18r3J00R4l6l41L69j3n4q4p8M88
$$ -64 -66 15 -15 125 -19 53 -33 41 43 -57 123 64 -194 -100 18 -75 25 119 83 -258 111 98 44 -40 -118 370
3059C70l01k93M15o9n1o2L1r9N7l4k9K99k62n4J42j68N5O1P3j7j58K06m9O9r7
$$ 370 69 -224 191 122 71 9 40 -59 -2 -36 -65 234 -28 -82 60 -108 -53 8 81 64 -94 112 63 132 35
3084C5j1j08N9J77l63J24p2P3Q8j44L1%J21O6L7N1L2M4l0o1q4k1q6L8Q9k37L8
$$ 35 24 -84 -25 152 -211 -87 -159 -86 2 -142 -111 -111 10 76 113 164 196 240 210 149 65 44 -42 -4 85 -152 -114
3111a14J55n6J57j59JJ52N7j68p6K42j21K79l89lo0L11l27K53p7n9J02j58J62
$$ -114 41 -15 142 -17 -16 136 193 25 -51 191 70 349 -40 -43 -103 208 -119 134 57 -2 100 -58 104
3134A04l12K41j63Q4R7j34R3q6R3O8j30J0J82o4k38K02j03l8P2P3p2n6R7j03K83
$$ 104 -208 33 -130 -46 51 -83 10 -76 17 85 -45 -35 147 83 -155 47 -56 -94 -22 51 -21 -77 20 -83 200
3159B00l96K24O3k25J30RJ58l9j00NK23k65N8r4p7K93Ll65R0R0l4j62J05N5j6
$$ 200 -196 28 91 -134 -4 5 163 124 24 29 252 -13 45 -49 -126 167 170 -195 -105 -15 -49 -211 -106 -51 -67
3184f7K9J78Lm27M00j29K5k2O0J92k55N0O8l12K60Ln0p3O5j45Q8Q4J33j70j4P1
$$ -67 -38 140 143 -284 116 -13 12 -10 50 242 -13 37 105 -207 53 56 6 -67 -2 -147 -59 25 158 -12 -26 45
3210D5K88l9j6k49N9M8pp0Q5k20k4p2K30q0o3ON1l7rJ90k86P4J29J9J00k14j10
$$ 45 333 294 278 29 88 136 129 59 144 -76 -100 -172 58 -22 -85 -79 -28 -65 -74 116 -170 -96 33 52 152 -62 -172
3237a72J70j5J42n6k29k7L40k35j99J00J11J01k06K99k03l6M2k17M37p5j31L79
$$ -172 -2 -17 125 69 -160 -187 153 -82 -281 -181 -70 31 -175 124 -79 -115 -73 -290 147 72 -59 320
3259C20l44K6J85l51J69M0p5j42J71j95L38o8k03q3J57j50K53N6k72L04j4J09
$$ 320 -24 2 187 -164 5 45 -30 -172 -1 -196 142 74 -129 -212 -55 -205 48 104 -168 136 122 231
3281B31k17J72o7k30K21l06L77l73J67n9P5k15R0J6K5L3M8k7J82J06k31o5J09
$$ 231 14 186 119 -111 110 -196 181 -192 -25 -84 -9 -224 -134 -118 -93 -60 -12 -39 143 249 18 -47 62
3304F2j24J22j07J52k59O9m9O1J31m9l9m2N4m8Mj0m3M7K69n1j37j5K05j90Jj16
$$ 62 -62 60 -47 105 -154 -85 -134 -73 58 9 -30 -72 -18 -66 -62 -72 -115 -68 201 150 13 -2 203 13 14 -102
3330a02M5K05k86J30J60j47j0k43K89o4j52J74j56O8J08J71p4Q7k79P5p1j24L07
$$ -102 -57 148 -138 -8 152 5 -5 -248 41 -23 -175 -1 -157 -89 19 190 116 203 -76 -1 -72 -196 111
3353A11k99q4L00l4j43m9K39k22J58j22J6L53l28P0j15O7J47k25L32p2j39N3j09
$$ 111 -188 -272 28 -6 -149 -198 41 -181 -23 -145 -129 224 -104 -34 -149 -82 65 -160 172 100 -39 14 -95
3376i5J26q2J11j64J36J72J7l17J27J58j13p5k8J90k27Q4Qj7q3L1J7L7k47K02
$$ -95 31 -51 60 -104 32 204 221 -96 31 189 76 1 -27 163 -64 20 28 11 -72 -41 -24 13 -234 -32
3400c2N5k91J02R3l7o8K43n1J4J09K0n0j13J02r7J34J26l74j01K31J55%jk15O6
$$ -32 23 -268 -166 -73 -110 -178 65 14 28 137 157 107 -6 96 -1 133 259 -115 -216 15 170 170 169 -46 20
3425B0q7j23J61j62r9L41M8q1Jl4l6J35m9qj49J77j14n3J78k51P9J99k8l53M7
$$ 20 -67 -190 -29 -191 -290 51 99 18 19 -15 -51 84 35 27 -122 55 -59 -112 66 -185 -106 93 65 -288 -241
3450b41L50j34K6P2N0k68J94k8k5k6K2k8L7n9j11K9n7J77M7k11K03j51qM7Q6j07
$$ -241 109 -25 1 73 123 -145 49 21 -4 -30 -8 -36 1 -58 -169 -140 -197 -20 27 -184 19 -132 -140 -93 -7 -114
3476a14RJ48N5M4j63J27j15M2j37J20j19j4R8J81j88o1j16J1P7j4K65j95M7j06
$$ -114 -105 43 98 142 -21 106 -9 33 -104 16 -103 -117 -19 162 -26 -87 -203 -192 -115 -129 136 -59 -12 -118
3500a18J36K1J27l94N6J98r0J31r6r7K2K4j45J89K09l68J49O2K9j16J67O2j15
$$ -118 18 39 166 -228 -172 26 -64 67 -29 -126 -104 -80 -225 -36 173 -195 -46 16 45 -71 96 158 43
3523D3KNN9N7j56J09J7j20J31j46L0m0O5j76lj5K6N8J38J32j42L8J00k8j13n9
$$ 43 45 50 109 166 10 119 136 16 147 1 31 -9 56 -120 -123 -138 -112 -54 84 216 74 112 212 184 71 12
3549A2LO3j26m0J8O7j46J5J35j22J30l0j9m6n3J35j16L00N2k54M3N0J88k45J72
$$ 12 15 78 -48 -88 -70 -3 -149 -134 1 -121 9 -21 -40 -86 -139 -4 -120 180 232 -22 21 71 259 14 186
3574A86P5n50J69K68l07q3O4L57l87J75J96l13J96k1Pl0K2J46j77K16j69L9J0
$$ 186 261 -289 -120 148 -159 -242 -178 179 -208 -33 163 -150 46 25 32 2 24 170 -7 209 40 79 89
3597H9L8l16M1J09j07J53q8J50j57o8J95k47J45N0M6K48k62J19L5j71q6K90j64
$$ 89 127 -189 -148 -39 -146 7 -81 69 -88 -156 39 -208 -63 -13 33 281 19 138 173 2 -84 206 42
3620D2j36J84q3m6J24m2j71M3Qj06J28P0j17L33k68J47j47J24J06j94O1r6K18
$$ 42 -94 90 7 -39 85 43 -128 -85 -77 -183 -55 15 -102 231 -37 110 -37 87 193 -1 60 -36 182
3643A82k09k3j30J51n3J69%m3r6R8k45K10m3J05R5j20K35l15o4J57J61j15Jk82
$$ 182 -27 -50 -180 -29 -82 87 87 44 -52 46 -199 11 -32 73 168 48 283 -32 -96 61 222 107 108 -174
3667a74K74q8j1J11j46r4J06J72j64j03K38j49p1N4P2J3J67k40J62r0k10J80m9
$$ -174 100 12 1 112 -34 -128 -22 150 -14 -117 121 -28 -99 -45 27 40 207 -33 129 39 -171 9 -40
3690d0j4L4k26k9K12K70k91m4K88j39R5l27K59Q7r1j24J81j91N5K50l21k1l4j22
$$ -40 -54 -20 -246 -275 -63 207 -84 -128 160 21 116 -211 48 135 44 -80 101 -90 -35 215 -106 -127 -161 -283
3714b83J21J5P2j2J87m1p0J11j90L3p8J85p6j6J54o2Qj04K59j92k05N3L5J26j34
$$ -283 -162 -147 -75 -87 100 59 -11 100 -90 -57 -135 50 -26 -42 112 50 58 -46 213 21 -184 -131 -96 30 -104
3739a04L3K26k87J22R0j59J76nq0o5J60J60l40J90j39J42j99J43j59j53J32R5
$$ -104 -71 155 -132 -10 80 -79 97 92 12 -53 107 267 -73 117 -22 120 -79 64 -95 -248 -116 -21
3761b1Kj73R8K3L3M6j3QJ34q3n5K16k67p5K96j60O3P9k03r8J42n5J80j33J51k59
$$ -21 -19 -192 -94 -71 -38 8 -5 3 137 54 -1 215 -52 -127 169 9 72 151 -52 -150 -8 -63 117 -16 135 -124
3787a24O9M4J0o1J06M8j24P7Q0j60p6K78l39L51k22O3K6j70o3J32J39p4Q2K0j80
$$ -124 -55 -11 -1 -62 44 92 -32 45 125 -35 -111 167 -172 179 -43 20 46 -124 -187 -55 84 10 92 112 -68
3812f8N8J00j6k0O0n7j52J35J44k34l9J00N2k61L71j13k06J12J8n7P3M9O0j0k4
$$ -68 -10 90 74 54 114 57 -95 40 184 -50 -89 11 63 -198 173 60 -146 -34 -16 -73 0 49 109 99 75
3837G5k7n1J2r5L3J5J7p3L5J19k15p8K25j80J93o3J11Q3k96P9K08J68m38J14Q0
$$ 75 48 -3 9 -86 -53 -38 -21 -94 -59 60 -155 -233 -8 -188 5 -58 53 136 -160 -81 127 295 -143 -29 51
3862E1pN2k57J85j30J26Q2j23J94p8j18l8L1l7mk1l3J16p9J11O2r7J17j34M5N3
$$ 51 44 96 -161 24 -106 20 102 -21 173 95 -23 -61 -30 -67 -71 -92 -125 -9 -88 23 85 -12 105 -29 16 69
3888F9j40K57k07K3j12J86j98J60Qj23k9P3K6P5L3r6l8P9M1j7J3m4l02L44O6r3
$$ 69 -71 186 -21 2 -110 76 -122 38 46 -77 -106 -33 -7 68 101 5 -33 46 87 70 83 39 -263 81 147 54
3914E4r4J23J8k30J55J13k23J42r0j83L35N4M2j95J6j32oN4K1m2RM5J91j72J00
$$ 54 -40 83 101 -129 26 139 -84 58 -32 -215 120 174 216 21 37 -95 -101 -47 -26 -68 -59 -14 177 5 105
3939A05k25J70oj44K19j36J07j05j54Q1L4J46j23K45k37R6r0j0j17J22k1m4L3
$$ 105 -120 50 44 -100 119 -17 90 -15 -169 -88 -54 92 -31 214 -23 73 -17 -27 -144 -22 -43 -87 -54
3962e4J78l42J90q3j38M25k13J84j90m2J19q2K20m3j6j50P2M3M0l08L62j11m0
$$ -54 124 -218 -28 -111 -249 176 -37 147 -43 -85 34 -48 172 129 113 -37 35 78 118 -190 172 61 21
3985B1J16l95J88K09o9k65L04j38J78J6j73N0P5j59L7k5n7m7K45O2k27Q9j42o1
$$ 21 137 -258 -70 139 70 -195 109 -29 149 165 -8 42 117 -42 -5 -30 -87 -134 111 173 -54 35 -107 -168
4009a68j6K89p1j5Kk01K89Pn0O3q6q1M7K9k9P3R8n7k43J41k9l8Q7j65Q1rP5o8
$$ -168 -184 105 34 19 21 -180 109 116 66 129 43 -38 9 38 9 82 180 123 -120 21 -8 -46 41 -124 -43 -52 23 -45
4037d5PJ58K3l10L24K2l1k6j95J3O3J25k23j28K92Qj26J25K4k94K06R1j34j30
$$ -45 -38 120 143 -167 157 179 148 122 -73 -60 3 128 -95 -223 69 77 -49 76 100 -194 12 103 -31 -161
4061a61J41j3J68l06J05K91m01K69Lj75l7J64k12K18L6n0n9r1M0J36K15k76J71
$$ -161 -20 -33 135 -171 -66 225 -176 93 96 -79 -116 48 -164 54 90 40 -19 -110 -70 66 281 5 176
4084A76k18J75J1o0j07k9LJ64k1O5k20qK29q5k26J12M1K53l22J82j24J1kJ26m9
$$ 176 -42 133 144 84 -23 -52 -49 115 94 159 -61 -69 160 75 -151 -39 2 255 -67 115 -9 2 0 126 77
4109G7j05N2J27k4j85Q7k50K56J6j35K21j04j2N8j50J4J95l16J33J92k96L37k05
$$ 77 -28 24 151 127 -58 29 -221 35 51 -84 137 33 21 79 -71 -57 138 -178 -45 147 -149 188 -17
4132a7p6J32J76k3j60p2M1J28n3l49L39J14l32M52j85k08J14J3q1K5J28j27J8
$$ -17 -93 39 215 192 32 -40 1 129 76 -273 66 180 -152 300 115 -93 21 34 -47 -22 106 -21 -3
4155cJ1o6J71j24L6j19k7K25q7o7j11J22lr3K65j65M9K3j47K45j39J2J30R4j44
$$ -3 8 -58 113 -11 25 -94 -121 104 17 -50 -161 -39 -42 -135 130 -35 14 37 -110 135 -4 8 138 232 88
4180H8l0J2l8KJ26j6l60O4J63L4O6j11j61j3L15j39j34J72j0p2j04J32k0L2J5
$$ 88 58 70 32 34 160 144 -216 -152 11 45 111 0 -161 -174 141 2 -132 40 30 -42 -146 -14 -34 -2 13
4205A3MJ11r2j31J70j81J26j97K66l9J20j11k40J33J33o2J99j75j91J98j57K03
$$ 13 17 128 36 -95 75 -106 20 -177 89 50 170 59 -181 -48 85 23 222 47 -144 54 -103 100
4227A00P8qj7N1j54K37l26r8J34n4l6O8N4j2k6K0n8QJ72o2J62l01j00K17j83R8
$$ 100 178 170 153 204 50 287 -39 -137 -3 -57 -93 -25 29 17 -9 11 -47 -39 133 71 233 -68 -168 49 -134 -36
4253c6K8n2J13q5n2n6L1J14J26J38k20J3j13K02k22J80L8j91J83n0j81L49l19
$$ -36 -8 -60 53 -32 -84 -140 -109 5 131 269 49 62 -51 151 -71 109 147 -44 139 89 -92 257 -62
4276f2m5J3L1k8J23K7k03J70l5R5j31J77j28j37J57j06J14j44r1P1P5o9lK28m3
$$ -62 -107 -94 -63 -91 32 59 -144 26 -9 86 -45 132 4 -133 24 -82 32 -112 -203 -132 -57 -126 -129 99 56
4301E6m0k4j06J18l9L2n9M1m0K35j60o3M1j08K69k22J45j14J29J1j20j47K20j17
$$ 56 16 -8 -114 4 -35 -3 -62 -21 -61 174 14 -49 -8 -116 153 -69 76 -38 91 102 -18 -165 55 -62
4325f2K00r8J05k02K45k27K7J95k48J05K9j50Q7k20K02J19o6q1L4jj24K43j14
$$ -62 138 40 145 -57 188 -39 -12 183 -65 40 69 -81 6 -214 -12 107 41 -40 -6 -7 -131 112 -2
4348bQ4k20K99l60O4O3J92K5j95J09k04J43p3m8J4N7J27p4k2j6RJ0K20k67P5n5
$$ -2 82 -138 161 -199 -135 -72 120 145 -50 59 -145 -2 -75 -123 -109 -52 75 1 -21 -37 -28 -18 202 -65 10 -45
4374d5L53m27L52l39P8j16j34o3K66N9K0J00k02K47l99L12j70qK05Rk48L83k08
$$ -45 308 -119 233 -106 -28 -144 -278 -341 -75 -16 4 104 -98 149 -250 62 -108 -116 89 98 -150 233 25
4397B5L5k6Q0j9o9k4J98j40m5j9Q3k28J15R0k09K05N7k0j04k2J90j49o1jJ04o9
$$ 25 60 34 114 95 26 2 200 60 15 -4 79 -149 -34 56 -153 52 109 89 -15 -37 153 4 -57 -58 46 -23
4423b3J5K98j35k53R4O3J0j33q8M2J37J08k45K28k61J81J19j0r5J34k21j88L84
$$ -23 -8 290 155 -98 -4 59 69 -64 -152 -110 27 135 -110 118 -143 38 157 147 52 186 -35 -223 161
4446A61k59k6L2J41j42K26q5k36K89k07J34j2k45M26j10n6j4j04KQ2M8q0L9J86
$$ 161 -98 -124 -92 49 -93 133 48 -188 101 -106 28 16 -229 197 87 31 17 -87 -85 -3 45 -35 4 190
4470A90k60J4K61k45K28r2j03j27J43j81K51n1J05j74J4P0j62J20Q4R2j83M8J10
$$ 190 -70 -56 205 -40 188 96 -7 -134 9 -172 79 28 133 -41 -27 43 -119 1 85 177 -6 42 152
4493A52j81Q6j16Nj30J58o4J44K03k88P0L7K62l82K4L0k0L98l60R3l39J42j74
$$ 152 -29 57 -59 -54 -184 -26 -90 54 257 -31 39 76 338 -44 -20 10 -10 388 28 121 -218 -76 -250
4516b50L4K57j15J65n9J00k32N4K96j67J7j15Q0m7j12J19n0J02K1Nk0j71K49j39
$$ -250 -216 41 -74 91 32 132 -100 -46 250 83 100 -15 65 18 -94 25 -25 77 98 103 83 -88 161 22
4540B2j42n7L13l03L70m2j90K88j91k36J63J47k78Q1Q3j63J09P7j24L48k84rj68
$$ 22 -120 -177 136 -167 203 161 -29 259 68 -168 -5 142 -136 -55 28 -135 -26 51 -73 275 -9 -18 -186
4563a86L39j17j72K81l00R7K68j57j21K82k18P1k9j16J30r6j7M3l6J03Lj3J2j9
$$ -186 153 36 -136 145 -155 -58 210 53 -68 214 -4 67 38 -78 52 -44 -61 -18 -54 49 52 39 51 32
4587C2j7qq4J08m7l1m8P9n2J0M9KJ28J24%k28q8Q6J38j42J13k02l9J75L5j81L14
$$ 32 15 7 -77 31 -16 -47 -95 -16 -68 -58 -9 -7 121 245 245 17 -71 15 153 11 124 -78 -117 58 93 -88 226
4614B26l77J91J4r5N9K34j64p0n5K70j42j30L6m3O1j11P6J64j56j63J18K17p0
$$ 226 -151 40 54 -41 18 252 88 18 -37 233 91 -39 -3 -46 15 -96 -20 144 -12 -175 -57 160 90
4637I0j64o8j9K08k31J26L34k99o4j10L75j09l03K20O5j30J00J23j53m7K24k13
$$ 90 -74 -142 -161 47 -184 -58 276 -23 -87 -197 178 69 -234 -14 51 -79 21 144 -9 -56 168 -45
4659d5q3L5L37q0l89K51r2l1J96J0l0N5j56n02N83j14N0J3J9p5M7p4J60q6J85
$$ -45 -128 -93 244 164 -225 26 -66 -97 99 109 79 134 -22 -524 59 -55 -5 8 27 -48 -1 -75 85 -1 184
4684A84k16j14J43k21K35j08j7P0K5k67m5J18R1N5l7K66j45l3j91J42l0O7l5R2
$$ 184 -32 -146 -3 -224 11 -97 -114 -44 -19 -286 -331 -213 -122 -67 -104 162 17 -16 -207 -65 -95 -28 -63 29
4708B9r0J13J16j89J85j96J1J1M6j7J09l6j87M7l1L03k07j45J84j27K0J89j25
$$ 29 -61 52 168 -21 164 -32 -21 -10 36 19 128 92 -95 -48 -79 224 17 -128 56 -71 -51 138 13
4731A3LJ11j18J05j91J82j8r1j18K27mJ89l43J80k05M6K78k45L4j77J64J06p9
$$ 13 16 127 9 114 -77 105 87 -4 -122 105 101 290 -53 127 -78 -32 246 1 35 -142 22 128 49
4754D9q4m3K52o9n2r2L0J03j29J09j61K13J9k9l15O1J05j42K36O8k27J60j1l11
$$ 49 -35 -78 174 105 53 -39 -9 94 -35 74 -87 126 145 116 -199 -138 -33 -175 61 129 -98 62 51 -260
4778b60J63L46l29J39K0k06Q0K47J68k18j82J69j26p0M7mK7m1P6l0p0J25o6J48
$$ -260 -97 249 -80 59 79 -127 -47 200 368 150 -32 137 11 -59 -12 -16 11 -30 46 16 -54 71 5 153
4802A53l89N7K93j47j11K0J41j89K05N1k00J53LM1k48J57J30k36J65J22j17j59
$$ 153 -236 -179 114 -33 -144 -124 17 -172 33 84 -116 37 40 81 -167 -10 120 -116 49 171 54 -105
4824a05L1O7l6N8m6j46J20N9j09k1J25OJ90j78j95J46M9l0j96J01j19K05J57k44
$$ -105 -74 -7 -43 15 -31 -177 -57 2 -107 -128 -3 3 193 15 -180 -34 15 -15 -211 -110 -229 -24 133 -111
4848a11p7L3P7l8j46L47p4J87m78L15qQ0j18j28K23j78K0J09q5J82Lk28J45r8
$$ -111 -188 -155 -78 -116 -262 85 11 198 -280 35 27 107 -11 -139 84 -94 -74 35 -50 132 135 -93 52 -46
4872d6j07J19O4p5Q3J09k69J93K23k60r0pKJ39j37J03pJ26l7o9l3J28o4J71p7
$$ -46 -153 -34 30 -45 38 147 -122 71 294 34 -56 -63 -61 78 -59 44 37 163 126 57 24 152 88 259 182
4897A82j05J3j01J45l03J89l6J52l0j13J0J00K6r4n7J83j56p2oR6L1p3P4P5q6
$$ 182 77 90 -11 134 -169 20 -16 136 106 -7 3 103 129 35 -22 161 5 -67 -73 23 54 -19 55 130 44
4922D4j85J82q7n6K06j99J74J11n5j38J5p1PR4Rl1M6O8j18N7p7j18J54kj55L8
$$ 44 -141 41 -46 -102 104 -95 79 190 135 -3 12 -59 -52 42 51 20 66 134 16 73 -4 -122 32 30 -125 -87
4948h7K59l06K93l33L24n9r5R1j36J83n1j73J11n5L5Q8j32N1j6r0J50P3Q5j52
$$ -87 172 -134 159 -174 150 91 -4 87 -49 134 83 -90 21 -34 1 89 -43 8 -8 -98 52 125 210 58
4972E8m4k3Q4J66p3o3m0Q1K6j19K3n5N2j7k18oO8K02o9J87j13p3L0k7O4j41K05
$$ 58 14 -9 75 241 168 105 65 146 172 53 76 21 73 56 -162 -168 -100 102 33 220 107 34 64 37 101 -40 165
4999A65l1r1O3j56r7K09j58NK19J01j48p0j76O7J5k6J83r3K44k61J4m3J4K1J40
$$ 165 134 43 106 -50 -147 62 -96 -91 128 229 81 11 -165 -98 -83 -109 74 -19 225 -36 -22 -65 -51 -30 110
5024A10k08j3J29R5j63l6O6o1J40j23K18j82o8j6R6%j2J91P0l02j22J95J21q8
$$ 110 -98 -111 18 113 -50 -86 -20 -81 59 -64 154 -28 -96 -112 -16 -16 -28 163 233 -69 -191 4 125 37
5048C7R1j26j8J28k04m5J37n9p0L3m0N3M7oJ61k41J73p3Q8M9j59J28j11j40K92
$$ 37 128 2 -16 112 -92 -137 0 -59 -129 -96 -136 -83 -36 -42 119 -122 51 -22 66 115 -44 84 -27 -167 125
5073A25k9k98K35j29l1K68j63L1M2J19j33k59J42P1J23q0j4p3J0J33j38J77j60
$$ 125 96 -202 33 -96 -127 141 -22 9 51 170 37 -222 -80 -9 114 34 20 -53 -43 90 -48 129 -31
5096c1J39l32J79N4o8l29L32R3j19j97L72p1p6Q0m1K6J36M4m1j51j64J94K7q7
$$ -31 108 -224 -45 9 -59 -388 -56 37 -82 -279 93 22 -54 26 -15 11 147 191 150 -1 -165 29 56 -31
5120c1l75M10K5lk34J87J19m6p3K16m30J14J85j5j52Qr1J71J74j71K55Ok98P4
$$ -31 -406 4 29 26 -208 -21 98 52 -21 195 -235 -121 64 49 -103 -95 -186 -15 159 -12 243 249 -49 25
5144B5j39j29K28J70j30M1n4K26q3k18J94l5j66R7Q1k8P1k31J70K20j02j8l59
$$ 25 -114 -243 -15 155 25 66 12 238 155 -63 131 96 -70 27 108 80 151 -80 90 310 208 190 -169
5167a69R8Q4j02P1k13K43N4p9J08l2J58q2l52J73j6N0P9j11K08k72Q5N9q5m9K12
$$ -169 -71 13 -89 -18 -231 12 66 -13 95 63 221 139 -213 -40 -56 -6 73 -38 170 -102 -17 42 -43 -92 120
5192A20k58O0J12j76J93j67R3j23R9J4j2l7K1ON7jK4j49K1J56k48L24r5m8l0O3
$$ 120 -138 -78 34 -142 51 -116 -23 -146 -47 -33 -45 -82 -61 -55 2 1 25 -124 -103 53 -195 129 34 -14 -44 19
5218A9Oj19N2J50k16K09O5j64j65R4J62p2o4J18j65K58l59K81L8j98M9J17J47
$$ 19 25 -94 -42 108 -108 101 166 2 -163 -69 93 21 -43 75 -90 168 -191 90 128 -70 -21 96 243
5241B43p9j29J81k41j52J3K42j02o0Q7J12k07J00r0J8J44k33J4K60k28J58Q9j16
$$ 243 164 35 216 -25 -177 -164 78 -24 -84 3 115 -92 8 -82 -64 80 -153 -139 121 -107 51 140 24
5264B4R4j62J07q2q3J97l1j98L3J34n3j4J74k12Rj11J30O7j58K9J25k90K54n7
$$ 24 118 -44 63 -19 -102 95 64 -134 -101 33 -20 -34 140 -72 -63 -174 -44 23 -135 -106 19 -271 -17 -74
5288g4J71k12J54N1Lm4J04l7J65k14j62K7j32J81qp8L03k10J22j76KRJ09k09J02
$$ -74 97 -115 39 90 93 49 153 116 281 67 -95 -68 -200 -19 -27 -105 198 -12 110 -66 -64 -55 54 -155 -53
5313e3l8L1J4K66k14J64l02m1J91L4J07j96r6o1J17O6N5k84J90J85j57m4K03q9
$$ -53 -91 -60 -46 220 6 170 -132 -173 18 52 159 -37 -133 -194 -77 -11 44 -240 -50 135 -22 -66 137 48
5337D8j3o8k7O2p9m4L9Q4o7j21K55j96L18j81n1oN4J05k92K37j47J41J7p8P3J45
$$ 48 35 -33 -60 2 -77 -121 -82 2 -65 -186 69 -127 191 10 -41 -47 7 112 -180 57 -90 51 68 -10 63 208
5363B08o7J03l91O7K57k49M1n4L7J8j00L9J47j64Qj8J53k29K47N4l2k10o2J17
$$ 208 141 244 -147 -80 177 -72 -31 -85 -48 -30 -130 -91 56 -108 -100 -118 35 -194 53 107 75 -135 -197 -80
5387h0K06k07R1J12Jj38R5j65K00q2m2m1J00k46K5L05k11o6J07J00M9J17j55k58
$$ -80 126 -81 10 122 123 -15 80 -85 115 33 -9 -50 50 -196 -171 134 -77 -143 -36 64 113 230 75 -183
5411a83Q8J10n4p6J80j00k57N28j96J12j31j01J26k26J73J13j79J96j23j14K93
$$ -183 -95 15 -39 -115 65 -35 -292 236 40 152 21 -80 46 -180 -7 106 -73 123 0 -114 179
5432A79m47L54k37m9J91K65k52J66k04K9J23l16K30k41K56J59j52j12qQ7k5K15
$$ 179 -268 86 -151 -200 -9 256 4 170 -34 -5 118 -198 32 -209 47 206 54 -58 -66 21 -4 211
5454B11k12LN3j12r4J37P5j49J63J4P0j46k1k4J07k88L40j1j53PR3r3P7l6r4Q6
$$ 211 -1 2 55 -57 -151 -14 61 -88 75 89 159 13 -8 -32 75 -213 127 116 -37 -30 63 -30 47 11 -83 3
5480COq2K22j72K35j21k37Q4J39j86J98k95J12J01j18J74J5q9J90k29J61j62n4
$$ 3 9 -73 149 -23 212 91 -146 -62 77 -109 89 -206 -94 7 -111 63 78 -11 179 -50 111 -51 -105
5503a05OP0J43q0OJ35j82r4Q3J49Q4k33j67L55j2j36M6m22M52J41m96L10Q6j03
$$ -105 -99 -29 114 34 40 175 -7 -101 -18 131 215 -18 -185 170 158 22 68 -354 98 239 -257 53 139 36
5527C6o9P2j12J04j10J59K0Pj20K9J02m0J21k32J53Q7k18j51Q8J39k62K05J62
$$ 36 -33 39 -73 31 -79 80 100 107 -13 16 118 78 199 -33 120 207 -11 -162 -74 65 -197 8 170
5550A70k60M2K24j95j00J92j65J89j53J57Lr7r6J28o3J18k14J44OP7ok8j49J87
$$ 170 -90 -48 176 -19 -119 73 -92 97 -56 101 104 7 -89 39 -24 94 -120 24 30 107 101 73 -76 111
5574A11Lp2Q2j01k25n6K72j03J03j23J81j30j20N0l2J14j00N2R5P1J3j38Oj54
$$ 111 114 42 124 23 -202 -258 14 -89 14 -109 72 -58 -178 -128 -160 -46 -146 -94 1 72 85 -53 -47 -201
5598b01J45m7j73M67j23k53K26N8j26Q2J29j75o6J81l23J99N9P2q0j32p9p6N11
$$ -201 -56 -103 -276 191 68 -185 41 99 -27 55 184 9 -57 124 -199 0 59 131 51 -81 -160 -236 275
5621B75j43k17n7L23j48o6O1j9j38J86O7j85n9J32k8n1J1R2j35O9o3J14m5J91
$$ 275 132 -85 -142 181 33 -33 28 9 -129 57 124 -61 -120 12 -16 -67 -56 36 -99 -30 -93 21 -24 167
5645A67j25n2Qp1J82j30K69l53K22k09K36j74O1l3j45JL5M5K96nk68j10J01J56
$$ 167 42 -10 -2 -73 109 -21 248 -105 117 -92 144 -30 31 -2 -147 -146 -111 -66 230 225 -43 -153 -52 104
5669A04j81O5K4P7p4J7k58J26J70j49J04m1j59J31PJ06k30K48j82K27o5k06R8
$$ 104 -77 -12 12 89 15 32 -226 -100 70 -79 25 -16 -175 -44 -37 69 -161 87 -95 132 67 -139 -41
5692d1l1j4K66l57J86k56K47MM2j55k6k2Q3r7N8J75j17J34p4P5k22L49k54R8j42
$$ -41 -72 -86 180 -177 9 -247 0 4 46 -109 -135 -157 -74 -171 -113 62 -55 79 5 80 -142 207 -47 51 -91
5717i1P1P5%r4J76k52J45J7o8m8O8O3k04RK80j69L2K0r2k3R5n3J6q3P8J5m4p2
$$ -91 -20 55 55 -39 137 -115 30 47 -21 -69 -1 62 -142 -133 147 -22 10 30 -62 -85 10 -43 -27 -110 -32 -17 -61 -133
5745a33J01J36k18M9J7L6L5m8q5J51j40kJ68K4j34J2P6j70q4K05J6P7n0Q5j86
$$ -133 -32 104 -114 -65 -48 -12 23 -25 -110 41 -99 -101 67 91 -43 -31 45 -125 -209 -4 12 89 39 124 -62
5770f2N4N6p7k0L1K08j85o9J27j67J4J77l5J79j77j36l3O3J68j13l02L26o4j36
$$ -62 -8 48 -29 -49 -18 190 5 -64 63 -104 -90 87 52 231 54 -82 -115 -52 116 3 -299 27 -37 -173
5794a73K40j34j33N0J98N5O7m9j88pJ84k20J60j6Oj97J80n8R0m6l7p1l7J24N7
$$ -173 67 -67 -200 -150 48 103 170 121 -67 -74 110 -110 50 34 40 -157 23 -35 55 9 -28 -99 -136 -12 45
5819D5k11J36J38j77Q3n5J1K09k63J11n7j95K26MK3j06K65j30N1l2j32P8j20K27
$$ 45 -166 -30 108 -69 14 -41 -30 179 -84 27 -30 -225 1 5 28 -78 187 57 108 76 -56 22 -98 129
5843A29ml82L71j54p8P9N8Mj71L9P6L1R3k30J97j20K7N3M1m3m0k1J2R6%o0k9N4
$$ 129 125 -257 114 -40 -118 -39 19 23 -148 -109 -33 -2 91 -139 58 -62 -35 18 59 16 -24 -45 -33 63 63 3 -26 28
5871B8j41j31L03O7j74j28k3J33J42j79J5R3l4r4L3J29J68l05Q3J41j50N1R8J10
$$ 28 -113 -244 59 126 -48 -176 -199 -66 76 -103 -88 5 -29 -123 -90 39 207 -98 -15 126 -24 27 125 235
5895B35l00J09J98k42k08L02j39J94l3j13K50l07m9K10O7k36M5j13j1K00j49K37
$$ 235 -65 44 242 0 -208 94 -45 149 116 3 253 -54 -103 107 174 -62 -17 -130 -141 59 -90 147
5917A47k08J12j90K26J7j42L2l7mJ12k2n4J20m9j40LoL13l21l3J63J25K9m25K34
$$ 147 -61 51 -139 87 104 -38 -6 -43 -47 65 43 -11 109 60 -80 -77 -83 230 -91 -124 39 164 193 -232 2
5942BP3J95j24j52q4m4N8K40l70K74J74m77K58M8k43j9M12j80jj0k5L7p0k18L12
$$ 2 75 270 146 -6 -90 -134 -76 164 -206 68 242 -235 23 71 -172 -191 221 41 40 30 5 42 -28 -246 66
5967F6j11J09K3o3j22j10K79R8k56M10k11m4j34K64N7l06K83n7j64J10k49L8l5
$$ 66 -45 64 87 24 -98 -208 71 169 -87 323 112 68 -66 198 255 -51 232 175 11 121 -128 -90 -125
5990a25K53j47j6J6j73J25J94k52j1J09j02J67o1k7J5J36p0k01MJ7l5K40j25R4
$$ -125 128 -19 -35 -19 -192 -67 127 -125 -136 -27 -129 38 -23 -50 -35 101 31 -170 -166 -149 -184 56 -69 25
6014B5j13N4J11j49K46ml22K99n4Kj89N7K59j38j08K47j08j24M4P9J19k01J10
$$ 25 -88 -34 77 -72 174 170 -152 147 93 95 -94 -37 222 84 -24 223 115 -9 35 114 233 32 142
6037A42J32l56K81k40J16j41q5J29J60k28K44j98K27k03K1p7qK9Q2j9j30J39O2
$$ 142 274 -82 199 -41 75 -66 -151 -22 138 -90 154 -44 183 -20 1 -76 -84 -55 27 8 -122 17 79
6060G9n4N3l0J47k00nj7L9J02j25R6k39k7K25m8j15J90l08L84k13q8K76Pj31j8
$$ 79 25 78 48 195 -5 -10 -27 12 114 -11 85 -154 -181 44 -4 -119 71 -237 147 -66 -154 122 129 -2 -20
6085b0%O7m8j96R6J60j24L03k81j0P9M5o2P5o5m6J50r3nj10K75l18QJ29j11K13
$$ -20 -20 47 -1 -197 -101 59 -65 238 -43 -53 26 71 9 84 19 -27 123 30 25 -85 190 -128 -120 9 -102 111
6111A11k61J99J42m8j20R5j32J67q7n5L9J12j44j6o0J96r0n0J2j01J94m2K6j01
$$ 111 -150 49 191 143 23 118 -14 153 66 11 50 162 18 2 -58 138 48 -2 10 -91 103 61 87 -14
6135a4j00N5K02k04J54j85L0m9K95j65j31L29q9j18P9Q3j90L3M4k59K45n4n7O8
$$ -14 -114 -59 143 -61 93 -92 -62 -111 184 19 -112 217 128 10 89 172 -18 15 59 -200 45 -9 -66 2
6159BJ92m83K49L1k12J58n3K54k37J76j87n1K60j45L14k18J25j67m4J4N7n1r4
$$ 2 194 -289 -40 -9 -221 -63 -116 138 -99 77 -110 -161 99 -46 268 50 175 8 -36 -22 35 -16 -110
6182a10L58j37q7N9k9j23q9J94j95p9K65l2K41m92L97O7o3j5j95j66K18J59j44
$$ -110 248 111 24 83 54 -69 -158 36 -159 -238 27 -5 236 -256 141 208 145 130 -65 -231 -13 146 2
6205Bl2J17k14k9K44j25J74j58j50Q5J46M3j53J76L5j35o8k2R6n3Q3P4J55m11
$$ 2 -30 87 -127 -156 88 -37 137 -21 -171 -86 60 103 -50 126 161 26 -42 -64 32 -21 62 136 291 -120
6229a20J77k53K43%n3Lj3J18l42J93j53K57k31J12L13k98LQo5J87K6k39J52j02
$$ -120 57 -196 47 47 -6 -3 -16 102 -240 -47 -200 57 -174 -62 251 -47 -44 -36 -101 86 112 -127 25 -77
6253g7K41j6p9m7J3q7j8o0J89k9rJ08j26J88j90n0N3j29J12M0m1j68L00j25pJ3
$$ -77 164 148 69 22 35 -52 -70 -130 59 30 21 129 3 191 1 -49 4 -125 -13 27 -14 -182 118 -7 -14 -1
6279al8J63j07K2j03RQ9j70J98r7j15L60j00K20k88L4J05m5O6j03J28n0l94K11
$$ -1 -39 124 17 39 -64 -55 34 -136 62 -35 -150 210 110 330 42 76 181 136 202 99 227 177 -217 -6
6303fj7L05k9l57K8r0J59N3k71L00l5J42L6k15J40j70p0J61R8l73M30l1k91Q7
$$ -6 -23 282 253 -104 -76 -166 -7 46 -225 75 40 182 218 3 143 -27 -97 64 162 -211 219 188 -103 -16
6327a6R6j30N0j39O1J22kr4j7J13l6k6j15K12N2j16k5k6JJ03k4j20j2o4L00j35
$$ -16 80 -50 0 -139 -78 44 42 -52 -69 44 8 -18 -133 79 131 15 -10 -36 -35 68 44 -76 -88 -152 148 13
6353A3L5K19k30k1p6K39k83O2P2J1J9n1J04j17j78L55k01J40k5rk37P8m0J43J28
$$ 13 48 267 37 16 -60 179 -104 -42 30 41 60 9 113 -4 -182 173 -28 112 87 78 -159 -81 -121 22 150
6378A50k96J65j8J22j60L8J03j20J02M7O1n6N3j51j83M7J17p5q8m5K1r6K26K47
$$ 150 -146 19 1 123 -37 1 104 -16 86 133 194 138 191 40 -143 -96 21 -54 -142 -187 -166 -262 -36 211
6402B11r4j73J86k18%KO4L0q4J54j41N1N1J77k48J15K17m29J99j32J62l0Pj55
$$ 211 117 -56 130 -88 -88 -86 -22 8 -76 78 -63 -12 39 216 -32 83 300 -129 70 -62 100 70 77 -78
6426g8N9j02J09J32k28J91k01J17Jp4j43J83J23j35N9Pj17P2J01j4m6R0n9o5K6
$$ -78 -19 -121 -12 120 -108 83 -118 -1 0 -74 -217 -34 89 -46 13 20 -97 -25 76 62 16 106 47 -18 8
6451Hj09J89k41J45j71K78k08k2J26j64J89P7j18j01M4Q5k54L36N9k40n7J30n8
$$ 8 -101 88 -153 -8 -179 99 -109 -131 -5 -169 20 97 -21 -122 -78 7 -247 89 148 -92 -149 -19 -77
6474g7J28q8J39J00qk26K97l21J32J48j13j3j56p0q8J04J96j50J8K2J69j50n8
$$ -77 51 -37 102 202 194 -32 265 -56 76 224 111 98 -58 -128 -216 -112 84 -66 -48 -26 143 -7 -65
6497f5n5J67K5l8j67K99k10L8J32r4R1j06j52K60j93k4N1j55K95k7P7k29J70L
$$ -65 -120 47 72 34 -133 166 -44 -6 126 32 123 17 -135 125 -68 -92 -41 -196 99 72 149 -80 90 93
6521I3q9j1k22L08n5J09j16j19O8J02j95N6L5j6n8J28j40P5J06j51K45j77o2J57
$$ 93 4 -7 -229 79 24 133 17 -102 -34 68 -127 -71 -36 -52 -110 18 -122 -47 59 -92 153 -24 -86 71
6545G1L1j9l8j11J75R7j44l3p8K16j65L0J54j21j95q3J82M6L9j94J20n9J39j07
$$ 71 102 83 45 -66 109 206 62 29 -49 167 2 32 186 65 -130 -213 -31 15 54 -140 -20 -79 60 -47
6569d7qm0J77J10k9k69K1J70K2l12J59J89q8L6j27K47l61J21K12k29K6lr9K18
$$ -47 -55 -95 82 192 163 -106 -85 85 107 -205 -46 143 55 91 -36 211 -150 -29 183 -46 -20 -23 -122 96
6593I6m5P1j81n4M6J4J62k80K91O6j83J20j17Q7m17K31j1J85M1q6l1j12K63k41
$$ 96 51 122 -59 -113 -67 -53 109 -171 120 186 3 123 6 93 -324 -93 -104 81 122 36 5 -107 156 -85
6617h5N0j73J51k9m3K82k35M3K6k8J54n7j18O7j35K89Q9l22J67k6l6n0k9m0J57
$$ -85 -35 -208 -57 -86 -129 153 -82 -39 -13 -41 113 56 -62 5 -130 159 248 -74 93 67 31 -19 -48 -88 69
6642F9j02kK7J11O0p7o1j25KJ67M1j80J02n1m8J68P7k52J82j95J63J58k08O3J5
$$ 69 -33 -35 -8 103 163 86 25 -100 -98 69 110 -70 32 -19 -67 101 178 -74 108 -87 76 234 26 89 104
6667A04j57J8R5jK35n11K05J75l5j12k19J27K00O8k63L40q0r7P8j47j34O8M4L6
$$ 104 -53 -35 60 59 294 -217 -12 163 128 16 -203 -76 124 192 -71 269 189 92 170 23 -111 -43 1 37
6691C7k30J24K18k26Q1j87K21J4J4m8K1Q3L8k05J1j3N8j83L2J56q8K30j44O2j57
$$ 37 -193 -69 149 -77 4 -183 38 52 66 18 39 122 160 -45 -34 -47 11 -172 -140 16 -72 158 14 76 -81
6716h1K08l95J28J32O1j37j6K05PO7j61J6j4j1O1K1o0Q8m3l3Rj30P6J91k16q6
$$ -81 127 -268 -140 -8 53 -84 -100 105 112 179 18 34 20 9 70 91 31 119 76 43 52 -78 -2 189 -27 -113
6742a13L05r0j38k0J60j04j52J21J8J25K8n17J32K71K9R1j8j35j02Rk8J77l33
$$ -113 192 102 -36 -56 104 0 -152 -31 -13 112 140 -377 -245 26 55 146 128 -7 -109 -100 -128 49 -284
6765b84K49J33j03j04K88N7k03J17j89RPoJ2K63k40K20l38K79k53j3K36l5k18
$$ -284 -35 98 -5 -109 179 236 33 150 -39 -30 -23 -29 -17 246 6 226 -112 167 -86 -99 137 102 -116
6788a16K41j29N8L1j19J20j77O7J30k5n7j70pJ19J31p7j44J7J51m2N8q8l6J06
$$ -116 125 -4 54 85 -34 86 -91 -24 106 81 24 -146 -153 -34 97 20 -124 -107 44 2 60 -28 -64 42
6812D2m3P9N4mk58J50j53O2L59k32Pq6P3l2P9o0K1Kl9q0K24Mj81o7J17K2q7j3
$$ 42 -1 78 132 128 -130 20 -133 -71 288 56 63 -23 50 18 97 37 58 60 21 -59 165 169 -12 -79 38 60 -27 -40
6840d0N8Q0m3j42j20K90j18jk6J2Q6P6l1p9q1J65k0r5K76j66RK9j46jq5K92l59
$$ -40 18 98 55 -87 -207 83 -35 -36 -62 -50 36 112 81 2 -79 86 66 -29 247 81 90 119 -27 -28 -113 179 -180
6867a80J59q3j41O5L42o0j09K3j59J77j62M0P1l6j27K61n1o2J66l01J26J67l1
$$ -180 -21 -104 -245 -180 162 102 -7 16 -143 34 -128 -88 -17 -53 -180 81 30 -32 134 -167 -41 126 95
6890I5j1m0O2j11j76J82m8Q9N5l5r2j51j3L45o7P4j62q8K4J30n7J32k67K51j40
$$ 95 84 44 106 -5 -181 1 -47 42 97 62 -30 -181 -194 151 84 158 -4 -92 -68 62 5 137 -130 121 -19
6915a9P6l2j96J90J8m9Q3L2o6J4p6J54j08p9m2J60j18K21k06MK45k51M9j06P5
$$ -19 57 25 -171 19 37 -12 71 103 37 51 -25 129 21 -58 -100 60 -58 163 -43 -39 206 -45 4 -102 -27
6940b7l0K05k18l4j09M15p5j55P8o9j98Q0J23Q1Q9k58L2j4l0K55J3l50J65o1N7
$$ -27 -57 148 -70 -104 -213 202 127 -28 50 -19 -217 -137 -14 67 156 -102 -70 -84 -114 141 154 -196 -31 -92 -35
6965c5J32p5J00P6k37oJ23m9q7P3J36j31J39j68K3p5k7K7Q4N5j21j12K02j63J33
$$ -35 97 22 122 198 -39 -45 78 29 -58 15 151 20 159 -9 14 -61 -88 -61 23 78 -43 -155 47 -116 17
6990A7O5r2N9q6l08M71j34j23k5J52l5r9J7L16Q7k85J18k56Q3n7M9K09k28m2M6
$$ 17 82 -10 49 -37 -345 126 -8 -131 -156 -4 -39 -138 -121 195 282 -3 115 -141 -58 -115 -66 143 -85 -127 -81
7015h1J58L6J03j44J24o8l87L71m5O1O9l59K59j49Q3q6J35m6K35l26J11j99Q7
$$ -81 77 113 216 72 196 128 -259 112 67 128 197 -162 97 -52 31 -55 80 34 269 -57 54 -145 -58
7038e8k75J61R5L9P9J48m13N41l34j8o5P6j21J12J12p0Nr0J87nk47J10K8J33J
$$ -58 -333 -172 -77 -38 41 189 -224 317 -17 -35 -100 -24 -145 -33 79 9 14 -76 111 106 -141 -31 -3 130 131
7063A31k12j35K29K2j20o7K56k22PK80k36q5J29J6j14L06k22r8K63k06r6J59J18
$$ 131 -81 -216 13 35 -85 -152 104 -118 -111 169 -67 -152 -23 -7 -121 185 -37 -135 128 -78 -174 -15 103
7086A03j58oK15p1J39j35o6j00J02j29k7P1J83k83J19K02k46k8qK75k15M9l5j2
$$ 103 -55 -61 154 83 222 87 21 -79 23 -106 -133 -62 121 -162 -43 159 -87 -115 -123 152 -63 -14 -49 -61
7110f1J1K8J76l19K38k37K12N1J0J90j84j99J20k95K05rK72l4m84J96N5lN9j03
$$ -61 -50 -22 154 -165 73 -164 48 99 109 299 115 -84 36 -259 -54 -63 209 175 -309 -113 -58 -61 -2 -105
7134a05J04n4Q0K06j55N0m6j21qr9p0n8M01j75J87m9n9k96J97J79j59qL3L3m4
$$ -105 -1 -55 25 231 76 126 80 -41 -49 -148 -218 -276 125 -50 137 88 29 -267 -70 109 -50 -58 -25 8 -36
7159c6N4l9p8J09l66K96j16K98j77P5j89j17P8L96k44R4j01K6j05l6KJ38j9L35
$$ -36 18 -21 -99 10 -356 -60 -176 122 -55 20 -169 -286 -208 188 -56 38 -63 -37 -142 -178 -176 -38 -57 278
7183B78k47Jj41K04O3k88P4p8NJ24k1%j49K50J00l10K63k36j6K70k77PJ16j2n6
$$ 278 31 32 -109 95 158 -130 -56 -134 -129 -5 -26 -26 -175 75 175 -135 128 -108 -124 146 -131 -124 -8 -20 -76
7208g6j19M1L71k99l8J25j3N3k47J64L00l39J7K3K68m97K48m7p0J55M8q3R8j87
$$ -76 -195 -154 217 -82 -120 5 -8 45 -202 -38 262 -77 -60 -37 231 -266 -18 -65 -135 20 68 -15 83 -104
7232a04L26r6l6p0r3MK06o9q8K4j1M9K9L2n0J46o2p8j90K03J76k89k08L3K50r
$$ -104 222 126 90 20 -73 -69 137 68 -20 4 -7 42 71 103 53 199 137 59 -131 72 248 -41 -249 -216 34 25
7258B5P8k19O7J66n4j25J19k12K64j05j97K35N3k89N43m44M6Q9N4o4j41O4J39
$$ 25 103 -116 -49 117 63 -62 57 -155 109 4 -193 42 95 -194 349 -95 -49 40 94 30 -111 -47 92
7281I2j40l6J72k91K00o7J54J40k43n5m7j9K31j47JL5n6K25j96o8j07J36M0J48
$$ 92 -48 -84 88 -203 -3 -70 84 224 -19 -74 -121 -140 91 -56 -55 -20 -76 149 -47 -115 -222 -86 -46 102
7305A02N3k81KoJ30m4K66j36r5j75PK16N9j84J03Qn2n4N9j23K01n3j51N3J06n4
$$ 102 155 -126 -124 -130 0 -44 222 86 -9 -184 -177 39 98 -86 17 25 -27 -81 -22 -145 56 3 -148 -95 11 -43
7331d3O9o7n0QQ2k60K99n1j4j07j03K61N8j06l08K26J85r5J19j16j57J05K9P6
$$ -43 26 -41 -91 -83 -1 -261 38 -13 -27 -134 -237 24 82 -24 -332 -106 79 -16 103 -13 -170 -65 -36 40
7355D0J70M9k88k2j01K82K9j77J96k12N1m4n7J20j86J88j0p7J08K9o2j58K15k10
$$ 40 210 259 -29 -51 -152 130 159 -18 178 -34 17 -27 -84 36 -150 38 28 -49 59 88 26 -132 83 -127
7379a27j0Q5j4O8j07J35L9m3j50J75J12M7m33K53J60L1l58K61P6n3o3j37l5L97
$$ -127 -137 -52 -66 2 -105 30 69 26 -124 51 163 210 -223 30 190 221 -137 124 200 147 84 -53 -88 309
7403C09l01k2j0%J15j08nj51M02k59p8J23k43q3K71K23k58O0j66J63J01j94K40
$$ 309 8 -14 -24 -24 91 -17 -22 -173 229 -30 -108 15 -228 -311 -40 183 -75 -15 -181 -18 83 -111 129
7426A29j56J00n3J86j49k88J90N5J31k20j9J4K78k59q2K8J53pO9j85J38j28K72
$$ 129 -27 73 20 206 57 -231 -41 14 145 -75 -94 -80 198 -61 -143 -115 38 31 100 -85 53 -75 197
7449A97j73J53l81K27k28K02N3N6Oj26n9m1L44l21n7o5K60K5k08J78q2o6K8J4
$$ 197 24 177 -204 23 -205 -3 50 106 112 -14 -73 -114 230 -91 -148 -213 47 72 -136 42 -40 -106 -78 -64
7473f4L4J09j50M8R3l7k10O9j4J84Jj24P7q1J70k23J54j9J11j25j34L1k6J06J11
$$ -64 -30 79 -71 -23 70 33 -177 -108 -122 62 63 -61 16 -65 105 -118 36 17 128 3 -131 -100 -126 -20 91
7498I1j64K28j45n9n1J15K0rO3j42K16r2R2L6j48K50m45K69j25R9j83MM3J41n6
$$ 91 -73 155 10 -49 -100 15 35 26 89 -53 163 71 163 199 51 301 -144 125 0 99 -84 -80 -37 104 48
7523D8r7Q2m9J96k68L53m47K63l12M34l8l6p9q8qJ20L3l39L39J5r0j64K8J13p7
$$ 48 -49 33 -16 180 -88 265 -182 81 -231 203 165 129 50 -38 -46 74 107 -232 107 122 32 -132 -104 9 -68
7548f8J56J4k10MK29j46K3O0K5k24R2N1r6J98L3j26r8oo2j1mJ46k00J15J51m2
$$ -68 88 102 -108 -104 125 -21 2 62 87 -137 -45 6 -90 108 141 15 -83 -89 -151 -162 -166 -20 -220 -105 46 4
7574DJ12l3N6k54K76j78J78l11M0J8O8q3j9L9O1l0K49j18j59J34N8J03k52J1J90
$$ 4 116 83 139 -115 161 -17 161 -150 -110 -92 -24 -107 -126 -87 -26 -56 193 75 -84 50 108 211 -41 -30 160
7599A60m8j34q6L9J08j34R5q9O5j48J36M3m5N8L4r6J43k03J92J60l38m8J45Q1
$$ 160 112 -22 -108 -69 39 -95 0 -89 -24 -172 -36 7 -38 20 54 -42 101 -102 90 250 -88 -136 9 90
7623I0K8j89L0J41k07J7K63o05L99R8j25K00k92R6k6m5K16j04R1O2j44k02K89
$$ 90 118 -71 -41 100 -107 -90 173 -432 -33 65 -60 140 -152 -56 -82 -127 89 -15 76 138 -6 -208 81
7646H1p8N3k71K02K48k88K25k10Q0j5q1Qj82J69J17j84J2J86K5j25k3l8P6r7O4
$$ 81 3 56 -215 -13 235 -53 172 -38 42 27 -54 -46 -228 -59 58 -126 -114 72 97 -28 -51 -89 -13 -110 -46
7671d6rl4R4O8L7j32j08JJ11J33q4K36j54k67L28j77NJ5L8rj66n8J16Q9p3K30
$$ -46 -55 -89 5 73 110 -22 -130 -129 -18 115 31 267 113 -154 174 -3 2 17 55 46 -120 -178 -62 27 -46 184
7697A84k25K5o0J81j94J57q4J59l0l0j69J18o0J14J0j7O5l99M24j81M5j89J11
$$ 184 -41 -16 -76 105 -89 68 -16 143 113 83 -86 32 -28 86 96 79 144 -255 169 -12 33 -156 -45
7720d5K7M3O0j6l4m3j41R8JK52j98N7q5J61k51J03j96J05O2L1j38J02R0j03rN5
$$ -45 -18 25 85 69 35 -8 -149 -51 -50 202 4 61 -24 137 -114 -11 -207 -102 -40 -9 -147 -45 45 -58 -67 -12
7746a2L9j19k30K13L27k91J62p5j65J03J09Nj54Q3R6j22j34L39j47P2j06Q0K3
$$ -12 27 -92 -322 -109 218 -73 89 14 -151 -48 61 66 -88 -5 91 -31 -165 174 27 99 -7 73 96
7769I6R0K8j59r6J03k9q3JLK32k44Rj13K26m32K12J25j0J15j24j29K86j56N8K8
$$ 96 186 214 55 -41 62 33 -50 -49 -46 186 -58 -49 -162 64 -368 -156 -31 -41 74 -50 -179 107 -49 9 37
7794C7k66J18j24P1J84q6J48j15Or9m5K87j80KL7j48K41j38O9J06j41J19l64K11
$$ 37 -229 -111 -235 -164 20 -66 82 -33 -27 -126 -171 116 -64 -62 -25 -173 68 -70 -1 105 -36 83 -281 -70
7818g0l7J46k0m7K13k82J57p4R4J34l42PJ36K55j68Nl2j19j16J62N7J00l17j8
$$ -70 -107 39 19 -28 185 -97 60 -14 80 214 -128 -121 15 270 102 107 75 -44 -160 2 59 159 -158 -176
7842a76L04j07j72L96l38j07J06K04K1j61l6p8Q5L3J02k25J86J14j35Qj57R4l4
$$ -176 128 21 -151 245 -93 -200 -94 110 131 -30 -66 -144 -59 -26 76 -149 37 151 16 24 -133 -39 -73
7865g3N7L7j94M91n01K5qL11k4l59L24j8o3J51o9j02O8k1O6j47L6m6J84o8j46
$$ -73 -16 21 -173 318 -183 -158 -166 145 121 -238 86 68 5 156 87 -15 53 32 98 -49 -13 -59 125 57 -89
7890h9J76j92%J10J47j96J28J03k37O2J94l52M8J9J57l3R4n8k11Q8P2O7J19k73
$$ -89 87 -105 -105 5 152 -44 84 187 -50 12 206 -146 -98 -79 78 45 139 81 -130 -42 30 97 216 -57
7914e7J55q0qj96K91j24L9p7J94k50J03n5m2K98k73L38j40l54J09K49j24J82k6
$$ -57 98 18 10 -186 105 -19 20 -57 137 -113 -10 -65 -107 191 -82 256 116 -238 -129 120 -4 178 152
7937A52k48N9K7nJ07q3om5n7o3J07J20N5j75q9j9Q2J05Kq7O7R5oj22j06K98j54
$$ 152 -96 -37 -10 -15 92 9 3 -42 -99 -162 -55 65 120 -55 -144 -163 -81 24 26 -61 6 101 95 -27 -133 165 11
7964A1o9o3j2PK16k2j18l4K3J68o3O4L5l95K50R9k04M13l92M8JJ3k59K46J39o0
$$ 11 -58 -121 -133 -126 90 68 -50 -84 -61 107 44 108 143 -252 -2 97 -107 306 -86 -38 -37 -24 -283 -37 102 42
7990D2Qj45OM6K09o9m3j14J22j79J31o8N2r6J96r7R4j73Q7r2L1J42n4k81K32o9
$$ 42 50 -95 -89 -43 166 97 54 -60 62 -117 14 -54 -2 -98 98 1 95 -78 9 -83 -52 90 36 -245 -13 -82
8016h2K14l17K10N0j46J36P6j28Op4R5K8j31J65j49m4P3K9j01J43J81k76r0M4
$$ -82 132 -185 25 75 -71 65 141 13 19 -55 40 68 -63 102 -47 -91 -18 11 -90 53 234 -42 -132 -88
8040h8n5J64K06j56p5o3P3j60O6j20K02l0MJ71l06K86k04KM2r1N6K86mk33M6j48
$$ -88 -143 21 227 71 -4 -67 6 -154 -88 -208 -6 -36 -32 139 -167 119 -85 -83 -41 -132 -76 210 206 -27 19 -129
8066a29J35k3M7j42K31p1j6k46L18k45j0J03l2Q5R9l12J58k04J56O4j5j14J39
$$ -129 6 -17 30 -112 119 48 32 -214 104 -141 -151 -48 -80 5 104 -208 -50 -254 -98 -34 -49 -163 -24
8089b4O1J50j04k99J97r5J96p2L2k0k7o9L8K5L9K1j49J11J33j32N3Q3l55L82j0
$$ -24 37 187 83 -216 -19 -114 82 10 42 22 -5 -74 -36 -11 28 49 -100 11 144 12 65 148 -207 175 165
8114A65q9j12p2j1n3K12j37k3J32p9J16j44J14j12J06r1M6Q7k19K87Mj43j42K63
$$ 165 76 -36 -108 -119 -172 40 -97 -120 12 -67 49 -95 19 -93 13 -78 -32 55 -164 123 127 -16 -158 105
8138A05j00r3K05j53J7Q5r4k06M96l72J14k78K02j5P4P1j6K04M8l95J34l3J32
$$ 105 5 -88 117 -36 -19 66 -28 -234 262 -110 4 -274 -72 -87 -13 58 42 246 294 -101 33 0 132
8161A32p1n5N8k04J96J05l14L99k68P4r7R1p4J16o4n7n6J85l4j63K43j01J12p2
$$ 132 61 6 64 -140 56 161 -153 246 -22 52 -45 46 -28 88 24 -33 -89 96 62 -101 142 41 153 81
8185H1j29J12j67J80k53J83
$$ 81 -48 64 -103 77 -176 7
8191G
$$ Imaginary data points
##PAGE= N=2
##DATA TABLE= (X++(I..I)), XYDATA
0@%%%%%%%%%%%%%%%qJ6j6J6j6K3l1L2l9M7n0N8p2Q1q9J04j20J36j54J77k00K24
$$ 0 0 0 0 0 0 0 0 0 0 0 0 0 0 0 0 -8 8 -8 8 -8 15 -16 16 -23 24 -26 32 -40 41 -48 56 -64 72 -82 95 -105 119
37A19k53K84l16L51l91M35m83N33n88O49p16P91q70R58j057J164j284J419j571
$$ 119 -134 150 -166 185 -206 229 -254 279 -309 340 -376 415 -455 503 -554 610 -674 745 -826
56h26J741j935K160k423K735l115L589m196N007o150P907j0966J7797o4551L3900
$$ -826 915 -1020 1140 -1283 1452 -1663 1926 -2270 2737 -3413 4494 -6472 11325 -53226 -19326
71a9326R6705q2418m0671M5863K3308l9664J8585K9433l5748l1953N5842K2861
$$ -19326 77379 -5039 -45710 153 23461 -16203 2382 31815 -3933 -35886 19956 42817
83D2817m9371j7849L6734L399j9129k667k92j1690J3949K3741j6283k9012J8662
$$ 42817 -6554 -24403 12331 15730 -3399 -6066 -6358 -18048 -4099 19642 3359 -25653 -6991
96f991J8859j5131r28J5803j2988j1914K1195J3663k0239q744J6580m931j9544
$$ -6991 11868 -3263 -4191 11612 -1376 -13290 7905 21568 1329 -7415 9165 4234 -15310
109a5310J6664J5005k7020p197L1339j851l3036O233L3648p489l1501J1751K7235
$$ -15310 1354 16359 -10661 -17858 13481 11630 -21406 -15173 18475 10986 -20515 -8764 18471
122A8471j4061j3906J8714K665k0839J043J7230l043j4980N026J1211p726p568
$$ 18471 4410 -9496 9218 11883 -8956 -7913 9317 6274 -8706 -3680 7531 -195 -7763
135g763N845l13L63Q081q133j1716J4246J5105j1476j4156J0817R817j4708k776
$$ -7763 -1918 -2231 -1868 6213 -1920 -13636 610 15715 4239 -9917 900 10717 -3991 -6767
149f767J8108m554j8458Q920J2270j2623n747J3489q09j6651N144J9971q863j6613
$$ -6767 11341 6787 -11671 -2751 9519 -3104 -8851 4638 3829 -12822 -7678 12293 3430 -13183
163a3183J4603J0546j6023k037J3423m210q473J1004N393j7322n421K0569K453
$$ -13183 1420 11966 -4057 -6094 7329 3119 -5354 5650 11043 -6279 -11700 8869 11322
176A1322j9593P57J0432o588j77J0503n580j2582R078J2756j0953r154J4857M871
$$ 11322 -8271 -7514 2918 -3670 -3847 6656 1076 -11506 -2428 10328 -625 -9779 5078 9949
190I949j7154K746J6458q670j1828J1278O222j3192l350J3043j266j3229O602
$$ 9949 -7205 -4459 11999 3329 -8499 2779 9001 -4191 -7541 5502 4236 -8993 -2391
203b391J0599j1566p279J3488K770r838R35O190k998k305P046J096r817J348R645
$$ -2391 8208 -3358 -10637 2851 5621 -4217 -3282 2908 -90 -2395 4651 5747 -4070 -2722 6923
218F923m862o335O505O89p371K243N656m370n216N972L880q335o57J1147l421
$$ 6923 2061 -4274 2231 2920 -4451 -2208 3448 -922 -6138 -166 3714 -4621 -5278 5869 2448
233B448r880P830Q104q569n214Q087L959p600j794P035l400o962P533L949j0443
$$ 2448 -7432 398 8502 -67 -5281 2806 6765 -835 -2629 4406 1006 -5956 1577 5526 -4917
248d917k544R543J372o864o07N709n01l948M480K010n931J630O230l658m113L020
$$ -4917 -7461 2082 3454 -3410 -4017 1692 1191 -2757 1723 3733 -2198 -568 5662 2004 -2109 911
264I11K226k551k127J726l99l238L296K105o298J011O142l460l860M955L638m848
$$ 911 3137 586 -1541 185 -214 -3452 -156 1949 -4349 -3338 2804 -656 -4516 439 4077 -771
280g71j712O166J084p352K166O565n907m456O469L24o479Q37N600k341n734L995
$$ -771 -2483 3683 4767 -2585 -419 6146 239 -4217 2252 2576 -3903 -3066 2534 193 -5541 -1546
296a546M708n814j134P340j758n366N090L122m590r42M084L81n188P46M101l877
$$ -1546 3162 -2652 -3786 3554 1796 -3570 1520 4642 52 -890 3194 3575 -1613 -867 3234 -643
312f43k794M917j720m576M084K282m302l07M428M50l926J146N336l524k942N414
$$ -643 -3437 1480 -240 -4816 -732 1550 -2752 -3059 1369 1819 -2107 -961 4375 851 -2091 3323
328C323M44n587J764L267k936k527K325J073l701p16M516j685m127M528J891m230
$$ 3323 3767 -1820 -56 3211 275 -2252 73 1146 -2555 -3271 1245 -440 -4567 -39 1852 -2378
344b378J119M007j659k096K058K402k276k462L673J81m351J563J502l208q2K536
$$ -2378 -1259 2748 1089 -1007 1051 3453 1177 -1285 2388 2569 -1782 -219 1283 -1925 -2007 529
360E29j094k022O63K320p84j954K574J946k977Q74K780j940j202J808N24j249
$$ 529 -565 -2587 -1924 396 -388 -2342 232 2178 -799 75 2855 915 -287 1521 2045 796
376G96j577J020N59k395N65J362k612l5K668q50j687J391K067q49j200J786J926
$$ 796 -781 239 798 -1597 -1032 330 -2282 -2317 351 -499 -2186 -795 1272 423 -777 1009 2935
393B935l231K15L839k246l336K807J078k870r21J947J56k999O28L571l135j882
$$ 2935 -296 -81 3758 1512 -1824 983 2061 -809 -1730 217 373 -2626 -1998 1573 -1562 -3444
409c444M561O27m060J826L125j377k356K368J910l493r39M040j312m284K921J868
$$ -3444 1117 1744 -2316 -490 2635 1258 -1098 1270 3180 -313 -1252 2788 1476 -2808 113 1981
425A981m204l92L170n34k732J579K704k897j153N066k53n130L213M221m101k450
$$ 1981 -2223 -2615 555 21 -2711 -1132 1572 -1325 -2478 2588 2335 -2795 418 4639 538 -1912
441a912M013K21l612K48L463k664l998M859J856n930j05N301j338k974K579J777
$$ -1912 2101 2322 -1290 -1042 2421 -243 -4241 618 2474 -3456 -3561 1740 402 -2572 7 1784
457A784k471l46M400q67n066K642M042l939j854L557j193l113J874K226l082k396
$$ 1784 -687 -1033 3367 2500 -2566 76 4118 179 -1675 1882 689 -2424 -550 1676 -1406 -3802
473c802L972J878m753L67M805j975k251L245Q10k998q6L323j12l319N70K538k223
$$ -3802 170 2048 -2705 -2338 2467 492 -1759 1486 2296 -702 -788 2535 2423 -896 -326 2212 -11
490a1j941K934q85k612J595J472j809r86K366J405k734q97M456n59l119K380J911
$$ -11 -1952 982 97 -2515 -920 552 -1257 -2243 123 1528 -1206 -2103 2353 1794 -1325 1055 2966
507B966l225m70K372M90l066m56K654j111l265K750J669l483K82K743j179j642
$$ 2966 -259 -729 1643 2133 -933 -1389 1265 154 -3111 -361 1308 -2175 -1893 850 -329 -1971
523a971K456J945k533j711M080N76m651J351L835k489k851J982J032j692o13J556
$$ -1971 485 2430 -103 -1814 2266 2842 -1809 -458 3377 888 -1963 19 1051 -641 -1254 302
539C02j026k429K756K291l228k51K800j207q25L077l33l542Q87M564j400n074
$$ 302 -724 -3153 -397 1894 -1334 -1585 1215 8 -817 2260 1927 -1615 -728 3836 2436 -2638
555b638J887L680l376j827L062r46k771K320K367k464k505K957K192k938L81L053
$$ -2638 -751 2929 -447 -2274 788 -158 -2929 -609 1758 -706 -3211 -254 1938 -1000 -619 2434
571B434k753j419M779L30m668j31L379m20l072N43K519k598j510L351k62l266
$$ 2434 -319 -1738 3041 3371 -1297 -1428 1951 1531 -1541 -998 1521 -1077 -2587 764 502 -2764
587b764J283K320q87o22J024K78r59J005J999k142k323L177J106l494K96K328
$$ -2764 -1481 839 -48 -670 354 632 -327 678 2677 535 -1788 1389 2495 -999 -703 1625
603A625j598k763J370L128j645l366K633J858k463O12K446j709j409J933J966
$$ 1625 27 -2736 -1366 1762 117 -3249 -616 1242 -1221 -609 1837 128 -1281 652 2618
618B618j894j230J847M47k569P46J420k678m37K959q57k963M56L040l01k326J156
$$ 2618 724 -506 1341 1788 -781 -35 1385 -1293 -1730 1229 372 -2591 -2135 905 604 -1722 -566
635e66J973k442O97K808j316k120J699J226j899o30J791l09k874J221K251k529
$$ -566 1407 -1035 -338 2470 1154 -966 733 1959 60 -570 1221 912 -1962 -741 1510 -1019
651a019j555L240J15l082R01L046j075k041J708J763k182l53K896r40k744K079
$$ -1019 -2574 666 781 -2301 -1400 1646 571 -1470 238 2001 -181 -534 2362 1422 -1322 757
667G57J146k317o57J475l65j440K49J805j863r69L024J06k635Q48K270p20p99
$$ 757 1903 -414 -1071 404 39 -1401 -1152 653 -1210 -2179 845 951 -1684 -836 1434 714 -85
684h5J147J23j425L28K071j257k355J283J222j956j03J142q38q45R22J372j198
$$ -85 1062 1185 -240 88 2159 902 -1453 -170 1052 -904 -1007 135 -703 -1548 -626 746 -452
701d52j351K069R47j439M08J020j005M2J273m76j139m41R30J05q27k48L28r84
$$ -452 -1803 266 1213 -226 182 1202 197 239 1512 1036 -103 -544 386 491 -336 -584 -256 -1240
719a240K79J378n59j072P85K86P57m30J81L05k32L4P02p56o76J180l52p73k16
$$ -1240 -961 417 -142 -1214 -429 -143 614 184 365 670 438 472 1174 418 -258 922 570 -203 -419
738d19L1L13n88l27Q64l03r29J545J74q65L77P75J39n22J26Q26o48o67O89M1j193
$$ -419 -388 -75 -663 -990 -126 -429 -1358 187 361 -504 -127 648 787 265 391 1217 569 -98 591 632 -561
759e61O42K01j151j29Q34j72p23N4R28J42q56J149M72j131N35J096o12j97Q2q4
$$ -561 81 282 -869 -998 -164 -336 -1059 -1005 -77 65 -791 358 830 -301 234 1330 718 521 603 519
779E19o52j14P66n28j239Q41P79j458j10J291l18n18N30M94k15k70R24N27j138
$$ 519 -133 -247 519 -9 -1248 -407 372 -1086 -1196 95 -223 -741 -211 283 68 -202 722 1249 111
798A11J31R62r70j40O67j008q0K75k10k09j44j38P36q23J89Q66l16l1O48j78K73
$$ 111 242 1204 234 94 761 -247 -327 -52 -262 -471 -615 -753 -17 -840 -651 215 -101 -132 516 338 611
819F11K98o48K17j21L3k1k94k11M31p60l37O38p83L41K91l47L89K97k20L92K60
$$ 611 909 261 478 357 390 369 75 -136 295 -465 -802 -164 -947 -606 -315 -662 -273 24 -196 196 456
840D56m0L11l48K12K36n82q6N43j196J45L21l38kj25k06N33l20j95R01m90K74
$$ 456 416 727 379 591 827 245 159 702 -494 -349 -28 -366 -368 -493 -699 -166 -486 -681 220 -270 4
861DQ03n88l52J032k44k14k03k14K86m56j83L85n13m34P23k36j97K44l76N39K99
$$ 4 807 219 -133 899 655 441 238 24 310 -146 -329 56 -457 -891 -168 -404 -601 -357 -733 -194 105
882A05QJ23k5L95j0r0k18M10l78k92R0k65P0M7p43M23Q5n41J0M54M72L8l90L36
$$ 105 113 236 211 606 596 506 288 698 320 28 118 -147 -77 -30 -773 -350 -265 -806 -796 -342 130 168 -222 114
906A14P00q25M55L62o61K97J78n00j08nJ17k02m57K01P9q06N72P83r49J9J146
$$ 114 814 -11 444 806 145 442 620 120 12 7 124 -78 -535 -334 -255 -1061 -489 294 -655 -636 510
927E10l0l66l0M50J18o19N37N85q96n26Q04n34p60O71k00o44O83J65k42l97N34
$$ 510 480 114 84 534 652 33 570 1155 259 -267 537 3 -757 -86 -286 -930 -247 -82 -324 -721 -187
948a87Q90q62j52R20m6p40Q18K59r27j28N61L22q65n70P19l77m51Q90l00r89Q23
$$ -187 703 -159 -311 609 563 -177 641 900 -27 -155 406 728 -137 -707 12 -365 -816 74 -226 -1215 -392
969c92N71l98M6L04M41l20j49O79j31r17P29O09r97l25L47k31l00j20L54l0m31
$$ -392 179 -219 -173 131 572 252 103 782 651 -266 463 1072 75 -250 97 -134 -434 -554 -200 -230 -661
990f61K34O21n29MO92R3j91K27n4J99l14k7M15r93OJ053q59p74N56K13j86n45
$$ -661 -427 194 -335 -331 361 454 263 490 436 635 321 294 709 -284 -278 775 -84 -858 -302 -89 -275 -820
1012h20N42L51n57K14J041n14m83N82J16k83O18k57l98R9K7J34p39n55J082m91
$$ -820 -278 73 -484 -270 771 257 -226 356 472 189 807 550 152 251 278 412 -327 -882 200 -291
1032b91p47N54Q53r87l10J225j07o42K46J163n27m54N50K37r13N17K31o72k41
$$ -291 -1038 -484 369 -618 -928 297 190 -452 -206 957 430 -24 526 763 -150 367 598 -74 -315
1051c15K42K0l33RN29k52j072R41J107j464J97Q47K39n48K82J19L03r35M95L82
$$ -315 -73 -53 -386 -377 152 -100 -1172 -231 876 -588 -391 456 695 147 429 548 851 -84 411 793
1071G93j221Q2N66n48k44P10m97m36K13O10m2n02N36O92q96k71J051Q5m03K9M45
$$ 793 -428 -346 220 -328 -572 138 -359 -795 -582 28 -14 -516 20 712 -184 -455 596 681 278 307 752
1092G52k04p04%M45m56k78M86o20j11N58o6l56M02M02l5l71K00P12n30k75M97
$$ 752 548 -156 -156 289 -167 -445 41 -579 -690 -132 -198 -554 -152 250 215 -156 44 756 226 -49 448
1113D48K4n82K90J08m37J55l74L86k76n46O18J04l79L74ol08P29j79J61J18k12
$$ 448 472 -110 180 288 -149 6 -368 18 -258 -804 -186 -82 -461 -87 -93 -401 328 149 310 428 216
1134B16M34k0q57J77O86p81KL00l32p7k14J99R6q5J47O6l03K31O77m59j6M73m6
$$ 216 650 630 -227 -50 636 -145 -143 157 -175 -252 -466 -267 -171 -256 -109 -43 -346 -115 562 103 87 560 514
1157E14J8l97M24l25o31L14N51p68m39Q49l83m1Kn0j24O9M96L54n89K21J060o24
$$ 514 532 135 559 234 -397 -83 468 -300 -739 110 -273 -314 -312 -362 -486 -417 79 433 -156 65 1125 501
1179E01l98N57k57n57NK78k95l50K50P1j67j15L61q7l03N80n6k31J22M87j64j86
$$ 501 103 660 403 -154 -149 129 -166 -516 -266 -195 -362 -477 -116 -203 -506 74 18 -213 -91 396 232 46
1201D6J22M65m27n33O72j3p62K65K98l70k58l5K33K00n28O61K69n08L45J60j89
$$ 46 168 633 206 -327 345 332 -430 -165 133 -237 -495 -530 -297 -97 -625 36 305 -203 142 302 113
1222A13K50J03n8j76k67L04J18n50j87L46l57k21K92j02j23K24J79L00l31J43
$$ 113 363 466 408 232 -35 269 387 -163 -350 -4 -361 -582 -290 -392 -515 -291 -112 188 -143 0
1242@N89k09k68N48l66m15M92K3m87k39K44N02j126L25M00k50n65N10N04k56j34
$$ 0 589 380 112 660 294 -121 371 394 -93 -332 -88 414 -712 -387 13 -237 -802 -292 212 -44 -178
1263a78M7M37l1l91P14k79l51L88j23n19K16M30n75m4O2j11j60l0L38K5l02L78
$$ -178 -131 306 275 -116 598 319 -32 356 233 -286 -70 360 -215 -259 -197 -308 -468 -498 -160 -135 -437 -59
1285e9J52j64K44L08l51J37K16m5l75j07M8N8l68L64n6m38n2N35l45J31J64j78
$$ -59 93 -71 173 481 130 267 483 438 63 -44 4 62 -306 58 2 -436 -488 47 -298 -167 -3 -181
1307a81K63J15m9K46j29j16L63m26L23k35l51J83J6k62J19j45j15L01k78mJ85
$$ -181 82 197 148 394 265 149 512 86 409 174 -177 6 22 -240 -121 -266 -381 -80 -358 -362 -177
1328a77k8K74j25r0K60J24j63J98N9r5r0n3j00O1k31j72K19l99L85q6l07K98M79
$$ -177 -205 69 -56 -146 114 238 75 273 332 237 147 94 -6 55 -176 -348 -129 -528 -143 -229 -536 -238 241
1351B41o16L26J95O0m9L36jj82m01M27k76j74M3K53l39n1L7j89R5k7J32Om6K02
$$ 241 -375 -49 146 206 157 493 492 310 -91 336 60 -114 -71 182 -157 -208 -171 -360 -265 -292 -160 -154 -200 2
1375BJ71q7ML92k19p5K57k75LM6n4J71n13j93L09k24M7j14J47M05k73j83L08J32
$$ 2 173 86 90 482 263 188 445 170 173 219 165 336 -177 -370 -61 -285 -238 -352 -205 200 -73 -256 52 184
1399A84j26L39n2k69M22k60P4k65l9J63j69l12J49j43m9J40j2j78K18L6R9n0P6
$$ 184 58 397 345 76 498 238 312 47 8 171 2 -310 -161 -304 -353 -213 -225 -403 -185 -149 -50 -100 -24
1422b4M22j18k85L44n9j39K4Q6k62J13n29J99j19j32L64L0k79K88K50k76j0K75
$$ -24 398 280 -5 339 280 141 165 251 -11 102 -427 -228 -347 -479 -115 -85 -364 -76 174 -102 -112 163
1444A63J10j10M1J46j50pk3K41n45O1O7l12j16J26oj62K26K7L9L9O8K36J78l51
$$ 163 273 163 204 350 200 193 170 411 -134 -73 -6 -318 -434 -308 -314 -476 -250 -223 -184 -145 -77 159 337 -14
1468a4M77m16Q1J54J0P1j45k07P5k65o4J13n9j64K01Oj80M43O9q0j5j4K14J43
$$ -14 463 47 128 282 292 363 218 11 86 -179 -243 -130 -189 -353 -152 -146 -326 117 186 106 91 77 291 434
1492D34l62M27k00j50L4k38P2j52k32K04Oo6j60L35k49K38N1O9K28P8k29J43j22
$$ 434 72 499 299 149 183 -55 17 -135 -367 -163 -157 -223 -383 -48 -297 -59 -8 61 289 367 138 281 159
1515A59J15K3l23J21K32o04P9L49k67o8j49O7Op2n9N14L6k65M92j83j23K17j39
$$ 159 274 297 -26 95 327 -277 -198 151 -116 -184 -333 -266 -260 -332 -391 123 159 -106 386 203 80 297 158
1538A58J27r3k5J45n34J68K25l34k22M90l60j08K51J66j54j35J17L60p7j46M87
$$ 158 285 192 167 312 -222 -54 171 -163 -385 105 -255 -363 -112 54 -100 -235 -118 242 165 19 506
1559E06k63k62L03J08n12K35K62m08l83K27L44l83j11L54J37n86L45J87n0Q4n5
$$ 506 243 -19 284 392 -120 115 377 -31 -414 -187 157 -226 -337 17 154 -432 -87 100 50 134 79
1580G9K2J20o8K34j68k80K45p2m09K52n7m27L44nJ43o5J28N2N8k79J39M48k66
$$ 79 101 221 153 387 219 -61 184 112 -297 -45 -102 -529 -185 -190 -47 -112 16 68 126 -153 -14 434 168
1603A68n2J77l8O5k55K86r0m57R9P8l44K03l2J01J3j90P6K74Q4l13M77j11q7k3
$$ 168 116 293 255 320 65 351 261 -196 -97 -19 -363 -160 -192 -91 -78 -268 -192 82 166 -147 330 219 132 109
1627A09Q2J5l1j14P7k83l8K25k49j94K23Q4m06M20Q9j10K3J24O8j56J49K49l5
$$ 109 191 206 175 61 138 -145 -183 42 -207 -401 -178 -94 -500 -80 9 -101 -78 46 114 -42 107 356 321
1650C21l71J00J34j64PL73n33k58K59L19n84j88O06O1n02M12J37p4O1J27k05m9
$$ 321 -50 50 184 20 27 400 -133 -391 -132 187 -397 -585 21 82 -420 -8 129 55 116 243 38 -11
1672a1K93K27m58N9P6q0l42K00m1k00K3J38j10j25K97M0J41j15J2P2j30J5L00
$$ -11 282 509 51 110 186 106 -236 -36 -77 -277 -254 -116 -226 -351 -54 -14 127 12 24 96 -34 -19 281
1695B81l56M31k29P8j34j05M6oj58p5K1M1j15J06N8JK63l25M30j05r4L07j34j96
$$ 281 -75 356 127 205 71 -34 12 6 -152 -227 -206 -165 -280 -174 -116 -115 148 -177 253 148 54 361 227 31
1719C1J0J04p7j82n3r2J82j22J03l2k00Q3L05j90PK80N7q0PR5k76j81M67r2k46
$$ 31 41 145 68 -114 -167 -259 -77 -199 -96 -128 -328 -245 60 -130 -123 157 214 134 141 236 -40 -221 246 154 -92
1744i2P9j0j83k39L31l61K90M3l8J63j20J23K39l30K96L11m11r7L09j96QJ1j42
$$ -92 -13 -23 -206 -445 -114 -475 -185 -142 -180 -17 -137 -14 225 -105 191 502 91 -6 303 107 115 126 -16
1767a6N5j45O9K08j88k28J49n4J33R0j40J77j30R3k5j21K55j25rj5J21j97p6J32
$$ -16 39 -106 -37 171 -17 -245 -96 -150 -17 73 -67 110 -20 73 48 -73 182 57 48 33 154 -43 -119 13
1791A3j0l4J05l23J13N6j09K61j79j27L64k26J36J26j08l9M7o6Q0O1k09J94o7
$$ 13 3 -31 74 -249 -136 -80 -189 72 -107 -234 130 -96 40 166 58 19 66 0 80 141 -68 126 59
1814E9k64K9o6R6L1j25K93q4J4j57L10J8j40J73q7K77k57J13k59J03k89N45m16
$$ 59 -205 -176 -242 -146 -115 -240 53 -31 -17 -174 136 154 14 187 100 377 120 233 -26 77 -212 333 -83
1837h3k44L15j45k29K96Q5K8n7r9K07j45K54R8j97J22j04M3l2n5P2k01k89L04
$$ -83 -327 -12 -157 -386 -90 -5 23 -34 -133 74 -71 183 281 84 206 102 145 113 58 130 -71 -360 -56
1860e6K04l79p4K94R7m45K43n1o3K50J87o7Mj3j80J17q7J94o6Ml23l1J43mj68
$$ -56 148 -231 -305 -11 86 -359 -116 -167 -230 20 207 140 144 131 -49 68 -19 175 109 113 -210 -241 -98 -102 -270
1885b70L2J15L09L4k29j54N01k63Q3j01N2J58j04k73L16j53l73K43K5k55J34k2
$$ -270 -238 -123 186 220 -9 -163 338 75 158 57 109 267 163 -110 206 53 -320 -77 -52 -307 -173 -195
1907a95M0Q7J8k66J41jM06j33N5J4p3J71j60l5j68L33k03j42K51j26j68R0Jj60
$$ -195 -155 -68 -50 -316 -175 -176 230 97 152 166 93 264 104 69 -99 234 31 -111 140 14 -154 -64 -63 -223
1931b23J62J1J79l32J64J61k67L27j11J88k65J18J08k25J54m14K17J6lK2j34n3
$$ -223 -61 -50 129 -203 -39 122 -145 182 71 259 -6 112 220 -5 149 -265 -48 -32 -35 -13 -147 -200
1953b00J84k96M5L69J11k09J67jM7K6j05j68J82m31K97K88j64k97o2K19l6j7J33
$$ -200 -16 -312 -267 102 213 4 171 170 217 243 138 -30 152 -279 18 306 142 -155 -217 2 -34 -51 82
1976H2l60K43K6R4P6k04K73j82L3j0J53J1k22JK21k31l24K43o4o7K44l72K58j11
$$ 82 -278 -35 -9 85 161 -43 230 48 81 71 224 235 13 14 235 4 -320 -77 -141 -208 36 -336 -78 -189
2000a89J01k6l2K38O2P8n2p9Q8j77L37l91J28j49lj04J86l18J82O7l0j93J94J54
$$ -189 -88 -114 -146 92 154 232 180 101 189 12 349 -42 86 -63 -66 -170 16 -302 -120 -53 -83 -276 -82 72
2024G2q9p6R6J99o6N3j02K4J30O6l39o3N6O2l28J28P0P8j11K23R1l52K78R3k34
$$ 72 -17 -93 3 202 136 189 87 111 241 307 -32 -95 -39 23 -305 -177 -107 -29 -140 83 174 -178 100 193 -41
2049d1L0N7K35pj06K78m96K12M4q9l34L51k32j30mJ50R5k79J32K71k22J24M9n3
$$ -41 -11 46 281 274 168 446 -50 162 206 117 -217 134 -98 -228 -232 -82 13 -266 -134 137 -85 39 88 35
2073C5lQ2K41k93j06Q7L1L2O2j11r2j83K33J33k79o0J45k27J85j4j09M68j08O5
$$ 35 32 114 355 62 -44 43 74 106 168 57 -35 -218 15 148 -131 -191 -46 -273 -88 -102 -211 257 149 214
2097B14l7j01pJ1J03j57J35j89k27J02m6J92j18K3J99j46M7L7p9J07J05N6P2l73
$$ 214 177 76 69 80 183 26 161 -28 -255 -153 -199 -7 -125 -102 97 -49 -2 35 -44 63 168 224 296 -77
2121g7R9R7r8j97K79Jj92r2%J44r3j35p9M70j66M3K15j19J36k06K5R3No8j01J37
$$ -77 22 119 21 -176 103 104 -88 -180 -180 -36 -129 -264 -343 127 -39 4 219 100 236 30 55 148 153 85 -16 121
2147A21k00m6L4k6jj53N9j5J33q9m5J5l8L93l5j40K37j54L24k24k23J36m3l2K16
$$ 121 -79 -125 -91 -117 -118 -271 -212 -227 -94 -183 -228 -213 -251 142 107 -33 204 50 374 150 -73 63 20 -12 204
2172B04k69J87k36j34M49m31o2J55K3J3J98K4q5Q7j51J80L4l7j39j18R3K4R4l18
$$ 204 -65 122 -114 -248 201 -230 -292 -137 -114 -101 97 121 36 123 -28 152 186 149 10 -108 -15 9 103 -215
2196b15J29J05o1j56O7m6J37q6K57k65K82L6j68N3j8m8oJ14r1N8j56l7j41M52
$$ -215 -86 19 -42 -198 -131 -177 -40 -126 131 -134 148 184 16 69 51 3 -3 111 20 78 -78 -115 -256 196
2220A96l52J28o0j09J06J33j09M45m76L7K77p7q9l4O8j62M3K5Pj65O1J98l53K60
$$ 196 -156 -28 -88 -197 -91 42 -67 378 -98 -61 216 139 50 16 84 -78 -35 -10 -3 -168 -107 91 -262 -2
2244bMo6l4P7K23k06j62J24K84j34K9j22k4k6j5j8J62j26J08j69NR5o6o5k4N49
$$ -2 2 -64 -98 -21 202 -4 -166 -42 242 108 137 15 -9 -35 -50 -68 94 -32 76 -93 -88 7 -59 -124 -148 401
2270D01k10j28n4m0N3J44j66J54l51L38pj40Q7r0j29K1R2j18j0j74L63k3j09j29
$$ 401 191 63 9 -31 22 166 0 154 -197 141 134 -6 81 -9 -138 -117 -25 -143 -153 -327 36 13 -96 -225
2294b25J48K33r4J66j35j50K10j55J59j84R7l1r8Qk75L98k76p9J00Q2Q2R8m9j47
$$ -225 -77 156 62 228 93 -57 153 -2 157 -27 70 39 -59 -51 -326 72 -204 -283 -183 -101 -19 79 30 -117
2318a17J81k08K13K9j33J51l2N6m70M82j49m5q5j0N9Lm6n1J60R1p6p2J56qJ7j16
$$ -117 64 -144 69 98 -35 116 84 140 -330 152 3 -42 -127 -137 -78 -75 -121 -172 -12 79 3 -69 87 79 96 -20
2344b0J29p0OM3L3rj89L9O6j97j3R1L1K6o0P5J86k04J11j87Q9p5J68R5j16R3o
$$ -20 109 39 45 88 121 112 -77 -38 28 -169 -182 -91 -60 -34 -94 -19 167 -37 74 -113 -24 -99 69 164 48 141 135
2371A35l82J55J7j23J82m6J47k68q3L55j76j02M54n04M42r7j94J92R7K8j62j10
$$ 135 -247 -92 -75 -198 -16 -62 85 -183 -266 89 -87 -189 265 -239 203 106 -88 104 201 229 67 -43
2393d3o3j2K14k77J77j07nN6l9K74l50O2L23k08m3L6J25K86m68Lj6J33rK9j43
$$ -43 -106 -118 96 -181 -4 -111 -116 -60 -99 175 -175 -113 210 2 -41 -5 120 406 -62 -59 -75 58 49 78 -65
2418f5p7J96Rk33K72k66k49L27J16k15J29J34k78M68k68p6K90j24j27J46p2l2
$$ -65 -142 54 63 -170 102 -164 -413 -86 30 -185 -56 78 -200 268 0 -76 214 90 -37 109 37 5
2440EQ0j59K14l71M3K03k15L6K68n6j45P7K63j69j27J95k1j1j30qqkK0l24Q7J02
$$ 5 85 -74 140 -231 -188 15 -200 -164 104 48 -97 -20 243 74 -53 142 121 110 -20 -28 -36 -38 -18 -342 -255 -153
2466a53J86k48q0ML66k13o9L32l29L66k98M21k13K22k89p6J43j36J26kj96p8J62
$$ -153 33 -215 -295 -291 75 -138 -207 125 -204 162 -136 285 72 294 5 -71 72 -64 62 60 -136 -214 -52
2489e2j10J06N9m7n0j30J71J90k48J24j33J41O4J98k63J29j2k03J43j12L33l01
$$ -52 -162 -56 3 -44 -94 -224 -53 137 -111 13 -120 21 85 283 20 149 137 -66 77 -35 298 -3
2511cm5j83m8K73j03oo1K34j27J05J29j1q2n3n0N6oK4M1n8j57J9j04q7K76p5j32
$$ -3 -48 -231 -279 -6 -109 -115 -176 58 -69 36 165 154 72 19 -31 25 19 43 84 26 -131 -112 -216 -303 -27 -102 -234
2538b34K40J54m24J20K47m0n5N8K0n0Q9j06jj16J50j71J4j21J9L30j73K39j12
$$ -234 6 160 -264 -144 103 63 8 66 86 36 125 19 18 -98 52 -119 -105 -226 -207 123 -50 189 77
2561G7m4k36L77j37o9J5K32j52j14J79j24j33J66m4j0pJ8j60N5K57r4l73L15j83
$$ 77 33 -203 174 37 -32 -17 215 63 -51 128 4 -129 37 -7 -17 -24 -6 -166 -111 146 52 -321 -6 -189
2585a89q0L35K1k7O4j41K06rj71OK1j60J84J01k69J02Lj37M1K43l65K39k1J43
$$ -189 -269 66 87 60 124 -17 189 180 9 15 36 -124 60 161 -108 -6 -3 -140 -99 144 -221 18 -3 140
2609A40j33o5M8j25J37K89o0l58K07k42J44j18J59p8r4m5J32M5K3l63K23Q6K08
$$ 140 7 -58 -10 -135 2 291 231 -127 80 -162 -18 -136 23 -55 -149 -194 -62 -17 6 -357 -134 -48 160
2632A60q8J42j80K4n0K25j12Q6k09j79L62j32l67L38j0n6J05j17O4n6N7p4J81
$$ 160 72 214 34 58 8 233 121 207 -2 -181 181 49 -318 20 10 -46 59 -58 6 -50 7 -67 114
2655A14k52J95N6j54r0K37n0j01j29K21j52J7o6j08J25k7J13J57j10J52j22j39
$$ 114 -138 57 113 -41 -131 106 56 -45 -174 47 -105 -88 -154 -262 -137 -164 -51 106 -4 148 26 -113
2677a13R7L35Oj26j36J82j3m07K21Qk50J09Qn5N10m07P9k8l09K84j5k0J62j79
$$ -113 -16 319 325 199 63 245 232 -175 46 54 -196 -87 -79 -134 376 -31 48 20 -289 -5 -20 -40 122 -57
2701e7J03nJ5J15p6O8l3j14j80R7L2j83J85L8mN4j18m4J35M8m4Q1o4J36n1pk3
$$ -57 46 41 56 171 95 163 130 16 -164 -67 -35 -218 -33 5 1 55 -63 -107 28 76 32 113 49 185 134 127 104
2728A04k19K80q0r4m1J50j73k0k8M2p6J18Q3j56L7J77q9J30j7PJ5j96J26j28J90
$$ 104 -115 165 85 -9 -50 100 -73 -93 -121 -79 -155 -37 46 -110 -73 104 15 145 128 135 150 -46 80 -48 142
2753A42q9o8k00N2J04N4J70o0j88J52n7J14q5pn6K60K9l25J29m5oK20l21k1N5
$$ 142 53 -15 -215 -163 -59 -5 165 105 -83 69 12 126 41 34 -22 238 267 -58 71 26 20 240 -81 -102 -47
2778d7O1R6j54q2J88j05j35j93L20J5M6Q5J6j51%K7J7Qn9mjn3J36J33l59k5J02
$$ -47 14 110 -44 -126 62 -43 -178 -371 -51 -36 10 95 111 -40 -40 -13 4 12 -47 -51 -52 -105 31 164 -195 -220 -118
2805a18N5J54k43j2J41j48J65K13k00LK28j23k22Q4L05k35p7k07J13K41k37K43
$$ -118 -63 91 -152 -164 -23 -171 -6 207 7 10 238 115 -107 -23 282 47 -30 -237 -124 117 -120 123
2827A23k84P2j03J61J59j31R5R5m2j62j01R9r3Q1O0j27J88j39j20K02r9J30k88
$$ 123 -161 -89 -192 -31 128 -3 92 187 145 -17 -118 -19 -112 -31 29 -98 90 -49 -169 33 -66 64 -224
2850b24K25Nj97L92k69K70k43R7K25l30K61k53J51l28J37mJ23J55l15l0p4J72
$$ -224 1 6 -191 201 -68 202 -41 56 281 -49 212 -41 110 -218 -81 -85 38 193 -122 -152 -226 -54
2872e4mr0L9P7J06l3P7M7r8j15q9J93k16J36L32k85q5J86l45K96j15p0mP1P3j86
$$ -54 -58 -148 -109 -32 74 41 118 165 67 -48 -137 56 -160 -24 308 23 -62 124 -221 75 -40 -110 -114 -43 30 -156
2898a56J72m2O4j70J02k2N8K16k9k51J90j33k5k5j02L01j76j29J57J27j91oK25
$$ -156 16 -26 38 -132 -30 -52 6 222 193 -58 132 -1 -26 -51 -153 148 -28 -157 0 127 -64 -70 155
2921A55j99k8O6j3K17k06NJ70n8R4j14l12J78N6K39m96J63m0k8J81r4K44j86P2
$$ 155 -44 -72 -6 -19 198 -8 -3 167 109 203 89 -223 -45 11 250 -246 -83 -123 -151 30 -64 180 -6 66
2945F6k41J82j24J84m2K02n8J15m03N8J44k94J28J37q0J03j90J42o8J37J7j21
$$ 66 -175 7 -117 67 25 227 169 284 -119 -61 83 -211 -83 54 -26 77 -113 29 -39 98 115 -6
2967fL5j7p8P0j7N2k4j8mJ46k76l2L77k01lr2L7P5k66K40J72j11j8j2J68j20q8
$$ -6 29 12 -66 4 -13 39 15 -3 -7 139 -137 -169 208 7 4 -88 -51 24 -242 -2 170 59 41 29 197 77 -11
2994a1Q5Q3j57q7J01N0pRr7M7r9n9M2K69j55j34N3Qj25J48L7J01L2K6mj50J35
$$ -11 74 157 0 -87 14 64 57 66 -31 16 -83 -142 -100 169 14 -120 -67 -59 -184 -36 1 102 134 160 156 6 141
3021A41j84j39K81j07J0j56J40m5j57J80j36K46l1J49k04k59L37J14l8k64K30
$$ 141 -43 -182 99 -8 2 -154 -14 -59 -216 -36 -172 74 43 192 -12 -271 66 180 142 -122 108
3042A08p4O1k10j03K31m2k4j59M7q6K63o7K58l42K8K16n3L3k4M3k4K8q3r7P0p2
$$ 108 34 95 -115 -218 13 -29 -53 -212 -165 -251 12 -55 203 -139 -111 105 52 85 61 104 80 108 25 -72 -2 -74
3068g4J70j94j2q1N1N5J07j58Q6J05QO2k06o5J85J57o3j88R4m0K7k3N9J02l26
$$ -74 96 -98 -110 -191 -140 -85 22 -136 -50 55 63 125 -81 -146 39 196 133 -55 39 -1 26 3 62 164 -162
3093a62J07l0J62o0k0K7J04m5m5R1j09l3J49pn1j71P3j2QK1Qn2k67L27K3m8j76
$$ -162 -55 -85 77 17 -3 24 128 83 38 129 20 -13 136 129 78 -93 -20 -32 -24 -3 5 -47 -314 13 36 -12 -188
3120a88K37o7l0J2M9k97L05Q2j76J93Pn8j39q1k6J99o2m6J02op5k18K55k3p5J11
$$ -188 49 -18 -48 -36 13 -284 21 103 -73 120 127 69 -70 -151 -177 22 -40 -86 16 10 -65 -283 -28 -51 -126 -15
3146a5k1K12m1j40p9K00R9k88J40j13J9r9O4p0K82m12o4J00J69Rp3K62L8l52K20
$$ -15 -36 176 135 -5 -84 116 215 -73 67 -46 -27 -126 -62 -132 150 -262 -326 -226 -57 -48 -121 141 179 -173 47
3171D7l9j32K19L2l6M7P8k80J68j68J21Q3j55l1j8KJ17j82R2j57L01j22J76m4
$$ 47 8 -124 95 127 91 138 216 -64 104 -64 57 140 -15 -46 -64 -62 55 -127 -35 -192 109 -13 163 119
3195A19N4N2k77K58k32m4M2L8m7J24l71L58j63M9MN9l4j83K21M8P5l71M69k92
$$ 119 173 225 -52 206 -26 -70 -28 10 -37 87 -284 74 -89 -40 -36 23 -11 -194 27 75 150 -221 248 -44
3219d4J31Q3n4j47J40k87J00L63m24j3K7j49K26k9J35k06L01j29k18J49P6J72
$$ -44 87 170 116 -31 109 -178 -78 285 -139 -152 -125 -274 -48 -77 58 -148 153 24 -194 -45 31 203
3241B03k78L1Q8K4O2k86J94j56J09L0l72L51O9Q2m7k45Q1N6J53MR4k21J16q7P4
$$ 203 -75 -44 44 68 130 -156 38 -118 -9 21 -351 0 69 151 104 -141 -60 -4 149 153 247 26 142 55 129
3266A29k25M69m78l4Q2m9Q2L5L22l50P8r2K0q5L5L3j01J36P1k4k21K54k09P4J23
$$ 129 -96 373 -105 -139 -57 -106 -24 11 333 -17 61 -31 -11 -96 -61 -28 -129 7 78 54 -167 87 -122 -48 75
3291G5l37K54J81k56k53K35K4J66L8q3j24J62J20m0K4r7j67J00j19K89m09L46
$$ 75 -262 -8 173 -83 -336 -101 -77 89 127 44 -80 82 202 162 186 89 -78 22 -97 192 -217 129
3313A29j79j8K79j57j39K02j29J5q0J87Rj32p4K08m7m0o2K3j08J68N8k89J50K00
$$ 129 -50 -68 211 54 -85 117 -12 3 -77 110 119 -13 -87 121 74 34 -28 -5 -113 55 113 -176 -26 174
3337A74k95K28k04O6K53l68j04K90j48k2P9Q0K03l01K16k59R9J37j02k18J71o9
$$ 174 -121 107 -97 -31 222 -146 -250 40 -108 -130 -51 29 232 -69 147 -112 -13 124 22 -196 -25 -94
3359i4j27K74k09K47p2j75J22o0J66j06n2j36J96M9K1k5j52J89OK2n3jk24J38
$$ -94 -221 53 -156 91 19 -156 -34 -94 72 -34 -86 -222 -26 23 44 19 -133 56 62 84 31 30 -194 -56
3383e6k1M7J08j02p6r2K60J25n3l3k06r3K15m2J03J27j97Q8j55R5k9J38k43K10
$$ -56 -77 -30 78 -24 -100 -192 68 193 140 107 -99 -192 23 -19 84 211 14 102 -53 42 13 151 -92 118
3407A18j56M2m1n4J95l17K29Np7K18j57rm1k32M29k0j84k69L07K0r2j74K6M01
$$ 118 -38 4 -37 -91 104 -213 16 21 -56 162 5 -4 -45 -277 152 132 -52 -321 -14 6 -86 -260 -234 167
3431A67k30N0j02K61mj43j57J67%n5L64k00k00K68j14nn6j38J30J43k67%Q6n8
$$ 167 -63 -13 -115 146 142 -1 -158 9 9 -46 318 118 -82 186 72 67 11 -127 3 146 -121 -121 -35 -93
3455i3k0P3L5j81J28R9j0j13q7J03J81Ok45l9L06k97O9J91o5nk12J64P5J48j33
$$ -93 -113 -40 -5 -186 -58 41 31 -82 -169 -66 115 121 -124 -163 143 -154 -85 106 41 36 -176 -12 63 211 78
3480G8j23J94rj00l8N9j00k3O0l4j40MM59k24l03M68l14J05j45J87q7o1q3J66
$$ 78 -45 149 140 40 2 61 -39 -62 -2 -36 -176 -172 287 63 -240 228 -86 19 -126 61 -26 -87 -170 -4
3504dJ33j89l4L16k80Q0Q7j62Q0K40k49n7j00J88J46q7j77J41j33r6n7J79J5K43
$$ -4 129 -60 -94 222 -58 22 109 -53 27 267 18 -39 -139 49 195 108 -69 72 -61 -157 -214 -35 -20 223
3528B23j60k20m3K08M0k7q1J81l63J32K09k28j14QM14l87J99N8j31Q8%O0N8KP3
$$ 223 63 -157 -200 8 48 21 -60 121 -242 -110 99 -129 -243 -235 179 -208 -9 49 -82 6 6 66 124 126 199
3553A99k6k01j04J11J01n0J0L1l53L41p6K9j22K09j15j18r3L94k7k50l1J21q3
$$ 199 173 -28 -132 -21 80 30 40 71 -282 59 -17 12 -110 99 -16 -134 -227 167 140 -110 -141 -20 -103
3576a03Q5o5j5m2K40mo8P0j47P1o7J94j54kj2j53K24k30M02k31j6l0L0km5K36
$$ -103 -18 -83 -98 -140 100 96 28 98 -49 22 -45 149 -5 -7 -19 -172 52 -178 224 -7 -23 -53 -23 -25 -70 166
3602A66k10O5k7L2oj33J39p9K4j69K58j04m0J68p9l7N5p1K32l8o2qk43K11j27
$$ 166 -44 21 -6 26 20 -113 26 -53 -29 -198 60 -44 -84 84 5 -32 23 -48 184 146 84 76 -167 44 -83
3627h3pM0K7k11J6K96M0j96J97p7m2k28L75n0k14K4J34j33J70P1j20m5J91j75
$$ -83 -90 -50 -23 -234 -218 78 118 -78 119 42 0 -228 147 97 -117 -93 41 -92 78 149 29 -16 175 0
3651@J43j59j31j33K19jJ47r7J01m5O2j04j23J07J03p5J16k4l41P9nK3M9R5Q4
$$ 0 143 -16 -147 -280 -61 -62 85 -12 89 44 106 2 -121 -14 89 14 130 106 -235 -156 -161 -138 -89 6 90
3676I0M2j05rN4n1p9K15lk46J95q3P2p8l7J71j33q8K70k59k7K08k5m8j50K45j64
$$ 90 132 27 18 72 21 -58 157 154 -92 103 20 92 14 -23 148 15 -73 197 -62 -89 119 94 46 -104 141 -23
3702b3N6M5P4p7j76K44k65J80j01k0K95k04R4jj52l6J63p8p3J04k63J58J30k25
$$ -23 33 78 152 75 -101 143 -122 58 -43 -63 232 28 122 121 -31 -67 96 18 -55 49 -214 -56 74 -151
3726a51J54mN3k13K43j99J68M6j14nq5r9K66Jj52k47K12J1o8J68o8l1J10j5P8
$$ -151 3 -1 52 -161 82 -117 51 97 -17 -22 -107 -206 60 61 -91 -338 -126 -115 -183 -15 -83 -114 -4 -19 59
3751E9P8j35N6n6J98n9R7j59o1K06k00J23K3k49J6J64K6k39R9M9K3j5k01J69o0
$$ 59 137 2 58 2 200 141 238 79 18 224 24 147 170 -79 -63 101 127 -112 -13 36 59 44 -157 12 -48
3776d8J17O2M3k30R7Q6j40N7jj08k2J68l6j53N6P0j83K12j44M0j18M33k45J97
$$ -48 69 131 174 -56 41 127 -13 44 43 -65 -87 81 45 -108 -52 18 -165 47 -97 -57 -175 258 13 210
3800B10j55P4M9j53JJ41j35j63J58L2m3K30j90Q6k21J74l9r9%j30m3L42k35r6
$$ 210 55 129 178 25 26 167 32 -131 27 59 16 246 56 142 -79 95 56 -43 -43 -173 -216 126 -109 -205
3824b05K67Q0p9j06J42j73J90j8J9k97J32j47M0J07M5K91k54j4LQ8j72J58j74
$$ -205 62 142 63 -43 99 -74 116 98 117 -180 -48 -195 -155 -48 -3 288 34 20 23 111 -61 97 -77
3847g7J91k14J44j93J52J04p4pO1J24k83k4J57j15J53j9r1J22j46K20k11k18K04
$$ -77 114 -100 44 -149 3 107 33 26 87 211 -72 -96 61 -54 99 80 -11 111 -35 185 -26 -244 -40
3870d0K2OJ34k25q0J3J78M6j02l9L3J32j14j38J24P9r5j6J24J5k11p9L88k71L8
$$ -40 -18 -12 122 -103 -183 -170 8 54 -48 -87 -54 78 -36 -174 -50 29 -66 -82 42 57 -154 -233 155 -116 -78
3895g8J89k90K49P0K9k02K4p7K24p8j59K31l98M16j95O1mq5J10r5j9Q1p1O4q2
$$ -78 111 -179 70 140 169 -33 -9 -86 138 60 -99 132 -266 150 -45 16 12 -73 37 -58 -77 4 -67 -3 -85
3920h5L32l86r9J40j5K76r5j07K76Rj15l70M15n54N52k41K78j71k52K33J77m47
$$ -85 247 -139 -238 -98 -113 163 68 -39 237 246 131 -239 176 -378 174 -67 211 40 -212 21 198 -249
3942b49K32lj0P5k81K94NO9k72k5n4K13o0J14o9M0o5J24l7J94l42J65j28j7p3
$$ -249 -17 -20 -30 45 -236 58 63 132 -140 -165 -219 -6 -66 48 -21 19 -46 78 41 235 -107 58 -70 -87 -160
3967a60K52j27%Q9j67K26l3Ll0q7r9J42JR2j55N4J34j74m6K06k11J74R7m4k46
$$ -160 92 -35 -35 54 -113 113 80 83 53 -34 -133 9 10 102 -53 1 135 -39 -85 121 -90 84 181 137 -109
3992a09J38KK8j22k6J75N3k77K89o8k03K85Mr5J0m0J23O3k5k30k26K30J89k58
$$ -109 29 31 59 -63 -89 86 139 -138 151 83 -120 165 169 74 84 44 167 230 205 -25 -251 -21 168 -90
4016i0J05k0P2r8P9Rj63j09L04N8j44J58j83K46l19j7J3J68j63RK57k62J2K34
$$ -90 15 -5 67 -31 48 57 -106 -215 89 147 3 161 -22 224 -95 -112 -99 69 -94 -85 172 -90 -78 156
4040A56l71K27J7LN1j6j73K73j19k01K20k79J33m5Q3kL8K43k28k96K29M04k38
$$ 156 -215 12 29 32 83 67 -106 167 48 -153 67 -212 -79 -124 -41 -43 -5 238 10 -286 -57 347 109
4063A09k7o5j86K41l41M89j09j93J07j21k3J37q0l2N7p2L15j33n4N7jj77J05j08
$$ 109 82 17 -169 72 -269 220 111 -82 25 -96 -119 18 -62 -94 -37 -109 206 73 19 76 75 -102 3 -105
4087a05K37P3l47Q8K53l14J25Qn1o1J29J63j98N2M8p5L7j57K8J17m2J24k5r3k13
$$ -105 132 205 -142 -54 199 -115 10 18 -33 -94 35 198 0 52 100 25 62 -95 -67 50 8 132 107 14 -199
4112a99J76K51k13J53j97p4O1L1P8j5j8j14K34l60J17R8k6q9J13j02j23J18J17
$$ -199 -23 228 15 168 -29 -103 -42 -11 67 52 34 -80 154 -206 -89 9 -17 -106 7 -95 -218 -100 17
4135A7j02j23K22J86k34L4j04LJ37Rl4j53J91O7k09Q1J47jo2Nk00J81q7L67l69
$$ 17 -85 -208 14 200 -34 0 -104 -101 36 45 11 -142 49 116 -93 -12 135 134 72 77 -123 58 -29 338 -31
4160c1K77m3k28J29j13L3R4j69O5K7j17q6L55l19J50j8r0o6J82j14r6J66l1l1
$$ -31 246 203 -25 104 -9 24 118 -51 14 41 -76 -162 193 -126 24 6 -84 -150 32 -82 -178 -12 -43 -74
4184g4qJ76j90K01k42R9l0j5N3m5R7rRK75j98J2k39R8J25r9j10K57k28k45L98
$$ -74 -82 94 -96 105 -137 -38 -68 -83 -30 -75 22 13 22 297 99 111 -128 -30 95 -4 -114 143 -85 -330 68
4209F8j88K65k42J08J27k65q2K28j43O5j5K39j71j66L41l21R2O0kq4j01J83p5
$$ 68 -120 145 -97 11 138 -127 -209 19 -124 -59 -74 165 -6 -172 169 -152 -60 0 -2 -86 -187 -4 -79
4232g9J87K5j2L4k73J63k10Q1J28L7N4j74j05J62q0k3M4K04k43L16j26k3j4j66
$$ -79 108 133 121 155 -118 45 -165 -84 44 81 135 -39 -144 18 -62 -85 -41 163 -80 236 110 87 73 -93
4256i3J67r7J05Ql33J99J2K2p6q5K15Mj14K47J79l59O9J4l7k04K33k23K47j76
$$ -93 74 -23 82 90 -243 -44 -32 -10 -86 -171 44 48 -66 181 360 1 70 84 47 -157 76 -147 100 -76
4280g6k4N5q8K05l9j38J40N3j71J29l6k1j88K21o9R0J80k47m8R2K3l0l3P1L5k60
$$ -76 -100 -45 -133 72 33 -105 35 88 -83 46 10 -11 -199 22 -47 43 223 -24 -72 20 43 13 -20 51 86 -174
4306a74J74M3r5J14K4q0J33l29K14n0q9J37J44p6m6Q2K2k38K9J01K4q8j2n9J97
$$ -174 0 43 -52 62 86 6 139 -190 24 -26 -115 22 166 90 44 126 148 -90 -61 40 64 -24 -36 -95 102
4331A02l33L91l06K46K2k47J0N8M9j35J00L7o1L4l5K49j76k35M26m34K06q5J69
$$ 102 -231 160 -146 100 122 -125 -115 -57 -8 -143 -43 -6 -67 -33 -68 181 5 -230 196 -238 -32 -117 52
4354E2J53j34p6J93j86N6O5j4q5J27L2j44j07j81K54j76J40j18J70o8m3L71k76
$$ 52 205 71 -5 188 2 58 123 109 24 151 183 39 -68 -249 5 -171 -31 -149 21 -47 -90 281 5
4377Ej06K91o9R3l16M01l45l9J00j6j7j20L25j03j06J47j68m2M8O7k48L54k29
$$ 5 -101 190 121 214 -102 299 -46 -85 15 -1 -18 -138 187 84 -22 125 -43 -85 -37 30 -218 136 -93
4400i3kQ1J32Q3l04N5j72L74k10j19J91QO2j87J13n4Kj99K53o9oJ50l01K48O9
$$ -93 -95 -14 118 201 -103 -48 -220 154 -56 -175 16 24 86 -101 12 -42 -40 -239 14 -55 -61 89 -212 36 105
4425A05k42o3K71j92K65k1j78J00Mj61n3pK02j17J75jo5M2j94M09n22K49J43j76
$$ 105 -137 -200 71 -121 144 123 -55 45 49 -112 -165 -172 30 -87 88 87 22 64 -130 279 -243 6 149 -27
4449b7j35K49J6l20K02j60m8L21j70J46j1p7J18q4j01M3p7P5P5N4J22j01r7R9
$$ -27 -162 87 103 -217 -15 -175 -223 98 -72 74 63 -14 104 20 -81 -38 -115 -40 35 89 211 110 13 112
4473A12j23l9K29j54j10N1J04M0j79l3J08moJ4j13J23n7J24l2k30K21q4K89k01
$$ 112 -11 -50 179 25 -85 -34 70 110 -69 -102 6 2 -4 10 -103 20 -37 87 55 -175 46 -38 251 50
4497E0j27M8J32p6q7K29k34K4j30K13k17L25j62o8J77j82j17L29J44k85K94l56
$$ 50 -77 -29 103 27 -60 169 -65 -41 -171 42 -175 150 -12 -80 97 -85 -202 127 271 -14 280 -76
4519g6j18J38N4J78j09j49J98o7j01R9%k8Q7J29k95J33j81R9m6j86J81Q2R6j36
$$ -76 -194 -56 -2 176 67 -82 116 49 -52 47 47 19 106 235 -60 73 -108 -9 -55 -241 -60 22 118 -18
4543a8N9p7J51r8j04J13J50l7J7n7M6j05R3k40R3L7j82K97J18k05J40k51r7J81
$$ -18 41 -36 115 17 -87 26 176 139 156 99 145 40 133 -107 -14 23 -159 138 256 51 191 -60 -157 24
4567B4j45J66J0k05L93m44J63m3R9r4P5l7J02M2k62J03J34j4n1J33j46N8J8j54
$$ 24 -121 45 55 -150 243 -201 -38 -81 18 -76 -1 -38 64 106 -156 -53 81 67 16 149 3 61 79 -75
4591g5m0QJ61L2n1O7J26k81j01R5K9P0J01r0j29j35K80k31J59O4j9R4O1k41k2
$$ -75 -115 -107 54 86 35 102 228 -53 -154 -59 -30 40 141 51 -78 -213 67 -164 -5 59 40 134 195 -46 -68
4616f8p2J63j72K30o3r5J84L6J0M0k43J06k23R9N7L6j26q7M21k55j8rJ68j83J02
$$ -68 -140 23 -149 81 18 -77 107 143 153 193 -50 56 -167 -68 -11 25 -101 -188 233 -22 -40 -49 119 -64 38
4641C8j78K44k48L67j18p9m3P4oL3j30pK16n9j41K21k53N9K7N0j14N3q1J18LL3
$$ 38 -140 104 -144 223 105 26 -17 57 51 84 -46 -53 163 104 -37 184 -69 -10 17 67 -47 6 -75 43 46 79
4667G9J78o5l20J64j80J35K24j72l9j29J60L7j70K70l1l79L02plr7J1M5m2p6K38
$$ 79 257 192 -128 36 -144 -9 215 43 4 -125 35 72 -98 172 141 -238 64 57 54 -43 -32 13 -29 -105 133
4692A33n6J47j77l2K00j68j6R2k48K18j94J56j11j86K20o7J02p5J12r6J8j34L98
$$ 133 77 224 47 15 215 47 31 123 -125 93 -101 55 -56 -242 -22 -89 13 -62 50 -46 -28 -162 236
4715B36j68p7J29M7k18L00k17l09N20k51R1j75J49Kp8K1P3j68J8p0J69q3J01j04
$$ 236 68 -9 120 167 -51 249 32 -277 243 -8 83 -92 57 59 -19 2 75 -93 -75 -145 24 -59 42 -62
4739f2K39j09J34j38n0j06J61J45o1k63J56rj32J69n6K73j30o0M2q7j99K07J96
$$ -62 177 68 202 64 14 -92 69 214 153 -110 46 37 -95 74 18 291 161 101 143 56 -143 64 260
4762B60j93J22k64K36q5l07L06k9j28p1J89l1j41L3J97n9j1L1j28K6K4M2j05J01
$$ 260 67 189 -75 161 76 -231 75 46 -82 -153 36 5 -136 -103 94 35 24 55 -73 -47 -23 19 -86 15
4786A5R6qk16M7q2K83j35o6Jk7j57K62j26J18J38k42N4J27K7j08j5L7J4j95L15
$$ 15 111 103 -113 -66 -148 135 0 -66 -65 -92 -249 13 -113 5 143 -99 -45 82 109 1 -14 23 37 -158 157
4811A57J1j39j23K43lj03K5j25L0J41j10K9j00K9o6J06r4J08L6m6%k7M4J92p2
$$ 157 168 29 -94 149 146 43 68 -57 -27 114 4 33 -67 -38 -104 2 -92 16 52 6 6 -21 23 215 143
4836A43k48j6J12Q2q7R9j42rN9p3K5J15K4K0l51M26k43J34P8j0j25n7J50j77K0
$$ 143 -105 -121 -9 73 -14 85 -57 -66 -7 -80 -55 60 84 104 -247 179 -64 70 148 138 13 -44 106 -71 -51
4861e1N7K97m05P8j7l6J72k3j80K2L9Q2J02k62J37L3j19n9J21J25j45j39J46k32
$$ -51 6 303 -102 -24 -41 -77 95 72 -108 -86 -47 35 137 -125 12 45 -74 -133 -12 113 -32 -171 -25 -257
4885b57J92j12J33j76K92P3j20P1k13J67Rj91K4J95P4j76n0J10j18L2j37K48N9
$$ -257 -65 -177 -44 -220 72 145 25 96 -117 50 59 -132 -108 87 161 -15 -65 45 -73 -41 -178 70 129
4908A29K2l56J25P3N1j78pR4K82k52J08j89q7K69n8J00l26J53K00k95J73O1J8
$$ 129 151 -205 -80 -7 44 -134 -141 -47 235 -17 91 -98 -185 84 26 126 -200 -47 153 -142 31 92 110
4931A10j8k39m4J10K4jL12p7o6R0n8j94J09k32K99j57o0Q1N1R1k76L55k85N7J07
$$ 110 92 -147 -191 -81 -57 -58 254 177 111 201 143 -51 58 -174 125 -32 -92 -11 40 131 -145 210 -75 -18 89
4956H9j76l5J91p4P9j26J28j51O8M9M7k8j94J26J09M0j17l3J97k31k7R2j99J49
$$ 89 -87 -122 69 -5 74 -52 76 -75 -7 42 89 61 -133 -7 102 142 25 -8 189 -42 -69 23 -176 -27
4980b7k2J88k99K24p3j14J1R1o3OJ75j55r9Q2p3J18J37o9k17J01J47j88J81L5
$$ -27 -49 139 -160 64 -9 -123 -112 -21 -84 -78 97 -58 -157 -75 -148 -30 107 38 -179 -78 69 -119 62 97
5004I7j35P0L8rq5J59j99O2rll6n3L41j81j81P6O3Rn0K81j33k41O9J78j64j60
$$ 97 -38 32 70 61 -24 135 -64 -2 -11 -14 -50 -103 238 57 -124 -48 15 24 -26 255 122 -119 -50 128 -36 -196
5030a96J91Q1j9J11k78j08K06k52K12L6M5p1n1J75J11Qk61J69j72K4P3m5L8l7
$$ -196 -5 76 57 168 -110 -218 -12 -264 -52 -16 29 -42 -93 82 193 201 -60 109 -63 -39 34 -11 27 -10
5054a0m1j67J34Q7K23k24p9Q9R2j15k9R9L9j46kJ52o7Q9j62K05k57K1R3m8r9J21
$$ -10 -51 -218 -84 3 226 2 -77 12 104 -11 -40 59 98 -48 -50 102 35 124 -38 167 -90 -69 24 -24 -123 -2
5080bj27J17n9R3l2n5K0P9k20L97m99L48j34N9J81j21L6j34j4J36l0j37J15o9
$$ -2 -129 -12 -71 22 -10 -65 -45 34 -186 211 -288 60 -74 -15 166 45 81 -53 -67 69 39 -98 17 -52
5104e2J70o8oj09P2r8J41o9mK25j52p6J34j06k6k4J12l03J71J84j14n4j94K34
$$ -52 118 50 44 -65 7 -91 50 -19 -23 202 50 -26 108 2 -24 -48 64 -239 -68 116 2 -52 -246 -12
5128a2m9J42k98K25j45J57k7K8Mj58p8K7N03m45K04L9p9j22J3j59J32J86j22J5
$$ -12 -61 81 -217 8 -137 20 -7 21 25 -133 -211 -184 319 -126 78 117 38 -84 -71 -230 -98 88 -34 -19
5152a9K92k75p3j16lJ6J83n1O2K6k88K84p2K8P8j32RK8j52K51p7N8J15k64J97
$$ -19 273 -2 -75 -191 -194 -178 5 -46 16 42 -246 38 -34 -6 72 -60 -51 -23 -175 76 -1 57 172 -92 105
5177A05m2m0n4l5m1J96l5P4j14m7P6K11j31j02K2L3j76j5K51j93N1J13k89N5J0
$$ 105 63 23 -31 -66 -107 89 54 128 14 -33 43 254 123 21 43 76 -100 -115 136 -57 -6 107 -182 -127 -117
5202a17J68L7J11k39j64J90J44k12K16L9p4m2L1r2M4j3l8qk17K67N8j02q5L4L7
$$ -117 51 88 199 -40 -204 -14 130 -82 134 173 99 57 88 -4 40 27 -11 -19 -236 31 89 -13 -98 -64 -27
5227b7j1k21K50k1J3j72J64n2j12q6M15mj01p7J43k00R6K47l00J27j48j68M26
$$ -27 -38 -259 -9 -30 -17 -189 -25 -77 -189 -275 140 136 35 -42 101 -99 -3 244 -56 71 -77 -245 181
5250A81k16n5M8J62k00k2L3R9l55M96j61Pq7R1O1J34j13O6k19o5J92J3j13J40
$$ 181 -35 -90 -42 120 -80 -102 -69 30 -325 171 10 17 -70 21 82 216 103 169 -50 -115 77 90 -23 117
5274A17J4N5j86J53j91Q4n7O1pkok9Mj8J09k34l0J24K31j80m8n3J15Kj99J78L
$$ 117 131 186 0 153 -38 46 -11 50 43 41 35 6 10 -8 101 -133 -163 -39 192 12 -36 -89 26 28 -171 7 10
5301A0j55K30J76k05J09j13k08N1l3K11j9k43K94j31pR1Rk12J11ok23K30j5J69
$$ 10 -145 85 261 56 165 52 -156 -105 -138 73 54 -189 105 -26 -33 58 67 -145 -34 -40 -263 -33 -48 121
5325A21k73K18P9j17j05j24K01l13K23P1n8j3j26J34J39O2l3k6j8j21q3J02J42
$$ 121 -152 66 145 28 -77 -201 0 -313 -90 -19 -77 -90 -216 -82 57 119 86 60 42 -79 -162 -60 82
5348H2n7J89j51k11K13o5J4J9J11r6p1J5K1K4n7K22j73n8M1j04P9J21M8j40j47
$$ 82 25 214 63 -148 65 0 14 33 144 48 -23 -8 13 37 -20 202 29 -29 12 -92 -13 108 156 16 -131
5373a31K09L6j22O5p9K4p0J63k47K12N3q1J11j77N7j14M1P0R3r9j51J31qj35J73
$$ -131 78 114 -8 57 -22 2 -68 95 -152 60 113 32 143 -34 23 -91 -50 20 113 14 -137 -6 -14 -149 24
5398B4j44K77l8j75J46J7p6j24j01P9M18k22m2p2K36m38K81p2M0q9L5K38j47l9
$$ 24 -120 157 119 -56 90 107 31 -93 -194 -115 303 81 39 -33 203 -235 46 -26 14 -75 -40 198 51 12
5422A2J7qN8j66K68l7j96J37o3j47j9O2k6J78j36J80j4mq8J94k55J23q7lk14K97
$$ 12 29 21 79 -87 181 144 -52 85 22 -125 -144 -82 -108 70 -66 114 100 96 8 202 -53 70 -17 -20 -234 63
5448F3o2J39j72k0N5n1J73j62j9J13O7J30j56K8L4j20r4l2J9J04P4k57K09p3j68
$$ 63 1 140 -32 -52 3 -48 125 -37 -56 57 124 254 98 126 160 40 -54 -86 -67 37 111 -146 63 -10 -178
5473a78K89j01j49J27J22r0Q3J11q1J47k85r0J68p5Q5k8J4L1j1l6j58j42L42k48
$$ -178 111 10 -139 -12 110 20 103 214 133 280 -5 -95 73 -2 83 55 69 100 89 53 -105 -247 95 -153
5497a53J21l7o6Q8m9L1O7j73J33q2J47n4O6n7n5KM3K36k24J58Lj40K8k5j32K64
$$ -153 -32 -69 -135 -47 -96 -65 2 -171 -38 -120 27 -27 39 -18 -73 -71 -28 208 -16 142 145 5 33 8 -124 140
5523A40r0n2P6m4l27K74j32R3K92k38j14J83J15q1k03Oj29J82p5LJ24J2L31l14
$$ 140 50 -2 74 30 -297 -23 -155 -62 230 -8 -122 61 176 95 -108 -102 -231 -49 -124 -121 3 15 346 32
5547C2q1R0K4j21L4P9j12P4j32J28J6j83R8K74j58o1k7Q5n7r8J11N1r9q9K80k57
$$ 32 -49 41 65 -56 -22 57 -55 19 -113 15 31 -152 -54 220 62 1 -26 59 2 -96 15 66 -33 -122 158 -99
5573i9q7J13J01l22M05j33j69L02p4j70K70j73J9K1J4N0p6J4j35K82k21J06p4
$$ -99 -186 -73 28 -294 111 -22 -191 111 37 -133 137 -36 -17 4 18 68 -8 6 -129 153 -68 38 -36
5596c6J36k37J68P4Kj07r2J20M3q1j6L5m8K00l85J46J47q9MqP8k54P5JK6K06r8
$$ -36 100 -137 31 105 107 0 -92 28 71 -10 -26 9 -39 161 -224 -78 69 -20 -16 -24 54 -200 -125 -124 -98 108 10
5623A0j4L2J2j8j%O0k58J33m6P5n0M8K4no0L5K6p5k4P7j45K07j1j77J53j33L50
$$ 10 -4 28 40 22 21 21 81 -177 -44 -90 -15 -65 -17 7 2 -58 -23 3 -72 -96 -19 -164 43 32 -145 8 -125 225
5651B25k08M5J6r6P0J8K3l12L0K39k36K44m1L4j79J63k01O6N7J89J28k21R6j54
$$ 225 17 62 78 -18 52 70 93 -219 -189 50 -186 58 17 51 -128 35 -166 -100 -43 146 274 53 149 -5
5675eJ1l6N2LJ71j94r0J80J33l22J59PL4p5Q9k71K28j85K2J41Q7j11p8K32j02
$$ -5 6 -30 22 25 196 2 -88 92 225 -97 62 69 103 28 117 -154 74 -111 -89 52 139 28 -50 182 80
5700H0L1l5P8k39j07L03P1l24J19K07K4q1k91J64O6j78J78j33O3r1L5J95k64J45
$$ 80 111 76 154 -85 -192 111 182 -142 -23 184 208 127 -164 0 66 -112 66 -67 -4 -95 -60 135 -129 16
5724A6M5O7k30OQ6Q3mp7P0j18K30k50J57n6O2j04j64K12jkL5j5j51O3K38j85K1
$$ 16 61 128 -102 -96 -10 73 69 -8 62 -56 174 -76 81 25 87 -17 -181 31 30 28 63 48 -103 -40 198 13 34
5751C4j09k2R6M4R1j72%j95L58j64P0j94R2k2J33o6J34j08No1j59J58P2j52J00
$$ 34 -75 -97 -1 43 134 -38 -38 -233 125 -39 31 -163 -71 -93 40 -26 108 0 5 -56 -215 -57 15 -137 -37
5776c7J27k87J27O6j63J52j01j04K22p6J8J66j46J4n8l7K86q7j9k77J77O8J13
$$ -37 90 -197 -70 -4 -167 -15 -116 -220 2 -74 -56 110 -36 -22 -80 -117 169 82 63 -214 -37 31 144
5799A44k04N5N4j4lJ9J42l1r9k78L22Q0j6j71N4q1P4j55R3j34N1J65q9p2R5pj06
$$ 144 -60 -5 49 35 32 51 193 162 63 -215 107 187 171 0 54 -27 47 -108 -15 -149 -98 67 -22 -94 1 -6 -112
5826a12J03o9J3oL5R4K5k13N2K43J37l69K53l10L23k97J28J31j43J89l27N6J98
$$ -112 -9 -78 -65 -71 -36 58 83 -130 -78 165 302 -67 186 -124 199 -98 30 161 18 207 -120 -64 134
5849A34P7j75O5m34L91kr6q1P5l5J3k2P7Kk01L28m1j98j20K78j24K13l27LJ68
$$ 134 211 36 101 -333 58 56 -40 -121 -46 -81 -68 -90 -13 -11 -212 116 75 -123 -243 35 -89 124 -203 -200 -32
5874c2N6k17M40l08J84P4j84K2J94l47K02j43j10J79k4j36K0J79j11J65o8lM2
$$ -32 24 -193 247 -61 123 197 13 35 229 -118 84 -59 -169 10 -14 -150 -130 49 -62 103 35 32 74
5897G4k10J56mJ54j92M1J6q7J7j60K70l5oJ25o8j78m2M3J66j16n3J81j15j46L62
$$ 74 -136 20 16 170 -22 19 35 -52 -35 -195 75 40 34 159 91 -87 -129 -86 80 -36 -89 92 -23 -169 193
5922A93l27J55mo3O7Q4j67J3l2Q8p9q4L19j32J81j86j32K73l12Q5J84Qk30J24
$$ 193 -134 21 17 -46 21 105 -62 -49 -81 7 -72 -156 163 31 212 26 -106 167 -145 -60 124 132 -98 26
5946B6J26J5j11j87K28k08K14k3k6L2n2p0L0k11M93k52j02l9K00r0j2p8N1N6o6
$$ 26 152 167 56 -131 97 -111 103 80 54 86 34 -36 -6 -217 276 24 -78 -117 83 -7 -19 -97 -46 10 -56
5971e6J36j94K24j95P4p0K0M3j42J58p6O8J67p4j46K64j61j36o3K78j28Np2n0
$$ -56 80 -114 110 -85 -11 -81 -61 -18 -160 -2 -78 -10 157 83 -63 201 40 -96 -159 119 -9 -4 -76 -126
5995a26j0J36j58K78j84M5J0J0p4L8N0Q4j38o7K85k97QN5J13k03J33K5J36j1k9
$$ -126 -136 0 -158 120 -64 -19 -9 1 -73 -35 15 99 -39 -106 179 -118 -110 -55 58 -145 -12 13 149 138 109
6020A09k14p5J74p5J68j52K26k60J29J12k59J59j0J0LJ20j58j36qjL93k22J28
$$ 109 -105 -180 -6 -81 87 -65 161 -99 30 142 -117 42 32 42 45 165 7 -129 -137 -138 255 33 161
6043A61k68Q3K84l55M3o1j8M9J57k47J66J5J2p9k9K38k58m5J44q7J72r7j2J80
$$ 161 -107 -24 260 -95 -52 -113 -131 -82 75 -172 -6 9 21 -58 -87 151 -107 -152 -8 -95 77 -20 -32 148
6067A48j19j47n8J69O1k4J46k8k07kk2j20J37J84j54K12j83j0Q4J1j28J07J21
$$ 148 29 -118 -176 -7 54 30 176 148 -59 -61 -83 -203 -66 118 -36 176 -7 -17 67 78 -50 57 178
6090A78r6J04l90J18L44k09N6l09J21n7J15q0K17l1k50J15m8o%K32k8K49k35k03
$$ 178 82 186 -204 -86 258 49 105 -204 -83 -140 -25 -105 112 81 -169 -54 -102 -108 -108 124 96 345 110 -93
6114i3J61q9j7j2J1j42J88J60j42K5K9l0L3P8r0q4J40j82j03R1N6K11k31P6O5
$$ -93 68 -21 -38 -50 -39 -181 7 167 25 50 79 49 82 160 70 -14 126 -56 -159 -68 -12 199 -32 44 109
6139A09k95K55k8P4k06R3n2K60k03N9m7j7J01j97R6j46J13j25oK42m4K6J5P5k25
$$ 109 -186 69 41 115 -91 2 -50 210 7 66 19 2 103 -94 2 -144 -31 -156 -162 80 36 62 77 152 -73
6164g3Q8p9K32j56n6K11k96K86j12m2J20j05J02j54j34J45p4K23j73q1J78k13
$$ -73 15 -64 168 12 -44 167 -129 157 45 3 123 18 120 -34 -168 -23 -97 126 -47 -128 50 -163
6186a63J73J23k61K83k77L5J58Q4l77J93j20N1J92j59Q4L1j39J19O1j47m1P9L8
$$ -163 10 133 -128 155 -122 -87 71 155 -222 -29 -149 -98 94 -65 19 50 -89 30 91 -56 -97 -18 20
6209B0j06J43j73O4j16K89j13k05K26k2j8n9K5J44R9j06Mj08k0K82m10Q1o9m1
$$ 20 -86 57 -116 -52 -168 121 8 -197 29 7 -11 -70 -45 99 198 92 96 -12 -32 250 -160 -79 -148 -189
6233a89K47J5J44m80M57Q2k70K0j30K10k6k53J96l0oP2k40K60j66J33k15M44k95
$$ -189 58 73 217 -263 194 276 6 26 -104 106 80 -173 23 -7 -13 59 -181 79 -87 46 -169 275 -20
6256b0K6j55J93k9j66P8K31j47K8o7r1R2N7j87J74n4k5j1J84J7j25R3O7j79J6
$$ -20 6 -149 44 15 -151 -73 158 11 39 -28 -119 -27 30 -157 17 -37 -62 -73 111 128 3 96 163 -16 0
6281@P0k85L06k6lJ51k93K59m22J21N9j8O2J15J3j49J50j28l4J98k66o7K06J71
$$ 0 70 -215 91 65 62 213 -80 179 -243 -122 -63 -81 -19 96 109 -40 110 -18 -52 146 -120 -187 19 190
6305A90j52j71J39L31l42J02J08n2r1k7L5k9k31R5J7K71k73LK9M2K61j03n7N4
$$ 190 38 -133 6 337 -5 97 205 153 62 35 70 41 -190 -95 -78 193 -80 -77 -48 -6 255 152 95 149
6329A49p6j53J41j18j3j23R7P2j05J01Q1Q8j43l8O5J12j21j48J78j36L54l35n8
$$ 149 73 -80 61 -57 -70 -193 -96 -24 -129 -28 53 141 -2 -40 25 137 16 -132 46 -90 264 -71 -129
6352a29J86J06k01k3J45R5j93k0k14K13J61k45P0J18j06R2J0k20K3O3P8p7R1j32
$$ -129 57 163 -38 -61 84 179 -14 -34 -248 -35 126 -119 -49 69 -37 55 65 -155 -132 -69 9 -68 23 -109
6376a09K80k72j0K36j95k6K26L1o4Kj03pN6o9j70K65m9j05N8l6K16o5j06R7P3
$$ -109 171 -101 -111 125 -70 -96 130 161 97 99 -4 -11 45 -24 -194 71 22 -83 -25 -61 155 90 -16 81 154
6401A54m09K79p3K9l4q7J5J86q8J60j61K53j60j63J00q5%j32J85J6J73j51J28
$$ 154 -255 24 -49 -20 -54 -141 -126 60 -28 132 -29 224 64 -99 1 -84 -84 -216 -31 -15 158 7 135
$$ [...]
8191c6
##END NTUPLES=NMR FID
##END=
