##TITLE=1H_92-D
 200.13MHz, CDCl3,
 8 sc
 
 28.1.2025
##JCAMPDX= 6.0         $$ Bruker NMR JCAMP-DX V2.0
##DATA TYPE= NMR FID
##DATA CLASS= NTUPLES
##ORIGIN= UXNMR, Bruker Analytische Messtechnik GmbH
##OWNER= pz
$$ XWIN-NMR		Version 3.5
$$ Tue Jan 28 16:24:31 2025 Russian Standard Time (UT+4h)  she@DPX200
##.OBSERVE FREQUENCY= 200.1313
##.OBSERVE NUCLEUS= ^1H
##.DELAY= (6, 6)
##.ACQUISITION MODE= SIMULTANEOUS
##.ACQUISITION SCHEME= undefined
##.AVERAGES= 8
##.DIGITISER RES= 18
##SPECTROMETER/DATA SYSTEM= spect
##.PULSE SEQUENCE= zg30
##.SOLVENT NAME= DMSO
##.SHIFT REFERENCE= (INTERNAL, DMSO, 0, 14.3821)
##AUDIT TRAIL= $$ (NUMBER, WHEN, WHO, WHERE, WHAT)
$$ ##TITLE= Audit trail, XWIN-NMR		Version 3.5
$$ ##JCAMPDX= 5.01
$$ ##ORIGIN= Bruker BioSpin GmbH
$$ ##OWNER= she
$$ F:/spectra/data/she/nmr/H-C/1/audita.txt
$$ ##AUDIT TRAIL=  $$ (NUMBER, WHEN, WHO, WHERE, WHAT)
(   1,<2025-01-28 16:23:50.59 +0400>,<she>,<DPX200>,
      <created by zg, POWCHK disabled, PULCHK disabled
       configuration hash MD5:
       00 E9 B6 7A A2 85 ED C7 34 08 36 98 17 FE 4E 26
       data hash MD5: 16K
       91 E9 BC 9F 11 1C AF FF 99 4F B4 2A 12 25 ED 45>)
$$ ##END=
$$ 
$$ hash MD5
$$ B0 6C B0 31 BB A6 66 38 D3 E8 04 1F 7A 07 81 5D
##$RELAX= 
##$RELAX= 
##$RELAX= 
##$RELAX= 
##$RELAX= 
##$RELAX= 
$$ Bruker specific parameters
$$ --------------------------
##$DU= <F:/spectra>
##$EXPNO= 1
##$NAME= <H-C>
##$PROCNO= 1
##$TYPE= <nmr>
##$USER= <she>
##$AMP= (0..31)
100 100 100 100 100 100 100 100 100 100 100 100 100 100 100 100 100 100 
100 100 100 100 100 100 100 100 100 100 100 100 100 100 
##$AQSEQ= 0
##$AQ_mod= 1
##$AUNM= <au_zg>
##$AUTOPOS= <>
##$BF1= 200.13
##$BF2= 200.13
##$BF3= 200.13
##$BF4= 200.13
##$BF5= 200.13
##$BF6= 200.13
##$BF7= 200.13
##$BF8= 200.13
##$BYTORDA= 1
##$CFDGTYP= 0
##$CFRGTYP= 5
##$CHEMSTR= <none>
##$CNST= (0..31)
1 1 145 1 1 1 1 1 1 1 1 1 1 1 1 1 1 1 1 1 1 1 1 1 1 1 1 1 1 1 1 1 
##$CPDPRG= <>
##$CPDPRG1= <>
##$CPDPRG2= <>
##$CPDPRG3= <>
##$CPDPRG4= <mlev>
##$CPDPRG5= <mlev>
##$CPDPRG6= <mlev>
##$CPDPRG7= <mlev>
##$CPDPRG8= <mlev>
##$CPDPRGB= <>
##$CPDPRGT= <>
##$D= (0..31)
0 0.7 0 0 0 0 0 0 0 0 0 0.03 0 0 0 0 0 0 0 0 0 0 0 0 0 0 0 0 0 0 0 0 
##$DATE= 1738067029
##$DBL= (0..7)
120 120 120 120 120 120 120 120 
##$DBP= (0..7)
150 150 150 150 150 150 150 150 
##$DBP07= 0
##$DBPNAM0= <>
##$DBPNAM1= <>
##$DBPNAM2= <>
##$DBPNAM3= <>
##$DBPNAM4= <>
##$DBPNAM5= <>
##$DBPNAM6= <>
##$DBPNAM7= <>
##$DBPOAL= (0..7)
0.5 0.5 0.5 0.5 0.5 0.5 0.5 0.5 
##$DBPOFFS= (0..7)
0 0 0 0 0 0 0 0 
##$DE= 6
##$DECBNUC= <off>
##$DECIM= 32
##$DECNUC= <off>
##$DECSTAT= 4
##$DIGMOD= 1
##$DIGTYP= 9
##$DL= (0..7)
0 120 120 120 120 120 120 120 
##$DP= (0..7)
150 150 150 150 150 150 150 150 
##$DP07= 0
##$DPNAME0= <>
##$DPNAME1= <>
##$DPNAME2= <>
##$DPNAME3= <>
##$DPNAME4= <>
##$DPNAME5= <>
##$DPNAME6= <>
##$DPNAME7= <>
##$DPOAL= (0..7)
0.5 0.5 0.5 0.5 0.5 0.5 0.5 0.5 
##$DPOFFS= (0..7)
0 0 0 0 0 0 0 0 
##$DQDMODE= 0
##$DR= 18
##$DS= 0
##$DSLIST= <SSSSSSSSSSSSSSS>
##$DSPFIRM= 0
$$ [...]
##$SUBNAM0= <"">
##$SUBNAM1= <"">
##$SUBNAM2= <"">
##$SUBNAM3= <"">
##$SUBNAM4= <"">
##$SUBNAM5= <"">
##$SUBNAM6= <"">
##$SUBNAM7= <"">
##$SUBNAM8= <"">
##$SUBNAM9= <"">
##$SW= 18.0517328524113
##$SWIBOX= (0..15)
0 0 2 0 0 0 0 0 0 0 0 0 0 0 0 0 
##$SW_h= 3612.71676300578
##$TD= 16384
##$TD0= 1
##$TE= 0
##$TE2= 300
##$TE3= 300
##$TEG= 300
##$TL= (0..7)
0 120 120 120 120 120 120 120 
##$TP= (0..7)
150 150 150 150 150 150 150 150 
##$TP07= 0
##$TPNAME0= <>
##$TPNAME1= <>
##$TPNAME2= <>
##$TPNAME3= <>
##$TPNAME4= <>
##$TPNAME5= <>
##$TPNAME6= <>
##$TPNAME7= <>
##$TPOAL= (0..7)
0.5 0.5 0.5 0.5 0.5 0.5 0.5 0.5 
##$TPOFFS= (0..7)
0 0 0 0 0 0 0 0 
##$TUNHIN= 0
##$TUNHOUT= 0
##$TUNXOUT= 0
##$USERA1= <user>
##$USERA2= <user>
##$USERA3= <user>
##$USERA4= <user>
##$USERA5= <user>
##$V9= 5
##$VALIST= <valist>
##$VCLIST= <CCCCCCCCCCCCCCC>
##$VD= 0
##$VDLIST= <DDDDDDDDDDDDDDD>
##$VPLIST= <PPPPPPPPPPPPPPP>
##$VTLIST= <TTTTTTTTTTTTTTT>
##$WBST= 1024
##$WBSW= 4
##$XGAIN= (0..3)
0 0 0 0 
##$XL= 0
##$YL= 0
##$YMAX_a= 333016
##$YMIN_a= -370317
##$ZGOPTNS= <>
##$ZL1= 120
##$ZL2= 120
##$ZL3= 120
##$ZL4= 120
##$ABSF1= 10
##$ABSF2= 0
##$ABSG= 5
##$ABSL= 3
##$ALPHA= 0
##$AQORDER= 0
##$ASSFAC= 0
##$ASSFACI= 0
##$ASSFACX= 0
##$ASSWID= 0
##$AUNMP= <proc_1d>
##$AZFE= 0.1
##$AZFW= 0.1
##$BCFW= 1
##$BC_mod= 2
##$BYTORDP= 1
##$COROFFS= 0
##$CY= -3
##$DATMOD= 1
##$DC= 2
##$DFILT= <>
##$DTYPP= 0
##$F1P= 0
##$F2P= 0
##$FCOR= 0.5
##$FTSIZE= 0
##$FT_mod= 4
##$GAMMA= 1
##$GB= 0.15
##$INTBC= 1
##$INTSCL= 1
##$ISEN= 128
##$LB= 0.25
##$LEV0= 0
##$LPBIN= 0
##$MAXI= 10000
##$MC2= 0
##$MEAN= 0
##$ME_mod= 0
##$MI= 1.114404
##$NCOEF= 0
##$NC_proc= 0
##$NLEV= 6
##$NOISF1= 3.799351
##$NOISF2= 2.8
##$NSP= 1
##$NTH_PI= 0
##$NZP= 0
##$OFFSET= 14.38212
##$PC= 1
##$PHC0= 254.6059
##$PHC1= 8.992229
##$PH_mod= 1
##$PKNL= yes
##$PPARMOD= 0
##$PSCAL= 0
##$PSIGN= 0
##$REVERSE= no
##$SF= 200.129724274929
##$SI= 16384
##$SIGF1= 3
##$SIGF2= 2
##$SINO= 400
##$SIOLD= 16384
##$SREGLST= <1H.CDCl3>
##$SSB= 0
##$STSI= 0
##$STSR= 0
##$SW_p= 3205.1282051282
##$SYMM= 0
##$S_DEV= 0
##$TDeff= 0
##$TDoff= 0
##$TI= <>
##$TILT= no
##$TM1= 0
##$TM2= 0
##$TOPLEV= 0
##$USERP1= <user>
##$USERP2= <user>
##$USERP3= <user>
##$USERP4= <user>
##$USERP5= <user>
##$WDW= 1
##$XDIM= 8192
##$YMAX_p= 0
##$YMIN_p= 0
$$ End of Bruker specific parameters
$$ ---------------------------------
##NTUPLES= NMR FID
##VAR_NAME=  TIME,          FID/REAL,        FID/IMAG
##SYMBOL=    X,             R,               I
##VAR_TYPE=  INDEPENDENT,   DEPENDENT,       DEPENDENT
##VAR_FORM=  AFFN,          ASDF,            ASDF
##VAR_DIM=   8192,          8192,            8192
##UNITS=     SECONDS,       ARBITRARY UNITS, ARBITRARY UNITS
##FACTOR=    0.0002768,     1,               1
##FIRST=     0,             0,               0
##LAST=      2.2672688,     0,               0
##MIN=       0,             -370317,         0
##MAX=       2.2672688,     333016,          0
$$ Real data points
##PAGE= N=1
##DATA TABLE= (X++(R..R)), XYDATA
0@%%%%%%%%%%%%%%%%Nj2J5j6J6j6J6k3L1l2L6m3M8n4O4p2Q0r1J01j12J26j42J58
39H3j75J94k13K34k61K88l15L46l81M20m63N09n61O20o86P62q48R48j062J200
59F39j371J575j836K185k661L349m422O272j0038K0381r7707k86683L56131K78194
73B64008k64047j25640J87571l3761j29690J43252P0152k15599l3260K16533N117
84H4636j63954K2492R3861j6259J0648K4275r9827m7037J28117M8881j15096k6363
96e5626P9544m793k7331M9175o133q2890R789P5415j2886m3237K6885R621n2217
109c4684k340N3145n826m5809K1369N1075k8009n8134L9815Q5682k9112r6552
121d9380J1723O8790k6403m2745N6802K6312p4657n304Q1886k0272p9909L8586
$$ y = [0, 0, 0, 0, 0, 0, 0, 0, 0, 0, 0, 0, 0, 0, 0, 0, 0, 5, -7, 8, -8, 8, -8, 8, -15, 16, -16, 20, -23, 25, -29, 35, -37, 43, -48, 53, -59, 67, -75, 83, -92, 102, -111, 123, -138, 150, -165, 181, -200, 220, -243, 266, -295, 325, -361, 401, -447, 501, -561, 639, -732, 843, -993, 1192, -1469, 1880, -2542, 3730, -6308, 14073, -83634, -370317, -14186, 264008, -39, -125679, 61892, 28131, -101559, 41693, 111845, -103754, -137014, 79519, 84636, -79318, -56826, 37035, 20776, 31424, 55699, -44128, -91165, 36952, 85833, -29263, -55626, 23918, 19125, -8206, 40969, 34836, -48054, -38265, 37150, 24264, -18973, 7912, 17533, -34684, -37024, 16121, 10295, -35514, -14145, 36930, 8921, -49213, -9398, 76284, 47172, -49380, -37657, 31133, 4730, -38015, 18787, 45099, -29558, -34862, 47024, 26752, -53157, -14571]
133a4571O5784m8546m5387L7135J8127o335J6103l0918m9535O0330O5912p5193
145g094n1525Q4550J5402q2175L3426P0369q3685n7652J03669K0244j05221L5289
157b4403J06590p4295q5156R9153M7556j04564j172R2065m4524o7327P5924K9089
169D8936r0958J3701R1311n3538q3503O8350N8937o1034j7461M5142k5375k5549
181c1041N5516L571o9968J4652O6241k5936l9745M2435J4089m9994N882M3763
193B9465k5468l5477L4667K0442l9990p774L9777P20l2937M755K5301q621j9414
206a4554J1856J9680q218j4212N370L191j2493N135K0520j1539k7644J6274K9738
219B3104j8670k1285K1552M101k7418J1463K8077k4667j9308L6359P764l8834
$$ y = [-14571, 51213, 2667, -42720, -5585, 12542, 6207, 22310, -8608, -58143, 2187, 68099, -7094, -58619, 25931, 41333, -40842, -7416, 62953, -20732, -78384, 25285, 45529, -59692, -24403, 82187, 7892, -77264, 21889, 69445, -35119, -36291, 55774, 11250, -56077, 19847, 48936, -42022, -28321, 62990, 9452, -74051, -5701, 53236, -7798, -25259, 19883, -5492, -31041, 24475, 28046, -41922, -27270, 38971, 13035, -26710, 15725, 29814, -20180, -14298, 29465, 3997, -31480, 3187, 23629, -16361, -24135, 15642, 16362, -16575, -11820, 13481, 4860, -14554, -2698, 16982, 8764, -5448, -78, 3113, -9380, -4245, 16275, 4736, -22908, -6634, 23104, 4434, -16851, 4701, 8802, -18616, -7153, 20924, -3743, -23051, 13308, 21072, -17762]
231a7762J1018L5598l0512k5760M4382Q874n1911R335M7817k8091l5488L9358
243F858J1614m7558J5557N0548l5851m1268N0228K7143n1940m970M3210j8659
255D912l0447L6695J3505m5611M358M5894k1120l7994L0218K1037l3821j654K9463
268A5435j5660k1297K9686J1562l5134J107L3980j1157k5730K0718J5253k4909
280f146l774K3170p664k1508J3905J4861j9698p994K1051K605j8927M929J6028
293A0838r233j1625J2276P885j3577l208J4411j193j4117N814J2249j0772r750
306a0002J3300N220j5666j377J5832m971j3836J1038Q625j5288m8J8088n837j7130
320a2052J4241J3656j8600p537K0459j937k0926J0365J5373j8036r031K2316K2
$$ y = [-17762, -6744, 28854, -1658, -27418, 16964, 25838, -26073, -16738, 31079, 2988, -32500, 6858, 18472, -29086, -13529, 37019, 1168, -40100, 10128, 37271, -14669, -19639, 23571, 4912, -25535, 11160, 24665, -20946, -16588, 29306, 8186, -29808, 410, 21447, -12374, -14028, 15435, -225, -21522, 8164, 19726, -15408, -14301, 19679, 8522, -17208, 3510, 18763, -6146, -9920, 13250, 5586, -15922, -2017, 12844, -6854, -14848, 6203, 8808, -10119, -5190, 10838, 1605, -10020, 2256, 10141, -3436, -6644, 7767, 6574, -7543, -1729, 10520, -252, -10002, 3298, 8518, -7148, -8525, 7307, 2336, -11500, -462, 8163, -7125, -7173, 10915, 5078, -12052, 2189, 15845, -2755, -10292, 10167, 8230, -12696, -2331, 13042, -4994, -14025, 8291, 8313]
333H313k2509Q922J8841j5283j1921K0787L831k1766N699J9329j2578j3236J6880
346E309N829j8989K540J6774r974j3679J4016P297j6871p93J5320n416j1691J1325
360I97P778j3916j424J6241l306j4793P910J1206j1320o684J3552n81j3884M457
374c767J2900j0299j0623J3377N650j3917P55J3913o624j0980J2647P697j5926
387e197k207J6701l052j3866Q832Q044j3374k294J5521o253j5448J1140J1608
400A0155j4519n853J5589j254j3792J0583R950j5964m160J9411r18j7719O562
413a929J1771j0407n893J2528k119j3708Q292J0282j1644o909J2714J547j0578
426f053L897P618p372l806R898J811q892J115O650k995m177L932J627m702j475
$$ y = [8313, -14196, -5274, 13567, -1716, -13637, 7150, 10981, -10785, -5086, 14243, 1665, -11571, 5309, 11138, -7851, -5311, 11463, 1489, -12190, 1826, 9123, -7748, -8541, 6779, 1363, -10328, 997, 8775, -5141, -6565, 9676, 6370, -8423, -513, 10693, -627, -7311, 6241, 5660, -8224, -3767, 9133, -1166, -11789, 1588, 7238, -6679, -5924, 7989, 1365, -9615, 3032, 10729, -5197, -7404, 9297, 6245, -7621, 1211, 9255, -4119, -6413, 9108, 2855, -12593, -1453, 10155, -4364, -10217, 5372, 4118, -9674, 909, 10859, -5105, -9265, 10146, 9228, -8491, -1929, 9842, -565, -6458, 6070, 3951, -9757, -1465, 8817, -2827, -9736, 2978, 4525, -6053, -2156, 5462, -1910, -5716, 4182, 5993, -2899, -1784, 4866, 1871, -2306, 1626, 3253, -1449, -2924]
441b924L371J276l648j125K198Q18j683Q26K611l077k045P717K216j0008j438
456d915J1277p75r963M300N776j0257p11J3749m176j6372P664J3642j0443p075
470h279J2111j803j0083J1160O886j7707o97K1512n442k0059J1638J3737j7619
483d645l025K0185q737k1390J5871J7616j9781r946J9342o49j4061J1410P674
496I864j8071J057K0787q625j8607J4346J2924j6054l707J4260q907j1854J6853
509D266Q549j9894m969J6715M95q601L375m1o590Q564P907j2206o500J3894L353
524H317r965J63M129m978J108O282m386o698L546M527l70L51m804o201Q910R331
540I262r612o400J0498R54r414N080P752r469m218J0440j357q712N690L357r202
$$ y = [-2924, 447, 1723, -1925, -3050, -852, -34, -1717, -891, 1720, -1357, -3402, 4315, 6531, -3477, -4915, 6362, 5587, -4376, -76, 5700, -4557, -5268, 8481, 4305, -12067, -4403, 9239, -1204, -8279, 3832, 2029, -8054, 3106, 9992, -7715, -8412, 13100, 7658, -12401, -763, 12974, -4645, -7670, 12515, 3778, -17612, -1741, 15875, -3906, -13852, 5490, 4841, -9220, 2190, 9864, -8207, -7150, 13637, 5012, -13595, 751, 13675, -2379, -6086, 8174, -733, -12587, 4266, 12815, -7079, -12048, 4667, 5162, -3439, -64, -105, -6695, 1869, 9776, -2430, -8930, 4964, 8317, -1648, -1485, 2644, -2334, -1226, 5056, 670, -6028, -2482, 2045, 1675, 2026, -2778, -8979, -69, 9262, -350, -6750, 3748, 4702, -4712, 368, 8120, -1349, -5567, 4873, 3516, -5196, 494, 3851, -5351]
555e351M134R373j1915q249J6038M257j5028M202J1599j2053o383J8350l19j8904
569a0249P486J4779j2932p106J4937m298j4642J4435J0905k1661m946K2260l928
582E040j8064J4085J2267j9705l962K0546m706j6418J2389R839j5081j086J3282
595H426r240r772J6013L726j7888K956J4634j0717r105J5857K930j5672M247J2989
609I384r663p917J1250K728q834L755N278q060k050O426l024k892P709p60r542
624f212K212O624l944l03N796l844n852P255J693p782M118P902p475m116P790
639C862l381q066R853N996j2405k299J1888n134q880J0616L912j2228L404J1392
653H530r596p278J4366N89j4974P599J3362j4716r319J6758J309j4957Q102J0618
$$ y = [-5351, -1217, 8156, -3759, -12008, 4030, 8287, -6741, -2539, 9060, -2993, -9376, 8974, 8655, -10249, -2763, 12016, -916, -8022, 6915, 2617, -12025, 2410, 13315, -8346, -13292, 8968, 5040, -13024, 1061, 13328, -6377, -10339, 10207, 5501, -10917, 1472, 11311, -3770, -4856, 8426, -814, -10586, 5427, 9153, -8735, -5779, 8855, -1862, -10967, 4890, 7820, -7852, -3605, 9384, -279, -8196, 3054, 5782, -3052, 703, 5981, -2079, -4129, 2297, -727, -3619, 4090, 3330, -6212, -4000, 2624, -1320, -1623, 4173, 329, -5523, 1732, 3425, -4357, -239, 7663, 188, -3928, 3862, 481, -7585, 2268, 8264, -4141, -6440, 5448, 314, -8566, 2050, 5962, -6266, -2862, 8530, -1066, -8344, 6022, 6611, -8363, -764, 12598, -2118, -11437, 5321, 6630, -8327, -225, 10393]
667A0393j5640o317J7612r08j4718R254J0729j3790m038J3859m649j0762J3420
680D445P997j7125k653J3632m809q343J1618K625j5209K216J2728p344q103J0847
694B522K874j0748M615P321j0037l436J2647R3j0048M910L920p859Q24P925n731
709b08n708P746K566q753Q90N937m260p15P686m133p480O308M644p142J113P518
725F009m760n482O866M86p651L869O582p407l629Q280j707p642O513M834q502
740c341k83Q670m920o748R727L141j0123J879Q695p019n786J0258M99j0628M663
755a316P719r047m357J0790j153r657P117O828j0801k047J1710k451r162P808
769A981M301j0256K96J0220n322p733Q479L944j0381R29P995n608m870Q850J377
$$ y = [10393, -5247, -11564, 6048, 5140, -9578, -324, 10405, -3385, -7423, 6436, 1787, -8975, 4445, 12442, -4683, -7336, 6296, 1487, -6856, 4762, 7387, -7822, -5606, 7122, -222, -8325, 2522, 5396, -5352, -737, 6584, -3453, -6889, 5758, 5851, -4197, 713, 4633, -3226, -2402, 5523, -208, -5916, 1830, 4396, -4357, -3467, 2470, -1790, -2505, 5181, 1048, -6432, -124, 4520, -2622, -1509, 6009, 1249, -4233, 2633, 3119, -4532, -663, 5919, -1488, -5117, 3163, 1456, -6186, 327, 5161, -3341, -3624, 5046, 126, -6622, 3105, 6246, -3877, -1998, 6697, -322, -6108, 4150, 4649, -5979, -1316, 6403, -2644, -7001, 3789, 2636, -7021, 96, 6924, -3877, -5924, 5786, 3335, -5827, 1981, 6282, -3974, -3678, 6542, 1220, -6513, 1966, 5910, -4471, -3542, 4453, -1155, -6025, 2825, 4202]
784D202r898L147P718n454l742P267j11o655L689M581o582j316P065k345n354
799c788M158K219n469L31N376l558k848M792M37m527K775L017l947l85M612j859
815A336l494L883Q51m890J731L732m091k112M629n36m507L260K773m883k76N212
831B618k064l961M514K245n305P80N527m114l091N124M27o244K387M680m955k033
847c465N608o06n856L585M261n114j610O207j207n055M334K939n756l62N835k090
863A648n039M022K447n330M15M642l330l242M444J722n176J052M367k784k061
878b203L890K47l937J810L164l229j531L299l67l195J820J763k462r27K353j95
894C00k347J593J285j523K19J488p96o17J327K62j070J51O14o40m0M21q22n33
$$ y = [4202, -5696, -2549, 5169, -285, -4027, 3240, 3129, -3526, 163, 4744, -1838, -3154, 3911, 1566, -3788, 370, 2589, -2880, -2549, 2827, -731, -3579, 1213, 1650, -2877, -102, 2915, -1032, -1417, 3195, 1336, -2158, 1725, 2576, -2314, -583, 3149, -942, -3054, 1575, 1039, -3468, -208, 2565, -2318, -2594, 2618, 554, -3407, 1107, 3352, -1953, -1173, 4354, 240, -2851, 2273, 2700, -3544, -1157, 3523, -1432, -3465, 2143, 1537, -4319, -734, 3527, -1587, -3197, 3010, 1803, -3252, 1082, 4021, -1735, -2097, 3738, 1648, -3391, 631, 3078, -2252, -1837, 2805, -525, -3767, 677, 2399, -2777, -1725, 2642, -142, -2203, 1687, 1934, -2003, -193, 2971, -258, -1789, 1510, 1143, -2052, -232, 1531, -931, -1858, 495, 300, -2047, -454, 831, -692, -473, 1015, 219, -398, 929, 1191, 121, 272, 886, 246, 206, 627, -195, -728]
912g28Q25n6j055O51K77j156J165J018j583l30J999k4j341N73J158j683j50J866
930A426p40j789J278R13j657m30J371j091q44K145J46k508N44K809q16j640J333
947D50J122j930K95J657p24j758R88J254j686m61R00m38m26N04J87j216N28J536
965G82o9j546K46J681o42q01J291J83j530J6J233kj761K05J372j139o43J102Q3
984F1j287J174R75k052mK489j00k775J433K020k153j125L161l62k989N39K634
1001A639j940j253K002j07k327J460J911k412m32K667m17k478J879J847k754r9
1017h14L323j264l182J758J914k024o10J342j070r32J806Q4k141J100J589j386
1033e07k58K224r02j453J715R48k218q5J863o07j327J550j160j330J655J149k419
$$ y = [-728, 97, 41, -1014, -363, -86, -1242, -77, 941, -642, -972, 1027, 1003, -338, 235, 1393, -290, -440, 1426, 686, -1103, 175, 1088, -569, -999, 372, -719, -1563, 582, 728, -1780, -1236, 1573, 757, -883, 450, 1572, -358, -63, 1594, 870, -888, 100, 1354, -332, -793, 107, -331, -757, -253, -66, -1282, -754, 782, 713, -833, -587, 1094, 452, -349, 942, 1125, -405, -389, 844, 842, -919, -714, 658, -481, -1124, -22, 61, -1226, -52, 923, -1129, -1133, 1356, 1256, -1519, -86, 1934, -219, -1344, 1817, 1455, -1534, -995, 1639, -301, -1554, 448, 341, -1986, -526, 1385, -1027, -1459, 1208, 791, -1687, 192, 2039, -715, -814, 2509, 1245, -1937, -179, 1735, -289, -899, 443, -627, -1559, 247, 331, -1810, -710, 879, -507, -765, 1459, 557, -896, 819, 1767, -451, -536, 1327, 720, -607, 943, -217, -1547, 108, 1257, -1162]
1050a162m6K177j085j834L004Q52l673R80L125k286j462L239k68l085J622K003
1066B101l317n38L763j644l555L238J955m363L12M741k099l998M132K043m459
1081a688O18M630l104l571M971O91n341J887M409m429k692N350P1n508L048L591
1097B933m499j706N694p02m541L197K738m574n12N051j874l674L819J040n216
1112b826J381M834l732k626M154J87m419K365L356l726j313M227r16l532L390
1127H04K229m523L38M435k907l063L999R10m991J798L987m394j537M999r12m571
1143c399L031L248m515j31M637k425l890M718K034n096Q84M166m076k776N696
1158B106K41o085K555M603n066k197O107n91n174M347L020o559l10O606k073m530
$$ y = [-1162, -1208, 969, -116, -1950, 1054, 1906, -1767, -787, 2338, 52, -1410, 1829, 1561, -1524, 98, 2101, -1216, -1754, 2009, 365, -3190, 48, 2003, -2360, -2048, 2693, 594, -3404, 728, 2771, -1688, -1070, 3560, 456, -3115, 1856, 2547, -2794, -907, 3502, -927, -3619, 1731, 1802, -3706, -658, 2933, -1566, -3272, 2422, 1720, -2821, 376, 3114, -1460, -1972, 3079, 1205, -2469, 1350, 2390, -2826, -1445, 3389, -343, -2969, 1185, 1372, -3047, -682, 2674, -1052, -2365, 1862, 946, -2586, 804, 3033, -1490, -1152, 3283, 376, -2687, 1312, 2222, -2769, -971, 3016, -1378, -2915, 2084, 1172, -3399, -368, 2880, -1635, -1766, 2871, 446, -3444, 1274, 3308, -1788, -904, 3262, -814, -3590, 2106, 2347, -3738, -1183, 3420, -1646, -3843, 2264, 1673, -3501, 846, 3866, -2693, -3003, 3603, 1530, -3000]
1174c000M841J616o516Q38N920l605l813N490J185o638J714N372m626k539O651
1189B890j41o390L180L893n147n40O087k019m810L640K562n612%N351k239l978
1205c273M644P51n820J972M680l534j916N186q41n520L410L841m298r34M971k410
1221I09m332M168J731n018J313M432l736l268M702P06m838L113L469m819j479
1236b947N468j334m434M373K804n591j09N120l223l786M902J835n509O55M423
1251B647m017k720O274M00n500K148M022m753j828O354j049m739L786K846o079
1266b208n65N692k069m300M938J329o247R63N355l289k874N308Q1n281K229M090
1282C152m063j208N464j074n135K888K815m588k25M955k056l947L324J771n152
$$ y = [-3000, 1841, 3457, -3059, -2221, 3699, 94, -3719, 1771, 2956, -3682, -1968, 3404, -1222, -3761, 2890, 2749, -3641, -461, 3432, -1715, -2255, 3832, 1813, -2997, 643, 3205, -2407, -2407, 2944, 705, -3273, 1371, 2122, -3698, -1726, 2954, -580, -2496, 2690, 1849, -3671, -261, 3580, -718, -1652, 3319, 909, -3423, 745, 2476, -2542, -1229, 3203, -533, -3801, 901, 1607, -3231, -118, 3351, -1468, -2947, 2521, 1187, -3247, 1126, 3930, -1661, -1770, 3350, 127, -3659, 1243, 3078, -2431, -1776, 2647, -1370, -4090, 2184, 2584, -2916, -768, 3254, -1499, -3327, 3027, 1978, -2761, 1025, 3871, -2208, -2773, 2919, 850, -3450, 1488, 2817, -3430, -2467, 2888, -401, -3275, 2033, 2114, -3167, -938, 3152, -911, -2119, 3345, 2271, -2864, 24, 2839, -1749, -1974, 2981, 925, -3022, 302, 2073, -3079]
1297c079J477M517l028k677M340R5m553K674L382l752j180M409j438m365L528
1312C50K465m017j6L660k585l342M037J127l995J180L810k816k857M916k7m228
1328b338K861K986m059j645M411j373l276L544J355m424k15M293k206l001M193
1343A106R11m098Q92L543l116j448L993j20l421J641K971l969q36M439j534l504
1359b550K828J831m137K85L746j945k537L536P64m250J632L302k780j537L799
1374A987k53l702K273K064l486o49L992j550k961K385J597l521O25L070j786k348
1390b263L170O55l164J016K978k509j232K872m30k810J887J783k852n14K860j141
1406C06k643K327J352k905K79K570j734j324K609L29k592J111K310j987j051K538
$$ y = [-3079, -1602, 2915, -113, -2790, 1550, 1645, -2908, -234, 3148, -604, -1784, 2625, 1187, -3178, 350, 2815, -1202, -1218, 2442, -143, -3485, 552, 1679, -2316, -1136, 2674, -142, -2999, 1917, 1890, -2338, 523, 3509, -550, -2195, 2216, 843, -2433, 1111, 2466, -1958, -2173, 2120, -86, -3087, 1106, 2017, -2081, -1189, 2354, -762, -2210, 1783, 1663, -1758, -117, 2854, -1115, -1951, 2488, 954, -2550, 278, 2109, -2028, -1743, 2003, 58, -2479, 1057, 1821, -2429, -797, 2505, -275, -1812, 1987, 1734, -1968, 305, 2369, -1117, -1766, 2226, 676, -2285, 100, 1697, -1824, -1199, 1871, 85, -2263, 907, 1562, -1602, -586, 2392, -117, -1349, 1523, 1093, -1717, 170, 1953, -899, -1413, 1447, 306, -2337, -10, 1342, -1563, -1284, 1286, -448, -1772, 837, 1166, -1426, -315, 1995, 8, -1043, 1495]
1422A495m48k466J462J139k178j01J896o58j856J921R96k337K31K400j522j179
1438a205K012L36k185J298J305j681q43J646J07j772J193J101k180j18K133j156
1454ij469J626N66j596O88J339j223p78J703J55j594N93Q63q55o96J378K5j832
1472a116Q97R01j603n8J724r18j054J362M74j324M98J362o60q37J039k3j263L04
1490b95J274j323k6O50l9q83L42Q48j006O8L01N5n67N99M16n65PO32k47j62L97
1511D76N9o81q7K73r1n9J50l19r2K38J99m16L28J51p8o9r2J08L48N6j44l09L63
1534C12m03N5L5K44k25j99L51o03k7N84q1l26K67L83o58L17M73l88j38O9O21m75
1556A88K03l6m50k26M29J02n56L96J26o29J51N44l76j55O89n90O8K9R59n84n84
$$ y = [1495, 1047, -1419, 43, 1182, -996, -1097, 799, 141, -1715, 206, 1202, -1135, -904, 1496, -26, -1205, 807, 1143, -1042, 256, 1561, -120, -963, 683, 790, -982, 211, 1312, -868, -986, 1147, -9, -1478, 148, 714, -882, -194, 1145, -78, -856, 847, 1002, -592, 1, 864, 9, -687, 691, 716, -1116, -219, 682, -921, -979, 745, -173, -1227, 135, 609, -715, -217, 1145, 485, -352, 687, 664, -599, -295, 979, -344, -370, 280, 241, -642, -300, 548, -458, -390, -89, -34, -601, -2, 414, -151, -144, 488, 241, 79, 476, 535, -146, -233, 40, -51, -110, 40, -279, -371, -133, 66, -350, -22, 129, 51, -18, -110, -2, 346, 402, 258, -51, 312, -91, -36, -1, 243, 18, -181, 170, -433, -460, 124, 43, -283, -16, 367, -291, 26, 499, 111, -27, 42, 663, 188, 391, 355, -95, -321, 108, 210, -346, 50, 176, -453, -302, 242, -134, -289, 400, -190, -122, -93, 866, 282, -302]
1577c02R12l57n09M72N54j299P8N52o13k54J055J22j180N24Q63j060k88J351r2
1596E29j329P95J157j163m24J447n40j310R26M96j754N33J408q63j245J266O37
1613E66j421N14J462j293r58J774K57j495J011O85j185n85J772q72j235J072R79
1630A048j941l81K027p71j190J516M95j666N47J548q97q80J079K55j738Q13J386
1647A250j883R1J327n23j591J396P96j807M21J378j042j036K048L02k355J106
1663a22J496j893k51J979l78k055J311J126j812m16K181j087j492J584P77j870
1679i22K58K186j597j321K200K67k255J102J817k208n45K273l51k294J427J582
1695A619k763J54K575j286j819J761P84k253L80K405j256j851K352L73k670J375
$$ y = [-302, 610, 253, -256, 216, 770, -529, -451, 101, -512, -766, 289, 411, -769, -245, 618, -442, -730, 621, 529, -800, -5, 1152, -11, -435, 1012, 472, -838, 88, 584, -1170, -637, 771, -92, -1337, -71, 566, -855, -341, 1121, -172, -1130, 644, 901, -594, 417, 1102, -83, -668, 1104, 232, -1003, 69, 1048, -893, -1274, 753, -18, -1208, 308, 803, -863, -316, 1232, 335, -545, 534, 789, -949, -136, 1250, -633, -542, 785, 262, -1329, 67, 863, -944, -523, 855, -187, -1223, 825, 1127, -1228, -122, 1374, -519, -770, 1209, 831, -1224, 87, 1213, -599, -1015, 1166, 79, -1413, 171, 948, -922, -664, 1522, -75, -1396, 804, 1071, -1184, -82, 1735, -473, -1018, 1255, 904, -1390, 37, 1619, -1144, -990, 1585, 299, -1520, 241, 1025, -1228, -848, 1557, 301, -1550, 802, 1175, -1495, -120]
1711a20J714j912p48K256m92k345J501J600k300k57K598j446j974K373P19k364
1727a197L92K386j791j168K525K2k328J279J932k608o67K297p89k257K294J080
1743A402k774L22K231j313j593K497N98k375P04K160k389r09K626L66k894J454
1759A13J659k889j21K914r86k148J776J128l550O50K936j576j541K597N67l262
1775a733R47K675j984j427L173j56l292J408K367k872n16L085r11k968K177J410
1791A383k968L29L272j614k298K897L35k986J286K583k297j377K537j49k912J828
1807a51K109l133k94K641j071k009K276J420k999N7K949j837j647K766O43l127
1823a407J384K094k567r10K634k68k770K149J236k467o55K739j147j979K435J429
$$ y = [-120, 1594, -318, -1066, 1190, 698, -1647, -146, 1454, -846, -1103, 1495, 49, -1925, 448, 1167, -1197, -805, 1581, -210, -1378, 1147, 1169, -1159, 120, 2052, -556, -1223, 1074, 285, -1972, 322, 1402, -1372, -1050, 1181, -132, -1725, 772, 1370, -1005, -301, 1859, -530, -1439, 1187, 1553, -1341, 113, 1772, -1117, -1238, 1676, 690, -1458, 318, 1446, -2104, -1454, 1482, -94, -1635, 962, 1529, -1733, -786, 1889, -95, -1522, 1651, 1495, -1797, -389, 1978, -894, -1410, 1675, 764, -2204, -27, 1383, -1585, -1256, 2016, 402, -1896, 1001, 1336, -1650, -364, 2219, -78, -1455, 1082, 933, -1979, -151, 1958, -1175, -1469, 1172, 101, -1908, 368, 1788, -1211, -1154, 1795, -42, -1689, 1077, 1720, -1407, -23, 2071, -496, -1406, 1228, 960, -1810, 339, 1575, -892, -1547, 1192, 45, -1934, 501, 1930]
1839A930l143K65K880k102j107K469L31k639O79K083k309j096L169m74k849K047
1855A34J336k916l2K857j152j739K183P67k865N04K548j509j652K620N30l174
1871a560J149K174k242p79K769p11k678J441J828k291m10K827q80k407K160Q87
1887A277k364M78K465j658j533K477k80k318J247J932j960j453K644n28k519J931
1903a62J615k117j01K351j208j959K334P07k170L13K037j747j456K445ok124R86
1920b62J831k456l01K133m31k177J963R24k102r9J859l81j517J698O01j929N50
1937i6J496j537j217K304j34k161Q43J687j567r98K239l31j576J304R11j743j34
1954g10K085q72j334J626K37j947L87J848j367r51J670j68j863J104R13j063q06
$$ y = [1930, -1213, -948, 1932, -170, -1277, 1192, 1523, -1116, -437, 1646, -663, -1759, 1410, 936, -1913, 134, 1470, -1446, -1478, 1379, 227, -1512, 671, 1438, -1427, -923, 1625, 116, -1536, 1084, 1614, -1560, -411, 1763, -479, -1258, 1511, 800, -1878, -437, 1391, -900, -1310, 1517, 637, -1770, 390, 1277, -1087, -609, 1856, 198, -1335, 1142, 862, -1456, -209, 1723, -237, -1690, 954, 426, -2093, -162, 1453, -664, -765, 1586, 378, -1581, 753, 1460, -710, -397, 1640, -107, -1563, 882, 876, -1248, -262, 1569, -887, -1188, 945, 514, -1663, 300, 1224, -878, -977, 882, 501, -1016, 682, 1283, -646, -96, 1400, -137, -1354, 950, 816, -1345, -502, 1185, -382, -1380, 859, 528, -1048, 256, 1167, -576, -710, 1375, 503, -831, 795, 1032, -915, -528, 1320, -47, -998, 672, 504, -1359, -255, 658, -405, -1211]
1971a211J924k80j737J671P23j580N1J586r44j020J362L78k033M61J591j127r17
1988a102J960p67j053J032N69j143l50J775n29j145J010N21j347M25J286p34j084
2005f76J050M84j551O31R37j282m83J250j0j577J059R58j195l31J290j97j071
2022g14J146L89j280L73Q30q64o04J225J49j240K77R93q33o01R83k18j001J099
2040A09L79o68k81J264m52q74R86K13j093L45R08r64p34J235N3j380Q80N79p52
2059b47j28Q25j25r22N63M08q67L54O85m34o04Q12L81j116K79P21n40p05R14k61
2079gl72L49L46q10J23P72o30k53O20N38p80J43M59m88l77M57K28m13o6M81n88
2100b68l16R21k33o70L00N94n12j90N23k14k20K42M62k45n2M64n71kmj83K52m50
$$ y = [-1211, 713, 433, -1304, 367, 1090, -490, -439, 1147, 203, -817, 545, 923, -1110, -649, 942, -185, -1102, 858, 91, -962, 70, 639, -504, -854, 921, 392, -753, 257, 778, -569, -144, 1142, 408, -676, 374, 858, -693, -62, 875, -407, -890, 360, 350, -1227, -168, 790, -405, -736, 554, 357, -714, 432, 821, -459, -86, 744, -120, -724, 501, 650, -590, -313, 680, -153, -754, 229, 11, -990, 109, 488, -180, -461, 803, 351, -523, 463, 676, -417, -72, 836, -128, -862, 373, 426, -954, -74, 505, -247, -375, 450, 325, -597, -34, 374, -493, -139, 546, 112, -492, 320, 701, -415, -136, 585, 45, -660, 254, -7, -379, -30, 316, -494, -371, 401, -229, -482, 138, 676, -104, 39, 498, 10, -367, 90, 318, -95, -161, 320, -268, -584, 337, 104, -566, -266, 328, -184, -374, 149, -65, -285, -43, 419, 174, 122, 586, 15, 13, 9, -174, 78, -372]
2122c72L99Q0k87K6M4K5Q2J19Jl19M29k7r4J36kj03j11j61L06k99J69k40J25k99
2146c73j19N76k94k43K24K83l57M83k71L63m71J55P6O6r8M31l34k0M7M7l16K38
2168I3Nk28j07R5Q5k68N02l4m59J65L34N3l35L20O5n82k2M10J23m04M21j19l76
2191b63M1M47k48o33N25M21o97K08N70k33k69M01Ql57J45M44o12j90P33l36q63
2212g58P84M21r71J10P39m63l96P49J69p27l7J040n09o23R04l5r28N19P78q83
2232a17m19N73L92q80M97M18q51J7J028n27n45L64N26p36K27O48p26k08N60L05
2252E46j077M16O68r85l9Q63k14q07P41O64j251O8J015m80o98J157M5j057L50
2271g5Q75r24n14J048J61j337M40J034q89n45J209j71j281R00O15j295M30J127
$$ y = [-372, 27, 107, -180, -154, -110, -85, -3, 116, 117, -202, 227, 200, 106, 242, 240, 137, 26, -135, 171, -128, 41, -199, -74, -373, -492, 84, -210, -453, -229, 54, -303, 180, -91, 272, -199, -44, 32, 98, 0, 431, 97, 77, 124, 171, -145, 93, 98, -130, -237, -142, -57, -325, 177, 143, -316, -151, 183, 236, -99, 221, 286, -296, -318, 92, 215, -189, 232, 113, -263, -222, 225, -23, -656, -131, 290, -407, -199, 371, 138, -131, 270, 278, -79, 66, 510, -102, -292, 441, 105, -758, 26, 447, -524, -414, 325, -138, -534, 215, 384, -343, -380, 660, 151, -472, 432, 397, -531, -12, 766, -117, -536, 37, 429, -451, 46, 464, -387, -370, 658, 131, -414, -50, 476, -260, -33, 615, -111, -319, 241, 546, -531, -115, 553, -432, -471, 392, 178, -629, 112, 776, -475, -407, 608, 128, -570, 587, 632, -425, -75, 800, -124, -638, 410, 571, -766, -326, 708, -181, -726, 483, 312, -969, -69, 546, -749, -319, 808]
2289H08m27j094J114L98j416N00J148j115o99J299K07j473N66J012j249k47J268
2306F00l47j325J002J297j545j17J169n59r22J390K34j494K60J238r35o99J437
2323F84j87j379O50J238j496l02J366m28j148J381N29j581J51J491q12r17J447
2340F87K54j721N38J157j059p63J424o9j487Q07J176j567l8J369o25j036J095
2357A42Q68j336k01J319m82p52Q93K89j604M09J496j172o16J468m26j396J037
2374f4J057j452k42J540p64q63Q08P53j230J63J263q27j029J571j92j059J98J329
2392I60j082p68J225K09j303N14J193j248n28J367r8j056Q81M51j319M81Q29r31
2410b23r79J443K48j257M86R51j158m43J367J3j369P03R75j206j22J367m81r79
$$ y = [808, 381, -713, 401, 799, -617, -117, 1031, -84, -783, 516, 723, -750, -184, 828, -421, -668, 600, 253, -1072, -70, 1227, -318, -435, 734, 175, -747, 643, 877, -617, -357, 881, -54, -753, 684, 497, -882, -232, 1006, -490, -792, 574, 146, -1002, 379, 908, -673, -522, 969, 157, -760, 687, 941, -780, -242, 915, -144, -907, 517, 448, -1039, -232, 944, -623, -661, 708, 83, -953, 142, 1010, -326, -527, 792, 310, -442, 451, 740, -864, -455, 1041, -131, -747, 721, 295, -1101, -64, 993, -459, -701, 839, 75, -788, 20, 773, -457, -294, 969, 142, -887, 684, 492, -567, -369, 960, -122, -890, 335, 544, -759, -245, 948, -300, -828, 539, 441, -615, 266, 717, -602, -121, 708, -223, -1202, 241, 489, -768, -282, 669, -489, -932, 435, 448, -921, -218, 757, -449, -571, 796, 315, -664]
2428f64J053O38j628PJ217p88m83R77J58j179K31J136j027n04J325J59j382N75
2446a79J150j523J34J336j66j919J511J80j235L75J205j124l07Q33K21j445M68
2463d85J419r68n47J051k88j091J018O76j142k66J471q59j045J214N08j386N55
2480a65J008o30j037J061K89j468Q84R29j171l86J467m86j236J078P29j112j13
2497c59J032m05j086J258J29j199M42N82p49o50J349Q4j250N19R98r48m5J108
2515H10n41q86Q22N74j384J49J248o53r00J142K09j112J77R93q53n29R05L60j094
2534e63M13O90p09l88J296m39o36M66P32j128l7J019o08q03Q02M25j272K52J073
2553E85p91m49Q48K30j038M24R15q17J53N70m78n67N00K28p24J31Q62m55o81P67
$$ y = [-664, 389, 1027, -601, -594, 623, -165, -648, 329, 487, -692, -461, 675, -352, -856, 469, 628, -754, -179, 971, -552, -418, 918, 752, -1167, 344, 524, -711, -336, 869, -255, -562, 271, 492, -953, -485, 934, -34, -581, 470, 182, -909, 109, 785, -357, -623, 848, -11, -1056, 158, 666, -720, -165, 843, 213, -824, 237, 526, -942, -58, 871, -300, -686, 781, 295, -941, 137, 866, -246, -359, 673, 268, -818, 440, 569, -630, -188, 394, -355, -1005, 344, 428, -822, -303, 695, -253, -298, 810, 269, -617, 205, 779, -605, -456, 792, 139, -761, 381, 590, -522, -345, 648, -205, -734, 171, 531, -563, -150, 540, -169, -557, 739, 300, -336, 130, 862, -266, -303, 716, 108, -695, 107, 532, -740, -488, 585, -206, -655, 193, 423, -615, -191, 724, -93, 60, 630, 152, -415, 85, 313, -411, -280, 582, 127, -554, 213]
2573B13j42m01J33P80o88m45O51K76m89K67P10q68k94P24J02j120R36M5n99l57
2593e66P45k49n75Q08L9j009O92L89n40m48P47K4k34m1N68m69L4M08l20k30K23
2614dN55j001L94J95l49k9K00J08k06J75J21k84k29Q09m44Q2p0M27n71k07N80
2635B52N3o13J13J00k22K87K10o57J38J85K07n48M07M91j74k36K34J20n42J25
2655g0M63l20j7J0k94J12L00k7m37N22l5J1m09M01l2n86O63j42m3m05O83k84q4
2678b0K46j57j64J08J87j29l67J63L17k13k35K90j99J28j73K68K18l73PQ5J15
2699A02j67m6l8K05J32k66j07L39k57OJ54j37J39K45k34m4K9j12jK55m2j73P0
2722E2p9J95j85Q8k09k16J44K80k39N4J08K88n38M55j93j14L25k54J25l14J50
$$ y = [213, 71, -330, -197, 583, -105, -550, 101, 377, -112, 155, 865, -3, -297, 427, 529, -591, 345, 390, -209, -566, 179, -70, -645, 163, 202, -807, -115, 274, -266, -714, 33, 57, -177, -218, 350, -119, -85, 323, 3, -227, -4, 551, -450, -56, 139, -210, -239, -39, 69, -137, 38, 159, -125, -354, 455, 11, 93, 23, 450, -121, -328, 252, 305, -308, -195, -95, -317, -30, 180, -477, -339, -154, 53, -495, -88, 403, 229, -7, 227, 347, -195, -70, 393, 73, 56, 66, -228, -116, 184, 157, -280, 242, 207, 218, -191, 210, 178, -408, 255, 113, 70, -335, 348, 64, -20, 226, 69, -95, 13, 200, 71, -296, -133, 184, -29, -264, 26, -173, -45, -218, 50, 268, -105, -98, -13, 102, -65, -111, -149, 56, 188, -78, -185, 154, -103, -97, 57, -80, 59, 304, 70, 26, 55, -57, -58, 197, 155, -18, 52, -27, 168, -17, 71, -138, -354, -210, 70, -169, -115, -7, 281, -257, 198, 5, -109, 216, -38, 87, -227, -77]
2743g7q6J30j21l0M74m57K7j43L79J29j95l33J52J55j83L14k2K39l47j0K15k83
2765g3Q2K54j75m71M03j2q7J05M3k7m28K71J74j74L49N7k24k21K52J23m51L89
2787A59p6k3j71N54m59k46M01k47n0j78K46L6l95O27j72j77N9K64m44L29L86l69
2809E4j63J62L80o73K01M31l44n43N68Rk34J75M52q36K50M65m10m78P75k2l95
2830a76j88R85o24k94N10n3m02pN10n06k27N92J13n45L38J90m03o6O33j78n25
2851c23L52M70m19k27M37kl72Q0L37p91J25P26o04q3N89k74m44m0P00k44l49N58
2873B02Q8o28M29L64q87J31P77n81l55R02j81o19M62L29l76m46P34O7r62N74K76
2894C00m46n8K93M07p31K08O57j143L17O26n94j45M04L16j034L06Q16n92l59Q19
$$ y = [-77, -163, -33, -154, -184, 290, -167, -140, -283, 96, 225, 30, -303, -151, 4, -179, 135, 113, 352, 5, -5, 210, -73, 9, 263, 88, -383, 20, 8, -79, 26, 69, 42, -386, -115, 59, -115, 234, 291, 67, -154, 98, 221, -230, 159, 83, 60, -111, 443, -16, -262, 139, -108, -158, -336, -90, -54, -449, 178, 6, -171, -112, 152, -292, 37, 423, 54, -109, 53, 433, -240, -39, 392, 48, -495, 73, 82, -152, 23, 475, -361, -111, 354, -56, -534, 241, 219, -176, -364, 621, -3, -297, 213, 160, -242, -249, 261, -245, -472, 120, 233, -312, 26, 216, -187, -253, 380, 202, -323, 29, 499, 80, -147, 290, 288, -84, -4, 333, -458, -333, 393, -211, -294, 295, 21, -423, -463, 237, -7, -356, 202, 290, -338, 91, 455, -432, -301, 476, -105, -460, 442, 261, -358, 104, 433, 57, -389, 345, 412, -550, 24, 300, -146, -204, 89, 496, -235, -27, 630, -513, -196, 430, -164, -309, 95, 411, -623, -317, 499, -93, -452, 367]
2914C67r9l65L3O51q25j55Q02k53m11L36L91p84P3N52m12m90Q74J75q26qQ74l74
2936A26o08R48j67r73M50O87n32p6N41k11p77O20N69j108K06P99m88m49O51n1
2956A57p02J19J055p31l20O83j7p35M36P00o99k35Q91m79p26P73J25o52K14M96
2976C53m46l93Q21o9p25N56O72r13j32M52O4n02K77L41n19l58R97m75l38M91P1
2997B25o57R5P38n97m6M11K13q20N85J74m65ML36p3k18J96J51o01m0Q11m51n12
3019e41M85M14r98M95L68k94j63N43K90j011L82N42o71j45O98k59p05O84L92p17
3039b11K6M77L6j120Q16K63p09Q9R30o09m15O66O4r43P03L42m22m35P89k08m94
3060c65O74L0o36j19P49k65n16K95M50m78L6L63k66l92Q09K9p78N44J74m73j02
$$ y = [367, 268, -97, -64, 587, -238, -393, 409, 156, -255, 81, 472, -312, -239, 313, -99, -589, 285, 460, -366, -374, 500, 126, -482, 466, 299, -674, -224, 463, -69, -145, 396, 185, -592, 28, 597, -511, -305, 494, 6, -443, 208, 157, -545, -426, 629, -102, -422, 261, 244, -491, -55, 645, -54, -289, 602, 123, -603, 170, 295, -357, -143, 353, -93, -486, 335, 266, -459, 97, 769, -144, -276, 176, 240, -262, 15, 356, -163, -521, 476, 1, -337, 154, 225, -432, -337, 401, -196, -242, 169, 382, -438, 147, 321, -144, -140, 196, 123, -95, 101, 252, -349, -389, 422, -29, -541, -56, 358, -640, -145, 223, -71, -234, 309, 599, -412, -30, 512, -159, -304, 394, 135, -570, 114, 506, -211, -185, 292, 328, -792, 24, 287, -422, -333, 597, -12, -427, 239, 303, -640, 63, 405, -17, -452, 337, 129, -365, 309, 339, -297, -416, 333, 68, -448, -153, 297, -181, -145, 218, -48, -440, 369, 398, -380, 164, 338, -135, -237]
3081b37P36n4p28M15K06n12j55N95l93p84Q35K85m80l03R27l03l16N75j02n59
3101c52M65K99o50N3M87l35q7K02J23m43j61J028q51p4L75K62p39J66R65j132
3121c99R0O32j81o42O21K2l49p6N45n02l80O80J72l99J17M07n99r6J61L69r08
3142g15N50N29l32K1R8L55n74J33L41n65m0N87l07k81K85M3n89L59L33j14l69
3163b52M16p2m89P48R8n61j91K93on9K57J89o74J08M25m60k26M39K49k50j89N53
3185C46j90j97K55P3m99p2Q57p88j3N08m25l7J12K63o06L9O38j52n14M33M10m92
3207e1r1K39q7k13J59K61n01L62J93j35k17K45k33k40L75L4P2l18N4Q9l21N05
3229A81%l78L08L7k21l28M19j36j7rL08k94M8M07k50l98M01K15l42o0L59m42K17
$$ y = [-237, 499, 445, -283, 132, 338, -174, -329, 266, -127, -911, -76, 209, -271, -574, 353, 50, -266, 309, 207, -352, 113, 412, -238, -185, 302, -33, -120, 82, 205, -238, -399, 629, -222, -296, 79, 341, -398, -232, 733, -399, -309, 323, 142, -500, 121, 143, -206, -282, 263, -239, -619, 61, 233, -166, -49, 358, -241, -337, -176, 193, -715, -165, 364, 32, 53, 151, 506, -68, 65, 406, -159, -199, 388, 81, -200, 85, 128, -461, -102, 231, 117, -252, 164, 92, -397, 351, 449, -112, -303, -10, -16, -75, 182, 371, -303, -195, 230, -230, -456, -17, 232, -18, -207, 346, 156, -41, 214, 287, -212, -284, 573, -215, -228, 280, -145, -182, -70, 193, -413, -374, 264, 112, -402, 31, 441, -51, -142, 97, 10, -203, -44, 217, -284, 78, 271, 136, -81, 164, -69, -309, 66, 100, 172, -146, -92, -3, -324, 181, 181, -197, 111, 148, -73, -401, 18, -118, -135, -144, 164, -130, -82, 325, 75, -323, 78, 293, -49, -109, 250, -192, 25]
3252B5J6K10l57K45J00n9l70J16K97k41m0J42j13L8k13K70m98K97K1J72j14j23
3274a79O22o22J35k7k1L26Q0q6j44k22J14j93K91K1mj12L63j3o70K24J42r3J30
3297F2K33l29O2M8k5j81NJ78N1l3K17l07pN9Jl6j64Q2N5o4J61j7qj20P1J58k36
3324h4K21k7j08K6P8k01O2ok85K41J08MJ28k17j54N83j38n22J73M1M78n03n9L46
3348A85k81m7L01K2k36jk10N9L17j8K7k94R7K17k08m2L42l07J91OL9J6q7L3j76
3373e5M2J6M4J1l2j00j71j48L75Q9l20M90j86l37K04J09n2r6M86k22j84J85J72
3396C20o09J58K51j48l59M41N3j66j64M82l68j46K08PM5K9K47n51L42j3j3j09
3418f3R2J06j00k71O2j14K24K0L30k41o7J83k07K6K68K6m03P9L65k30k50R9L72
$$ y = [25, 41, 251, -106, 139, 239, 180, -190, -74, 223, -18, -58, 84, -29, 9, -204, 66, -432, -135, -114, 58, -56, -179, 443, -179, -44, -71, -92, 234, 314, 228, 84, -138, -24, -217, 74, 95, 91, -21, 342, 329, -341, -117, 25, -68, 62, 295, -34, 28, 76, 51, -130, -125, 53, 104, 71, 288, -19, -26, 33, 34, -2, -166, -84, -29, -93, 68, 51, 43, -77, -6, 152, -84, 137, 110, 2, 28, 106, -95, -33, -39, -324, -83, 25, 29, 157, -60, -214, 369, 231, -291, -118, -77, 401, -102, -161, 185, -96, -143, 158, 180, -56, -57, -267, -208, 109, 91, 118, -176, -79, 138, -70, -112, 230, -77, 114, 120, 159, 175, 88, 121, -55, -13, 3, 47, 58, 26, -74, -245, -393, -18, 71, -249, 241, 55, -282, -78, 31, -21, -117, 369, 147, -37, 148, 320, -289, -131, 120, -28, -387, 54, 107, -59, -223, 259, -109, -255, -47, -40, 5, 34, 281, -270, 72, 59, 46, -63, 29, 135, 35, -236, -174, -288, -64, -44, 286, 45, -22, 161, -46, -20, 248, 274, -129, -50, 315, 85, -165, -66, 306]
3441C06l26r7J85j52l42N43K37m85M0L0R2K11N8j07m36N99m73j98K11K88j80m4
3463d0Q3J90n14J17K16k77J54mq3j2K98o5l25L02J05o8l22K29L19o35L57R6j43
3486b2k97K75m0j59J80K50n10j9K72K89n48M59J12l60J23L31l76j8K78Q2l99J59
3508F2J85l74O6L7J06k78K08J79l45j2M87k44m38N29k34J5J08J06j54N4M3J08
3530B14m94qK50m3k24M65j78l3J33J43k82J94J13l60K1K72p6k75J67lL23l19K51
3553B51j87l91L17K00m79P1L72J29p17M46J85l65j03K67J21k25L05J62n26j35
3573c02L08m5k42K63J67m12L33P8m34j60L11K44l98N39j32R7n15M50k89PJ38L13
3595C19m47j12O49k88l36M12k29m49M39M9k22m9N32m56L8L4M32l35QK97k09r3
$$ y = [306, -20, -117, 68, -84, -426, 117, 354, -131, -91, -61, 31, 242, 300, 193, -243, 356, -117, -315, -104, 184, 4, -40, 43, 233, -281, -164, 52, -225, -71, -75, -158, -170, 128, 63, -262, 40, 145, 77, -245, -16, 303, -332, 25, 121, -22, -319, -44, -84, -243, -63, 187, -323, -342, -70, 219, -329, 130, 242, -118, 5, 336, -40, -58, 220, 302, -97, 62, 247, -127, -61, -24, 82, -196, 12, 191, -154, -166, 321, 77, -361, 168, -66, -51, 57, 163, 9, 63, 106, 214, -280, -288, -38, -81, -305, 160, -18, -51, 82, 225, -57, 137, 250, -110, -89, 183, 107, -168, -1, -4, 319, 0, 251, 64, -327, -10, 190, -289, -218, 154, 283, -434, 12, 197, -168, -271, -4, 117, -108, 197, 359, -167, -302, 6, -39, -281, -18, 149, -263, 70, 148, -286, -446, -135, 109, -289, 250, 118, 215, -300, 150, -139, -132, 6, 319, -128, -240, 409, 121, -215, 197, -32, -481, -42, 7, -215, -264, 268, -188, -150, -116, 316, -19, -11, 286, 77, -16]
3617a6R3O9o20L74M09l29k02M18j08k00j65K71k13M9K02P8k56L97M1m48p1M06
3639A79r8P1j76R4L1m7J45n7k31K12P2k32J33J40k34K4J53l42Q2o7J98q7M5o5
3663e7K68k30R8j37J48m6j39r0o6J49M08j55k03J88n19L39j5J53k27K37K12m57
3685a41K64n1p2j23J0J40n35L44L14k7k26J63Q8k06m9M16m28LK80oM7k27J74n57
3709d05N65J45k15k30N6L62k56q8K74j09m43L89K26l91K7L16k90k4M39n26j71
3730c49K79J77n15J42L01J25j47j6k6p0P1M13l95j47K21Q3o9l01N20k87r1L88
3752C07l52l7L57k53mMN2j53k0J97n3m13L18K73k7k66K77j16n96M35K23l15M7
3775a15K60j34k79L09J68k17J58p7r8l74O86j75k88L00K80m38k6L37l85J20l9
$$ y = [-16, 77, 146, -474, -100, 309, -20, -222, 196, 88, -112, -277, -6, -219, -170, 32, 110, -146, 251, 292, -156, -227, 179, 81, 152, -24, 70, 101, 54, 199, 142, -89, 123, 195, -37, 96, 236, 2, 26, 179, -163, -81, -148, 50, -37, 8, -57, 211, -19, 79, -58, 90, 44, -95, -185, -251, -102, 306, 151, -52, 136, -383, -44, -59, 94, -133, 104, 316, -141, 123, 72, 0, -123, -113, 27, -508, -164, 150, 123, -103, 60, 148, -58, -107, 309, -119, -116, 164, 158, 205, -22, 152, -405, 160, 305, 90, -140, -84, 278, 22, -66, 208, 99, -344, 45, 271, -120, -93, 223, -67, -91, 348, -178, -349, -70, 107, -408, -266, 35, 160, 13, -3, -29, -99, -28, 385, -10, -157, 64, 147, 78, -223, 297, 10, -81, 307, -45, -82, 275, 22, 18, 22, 74, -79, -99, 98, 45, -368, -50, 223, 196, -70, 207, 91, -505, -70, 153, -162, -115, 145, 11, -268, 41, 209, -8, 150, 73, -25, -399, 287, 112, -176, 124, 404, -34, -60, 277, -108, 12, -27]
3796b7n6j1q2j5J10J59r3k9o0k0N50m79J49j62K05j8k42K6J36q6K58k25J2J6k1
3821eq7M4L80l57n7K0j92K71J25j60k20K76k09K54n7k19K11J27Q5l15J46L6k42
3844a45J76l72N9N00j47l2j61K86k14K76m7k44J93m20M14l4j2j57L13k21M6q3
3866b6j09L78l04J80L4j78M6j97L19l46J40j57M35l05K42j49R9r1K9k10JK7L03
3889A61q0j07N6j69L7M2M7O7j39k1K90l9L5k4P5k39r7j39kM60l81J08N8jr7K21
3915A22k37J96J69m74m4L57K36k83J22k19K38l11L23k80P7Q9j71J04k46O3K00
3936C1J73k80J54J02m04L05j52k10N64j43k42J68j83J63o9K47j05j92J01k7R9
3957A00l22J02K20n09N60k01M7j14J84k39J61K26j08k6J07l3J9N3p3L5m13K75
$$ y = [-27, -83, -94, -176, -191, -81, 78, -15, -44, -104, -124, 426, -53, 96, -66, 139, 121, -121, -95, 41, -45, 213, -12, 0, 16, -5, -92, -48, 332, -25, -82, -62, -254, 17, 142, -18, -238, 38, -171, 83, 26, -193, 18, 145, 230, -85, 61, 97, -145, 31, -341, -282, 218, 71, 39, -122, 164, -50, 226, 179, -65, 128, -292, 122, 88, 76, -81, 232, 11, 57, -26, -135, 243, -61, 119, 153, -25, 21, -176, 143, -203, -63, -220, 215, -90, 152, 3, 102, 11, 40, -170, -169, -142, 161, 81, -26, 30, -139, -102, -60, -13, 54, -85, -106, 184, 145, 180, 156, 231, -8, -105, -244, -246, 214, -167, -59, -1, -2, -99, 122, -115, 81, 250, -224, -268, 89, 325, 42, 164, -55, 183, -128, 195, -85, -8, 81, -90, 14, -232, -169, 31, 204, -76, 78, 180, -224, 81, -71, -281, 283, 140, -102, 66, -117, 46, -23, 224, 119, -73, 28, 1, 100, -222, -120, 100, -409, 151, -50, -3, -117, 67, -172, -11, 215, 107, 81, 188, 155, 174, 227, 154, 189, -224, 51]
3979E1p3K54j07j59j24M30k69k30M3L9L46l04P0l3L31l33k09M62l30Q5J10K3j41
4002f8K07J23j33j91K9J21k44M7J32J8O0k65K42l88L89l0J45m08K83j59J98o0
4024D8k75L23j86M42j65p0k75R2L22m05J0M6k7J97j65Q9m2K6J8O2j31j53L31N1
4048A63j33K1k48L32l8J7J16j33k41P2R6j18L0Q0j54K01j56K65k70J79J08j43
4070D6Oj12J29l1k0j06KK64j11k41R0M01j21k33N0J15N4l05J17L24l22J26K50
4093C72m48M3l9k6J29Nn2j56O1K88K35l17lL20n36K50J74k89q6K39J28m77j78
4116c63P31k49j08K47j6k58k06M26l37K17N8p0k61J39N2l26L22L5Ok17rM14k62
4139c5O2K99m11R0j24O4J11J50j95j13k57O77k35k66K89Q3m1m09l0K55k49K66
$$ y = [51, -22, 232, 125, -34, -158, 272, 3, -227, -184, -145, 201, -103, -33, -66, 265, -68, -277, 185, -145, -60, 50, 73, -68, 139, 262, 129, -62, -33, 88, -156, -109, 23, 41, 101, -164, 78, -310, 79, 49, 194, -214, 69, -90, 108, 48, -227, 96, -90, 352, 187, 117, -158, -66, 256, -149, -139, -93, -120, 77, -88, 1, -41, -15, 3, 65, -66, -219, 112, 163, 30, 51, -197, 135, 97, 114, 230, 97, -144, -72, 24, -94, -64, 16, -138, 63, -93, 172, -98, 81, 189, 46, 52, -60, 69, 38, 18, -88, -86, 178, 67, -174, -84, 317, 196, -37, 13, 128, 182, -123, -6, 318, -4, 122, 372, -76, -33, -72, -98, 31, 36, -16, -172, -111, 177, 412, 95, 92, 412, -124, 126, 300, 11, -75, 164, 292, -185, -363, 368, 119, 11, 258, 242, -16, -222, 204, -133, 84, 142, 72, -189, -50, 2, -324, -2, 33, 39, -178, -187, 227, -35, 27, 326, -85, 5, -119, -55, 56, 206, 11, -102, -359, 318, 83, -183, 106, 189, 148, -261, -291, -36, -285, -19]
4161a9K20p4k16J57l55K31J01k82L2K66O7k58N6K30j5k30L4q1P1q6j23O0j49N19
4185A56k16j42rR9L91l93qQ3j88J80J90M4l74L15J15l36K37j37Rp0J04Lk27K59
4209H5o4P5k94L19k02p2J56p7j35K38J2k65j11M79J08o94M37Ol9k48M69n1j78
4232d6M0J90l64J04J66J3k74J46j3mj44O09n20jJ50k32p9J78J08K6m3j14m7J87
4256C6j8j66q9J41J90l14K70J39l32O9J42k00K69o1J8k16R6j23J41m69L05K52
4278H0J32m54M30j05Q9j0O3k75k48K30K98n67R3M87j81K8J2j59j67nJ95n8j82
4301b74L58J20k68o0L88k88K06j10nm7o1J39o1m35N19o9k42K68q0k65P5J13L3
4324d6J34j29J11k69K27J08l21K73k4j22l14K42J10r0J65q5j40L52j03j15j95
$$ y = [-19, 201, 127, -89, 68, -287, -56, 45, -237, -205, 61, 128, -130, -74, 156, 141, -89, -55, -136, -65, -151, -274, -214, -363, 156, -60, -202, -211, -112, 279, -114, -122, -39, -227, -47, 143, 187, -187, 128, 243, -93, 144, 7, 16, -54, 50, 53, -174, 85, 21, 96, -198, 121, -81, -153, 3, -74, -209, 29, 41, -224, -335, 144, 252, -442, -5, 1, -38, -286, 183, 132, -46, -6, 184, -180, -76, 90, 103, -171, -25, -38, -42, -186, 423, -97, -98, 52, -180, -259, -81, 27, 53, 10, -104, -151, 36, 18, -148, -237, -96, 94, -220, 50, 189, -143, -74, 68, -132, 137, 76, 94, -122, -26, -149, -8, -477, -172, 80, 212, -242, 188, 83, 172, 162, 225, -50, -298, -68, 230, -337, -244, 243, 62, 90, 102, -57, -224, -229, -34, -92, -274, 84, 204, -64, -124, 264, -24, 182, 72, 67, 20, -41, 98, 37, -398, 121, 52, -190, 78, -2, -267, -192, -79, -46, 88, -41, 70, -199, 28, 136, -185, 88, 64, -58, -372, -130, -20, -110, 55, -30, -170, 182, 79, -36, -231]
4345b31K04K00k44j10J51Q8k7p5k62M3j9M53l03q2L20k26J23k13OP8N5J01r9J53
4369H4Mj20l13N17j37r4j35M17j9o6r2J50o5j20K00k30q6o3J05p5K75j31L05k68
4393D3j76K67j79j60K81nk6o2k6j83M3Ok0r4K02J18j43j65L40K66j82l1k43K55
4417A26P7j28K96n44K59K1j75J35M3k04k47K46J01J1j30j34K0K25L2j9j70L52
4439A93j22l19K25K64n61M43K3q1K7kk3o8n6j96K40k72O1J38K29k31K55k43j55
4462b31J17K74j75j7L02k95J73j42j03J05k9M3o4k27L18j4j73p2J73k9j8L6K74
4485B26j12l20M22k94J23l16L99j6k44KQ1L19k87j7j65R7L0q7M71k38o6r1OJ41
4509F4Jj67p4P9p3n3J66M9J57Mj38j05K7K68n01M91J69m56J63q4J21k00P3N8J15
$$ y = [-231, -27, 173, -71, -181, -30, 58, 31, -44, -306, -263, -282, 171, -132, -214, 106, -120, 3, -210, -204, -126, -71, 30, -69, 84, 88, -32, -345, 172, 35, -59, -194, 223, 204, 138, 46, 196, 131, 11, 211, -19, -105, -168, -63, -138, 137, 6, 311, 43, -133, 134, -45, -205, 76, 71, 45, -17, -43, -226, -183, -177, -197, -291, -89, 29, -114, -279, 61, 327, 145, 114, -129, 126, 203, 75, 371, -173, 86, 107, -68, 67, 110, -94, -341, -95, 6, 17, -113, -247, -227, -2, 30, 11, -159, 193, 71, -248, -23, 241, -320, 123, 146, 65, 92, 90, 67, -1, -57, -253, -13, -285, -224, -86, 143, -88, 167, -76, -231, -114, 160, -15, -32, 270, -25, 148, 6, -97, 8, -21, 22, -42, -269, 49, 35, -138, -210, -37, -66, -84, -48, 226, 114, -206, 216, -78, 45, -271, 128, 112, -132, -130, -49, 270, -17, -34, -199, -102, -72, -159, 312, 74, 8, -83, -77, 64, 65, -102, -176, -97, -170, -223, -57, -8, 149, 153, 15, -90, -63, 205, -296, 195, 364, -92, 71, -13, 108, -92, -19, 39, 154]
4534A54r9l51K77J30Mk7K30k38j52M7J05K6l1L2j57L47m41L36k49J39J14k01l24
4557c29L96p0q1J36j12J90j68Q3j26p6K15k43k4L8K80j99J9j91L33R0J5Pj35k14
4581a66K10o0m1Q9Q8j37M0k71K03j2L14j5l92L11n76M77k48J41J44j76M1L8m7
4604d5r2K84j80j17j49L54j30J01k34L76k44J1j50R3J83q4j8K21K25k77k23J51
4626E6Jn4l46L54K8L0j65j48M98l81J4K78j68pk87K19q6J94p0J33J68j73K0m17
4650c09K91j30J02O7l26N52o2k07k06N02k69J53j27J99j23j4j60K32k43j39L64
4671A47o6j87L30k30k92M76l88K83l23K28j03J72p1k10Q1K08l11OK33L3L3P8j01
4694B6L7j10j09M85m02n6l8o3K26J27j15k06K14K20k70k16L24Q4k42q9N0J86j81
$$ y = [154, 55, -296, -19, 111, 115, 88, 318, 80, -72, -25, 80, 106, 75, 107, -50, 297, -144, 192, -57, 82, 196, -5, -329, 67, -3, -84, 52, -60, 130, -38, 45, -81, -157, 58, -185, -209, -171, 109, -90, -71, -262, 71, 161, 176, 183, 48, -166, 44, -16, -57, 32, 120, -17, 23, -248, -45, -57, 257, 242, -150, 161, -415, 62, -186, -45, 99, -77, -36, 2, -45, -137, 147, -33, -150, -299, 55, -75, 26, -208, 168, -76, -65, -215, -122, 61, -23, -41, 180, 405, 128, -95, 56, 57, 3, -343, 11, 39, 69, -96, -244, 254, -127, -113, 165, -3, -10, -297, -78, -164, 30, -40, 93, 261, 88, 108, -309, -18, -148, -46, 21, -305, 247, 185, -22, -228, 274, 5, 158, 31, 230, 107, 93, -67, 165, -78, -217, 147, 81, -106, 224, -6, -298, 178, -210, 73, -250, -22, -125, 47, -24, -234, -153, 55, -256, -250, -17, 16, 49, 127, 26, 63, -47, -156, 329, -73, -129, -167, -230, -4, 123, 8, -198, 16, 236, -34, -250, 74, 158, -84, -173, -123, 63, -118]
4717a18L11pl77L03r2m4P9L9K16k94K7J82l93J26K40l39Q8K4j23J92j75K57J47
4740B69l57O3L2J08o3l1l10j0L10R4r4J65p2l23J91n6K08k63kk7j09K53k6k10
4764b60J33q0L82k10J58K6l40M0L22k29J56k98L66k98k04N22k94K74K5N3j66N3
4786A31j17P1m59L26l3j15K48J90l91K7J04Q2j96P9M7r3k09M22j81R2O8on21P9
4810c55M53Nj23Q3j05j14J6O7l7J58k1qj98K35J43m05J87k32M03l78J71k9K02
4833A18P6j7n31L66N7k34J03K12p5K54k51j37r3J74l13K94k49M02O6l33n8n3K79
4856E7k81M90j80k56L2O0J01K55l71n7J12K07R1j78r9J98m6p1l26J48Q4L4J10
4879A14p7j65L83j1q3j47k2M57m21j11P1%K53l10K28M1j93j95j28M28j81J13j17
$$ y = [-118, 193, 186, -191, 112, 20, -24, 55, 94, 310, 16, 43, 225, -168, -42, 198, -141, -53, -29, -152, 40, -135, 122, 269, -88, -25, 7, 115, 52, 21, -289, -299, 11, 105, 11, 176, 104, -219, -28, -84, 124, -139, -141, -168, -277, -24, -50, -260, -127, -207, 175, -35, 123, 149, -191, -151, 171, -58, 98, -200, 166, -132, -336, 186, -108, 166, 191, 244, 78, 131, 14, 85, -374, -48, -81, -196, 52, 242, -149, -122, -18, 64, -132, -53, -6, -99, -308, 114, -67, 25, 93, 87, -434, -355, 98, 103, -20, 63, -42, -156, -140, -73, -110, 48, 27, 19, -179, 56, 199, -206, -19, -251, 152, -226, -55, -84, 118, 194, 177, -354, 12, 69, -165, -62, 150, 75, 329, 78, -59, -152, 22, -291, 3, -246, 156, 222, -111, -169, -222, 57, -224, 266, 86, -170, -138, -78, 23, 278, -93, -150, -38, 169, 260, 82, -17, 181, 135, 64, -262, -114, -30, 4, 114, 37, -128, 255, 244, 161, 14, -8, 449, 28, -83, -12, -12, 241, -69, 159, 200, 7, -188, -316, 112, -69, 44, -73]
4902g3K62p9k96j26L19M6q6K03N7m66K80p7K95k59k35J7p2N34j68l09J13K39o0
4925E9j2r0K49l23K01K25m31Q6K6K7L2j09K69l29m9R8J25o1K6J07O0o9P3k68q8
4950a66J01n6K46k61K12j77J84L5L2j84l6M9k99K51J47n1J0K02j73j61k56M57
4972A06j08k29L24m4j23J69j67R4J69k51j58J71J06k80J17k6L77m55J94J95j23
4993E8O3k43J70k05J02N8K01j36j74J67j96J95j27N9k35K85mq7L8n2m6J23K6k00
5017a60K44j14N0q7j6M8r9j01L54k42J90j19N5pK69l95K66j03j5l4R6j65m0L71
5041B46j65k06L83k30j13LJ96m8k11K72j22ql9J32j32J20P3k63qJ54j93M8p9K17
5065B7J29k30r8J5J9O5J89j67J41j02k50L60J15m33K24j6l10M21NJ06O6m46K15
$$ y = [-73, 189, 110, -186, -312, 7, 53, -33, 170, 227, -239, 41, -36, 259, 0, -235, -218, -290, 244, 76, -233, -120, 119, 59, 47, -43, 206, -117, 84, 309, -122, -36, -10, 17, 49, -60, 209, -120, -169, -71, 54, -7, 19, 126, 186, 117, 190, -78, -166, -65, -121, 125, -136, 76, -101, 83, 118, 150, -34, -70, -21, -320, -69, 78, 27, 37, 239, 66, -95, -351, 106, -2, -231, 93, 49, -74, 95, -72, 22, 191, -60, -218, -47, 59, -221, -104, -130, 247, -208, -14, 181, 58, 121, -122, 48, -157, -55, 3, 204, 68, -106, 61, -135, 60, -67, -8, -243, 42, 38, -49, -11, -63, -109, 14, 40, -160, 84, -30, 20, -67, -83, -35, -134, -235, 119, -123, 67, -52, 3, -4, 265, -130, 136, 33, 18, -16, 80, -85, -125, 246, 81, -125, 258, 28, -85, -82, 114, 66, -145, 127, 5, -3, -42, 90, -42, 78, 151, -112, -120, 34, -159, -111, -190, 27, 156, -74, -172, -157, -138, -73, 116, -51, 90, -12, -262, 98, 213, -220, 4, -12, -322, 99, 104, 210, 276, -170, 45]
5088D5l9J81O2l18J23p9j28M8J17R3l79M97k60j0J89o3k08p0L76k14o8Q5kK0L5
5113C3p5J24J10J27l8k70nK30j21k52r6L87j34k6q1k8J31J63o3L4j64M0o7m7r4
5138a82K19k16K08p0J01J34k15m0n9L30j64k62M09k50k2J04P5k40o8M39k06n2
5160b7o9L59r7k56K42k69L6K8J81l21Q5O7Q9J68m83J8L91j66L00m64J26J81k33
5183a14K27J00R1l21J3j67L5L68l13o5K8J50J81l22P5k40L18j33R8L0M0l6l20
5206b77J49k35M18k17pN7j92K10J7J15j65K56j89j51L10q3Q9k93k2K58j17K47
5228A78l01K48j22L5j08P6K89n02M22j70j02j6j3J22r6qK0j25k10M63m63L94k18
5251b07K68M9O0k73J74M7LN6k12J29K5k28K28j76L8Q9k28j4L46m2o6l1L9J13j07
$$ y = [45, 6, 187, 249, -69, 54, -25, -153, -105, 12, 105, -274, 223, -37, -47, 142, 79, -129, -199, 177, -37, -105, -20, -22, -2, 33, -42, 82, 192, 319, 281, 11, 6, 236, 115, -137, -233, 154, 20, -6, -87, -115, 16, 179, 116, 150, -14, 26, -41, -88, -182, 37, -179, 29, -41, 60, 194, -21, -61, -120, 210, 46, -216, 193, -57, -79, 25, 100, -140, -208, 231, 25, -27, -96, 263, 166, -90, 152, -117, -81, -53, 128, -193, -108, -41, 48, 216, -267, -249, 142, -24, 276, -188, -62, 119, -114, 113, 213, 304, -17, -4, -171, -136, 232, -81, -146, -118, 32, 213, -109, -34, -274, 44, -89, 9, 39, 79, 43, -277, -128, -363, 55, -162, -169, -112, -304, -94, -77, 38, -127, 129, -60, -211, 99, 16, 105, -188, -210, 48, -69, 178, -123, 125, 3, 38, -70, 6, 295, -207, 215, 45, -57, -73, -86, 36, -60, -68, -48, -173, -383, 80, -383, 11, -207, 61, 110, 170, -103, 71, 118, 121, 177, -35, 94, 119, -109, 119, -57, -19, 70, -158, -172, 174, 132, 66, 35, 74, 187, 80]
5276H0k73K38J70l21m%j29K07M0n0j73L37j62K37M5l94L43k06Q7M4Kj04k90N61
5300B85l23J84k81K47m26L27J80R3k86J3P8n0J92m44J43J85l20K05J8J39k54j55
5322b50L84p4M9j00l0N2P6M3R4k83j05K08j62J86j62J3K34jl41J42R8k20P9K60
5346A90j08p3J06k72K93j97j4Q1m00M47q8R8k89pK49r0K35j73J7j13J39L02j89
5369A44n9J5K2j51j47K47k16l77M81%jJ77l40J64oR0K5j26J75k92K67P6j20pl51
5394c10K77q8K67j85M7N2k11M34k22j98J13N7l19J59J04J24K6j12j05j24L93k31
5416e2J5m6J65Mk81j6K86l53K80O0p7j72o6N14k51m6K52k55r2n5M7L91l43J61
5440G0k0m9q0mL3J83J8k71L6J2m6J50o4K8l7j30R1P1j61q9L32l03J5J14p2p6K14
$$ y = [80, -193, 45, 215, -106, -110, -110, -239, -32, 8, -42, -215, 122, -40, 197, 242, -152, 191, -15, 72, 116, 118, 14, -276, 285, -38, 146, -135, 112, -314, 13, 193, 286, 0, 13, 91, 41, 233, -211, -68, 117, -203, 2, 20, 159, -95, -250, 134, 60, 109, 9, -21, 31, 107, 150, 244, -39, -144, 64, -98, 88, -74, -61, 173, 172, -169, -27, 71, -149, -70, 190, 82, 9, 115, -157, 136, -61, -75, 6, -394, 53, -35, 63, -226, -233, 16, -74, 161, -12, 5, -108, 31, 333, 144, 85, 100, 122, -29, -176, 71, -145, -522, -41, -41, -42, 135, -205, -41, -47, 43, 68, -58, 117, -175, 92, 168, 48, 41, -310, -33, -121, 146, -39, 8, 60, -151, 283, 61, -137, -24, 33, -286, -127, -23, 101, 127, 15, -90, -214, 179, -52, -37, -83, 82, 86, -195, -211, 75, -278, 2, 62, -15, -187, -253, 261, 10, -36, 216, -39, -131, -186, -139, 252, -91, 70, 50, 1, -79, -83, -50, 133, 151, -120, -84, -72, -118, 32, -32, -4, -41, -171, -80, -9, -170, -259, 73, -230, -215, -101, -173, -249, -35]
5467c5K50j74l14K83k19O3J94k37K13j91L03l03RL42J08n58J55N4R3m3L5K1j33
5490h4J44l8M5o6K58k43j72K45j6j02j07K22j95J86q5K40l01Km3J97k00n7J32
5513c8Nj48O6P3l65K82R6Q7m4j67n3O5K93q0j35R5j85N9n0L11k50K72j60L5j24
5538f0L89l22j32J71l6l15K80J78j72OK35j16m6m9J63j18nN3j12mJ44j55J47J4
5562A38j83J67j57n6R0l2j8K5n0L14k34P4l44K80K54o5j98J6j7K0J51l98l2K76
5586B1Nj42O0Q6J19n3m46M40j70o6K30j66or3L81l87M31o20K07L15l33K07N0j88
5610a18j19K80j6k56P6J08oJ83j74q7M68l93K53p4j01L01k78j26k4p8M34j34l50
5633b31J50K55j2j38j08K92j65l1L4L4J2OK22m10J84k93J64j41K05P4L8k26k3
$$ y = [-35, 215, 41, -273, 10, -209, -146, 48, -189, 24, -167, 136, -167, -158, 184, 292, -266, -111, -57, 36, -7, 28, 49, -84, 60, 22, 67, 1, 259, 16, -156, 89, 73, -29, -136, 86, -109, 77, -8, 232, -69, -67, -110, 87, -113, -170, -38, -33, -181, -115, -42, -407, -125, -29, 58, 14, -153, -206, -141, 152, 72, -63, 32, -153, -94, -144, 167, -83, 189, 29, 64, -60, 329, 7, -125, 46, 10, -305, -25, 153, -19, -13, 222, 106, 60, 11, 174, 56, 51, 104, -8, -12, 132, -23, 124, 138, -45, 122, -35, -91, -1, -33, -51, -26, -76, 238, 4, 78, -266, 14, 268, 203, 5, 21, 4, 24, 175, -223, -255, 21, 26, -116, -56, 30, 149, 96, -350, 90, -80, -146, 84, -82, -88, -181, 200, -187, 244, -376, -169, 146, -187, 20, 70, -118, -237, 43, 27, -229, -153, -45, -51, 132, -42, -129, 339, -54, 199, 125, 24, 325, 47, -79, -103, -181, 253, 119, -231, -81, 174, 162, 24, -84, 208, 43, 12, 46, 80, 92, 98, 320, -90, 94, -199, -35, -176, 29, 103, 141, -85, -108]
5656a08j07K85k23L94l30M2J11j07m2K3J62k5J67l76K17m64L57mJ71L7J4n5k65
5679a26J70o6J90l56J02k8j6j05L64k13J12k7P3n3J07N8m8j53L19n32J81J27l90
5702c10M00j88q8j0J06M08n61K7K24P5OJ03l84J7J09J61j31l0J59j62R5K9R5m2
5726A08j93j87L02r2m2mJ20J2j01K51q1j09Q4r4J41L6k06K52k96L01l24K7k7K52
5750A30r3j25N6j5M7L0J36k7J14l54j50J84j46K50k96L47j13l6j5N5J50J2J20
5773B61l76l9J25K59l27q1L85l53l4P0k8L89j88k05k45M17K12m20J33pJ41J43
5795B32OJ53m97J82k27J07Q1o4K23l09j60k2M51j61l6M9k12K49m7k37L75p7L04
5818C63n42J05J47j53K00p9o5N2j6j57Q4K58r3N0R3J12n46L27j87K48j36k83K45
$$ y = [-108, -215, 70, -153, 241, -89, -47, 64, -43, -85, -62, 100, 75, 242, -134, 83, -381, -24, -28, 143, 180, 194, 139, -126, 44, -22, 168, -188, -86, -114, -130, -235, 129, -84, 28, 1, 74, 21, 128, 186, 138, -15, 304, -228, -47, 80, -310, 90, -98, -186, -196, -90, 318, -243, -216, 8, 83, 89, 192, -192, -175, -66, 95, -36, -66, 93, -69, 26, 55, 150, 108, -85, -272, 30, -62, -104, -108, 12, 24, -77, 174, 93, -16, 68, -26, 115, 151, -55, 197, -99, 202, -122, -95, -122, 130, 37, -88, -32, -47, 0, 30, 166, 139, 253, -101, -251, -67, -213, 37, -259, 88, -25, -61, -76, -21, 129, 141, 261, -115, -154, -29, 230, -97, -178, 207, -146, -180, -110, -138, 251, 63, -142, -387, 30, 242, -178, -45, -52, 89, 232, 238, 391, -106, 76, -151, -44, 37, -27, 196, -113, -273, -295, 156, -5, -41, 8, -204, 45, -2, -239, 136, 59, 363, -179, -74, 73, -80, 120, 41, -24, 28, 12, -145, -61, 197, 104, 154, 247, 359, -187, 140, -47, 201, 65, -218, 27]
5841B7N4k80K35M1j92M9m6l4Q4j34L05k74K11J03l03O2k84N41pN2j97J84l32K20
5865H5j2k29K32j46J60j7j10q4Q4j18K46O6j80K85k96q7J79k75J51J1o8J37l5
5888b1j36N7N4J32p2l6J88k46L07l1L2j66L9l08R8r0J92K14k26k5L32n10J06L66
5912B50k12r3K30Pj20R5l12L74m06L7J48J44r0J63l11J05N6j93J80l81J92Q1K76
5935B20j84j99J55o5J25K6j89k2j05L18J28j64o0o7J15K75N1l49j20K72L9m80
5957b80L64l40K17j81K93j86J46J91L1k33n9O3j60j56L32k51L47n0j54K7j16K90
5979A35J16k70n1K84K7k72l6K43j01m35M39Qj96M85m66K08Q6m01K92O9k42M83
6001D05k97j97R8k08K57J8P0j12j54p0R2P6j44L37k20J85J47l12l13L36J82j67
$$ y = [27, 81, -199, 36, 77, -115, -66, -112, -146, -62, -196, 109, -165, 46, 149, -154, -92, -376, 165, 158, 210, 13, 197, -135, 85, 73, -156, 76, -70, 90, 73, -37, -121, -37, -155, 91, 157, -23, 262, -34, -121, 58, -217, -66, -55, -123, 14, -21, -157, -100, -46, 86, 14, -22, 166, -80, 227, 196, 228, 62, 101, -207, -109, -199, -7, 207, -19, -44, 288, -222, -116, 250, 38, -55, 175, 182, 62, 157, -155, 219, -187, -150, -2, 142, 52, 215, -96, 9, 65, -128, 52, -329, -137, -56, 220, 36, -163, -8, -73, 52, 78, -111, -133, -238, 80, 208, 44, -16, -83, 32, 307, 358, 9, -111, 161, 200, -280, 84, -256, -39, -220, 73, -113, 33, 224, 255, 22, -37, 26, -134, -290, 42, -209, 138, 88, -66, -39, -155, 135, 251, -19, -70, 214, 241, -31, -67, 176, 75, -360, 79, 87, -109, 376, -90, 118, 204, -197, 95, 164, -78, 405, 108, -89, 9, -199, 58, 76, 146, 34, -120, -190, -98, -22, -166, 171, -49, 136, 283, -29, -342, -6, 176, 9]
6023Im00L39K89j64l2n2J21l89L30j26Q6r7n3K99j50jJM1m98N29m0jK1M4j32j81
6049b07J87k72K83j01L5J17n0K4J35k11L1n2R3M08m64l0r2k00L97P5k40K84j4
6072A36n4k10K19j42J93P6l13l7K34o8L0M6l90P1J04J09K0j0qO8k53K21k6J60
6096A76l75J75k6r0J01K25j25L2q6J93j60Q6K71k78kK2k07M5j11l9j48L69J45
6119A93J34j34N1k12J25j89o7J53k20p2J17j3J11P7q2k16nK97J08n04J88M25l42
6142g7K03Q5l18r4K0R4k9k00L55M1k8l7J6j2K80l74K93l25K15R7k82j11J02L59
6166B73l15P3NN7j34o2j41Q5L68m32K78j18P8K17l23K39l07J70L5O1k24K53j43
6189gJ3q2K58k1j96r9K15j55L00j71L7J22k09j31M39k57l65K18J15J1R9j70J49
$$ y = [9, -391, -52, 237, 73, 41, -11, 110, -279, 51, -75, 11, -86, -139, 160, 10, 9, 10, 51, -447, 82, 42, 41, 62, 106, -26, -207, -20, -292, -9, -110, -75, 42, -8, 16, 151, -60, -29, -81, 12, 420, -44, -74, -166, -366, 31, 106, -134, 150, 136, 82, -128, 91, -51, 142, 218, -95, -132, 102, 34, 64, 110, -280, -209, -105, 4, 24, 14, 6, 74, -179, 42, 16, 176, -199, -24, -50, -140, -39, 186, 61, 93, 7, 200, 40, 126, 397, 119, 117, 139, -68, -23, -134, -173, -321, 48, 193, 327, 193, 244, 32, 157, -32, -99, 54, -166, -238, -121, -134, -23, 54, -28, -244, -249, 48, 156, -348, -160, 265, -77, 126, 211, -107, -201, -181, -87, -116, -316, 39, 80, 52, 15, 31, 19, 299, -75, 218, -107, 108, 205, -77, -188, -86, 273, -42, 31, 36, 93, -41, -103, -244, -159, 209, -223, 55, -63, 15, 232, -91, 148, -159, 11, 46, 107, -117, 136, -7, 6, -76, 182, 161, -35, -134, 81, -74, 226, 55, 92, 214, 5, -126, 313, 56, -309, -91, 24, 35, 134, -36, 113]
6212A13k73K08j78J87j53K09l23O6K61l13L88l85L22k00K11j79jo2K07l63J62
6233i6J6K53j36m3k96M76j89j21J23p7O3j53J20L98n11J91m0Nj19p7P5L6J39q0
6257d3N2j01K04r3o7k8J35j18O9k51R5Q8M41m84J24k59J23Q5J51j20K2J9k11J9
6281a48J49L5M1l4L7k40j4K28p0l1k68L00p3Q4r8J21o0O0R3R1m61K64j2K38j81
6306E1j51K19k6j0j27J02K0j94j55P6p5K88ojn8J09o7R5N6k13n0m3L00j01j28
6331h9M7n1L31j98m5K52k13j89L32k36JM8p5K73k10k1M1n5J44l2J71m39J63Q7
6355C7J24j47J72k60K37k02j1j0k25K92j50J21Q7R6l93l6K50J41p0K42m45J7R5
6378c8J66r7J6l93L62OJ7J51k62P5k4J1J4P7K75m82LJ85R7J86m77M13k14l44K85
$$ y = [113, -160, 48, -130, 57, -96, 113, -210, -144, 117, -196, 192, -193, 129, -71, 140, -39, -40, -102, 105, -258, -96, -80, 173, 37, -6, -302, 174, -15, -136, -13, -90, -27, -180, -60, 338, -173, 18, -22, -17, -136, -213, -138, -102, 37, -43, 9, -92, 112, 19, -48, -76, 59, -59, 10, -241, -146, -58, 383, -101, 23, -236, -113, -28, 123, 3, 25, 44, -167, -148, 1, 36, 77, 43, 80, -160, -174, 54, -16, -47, -315, -15, -88, -4, -102, 19, -41, 19, 112, 203, -258, 6, -6, 232, 51, -100, 119, 93, 83, -44, 58, 78, -116, -271, -195, -270, 18, 12, 11, -47, 62, -5, 90, 146, -67, -117, -160, 140, 39, -89, -42, -93, 238, 40, -5, 247, 34, -155, 177, -59, -58, -10, -85, 188, -22, -43, -2, -57, 87, 55, 226, -213, -50, 37, 161, 14, 186, -74, 163, -39, -50, -60, -285, 7, -143, -22, 65, 161, -232, -268, -18, 123, 53, 295, -150, -133, -38, 128, 31, 47, -346, 16, 22, 39, 190, -72, 3, -21, -10, 4, 81, 356, -126, -123, 62, 159, 345, -132, 281, 67, -277, 8]
6403HJ21l75L93r9L3q4qj50JJ89J41l61J81k2J05j7j41J00l07K53K6j35K8M6L51
6428B77m94M27j25o7o5j39K26j86O5J27R8j18r3K22k35J06K45l39o9J75k67M12
6450A83J5k72j14K70j02K88j27r2l28M55j67L2l08L30oj03K49lk92J74K95m29
6472e2J38k42J98l3p2QR4R0r8r4J59j91J54q6mM49n22J57J8L3P5l15K1L9J03j96
6498a69J07J07J70m8j88Kp0j40q3J51K22j01J6J53K6k96K30L7J19q1q6n7j99K91
6522A13J44l08q7j65K25K94N2j85R1J19k80m05L24m5J72j37P0M9Qm64L09J13M4
6545E1K24j21l65L11o6k13J76J82l64K04J00j03o3J7R9P6j01R8j92k0p2K17j32
6568e7Q0J51j24J6q9J31j46j39Q2l0M05l07k57K24O5J75l67L10j55l6M1K63m01
$$ y = [8, 129, -246, 147, 48, 81, -3, -11, -161, -160, 29, 170, -191, -10, -32, 73, 56, -85, 15, -292, -39, -13, -148, -120, -74, 277, -217, 210, 85, 18, -47, -186, 40, -146, -81, 46, 144, 26, -67, 155, -80, 26, 271, -68, -137, 38, -229, 183, 198, -74, -188, 82, -20, 268, 141, 49, -279, 176, 9, 41, -267, 63, 57, -46, 203, 200, -92, 82, 377, -52, 86, -156, 42, 9, -63, -55, 39, 129, 31, -63, 96, -95, 59, -27, -31, 418, -104, 53, 71, 104, 179, -136, -115, -76, 27, -169, -62, 45, 215, 167, -21, -19, -89, -229, -312, -161, 61, -40, -24, 129, 155, -141, 89, 126, 245, 164, 78, 21, -178, 113, 257, -51, -138, -303, -78, 216, 268, 83, 174, 293, 13, -392, -68, -113, 59, -78, -8, 41, 49, -415, -106, 7, 51, 275, 154, -211, 100, 34, -179, -3, 179, -185, 19, 119, 16, -47, -30, 69, 145, 44, 142, -50, -70, -142, 75, -57, 23, 174, 50, 66, -23, 108, -38, -177, -95, -125, 280, -27, -284, -60, 5, 180, -187, 123, -32, -68, -27, 236, -165]
6591a65L29l49j2L6L3N1r2K0K93k56K5K14k46O1p1K42r2j64J06j92J58N6oJ50
6615A29n4q8n5j1K5k24M62k13J1J68j64l05K20J41j21l53M78J68j64k2p4O9n1
6638b8m2L9j41J39J62m13O5J2J55k14J61Q3K89k53j3k04l3J40j34P7J49J03K14
6661C13l49J14J0k4J10j86j20o8K57k35J71K24k26J37l08J56m4k50O62k05J07
6682B46l67J33K23j47r7j56J24J97k21RJ85k14L29j49J28j74k60J92m2j69k3M5
6704b08L40o3j32J12k53K67k31Q1k26J71Q2L21o4j21r0J99k81jo3J22j99K33j12
6727a16J45n8LL6n5r9K27k20J11o6J71J94k32m9l9LN8l3K36j54N2j50J68j47j19
6752a33K23k21j3J26R4J35j84n3k76J72K51j15j6j59j90J98K12J27q9L8O2j97
$$ y = [-165, 164, -185, -197, -161, -128, -77, -169, -149, 144, -112, -87, 127, -119, -58, -129, 113, 21, -143, -37, -229, -71, -15, -21, 129, 75, -13, -68, -79, -54, -278, 184, -29, -18, 150, -14, -319, -99, 42, -79, -432, 46, 214, 50, 28, -46, 23, -28, -70, -31, -172, -33, 129, -284, -219, -207, -52, -266, -105, -22, 267, 14, 1, -203, -236, -96, -230, -153, -4, 99, 313, -36, 78, 88, 64, 174, -12, -132, -200, 57, -178, -7, 217, -9, 128, -180, -24, -68, -318, 344, 139, 246, -121, 12, 235, 88, -9, -165, -41, 156, -65, -56, 129, -85, 244, 95, 223, 49, -211, -19, -61, -230, -253, -208, 132, 69, -63, 49, -204, 63, -168, -87, -313, -142, -60, 261, 197, 76, -14, 185, -96, -97, -160, -38, -237, -4, -116, 29, -29, -26, 10, -45, -144, 83, -137, -26, -92, 79, 273, 41, -8, -47, -44, 14, -19, 217, 63, 115, -35, 133, -14, -133, 90, -131, -144, -18, 76, 211, 27, -26, -302, -130, 121, 6, -10, -169, -359, -161, 51, 178, 89, 127, 189, -8]
6774hN3K0K11l33K04Pk01K04j91K71j39J36k88o0M2q7k23K09J3K42J4l9K6Nk85
6799a97J96m1l1K12k7m7l00L01j11J73qj39j34J29L9J36p8M9j28M9o1n3J60r0
6823aJ52j70J12j87P0J38J6j35K7J5J45Jj02k03r4K70n2J33k1p1j90n6L05pK9
6848A24r9r4J91%j93O9k28K61j52K12k90J50K56q1M5k62J22j04j67L03K21k55
6870B9k08J7K91j65J94j21j92k35L55jK42k70pp2j3J99n5j0K26p5J2j19J51l23
6894a50K40q8j9J42k25J68n6J74l61n5N55k20n1J08o7j51k7J81PP1l09K16k27
6917a44K61k11K12l27K8n4J97M1k7J4O5j84k21M35j05Q5P1M5k35J37k92K70k18
6940a57O7o7J00L01m92J67k37L57l34L34J08j13J08J9k76R6o7K47j06j43K56l18
$$ y = [-8, 45, 65, 276, -57, 147, 154, -47, 157, -34, 237, 98, 234, -54, -114, -72, -159, -382, -173, -160, 82, 96, 57, 83, 88, -197, -1, -42, -73, 139, 112, 65, -235, 66, -45, 128, 120, -19, -153, -24, 15, 151, 73, 122, -6, 43, -18, -71, 89, -1, 151, -19, 93, -94, -24, 114, 130, -5, 22, 37, 182, 183, 81, -122, -216, 54, 2, 135, 114, 43, -147, -203, 102, 95, 124, 25, -69, 122, 122, -71, -2, -230, 31, -121, 91, -199, -49, 207, 126, 171, -91, 31, -73, -240, 63, 284, 29, -179, -162, 129, -36, 158, 37, -155, -390, -35, -36, 206, -64, -71, -143, -156, 43, -12, -22, 204, 129, 141, 22, 173, -150, 90, 2, -17, 125, -100, 68, 12, 186, -175, -230, 325, 105, 54, 162, 95, -56, -83, 98, 105, 176, -133, 83, -144, 117, -94, 118, -209, -181, -235, -38, 3, -24, -10, 55, -129, -350, 85, -20, 65, 136, 181, -54, 83, -209, 61, -157, -90, -157, -57, 244, -248, -81, -318, 39, -295, 39, 147, 34, 142, 161, -115, -19, -86, 161, 55, -88, 168, -150]
6962a50K06m14M36Q2j0p5l27K37k3j7J21J45k70J46k9J34m9j56j5K8O3l71N40
6985B32m06J17L0k61L75L8P0k75K26k46J3J63J85N6k83J0P7m66K01J62m6K51j48
7008G5m69J44N88k12r0j46J81k41J72N4o4K3l60J65N7rJ04r6J94M8k2k72K11N5
7032I0n1J18l95M24k59K8n5M99l66RK34m56K59j67J92pk01J76n6k0j40r5K91O
7056E8J02k67q1K64k77J48q0K27J60m42K73R1l32J56j70N51l67j28J82m3j52J08
7078a9J93K4l27n3K92j41nJ27rJ16K1j76m85N07n8j83J2K23Jq7k29K44j77M2N8
7103h9J03k08K82M0k64J45J23o1l13L55k5l4l29J11P1K09o2J23l6j83K2k30K12
7126c8J56k2j82K13j99j15L53j62Q8r3p8K34p9J53p9k3l00K91k8l80J95K05nj34
$$ y = [-150, 56, -358, 78, 160, 150, 75, -252, -15, -38, -55, 66, 211, -59, 87, 58, 192, 143, -13, -28, 0, 63, -308, 232, -174, -57, -27, -288, 87, 125, 195, -80, 146, -100, -87, 76, 261, 317, 34, 44, 121, -345, -144, 18, -28, 223, 75, -394, -250, 338, 126, 36, -110, 71, -170, 2, 56, -8, 15, -345, -180, -123, -132, -28, -124, 70, 118, 96, -176, 35, 90, 39, 157, -238, 186, -73, -45, -100, 399, 33, 42, 276, -180, 79, -88, 104, 97, -104, 72, 16, -4, -144, -239, 52, 58, 160, -107, -188, 76, -201, -53, -133, 94, 254, -188, 85, 176, -156, 0, -170, 381, 14, -114, 68, 25, -127, -19, 174, 198, -129, -182, 110, -31, -36, 91, 82, 198, 219, 43, -442, 65, 7, -176, -164, 59, 60, -27, -256, -12, -189, -147, -89, 14, -194, 88, 128, -136, 9, 132, 71, -242, 113, 88, 54, -275, -164, -93, 116, 54, 177, 141, -42, -20, -250, -38, 118, 96, -86, 127, -72, -187, 166, 4, 92, -1, -79, 155, 76, 229, 150, 127, -173, 118, 90, -290, -95, 110, 105, -29]
7150b9j2P6j10o0P3j39J01J13n1O1j0J23p9M5k58K20j81Q6k7j20Q0l2L39l84K39
7175F4k0j52O5L91l75m9K7p9j79mL99j82l0J51J98k98O8K62l77J90k91K51j48
7198a18K23Q5j85J47l53K55J20m79J67k09L55o0k7J79j08j57N3k40N10k53M26
7219C31k81j95K46k43l62K87O8l2K05j01K10k50J74J01j30%ln61N64j31l2k8P
7242a56L18q1k3J44j57Q4k42J51j71L52k69P7P4j27o5K22j50n9k0K6K60M7m10
7265a75JK37l0j0J4J06k06N8k42j7L75r5k5J29j95J55k23J36J47j79M9nJ26o9
7289F2l6m8K18j14J7N2K87m25J13J59k70M0n6j9j22K40K02k03k11M68m78J43Q9
7312A08j28N8l2j12J62j7l16O8K46j04j11K84k17J51J95l15k04L42l41K8L71k72
$$ y = [-29, -41, 35, -75, -135, -62, -201, -100, 13, -38, 23, 13, 136, 57, 102, -156, 64, -117, -31, -58, -178, -98, -130, 209, -175, 64, 44, -108, -43, 348, -27, -76, -49, -128, -307, -311, 88, -94, -124, 27, 225, -73, -5, 257, -120, 70, -221, 30, -118, 105, 190, 5, 152, -201, 54, 174, -305, -138, -347, 8, -52, -79, 100, -8, -165, -112, -352, 158, -95, 331, 50, -145, 101, -142, -504, -217, -149, -181, 24, -77, 133, -117, 57, 158, 28, 28, 25, -536, 28, -103, -135, -163, -156, 162, 81, 58, 202, 45, 129, -113, 38, -133, 219, -50, 27, 101, -26, -91, 131, -19, -78, -98, -72, 188, 235, -175, -174, 63, 33, 23, 37, 143, -63, -5, -247, -264, 111, 16, -9, 120, -75, 80, -143, -7, 140, -39, 10, 5, 131, 62, 26, -22, 196, 82, 99, 151, 438, 13, 126, 285, 15, 55, -1, -20, -142, 98, 300, 97, -114, 354, -124, 19, 108, -20, 38, 6, -106, 56, 39, -277, -209, 37, -67, -178, 106, -111, 40, 235, -80, -284, 58, -283, -255, 116, -156]
7334a56J53N8l2M2K6j99K28j23J05k89J61OJ66m17K00J97j88J58m5J88l49N8o2
7357a14K54k22j03K46j39j15O2K95n3j51K06j22j51J75m12K57L38k16P5k8p5j61
7379a54L32k37J95k31K30j07j07J56j46J52J39j14j41j12J53O7J0q5L85k60j40
7400a5J39k29J96l4Q8%l7N6k25p7q9K69R9l84M26k13l9J32Mn7o1K41q5p7j50J
7426a21K6L7o2M27l75r6L20k48Q6n6J66L31m01p7j31J92K1j48R2J38j02M2j72
7449a11J72j6k8J77j79j63K74k37L24k37O7r9L8J81j15j60L01j34J4J36j56j68
7471a19J81k7nm1OK1J28M4m33J90M2p5O9J27k5j35L8O1kJ28J6k88j03L30j88o0
7497a20k01J80J32J31P8j53J38k96K28J5l0k8J95j49l21K58q4nJ30k11K11m5m11
$$ y = [-156, -3, 55, 23, 65, 91, -108, 120, -3, 102, -187, -26, -20, 146, -271, -71, 126, -62, 96, 51, 239, -110, -52, -114, 140, -82, -185, 61, -78, -193, -131, 164, 111, -40, 166, 44, -107, 68, -344, -87, 251, 35, 110, 82, 7, -154, 178, -59, 136, -95, 135, 28, -79, 77, -69, 83, 222, 108, -33, -145, 8, 75, 85, 0, 385, 125, -15, 124, -105, 91, 57, 145, 145, 108, 164, -61, -138, -227, 42, 141, -243, 183, -30, -69, 63, 67, 10, -51, 190, 105, 28, -122, -121, -95, -58, -120, 307, -68, -164, 156, -92, -6, -62, 104, 435, 34, -43, -174, 18, 39, -109, -17, 121, 19, 61, -111, 61, 45, 17, 194, 15, -148, 126, -111, 213, -24, 43, -56, -18, 163, 48, -112, 189, 55, 69, 205, 49, -119, 62, 35, 30, -11, -5, 16, 144, 188, -245, -55, -13, -88, -19, 108, 83, -52, -14, 47, 45, 173, 189, -99, -202, 128, -60, -120, -321, -141, -9, 122, 200, 47, 185, -111, 117, 132, 102, 74, 269, 120, -201, 57, -27, -32, 98, -113, 98, 53, -358]
7520c58M72l16P7J26J40m2j98K09o3j74J22j97M22N2n08O23l85k9o8K55k46K7
7542e9L41m65K60N0l1j12Q6j53Q3q7l7R2j03J64j49J74k00K65j83L97l20J77k29
7565c9O4K16j53k37M20k63J12q6q1L60l58K4J45O2k3l5q2j33Q2n4j65M09j58j7
7589A0M0j15J49NJ69l01r2L00k00J76m0k77K27k3P8qj32n7M1n6J16K44m87K66
7613C3P1j82J19Jn4J59m60M55K53n43R0q4M77l84L1r3J13j61k7km9L51j05P1r4
7638a4J06k43J41j55K98k60P2k50K24J49j57j17J96l2J35j56J4MM06m58L03J0
7660B16l10r3M04r8j87pJ38n4J96K95l74k33J51Ol14K73J9N7P0j81O8r8J69q6
7684B7j34L9K77p6j61M3J27m5j38J46k20j4J41K06l57K01k29J17k35K42J76n6
$$ y = [-358, 114, -202, -125, 1, 141, 99, -99, 110, 47, -127, -5, -202, 220, 272, -236, 387, 2, -27, -95, 160, -86, -59, 282, -183, 77, 127, 96, -16, 70, -83, 0, -87, -124, -32, -135, 29, -120, 54, -146, 119, -64, 333, 13, 190, -39, 25, 241, 88, -149, 271, 8, 120, 34, -47, 313, -45, -21, 124, 186, 163, 128, 46, -87, -5, -59, -224, 185, 27, 10, 50, -65, 84, 89, 258, -43, -135, 165, -35, 141, 101, -176, 51, 28, 106, 98, -34, -91, -50, -106, 10, 254, -233, 33, 104, -78, 41, 42, -12, 147, -313, 142, 395, -148, -58, -142, 335, -49, -18, -111, 2, -159, -186, -188, -237, 114, 9, 80, -14, 92, -151, -10, -165, 133, -127, -55, -305, -81, 68, -89, -206, -10, -42, 93, -63, -49, -45, 361, -97, 206, 216, -94, -187, 217, 119, -68, -75, 63, 9, 205, 500, 126, -107, 44, 50, -264, 9, 28, 85, 155, -26, 42, -56, 113, 27, -107, -68, 209, 133, -28, 15, 142, 97, -41, 105, -115, -129, 12, 218, -139, 62, -167, -50, -285, -43, 133, 77]
7706G7m4j40J87N8q1L7j46j49K99k07K26j29J22k36j25K21N2J11k03K20j23l5
7728hk32J95M8R2p5k10J58J13l02N59k58O5n7J38n17L49l3J45q1p7O4j44J35j12
7752d5n0o9J55O8n4j76M8O8J34qJ23j91k6J40r9j24R6R7l65K61J50k84o9L65l72
7777b27O4J20K8m1j1L0J88n2j0L9N9r3j19m4m6p9L06j64j00K46j93J78j66M7l0
7802g0j60L76q7m2K25k69L0k7J8j21J58j8K06j06j91M4k88K70K01J63l61j26L08
7825A33n23L32k6J83j14K01k59R3k66L97k39Q3j81L68P5k07j21n1j4Q4K76k47
7847b3j51N5J43j23K3J02k09R0o5M10l59K6Q4o8J5J73j27J35j49Q1j33Q5j42L13
7871A86k10N8k16L35m74L43R6p8k38J20O7J9J44l63K83j5J12j74q9R3k7M26l63
$$ y = [77, 33, -107, 80, 138, 57, 94, -52, -201, 98, -109, 117, -12, 110, -126, -251, -30, 22, 133, -70, 150, 27, -8, -240, -45, 3, 95, 20, -190, -32, 81, -221, 338, 80, 145, 88, 226, -291, 58, 25, 170, 89, 12, 76, -68, 67, -45, -95, -164, -9, 59, 5, -171, -123, -55, 79, 71, 194, 3, -23, 117, 18, -106, -10, 87, -278, -17, 133, -151, -220, 145, -227, -163, -43, -15, -56, -67, -37, 151, 99, 89, 128, 187, 94, -25, -69, -115, -194, 112, -52, -152, 94, -99, 79, -87, -40, -70, -230, 146, 59, 17, 242, -27, 3, -24, -6, -127, 31, 13, 219, 113, -78, -34, -322, -52, 149, 312, -49, -175, 133, -390, -58, -84, 99, -15, 186, -73, 20, -246, 151, -88, -5, -186, 182, 257, 50, -71, -122, -136, -52, 224, -23, -174, -119, 24, -99, -76, 26, -183, -93, -158, 252, -107, -81, 3, -65, -50, 123, -4, 131, -18, 63, -70, 15, -127, 186, -24, 34, -182, 153, -321, 22, 118, 40, -198, -78, -11, 8, 152, -211, 72, 57, 169, -5, -94, -1, -28, 398, 35]
7894C5k30P2J80M1k47p4K01mK71rj01j18j20J16J5J40l29K8J20L5Jk08J96RK6
7919D6Q8j47Ok3K34j02l77L22q9n2J98L5r7k87K57J92k35K10P0L8j40k69J27r7
7943i2j52J10K18l82M05j84m0J97K26m27N4N5Q5m9K7o9j03K70k93j51M81l2k05
7966e1qp9L82l24K6j65K57l7Q8Rk68K20J60l6j57j12J88Q0r2n1K20k11l49K31
7990g9J8j59J89R7j7j62J59J16q9N4j23r8K70n7m19M36m68M19J00j67R7J35j87
8013F5O0J92k54%M7j08O0o7j30L61k99J81q5L6k4p9J37j71N9o6K84l9K1p0o4m6
8039An8K98k50k10Q4J22Q1p9m5j24J61j05N00l51QJ11j66k98K03J05M3j23j7K33
8063A24m1n9m0j3P7K0j53j70K09L4j2p3m5L47j12k04L83l64R2J57k59P1j90K27
$$ y = [35, -195, -123, 57, 98, -149, -223, -22, -26, 245, 236, 135, 17, -103, 13, 28, 168, -161, -133, -13, 22, 23, -185, 11, 20, 46, 134, -13, -7, -30, 204, 102, -275, 47, -42, -94, 104, 139, 42, -245, 12, 204, -31, 179, 249, 287, 147, -122, 5, -92, -244, -134, 84, -298, 107, -77, -117, 80, 306, -121, -67, -12, 73, 24, 51, -18, -121, 149, -144, -295, 186, 154, -51, -59, -138, 244, -80, -54, -219, 38, 1, 89, 98, -170, 50, 210, 174, 17, -95, 93, 173, 81, 30, 250, 39, -310, -79, -61, -220, -31, 66, 49, -113, 46, 162, 73, 127, 4, -94, 176, 119, -300, 136, -332, 87, 187, 20, 117, 252, 65, 125, 317, 63, 63, 110, 2, 62, -5, -135, 226, -73, 108, 23, 59, 35, -44, 93, -78, -19, -85, 199, 160, 181, 111, 47, 1, -57, 241, -9, -219, -135, -13, 68, -11, -56, -180, -19, -124, 376, 25, 33, 144, -22, -320, -117, -12, 31, -92, -109, 124, 83, 24, -16, -29, 48, 68, -85, -255, -46, -12, -24, -97, -142, 205, 93, -111, 272, -92, 0, 157, -102, -31, -221, 6]
8087FQ0k73NK11l02L3L89j45l31L52J40l55P1J22J85k89J70l2M8k15K6J17o8O
8111d9O1O6k48J79j45qL29l25K85j36o5m9ml2J65l37J64J3P4K45M1n12K7K00K99
8136B38j99N2q6K56ok93P0J01j06J37Q7p9k36q6M09j52M5k39K96j43k22L37m0
8159A41j43K14m08M0M2L05k78q8J00j4J33Q2p6l85M99J10m05L4K6n0Lj36L25k6
8183D5J99m63L6m7P0K78p2j05
$$ y = [6, 86, -187, -182, 29, -273, -240, 149, 4, -327, 25, 165, -190, -119, 3, 188, -101, 69, 37, 85, -130, -104, 13, -55, -49, 12, 78, -170, 9, -136, -144, 185, -140, 145, 9, -56, -105, -109, -141, 24, -313, -149, -136, -62, 183, 224, -288, -261, -61, 238, 39, 91, 5, 261, 255, -38, 32, 133, 27, 164, 251, 172, -64, -150, 259, 107, 152, -87, 209, 66, -156, 181, 141, -2, 212, -196, -156, -114, 191, -87, -175, -75, -89, 44, 126, 50, -335, 164, 274, -131, -97, -71, -121, -118, -254, 71, 45, 244, -219, -183, -230, -160, 118, 46, -59]
8191e9
$$ Imaginary data points
##PAGE= N=2
##DATA TABLE= (X++(I..I)), XYDATA
0@%%%%%%%%%%Qj6J6j6K4l2M0m8N6p2Q8j04J20j44J70j95K30k69L11l58M08m66
32b49N31o02O80p66Q63r67J081j208J346j497J661j841K039k255K490k746L026
49A586l333L673m045M457m918N431o006O658p404Q264r272J0473j1933J3746j6071
64h694J9182k3579L0306m1991O7939k29531J21556L97828l50362j67029K06157
75B1782O8115j69832J09865Q5612j78911o2545K28403P269j89807M576J37933
86F2460k4580l5716J6244n4435l7203J24649M7168j26029m5599R7493O500n4595
98b3643K3895R119o7250J6433Q7826n148n7736K0014K2101m2832q135N0579n694
111A9529n1788J1229M7657k3103n0273L7844P5361l3434r2723J9354Q6294j5844
$$ y = [0, 0, 0, 0, 0, 0, 0, 0, 0, 0, 0, 8, -8, 8, -8, 16, -16, 24, -24, 32, -40, 48, -56, 64, -80, 90, -105, 125, -144, 167, -191, 217, -249, 282, -320, 360, -406, 457, -510, 571, -637, 709, -788, 873, -968, 1071, -1184, 1306, -1440, 1586, -1747, 1926, -2119, 2338, -2580, 2851, -3155, 3503, -3901, 4363, -4909, 5564, -6369, 7377, -8694, 10488, -13091, 17215, -24776, 43163, -186368, -64812, 333016, -17346, -184375, 21782, 89897, -79935, 29930, 115542, -63369, -125914, 102489, 109758, -80049, -75473, 62460, 37880, 2164, 18408, -36027, -73230, 51419, 98587, -27442, -73041, 24452, 30952, -23643, 252, 9371, -57879, -41446, 46380, 41232, -16504, 3510, 25611, -17221, -25356, 25223, 19529, -32259, -21030, 26627, 3524, -46749, -8905, 66456, 33022, -59701, -40347, 45947, 30103]
123C0103n6816L9071L1187o9964j8986P8686o736q1013L2025P5497m4521n5348
135d6815M5222L1512k5551l624j4625l5366M7806O2441o7306n8963Q4465L8374
147E7570q2587Q936P6604o1886o7044R4446L9111j07349N345J05499n8506r8083
159h7944Q9474O9568j02079k2552J01747k1366q0966O1714M8919q6658r100R1895
171E2652l6219q9046O4830P4591o6049l9093N3611n340l6432M0958J3572o5955
183c7920N512P1073j9803n3552L5313K7295m6168k214M9609j5374l9791L0762
195D742K7283l9461j5471L8700J880l8552J883K9275n996k0842J2265J9936r017
208F625j7502O600R284q233J170J6453q514k4872J4439K9675j7523k6723J9825
$$ y = [30103, -26713, 12358, 43545, -26419, -45405, 33281, 26545, -54468, -22443, 53054, 8533, -46815, -1593, 29919, 4368, 744, -13881, -49247, -1441, 61000, -6306, -65269, 19196, 57570, -25017, -16081, 60523, -1363, -68407, 26039, 65150, -42199, -36854, 68645, 10139, -87944, 1530, 71098, -30981, -53533, 48214, 26848, -54118, 7596, 56515, -30143, -39243, 52652, 16433, -72613, -7783, 66808, 759, -38334, 15277, 9937, -26495, 14463, 28035, -37920, -32408, 38665, 18862, -34690, 623, 27918, -18250, -20464, 29145, 13771, -26020, 4742, 32025, -7436, -22907, 15793, 17673, -20879, -18996, 10279, 4283, -16559, -4294, 15642, 6625, -10877, -4277, 5007, -3226, -2056, 14397, 5883, -18989, -4550, 25125, 7602, -19121, 704]
221G04J2559k5011L256K8119j8717k5223K9997J4238l8715J717L8479k0116l0011
234b8724L9413J9586m8696M88N0910k0034m4089L3134K3419m5150J455M9319k6490
247D541m7060M5042L5588n2368j5324M9028o388l7410K8913K2743m2526m374M6985
260B7390j3579m2879K6433K9865l2799j1605L1934p712k6677K2491J6099l4212
272a5251n422L5965n944k9977J7563K1981k2570q907K5317j751k2972J1027J7513
285A6572j7661j2280J9619M632k0582J179J6896p357j3082J1294R961j2672n335
298h816J4278J515j4055L699J3165q238j0560J2454P742j4840l589J6135k807
311F083j5692P631J0520j3830m492J6446k498j7783J0848J6283j6249j0096K1093
$$ y = [704, 13263, -11748, -8492, 19627, 910, -24313, 5684, 19922, -18793, -17076, 21403, 1287, -28724, 10689, 30275, -18421, -17933, 32977, 12943, -31146, 1988, 25407, -19743, -18288, 31031, 4541, -42519, 2523, 38111, -14257, -29581, 19447, 13059, -24351, 4562, 27305, -15221, -19595, 27390, 13811, -29068, -2635, 27230, -5569, -17174, 14760, 7048, -19629, 2862, 18961, -15251, -20673, 15292, 9348, -20629, -3066, 18915, -3655, -12562, 12755, 11004, -11968, -941, 16572, -1089, -13369, 6250, 10882, -9700, -8521, 8375, 1018, -12064, -770, 9191, -3481, -8816, 5462, 6977, -7078, -3379, 9786, 1548, -9012, 3442, 11184, -3656, -7245, 8890, 6083, -9609, -1978, 8542, -5288, -9780, 6666, 4168, -13615, -2767, 13516, -2733, -12829, 8264]
324H264L034k0895O316J8814j5249j2854J9733M458k3111L377K1299j2816j5810
337a5440J8435Q081k1269R37K0919q732j6366J5303J0112j7809j692J8647n765
350E361j5543J1878J0528j6198m228J5843l234j4110Q091R030j2764m527J5805
363E932o80j5202O135J3923r285q831J2986L283j3805K422J3416p661j2619J1611
377A625P496j3685k957J3734l835j2701R963R244j4370n129J7401K25j5435N835
391b589J2020j0935m955J4907j866j5902Q456J3553j3568r843J5358J433j5419
404i350O098J2078j3542p044J8266K232j8226L952J5183p897r169J2160J994j3467
418f732N419J2115j0747r071J2276L522j2370J378R102o200n721R259K360r285
$$ y = [8264, 11298, -9597, -3281, 15533, 284, -12570, 7163, 11621, -11490, -8113, 13186, 370, -15440, 2995, 11076, -10193, -9256, 11663, 2931, -13435, 1868, 11980, -5829, -7521, 11126, 5361, -10182, 1696, 12224, -3974, -8202, 7641, 4407, -9703, -1612, 7418, -5346, -9873, 5932, 5252, -9950, -3815, 10108, 823, -8008, 4978, 8261, -5544, -3122, 10294, 2633, -9986, 1625, 9121, -4564, -7521, 6213, 2378, -10323, -360, 8884, -5486, -10615, 6786, 7011, -8424, -2589, 9431, -1504, -6459, 8448, 6582, -9320, -864, 12689, -879, -10722, 4636, 6069, -9350, -3252, 8826, -4716, -11760, 6506, 8738, -9488, -5536, 9647, 1750, -7419, 4741, 6735, -6732, -1313, 10802, 55, -9016, 3260, 6782, -5588, -4210, 4892, -1308, -7029, 2230, 4590, -4695]
432d695j29Q400j627m951L668L130l615j701L859J264l526j867K068O77k209m59
448a713K192k120k467N152K509q222j746J1343N70j0173K490Q000o706k930J1774
463G953j966j5497N493J5134r684j0832J1382K704j1810O050Q929j4679m035K0736
477I878j716k1585R092J8011j4305q585J9037k537k1446J2586J9670j9099j3999
490a4998J9641M265j7546O060J1326j5690l277K0467m805k0057J2313J6692j5286
503h95q451J5462k569j2714J3069J0429j9896o925J8937K471j3490J396L669n539
517e046M669P439j0479o865J3878N257j2284j618P615k285r12N696k956o851M126
532f16N759k772k570k951l352O902Q119r568q567J0270M508j0246K120R396p273
$$ y = [-4695, -4824, 3576, 1949, -3002, 666, 3796, 181, -1520, 2339, 3603, 77, -1790, 278, 955, -1254, -1713, 479, -1641, -4108, 1044, 3553, -4669, -6415, 4928, 5498, -4675, -2185, 5815, -891, -3821, 7953, 5987, -9510, -4017, 11117, 1433, -9399, 1983, 4687, -7123, -1073, 7856, -6823, -10858, 9878, 8162, -13423, -4331, 13680, -625, -9210, 9827, 7290, -14156, -1570, 18100, -999, -14998, 4643, 8908, -8638, -2578, 8748, -6942, -10219, 10248, 5443, -14614, -2301, 14391, -895, -9346, 6116, 3547, -9167, 3902, 14331, -5565, -12490, 6447, 8918, -4572, -3176, 493, -5046, -377, 7062, -3417, -10282, 3596, 8853, -3431, -5049, 2566, 281, -631, 5065, 2109, -4742, -616, 5143, 2371, -199, -3150, -6502, 400, 8519, -1049, -9616, 654, 5162, -5084, -2964, 6432, -841]
547h41n688J0435J603r620L611O521p623m15R288q548r620J4358O650j6164q67
562f920J3694q423q853J5923L242j8690M448J7655j0297j1268J4407J573j4951
575h460R528J2624j8843q660K2331P47k0787Q759J5283j7661q373K1217l00j8765
589a1360R293J3594j3728n567J4704l775j2220J3348P076j7941p16J6777p582
602A903j2184J3880N486j6682N94J4490p163j0193J1135N829j0570J151P499o516
616a341l335Q240l67m986N591O65r787Q84R116l399m038M978k395o396O061M424
632C915p519J430Q400n915o443P861J155p697O683P787j1813m727J2023j476j0722
647g058P622O702j2197n27J2251o553j0048J2718M165j4673L924J4651j1174j1666
$$ y = [-841, -6529, 3906, 5509, -4111, -500, 6021, -1602, -2017, 7271, -1277, -10897, 3461, 10111, -6053, -6920, 6774, -1649, -10502, 5421, 8663, -10027, -5579, 12076, 1779, -9489, 4918, 6491, -8460, 1068, 13692, -5151, -13811, 8520, 9267, -11520, -2761, 12522, -5139, -13512, 7705, 7405, -11360, -2067, 11527, -2201, -7768, 6936, 3161, -9059, 4289, 11365, -6576, -7292, 9485, 1903, -10281, 3599, 9085, -7597, -7003, 7487, 324, -9869, 1266, 7095, -3475, -2324, 5175, -1341, -4676, 3564, 3197, -1789, 3802, 4467, -5320, -4436, 4680, 1281, -2757, 2221, -174, -6570, -509, 3915, -3604, -2174, 6226, 311, -6132, 1729, 2884, -4813, 1870, 9657, -2156, -6883, 5140, 3664, -7058, 564, 7266, -4931, -5458, 6793, 240, -9808, 2910, 7075, -7598, -3674, 10977, -197, -11863]
661a1863J6061O323j6127L201J2537j2356r051J6995L041j6835N027J3041j2549
674b555p770J4256r3j2402R704R601j5417n357J5960o13j1010Q468N580j4397
688f045k96J4389m949j0801R329M769j1332J081R117p564n458J2020J919j1347
702e168K137P575n935j820Q882l469p332O960L929q733r74P766k939l662N827
717C044j844q196N210O440o482j699P592k946o735O447L511p420K116P700o519
732B19n217Q247M00q222M310O168q220l330R342k492q325P938N474j0310r59J0379
748E402m865p161R336L695j0959K194R431p108o344R913J610j0753L860Q357r280
763b672m800J1429m4j0663N557P192r155k280J1249k618r618P643O085r920j901
$$ y = [-11863, 4198, 10521, -5606, -2405, 10132, -2224, -11275, 5720, 8761, -8074, -3047, 9994, -2555, -10325, 3931, 3838, -8564, 1140, 10741, -4676, -10033, 5927, 5314, -5696, 2772, 8352, -6045, -6341, 8048, 3099, -7702, 1627, 6396, -4936, -3855, 5262, -2302, -7760, 4260, 6179, -5168, -3031, 4544, -1391, -3211, 5671, 2202, -5130, 1830, 5759, -2974, -3948, 3818, 879, -2783, 3044, 1200, -6996, -1786, 4654, -1828, -3527, 4065, 1119, -5616, 831, 4342, -3078, -962, 6738, 219, -4998, 3249, 3649, -4573, -263, 5905, -2315, -5645, 3697, 1205, -7120, 818, 6292, -4018, -4977, 5402, 537, -6624, 2712, 6407, -4552, -2358, 7073, -35, -6379, 3534, 5144, -5609, -1749, 6608, -2672, -7472, 3957, 3913, -6750, -1193, 5999, -3156, -5436, 5813, 3195, -6423, 1220, 7305, -2615, -4516]
778d516R688l664o899P364L070r686O11Q697m386n507O316K037o911K269N898
793D381n250k699O911j74o146L025L789n288q40N791k172m854M005J555m997J372
809a591L767l549j364M514p40l781L148K305m111M44M452k815l108M234R05n159
825b449J975L763m641j861N202j144m988L744L241m903m31N634k189m321M871
840A503K106n892Q94N591l837l365N188O86o283J738N164m644k681N484L46n752
856c754K697M455m794k014O173o46m872L062L554m534j304N002j809m364L788
871F40K288n104k65M811k396k971L610J024l957J294L493k282k257L081J295l335
887a031J164K075k141j538K741j16k479Q30J438j443o20J333n81j250J730O73
$$ y = [-4516, 5172, 1508, -5391, 1973, 5043, -4643, -4032, 4665, 279, -5228, 1088, 3125, -3786, -1517, 4381, -869, -3568, 3343, 3169, -2977, 48, 3837, -1451, -2291, 3500, 1328, -3526, 479, 2034, -2963, -1591, 2176, -1373, -2737, 1777, 1037, -2744, 404, 2709, -1402, -958, 3494, 679, -2429, 1805, 2710, -2449, -474, 3289, -1352, -3213, 1989, 845, -4143, -399, 2842, -2061, -2492, 3142, 953, -3368, 1503, 3609, -2283, -1389, 4202, 365, -3000, 2188, 2874, -3409, -1671, 3493, -1151, -3832, 1652, 1998, -3754, -1057, 3398, -1396, -3410, 2763, 2117, -2755, 307, 3861, -673, -1977, 3025, 1216, -3148, 640, 2928, -2176, -2441, 2370, -26, -2997, 613, 1637, -2320, -1026, 2467, 185, -2072, 1009, 2304, -1031, 133, 2208, 67, -1471, 1270, 1154, -1325, -495, 943, -500, -1120, 213, -368, -1618, 112, 785]
903G85j369QJ201k39J34M87n28m44Q64pn94j10J88j137O76O93j490p72J843L20
923E09j949P28J122j067K29J563k06j841J008J696j658m52J370p33j181J569J77
940H84k369j63K544m50k610J544J671j444m57J856k34j603Q40J166p67q02J033
957F39j81n88L80J14r67j66J471o56j563N43J237l61r51Q37Q99j036l8J454P0
976A137j593K73J246o35p14Q30R0j202L72Q83j753n80K278m8k377O49K681j852
994c15j198K834O22l057K05L080j063k227J851Q48k528O73J659j908j249K340
1010E67l25k319J366K163k240p47L243m99k862J367K446j458j540J569k42j361
1026h72J563L41k165N50J322j173r65J592q4j704J428J443k240l02K626m47j542
$$ y = [785, -584, -576, 625, 386, 520, 1007, 479, 35, 899, 892, 298, 188, 376, -761, -85, 608, -882, -1654, 189, 509, -1440, -712, 410, -657, -428, 1135, 929, -912, 96, 1792, 134, -318, 1052, 319, -862, 707, 884, -1485, -1648, 896, 446, -2164, -620, 1051, -393, -850, 1006, 772, -831, 9, 1175, 408, -394, 639, 458, -130, 250, 364, -603, -769, 702, 46, -1517, -974, 263, -98, -1049, -212, 687, -349, -387, 1067, 1137, -456, -183, 1063, 428, -286, 544, 634, -568, -196, 687, -1066, -1646, 632, 584, -1793, -1144, 1537, -315, -1513, 1321, 1943, -1114, -909, 2171, 1108, -1119, 732, 1580, -948, -275, 1384, -524, -1773, 567, 242, -2077, -711, 1452, -788, -1535, 1708, 1209, -1653, -286, 2160, 702, -838, 731, 489, -872, 691, 1032, -1133, -583, 739, -434, -1399, 193, 109, -1595, -167, 1276, -964, -1266, 1360, 913, -629]
1043f29J072K48j302J164J095k187n05K206q89k103K126J080l045k36L221j136
1059A80k284K740J109l457J574K343k429j062L617l91l989K216K974m360p07M657
1075B731k309m210L395L073m401o47N007k090l780M099K507m969J19N158l593
1090I0l282M984J298n651J214M581l742k988N167N14n556K209L840m159j330N550
1106B739j019m466L230K398m409o3N092k531l734L726J276m730J303M127k982
1121d3l102M051J55l755K433K984l842n52M177j572l670L840J811m212M68L975
1137C146l283k636M335L80m908J938L841l817j784M724j427m344M176L341n197
1152a515q81N448k685l520M924K042o119Q45N261l942l745N901P04n908K276M126
$$ y = [-629, 443, 691, -611, 553, 1648, -539, -1044, 1162, 273, -1830, 296, 1376, -1669, -1905, 1316, 180, -2104, 636, 1745, -1712, -138, 2205, -224, -1286, 2331, 1940, -2049, 167, 3141, -1219, -1926, 2731, 422, -3788, -393, 2680, -1721, -2368, 2639, 549, -3231, 868, 3375, -1594, -1475, 3683, 90, -3192, 1792, 3090, -2561, -1347, 3234, -508, -3496, 1671, 2185, -3371, -1162, 2678, -1481, -2811, 2739, 1720, -2746, 484, 2882, -1527, -1590, 3502, 971, -2763, 963, 2239, -2491, -1188, 2939, -43, -3145, 906, 1061, -2694, -261, 2723, -1119, -1671, 2506, 934, -2736, 1104, 2915, -1297, -829, 3146, -137, -2773, 1562, 1942, -2966, -1028, 2813, -1004, -2788, 1936, 509, -3835, 341, 3682, -1515, -2396, 3052, 367, -3153, 1771, 3813, -2306, -1461, 3800, -142, -3887, 2014, 2718, -3190, -914, 3212]
1168C212n532j620O803r20n170L625L012n764n8O656k596n474N134K219o084J09
1184b448O062l655l740N646R96o434J747N230m283k534O501r08n781K852M465
1199C716n197r53O022j852m723L890K373o104M33N984l085l763M448K43n296K238
1215a626N242l851k654N047l97m982L450L343m700j98M842l102l851M158J947
1230B668m593R52M162m159l006N324M22m792K859L911n024j556N474j366m306
1245c030M165L127n875q55N255k725l657N060J851o035P72M847l702l121O155
1260B232L18n605K516M091n091j973O521n10n173L611K527n656n22N936k003m321
1276c102M300J232n727P62N545l199l096N365j9n190K244M133l584j606N239j303
$$ y = [3212, -2320, -3940, 2863, 1943, -3227, 398, 3410, -2354, -2412, 4244, 1648, -3826, 1308, 3527, -2557, -2448, 3614, -41, -3781, 1865, 2861, -3573, -1826, 3404, -879, -3413, 3088, 2180, -3601, -749, 3716, -1481, -2434, 3588, 1736, -2987, 903, 3276, -2828, -2395, 3589, 504, -3259, 1189, 1432, -3864, -1626, 3616, -235, -2889, 2158, 1761, -3221, 229, 3572, -1128, -1326, 3516, 414, -3437, 721, 2668, -1925, -973, 3189, -970, -3976, 1348, 1770, -3022, -163, 3748, -1276, -2832, 2642, 1276, -3030, 1135, 4262, -1613, -2468, 2787, 62, -3595, 1465, 3316, -2719, -1947, 2900, -802, -3923, 2232, 2550, -3055, -539, 3552, -1539, -3512, 3009, 2499, -2674, 937, 3464, -2192, -2714, 3222, 1219, -3102, 1198, 2430, -3297, -2535, 3010, -189, -3285, 2080, 2061, -3129, -885, 3248, -336, -1942, 3297, 1994]
1292A994m954L171K509m315k57M858k521l829L719J329m302R34M544k921k828
1307b869M369K23m440K473L806l861j485M199j541l771L502K052m129n9L761k437
1323b07l252M167J291m377J560L611l484k110M572qm236K817K686m145q45M180
1339B220j043l749L141J901m568K99L755k436k389L771Q23l986J002L604k778
1354d33j724M098ql969K391K462m039n80L865j150l660L040J202l225k0M004k429
1371a75k224L408N45l459J086L281k786j522L652J8l920K134K352l468m06L084
1387A600j095k822K473J711l521J13L467k069j992K886Q35l035J138K544k403
1402a70j371L034q4l253J804J757k543m01K764j328k162K111J407l191M95K672
$$ y = [1994, -2960, 211, 2720, -1595, -1852, 3006, 485, -3344, 375, 1704, -2598, -1664, 2880, -41, -2869, 1500, 1723, -2717, -244, 3562, -299, -1784, 2415, 874, -2897, 605, 2657, -1472, -1531, 2230, -207, -3459, 708, 1999, -2378, -818, 2793, -691, -2801, 1771, 1763, -2473, 344, 3030, -1115, -1960, 2220, 1177, -2572, 569, 2470, -2098, -1799, 1956, -480, -2869, 902, 1725, -2261, -1259, 2345, -433, -2157, 1941, 1933, -2036, 355, 2817, -1222, -1802, 2063, 913, -2747, 293, 1495, -1730, -1750, 2254, -175, -2399, 1009, 1554, -1905, -819, 2462, -324, -1846, 1806, 1824, -2096, 38, 2390, -1078, -1484, 1600, 505, -2317, 156, 1867, -1654, -1541, 1926, -143, -2135, 751, 1586, -1449, -311, 2233, -170, -1541, 1493, 1409, -1844, -40, 1717, -826, -1227, 1537, 209, -1953, 158, 1565, -1626, -1131, 1541]
1418A541j511j713K323N97k479J155J800j996r20K504k63k401J421J145k253j43
1434a193K220j213j639K035P82k440N83K284j312j053J867L77j914M26J612j588
1450a66l21J412k42k168J590R94k169J0J994j160j311J675O00j628J60K041j277
1467C4q43J510M22j708M1J760j457m06J455l49j806R10J327j689k1J192j82j204
1485a014O73J068r26p9J250r21n49R85K56j059K43P15q04m91O58L36j117L66P09
1504B99n56l47N24L21o39N30K72m16j78N08Pk07K78Jn01Q1J87m05J72r0l31M00
1526i0k34K80k46o8L06k67LO34j80m7j6K58j38j15L3q4K78k39p44N84K62m05o22
1549h57R38k92j46J31O26m44m6L75k33j90L51J73l63Q0j6m46J89L50l78l88N40
$$ y = [1541, 30, -1683, 640, 1237, -1242, -87, 1713, -283, -1203, 1301, 1038, -1363, 58, 1203, -1050, -1193, 1027, -186, -1825, 210, 992, -1448, -865, 1419, 107, -946, 921, 1298, -616, -190, 1422, -166, -487, 925, 683, -1485, 105, 1099, -1070, -1060, 934, -226, -1537, 138, 738, -890, -730, 1311, 34, -809, 701, 1123, -585, -544, 1216, -241, -647, 808, 459, -1347, -437, 890, -799, -820, 372, 190, -1014, -341, 727, -199, -278, 972, 51, -498, 487, 743, -316, -73, 642, -162, -653, 5, 341, -776, -410, 299, -257, -604, -80, 241, -398, 132, 404, -12, -190, 318, 325, 118, 396, 397, -104, -23, 164, -241, -69, -159, -490, -90, -324, -44, -290, -358, -52, -319, -316, 318, 138, 91, 75, 333, 195, 80, 113, 29, 307, 68, -676, -92, 170, -235, -857, 81, -211, -357, -226, 400, -44, -90, 285, 52, -138, 213, 386, 23, 103, 87, -359, -170, 180, -198, -586, -46]
1570d6K06o60N7Q78m73m40P77k10k20L22O15r54j79Q20m32j36L08L46j132k0R76
1591D03q82k80Q92J30j297K83J352p59l06J270J32j625Q98Q96j526j20J384k49
1609E96j658J179R05j626m0J309n69j180J291N07j506O10R56p61p75J264K46j326
1627e78O58J180j354p70J959r42j455J083R85j641K43J468q75j368J707N58j808
1644i50P13J439j432l47J520j06j606Q58J170j617o93J929p56j109J311N12k126
1661a290L30J785j300j052K360J2k017P86J413j149r22K347m84k007J332J119
1677A263j860k95J962r01k035K130Q68k603P31K181j748r92K281L5k192Q38K202
1694A865k239p15K624l79k623J358J633k580l17K765q96k261J946P81k496R83
$$ y = [-46, 160, -500, -443, 435, -38, -478, 299, 89, -131, 191, 806, -148, -327, 493, 61, -75, 233, 579, -553, -573, 403, -479, -759, 133, 263, -1034, -751, 601, -158, -464, 806, 938, -687, 211, 1107, -419, -539, 845, 596, -1062, 117, 1022, -604, -644, 665, 96, -1084, 207, 714, -792, -182, 774, 13, -762, 502, 748, -578, 80, 1260, -94, -864, 1095, 153, -1302, -219, 766, -875, -632, 836, -39, -1407, 300, 858, -950, -237, 1202, -230, -577, 943, 837, -769, 89, 1259, -358, -1051, 878, 122, -987, 324, 836, -1290, -960, 825, -475, -1527, 833, 845, -1172, -386, 1027, -122, -1044, 1303, 819, -1188, 144, 1263, -597, -892, 1070, 169, -1866, 264, 1132, -1471, -740, 1441, -307, -1299, 982, 1017, -1175, -337, 1865, -374, -1089, 1535, 1156, -1467, -109, 1524, -1056, -1373, 1392, 496, -1765, 181, 962, -1534, -551]
1710e51K234j597j706K552J07k320J037K102k228q02K354n88k144J704J312k472
1726a006l41K452r67j934K104J021k702J034K001k101j102K926j70k413J535J753
1742B090k727q15K826j168j842K061J131k704J06K509j551j648K541P36k818N18
1758g55K570k186j012K664K12k767J221J800k775l37K937j098k255K098R65k914
1774a632N33L022j832k008K888L27l028R16K900k183j414L346p42k919J528K102
1790A804k668n08K912j030k815K428J406k995N21K790j638j997K132R93k698J093
1806b70K609k324j627K634l49k527J721K164k891o09K669j215k279K376J631k824
1822a111L08K414j649j686K706M46k460R33K214k476j279K792n32k047J659J628
$$ y = [-551, 1683, 86, -1620, 932, 1039, -1281, -244, 1858, -370, -1172, 1182, 594, -1550, 154, 1466, -1006, -1347, 1105, 138, -1796, 308, 1329, -1373, -339, 1662, -439, -1541, 1385, 1215, -1198, 337, 2090, -637, -1452, 1374, 206, -1636, 425, 1556, -1148, -1042, 1467, -84, -1732, 809, 1545, -1273, -755, 1815, -371, -1383, 1281, 1493, -1274, -53, 1747, -1028, -1365, 1572, 474, -1781, 317, 1282, -1632, -1099, 1923, 91, -1917, 971, 1298, -1730, -814, 2086, -97, -1511, 1835, 1093, -1826, -298, 1804, -864, -1372, 1540, 510, -2305, 123, 1529, -1466, -945, 1845, 207, -1790, 342, 1335, -1363, -270, 2339, 15, -1612, 1022, 673, -1854, -133, 2031, -860, -1469, 1200, -15, -2294, 82, 1713, -1111, -803, 1611, -38, -1724, 982, 1428, -1032, -99, 2115, -361, -1640, 1152, 620, -1427, 232, 1860]
1838A860k772m51K519q63k046K430P66k874L59K914j869j349K970Q4l095Q74K418
1855A875k591r28K811j61k863J828J313k568J54K699q51k262J946P69k625P68
1871f86K729j930j577K518Q6k624R09K203k047q44K290m74k549J863J594k122
1887f61n49K735j146k206J990R68j987K79K800j899j752K437P6k577J340J825
1903A673k387o01K283q64k189K148J469k295j49K349j505j533K343M79j874L59
1919b94J795j662j211K285rk091R96J484j892q63K480r18j696J806Q93j821j84
1936i02K287j176j316J956N77k349K44K012j452q38J740j82j771R16J128j551
1952f77m49J890l61j582J523P36j666l0K033j142j153J316M76j830O27J357q81
$$ y = [1860, -912, -1363, 1156, 293, -1753, 677, 1443, -1431, -1072, 1842, -27, -1376, 1594, 1678, -1417, -543, 1875, -716, -1644, 1167, 1006, -1857, -29, 1284, -1284, -1130, 1569, 718, -1544, 402, 1171, -1454, -686, 2043, 113, -1464, 1054, 1140, -1484, -575, 1628, -419, -1263, 1027, 553, -1996, -133, 1461, -661, -1210, 1525, 379, -1827, 163, 1131, -856, -577, 2223, 324, -1428, 1009, 1085, -1492, -152, 1673, -714, -1315, 968, 104, -2085, 63, 1532, -763, -912, 1437, -68, -1601, 742, 1221, -653, -294, 1501, -161, -1372, 913, 904, -1187, -191, 1293, -599, -1462, 1018, 100, -1596, 210, 1103, -718, -902, 1385, 209, -1107, 849, 1426, -923, -679, 1333, -119, -957, 783, 601, -1170, -254, 874, -677, -1126, 764, 403, -1179, 344, 1080, -586, -616, 1417, 275, -878, 438, 914, -916, -289, 1068, 187]
1969A87j311J551J84k200J424J002j462m02J951o50j129J240Q45j890M48J244
1985A032p46j038J329N08k030M77J286j083q13J564p2j259P55J375j660n18J575
2002F82m59j158J218O86j335K41J251j204m68R90L36j487L7J095p21o15J445m38
2020I6q89J094M43r85l35J148n5j313J087N27j419O26O28p25m37J085l8j422O97
2039a87Q12r72k90J078j85j164J128L44q82k0J015m96o32Q29L14j015K41P26o60
2058a6n97O02N64j020N1O45n20k50R35l13o28P57J65j100M51Q94l48n78N10p2
2078A32n64J12P31n07n83O68K52p67L41M79n49p4N96r8n91O89K96o70J63L45j31
2099B70m17L53L96r47J04K91n0k36M15n3p24M92K12l42R6Q9K4J45q1L38k13k22
$$ y = [187, -1124, 427, 611, -1589, -165, 837, -625, -1027, 924, 274, -855, 385, 1230, -660, -212, 1032, 286, -752, 577, 1085, -945, -468, 818, -265, -1078, 486, 414, -845, -90, 1285, -375, -893, 682, 223, -935, 283, 969, -366, -125, 1126, -78, -546, 444, 780, -707, -670, 425, -296, -911, 534, 96, -793, 301, 744, -241, -576, 572, 517, -796, 291, 818, -601, 25, 653, -72, -509, 576, 538, -884, -187, 625, -347, -637, 441, 256, -908, 220, 564, -318, -338, 677, 181, -451, 378, 692, -323, -82, 644, -16, -613, -11, 553, -467, -416, 229, -291, -541, 394, 81, -547, 210, 375, -725, -274, 620, 272, -306, 204, 132, -432, -320, 411, -96, -679, -11, 241, -526, -185, 294, -255, -329, 267, 169, -422, 267, 563, -107, 56, 401, 270, -147, 206, 602, -345, -241, 50, 0, -236, 179, 126, -598, -106, 106, -236, -140, -51, -27, 118, 37, 375, 162, -60]
2121f0J00k42n9K80Q4m05M9L36l87k30N21j02p9r9R2N0J90L2J13j21K06k82k6
2144c9m0M39m24K12m32J20Q6M6j80L22k09m73K79J49J64q5M6J45R3j53J26n2j29
2167A1L49j45m14L61J16k02k29L65n98J71L7Q8L0K2L30k83o1N26K9o70K23M49
2189E05k25q07R41j56j053R09j72l39J75O99n39n23P18j36m81J83R79r00l43R94
2209D29J37n72J03O19q91m24Q24K3q22O17M37p99N7M44j84m86O73K57p08K72N33
2230E39n10l08P41l56m06K04Q95r06m98R92j19j073N10O85p84L7O41n60k58Q68
2250C34J23p54J10P74o38l97R07p5r51N57L58n55l02Q48k30r68R00K73r54J27
2270e13J093l91j031J403qj012K28R59p04p89J312j71j123M54J113j157m29J530
$$ y = [-60, 40, -202, -261, 19, 103, -302, -253, 83, -304, -534, -13, -115, -194, -293, -201, -151, 39, 71, 184, 63, 269, -13, -39, -79, 360, -64, 148, -284, -164, -78, -32, -212, 110, -99, -572, -293, -144, 20, -65, -19, 126, 219, 66, 192, 140, 11, 360, 215, -199, 162, 278, 76, -153, 212, -386, -215, -178, -90, -60, -38, 292, 9, -52, 474, 503, -167, 56, 505, 280, -527, 414, 258, -795, 114, -58, -397, -222, 477, -62, -585, 133, -3, -484, -301, 678, -222, -565, 429, 566, -6, 97, 716, -175, -599, 225, 248, -574, 43, 480, -319, -262, 182, -2, -488, 185, 442, -266, 6, 539, 29, -279, 462, 106, -300, -96, 799, -107, -605, 387, 268, -805, -295, 390, -394, -357, 284, -276, -534, 334, 457, -297, -187, 587, -51, -448, 459, 384, -567, -10, 348, -207, -509, 339, 109, -859, 41, 314, -640, -513, 580, 189, -842, 561, 553, -459, -231, 728, 24, -765, 547, 376, -747, -293, 820, -337, -766, 764]
2288G64n11j111R61Q03j293o1J445p98q60J257K65j454L67J075j030o15J308j84
2306C28j173O34R70r47p10J447m83r45J080M58j143J12R46n13q69J480L14j432
2324d46R4J083p96n58Q68L26j535O38P11r04m36J449pj067P27P92j671N33J203
2343A004p50r69J291L98j768M53J222j382l20J265K18j432M11J175j371L9J496
2360I80o00j050Q74P96j587q3J801q26j275J393J92j394O72Q76p14r35J377j91
2378C06j155O72J228j477m5J576q50j207J173Q79j615J08J411q62j080J322K89
2395F73j434L28J294j287n83J289J4j243J348L75j043j71J314m29j517J141N79
2412F48j055k96J408o62p17J159J71j263J69J129j222l46J652l77j067Q49O58
$$ y = [764, 253, -858, 103, 906, -387, -448, 997, 199, -661, 596, 861, -593, -226, 849, -181, -796, 512, 328, -845, -211, 759, -188, -898, 549, 66, -879, 201, 659, -484, -372, 574, 61, -808, 672, 986, -446, -352, 731, -65, -623, 245, 571, -964, -326, 385, -519, -955, 494, 487, -580, 147, 939, -732, -199, 1004, 254, -715, 576, 974, -794, -341, 881, -501, -821, 444, 662, -770, -359, 816, -555, -516, 980, 380, -670, 204, 1000, -587, -670, 1131, 305, -970, 423, 615, -779, -107, 769, 55, -880, 497, 306, -849, -177, 1051, -426, -471, 1105, 255, -952, 221, 1100, -515, -407, 1004, 142, -938, 384, 673, -761, -433, 861, -426, -1009, 280, 294, -949, 399, 774, -269, -440, 874, 445, -1072, 69, 648, -407, -703, 705, 43, -674, 485, 656, -607, -438, 691, -531, -877, 775, 398, -669, 180, 838]
2429H38j262r6J415n19j027J094N17j600j14J366m47j058J538j79j313M05J196
2446G54q94n20J436k92j227P37O55j131k64J914p13j356J045O19j462K93J339
2463I33r73o87J213n1j654Q89R62p55m04J155m74r61O61R78j140j52J209o29j013
2482h93J045M24j189K04J217j125m72J087K46j618P40J234j136l43J043j80r30
2499f46J142L01j229r1J360p40p53Q25M76j265M04R30p81p02J190j92p14L03Q89
2518G07q89l09J242l39r44N92O98j142M3Q87j24p92L79M84j179J38J411j023m36
2537e96R56J89r43L38R20j130j01J121m34p31N94N63j229J11J042p67m56N56O05
2556F08j193K70J183r22p83J236J22j277R07L74m95j80P12k96p83M34L52n47K60
$$ y = [838, -424, -520, 895, 376, -651, 443, 960, -640, -754, 612, 165, -893, 645, 466, -847, -442, 754, -140, -660, 776, 484, -743, -6, 649, -482, -746, 1168, 455, -901, 144, 763, -699, -406, 933, -40, -727, 486, 435, -1219, -330, 632, -123, -527, 628, 154, -807, -146, 832, -308, -460, 749, 120, -893, 152, 576, -613, -409, 808, -317, -789, 298, 544, -1074, -334, 900, -236, -579, 464, 284, -646, 496, 797, -432, -523, 837, 97, -656, 169, 645, -620, -216, 714, -67, -769, 421, 229, -485, -182, 707, -182, -491, 751, 412, -532, 60, 758, -384, -341, 546, 422, -370, 9, 493, -686, -548, 863, -160, -596, 360, 549, -394, -56, 864, -266, -367, 754, 320, -411, 183, 746, -483, -372, 670, -97, -553, 3, 608, -585, -315, 868, -54, -837, 399, 521, -756, 151, 525, 30, -150, 562, 266, -517, -83, 269, -278, -18]
2575a8M10o83l21R22J39q09K96N50n38n09R21j7o96M54K98m55k37N88j21o92P10
2596A92R2p05J77P28l61n85O02L0m69K17N03o70k0N30l70k77L65N77p59q8M52
2617A61n5m31L21M27p18K15L58l79m97R14l59j88k53O74m01mM77j03m14K50L99
2638C94k80l37L95m82PM34K8l64J28K90m10l0J89P6O1K06l8k59k42O07o7m7k59
2661@J93n60K57J21R7n40M63j02j68L8K00J87n28N87k14k83M70J67l32j91J49
2682A1o9L4L6J59k27j8k3j36J77j3n6Pj8J18k5l0mL18l0j70j15O9J84k36K96k00
2708C9O6l77J95l11O1J98M2P4K55j52r5j68o2N82n63J56K89J71l52M2O3l91L68
2731A30OR3l33K0L96k42k40Q1L77l61l2K09k34J07M28l34J02j5R0m95M72k06l0
$$ y = [-18, 392, -291, -612, 310, 449, -360, -64, 486, -52, -561, 360, 343, -353, 101, 399, -56, -293, 295, 174, -518, 192, 284, -421, -244, 484, 123, -462, 140, 170, -299, -82, 421, -249, -269, 261, -109, -386, -21, 556, -203, -291, 161, 106, -325, -4, 423, -295, -80, 278, -101, -598, 316, -43, -231, -484, 190, -211, -215, 262, 159, -255, -5, 394, 114, -223, 172, -310, -303, 131, 159, -205, -77, 213, -197, -227, -38, 38, 99, 305, 267, 8, -234, 373, 306, 259, 0, 193, -367, -110, 11, 108, -432, 31, -71, -239, -201, -1, 186, -342, 245, 31, -252, 218, 385, 53, -138, 11, -58, -24, 12, 171, -56, -74, -97, -233, -56, -69, -125, -118, -136, -18, -43, -73, -77, 241, 211, 41, -74, -5, 179, -57, 239, 39, 105, -272, -77, -388, -327, -129, -87, -13, 242, 90, -5, -173, -235, 347, -216, -60, 229, 400, 48, 90, 153, -238, 130, 136, 229, -104, -84, 312, 70, -170, -89, 288, -73, -105, 104, -130, -23, 405, 71, 173, 158, 248, -247, 225, 19, -11]
2754a1J50j36k02N3N8J27l31L43J22l08N3m8M5k51L73J85k06j95K38j69l0o6K57
2777E1o0k68L84l81L0N94n25j8J82L04m30J58L16l55k39L65L36o20k64P05j26
2798A39l20L55k15l27J63L40m41J57M24l20j38L92K11n73K3K44j96o4L6O31p71
$$ y = [-11, 139, 3, -199, -146, -88, 39, -292, 51, 173, -135, -82, -130, -85, -336, 37, 222, 16, -179, 59, -110, -140, -206, 51, -9, -277, 107, -274, -244, 350, -175, -193, -11, 293, -137, 21, 337, -18, -257, 108, 444, -176, -440, 265, 139, -181, 174, -41, -368, -205, 135, -306, -149, 275, -45, -183, 209, 420, -153, -130, 114, -82, -146, -110, 521, -250]
$$ [...]
8191I3
##END NTUPLES=NMR FID
##END=
