##TITLE=1H_4687-n_eth
 CDCl3, 8 sc, 
 27.3.2020
##JCAMPDX= 6.0         $$ Bruker NMR JCAMP-DX V2.0
##DATA TYPE= NMR FID
##DATA CLASS= NTUPLES
##ORIGIN= UXNMR, Bruker Analytische Messtechnik GmbH
##OWNER= root
$$ XWIN-NMR		Version 3.5
$$ Fri Mar 27 14:05:28 2020 Russian Standard Time (UT+4h)  she@DPX200
##.OBSERVE FREQUENCY= 200.1315
##.OBSERVE NUCLEUS= ^1H
##.DELAY= (6, 6)
##.ACQUISITION MODE= SIMULTANEOUS
##.ACQUISITION SCHEME= undefined
##.AVERAGES= 8
##.DIGITISER RES= 18
##SPECTROMETER/DATA SYSTEM= spect
##.PULSE SEQUENCE= zg30
##.SOLVENT NAME= CD3CN
##.SHIFT REFERENCE= (INTERNAL, CD3CN, 0, 15.7039)
##AUDIT TRAIL= $$ (NUMBER, WHEN, WHO, WHERE, WHAT)
$$ ##TITLE= Audit trail, XWIN-NMR		Version 3.5
$$ ##JCAMPDX= 5.01
$$ ##ORIGIN= Bruker BioSpin GmbH
$$ ##OWNER= she
$$ F:/spectra/data/she/nmr/H-F/1/audita.txt
$$ ##AUDIT TRAIL=  $$ (NUMBER, WHEN, WHO, WHERE, WHAT)
(   1,<2020-03-27 14:04:18.70 +0400>,<she>,<DPX200>,
      <created by zg, POWCHK disabled, PULCHK disabled
       configuration hash MD5:
       00 E9 B6 7A A2 85 ED C7 34 08 36 98 17 FE 4E 26
       data hash MD5: 16K
       C0 DA 57 49 EF A1 CE 45 38 20 47 B8 2F EF 81 14>)
$$ ##END=
$$ 
$$ hash MD5
$$ 98 C5 A1 98 F5 B6 3D E0 C4 33 71 46 C2 C2 F9 EF
##$RELAX= 
##$RELAX= 
##$RELAX= 
##$RELAX= 
##$RELAX= 
##$RELAX= 
$$ Bruker specific parameters
$$ --------------------------
##$DU= <F:/spectra>
##$EXPNO= 1
##$NAME= <H-F>
##$PROCNO= 1
##$TYPE= <nmr>
##$USER= <she>
##$AMP= (0..31)
100 100 100 100 100 100 100 100 100 100 100 100 100 100 100 100 100 100 
100 100 100 100 100 100 100 100 100 100 100 100 100 100 
##$AQSEQ= 0
##$AQ_mod= 1
##$AUNM= <au_zg>
##$AUTOPOS= <>
##$BF1= 200.13
##$BF2= 200.13
##$BF3= 200.13
##$BF4= 200.13
##$BF5= 200.13
##$BF6= 200.13
##$BF7= 200.13
##$BF8= 200.13
##$BYTORDA= 1
##$CFDGTYP= 0
##$CFRGTYP= 5
##$CHEMSTR= <none>
##$CNST= (0..31)
1 1 145 1 1 1 1 1 1 1 1 1 1 1 1 1 1 1 1 1 1 1 1 1 1 1 1 1 1 1 1 1 
##$CPDPRG= <>
##$CPDPRG1= <>
##$CPDPRG2= <>
##$CPDPRG3= <>
##$CPDPRG4= <mlev>
##$CPDPRG5= <mlev>
##$CPDPRG6= <mlev>
##$CPDPRG7= <mlev>
##$CPDPRG8= <mlev>
##$CPDPRGB= <>
##$CPDPRGT= <>
##$D= (0..31)
0 1.2 0 0 0 0 0 0 0 0.06 0 0.03 0 0 0 0 0.0002 0 0 0 0 0 0 0 0 0 0 0 0 
0 0 0 
##$DATE= 1585303457
##$DBL= (0..7)
120 120 120 120 120 120 120 120 
##$DBP= (0..7)
150 150 150 150 150 150 150 150 
##$DBP07= 0
##$DBPNAM0= <>
##$DBPNAM1= <>
##$DBPNAM2= <>
##$DBPNAM3= <>
##$DBPNAM4= <>
##$DBPNAM5= <>
##$DBPNAM6= <>
##$DBPNAM7= <>
##$DBPOAL= (0..7)
0.5 0.5 0.5 0.5 0.5 0.5 0.5 0.5 
##$DBPOFFS= (0..7)
0 0 0 0 0 0 0 0 
##$DE= 6
##$DECBNUC= <off>
##$DECIM= 24
##$DECNUC= <off>
##$DECSTAT= 4
##$DIGMOD= 1
##$DIGTYP= 9
##$DL= (0..7)
0 120 120 120 120 120 120 120 
##$DP= (0..7)
150 150 150 150 150 150 150 150 
##$DP07= 0
##$DPNAME0= <>
##$DPNAME1= <>
##$DPNAME2= <>
##$DPNAME3= <>
##$DPNAME4= <>
##$DPNAME5= <>
##$DPNAME6= <>
##$DPNAME7= <>
##$DPOAL= (0..7)
0.5 0.5 0.5 0.5 0.5 0.5 0.5 0.5 
##$DPOFFS= (0..7)
0 0 0 0 0 0 0 0 
##$DQDMODE= 0
##$DR= 18
##$DS= 0
##$DSLIST= <SSSSSSSSSSSSSSS>
$$ [...]
##$SUBNAM2= <"">
##$SUBNAM3= <"">
##$SUBNAM4= <"">
##$SUBNAM5= <"">
##$SUBNAM6= <"">
##$SUBNAM7= <"">
##$SUBNAM8= <"">
##$SUBNAM9= <"">
##$SW= 24.9337058887773
##$SWIBOX= (0..15)
0 0 2 0 0 0 0 0 0 0 0 0 0 0 0 0 
##$SW_h= 4990.01996007984
##$TD= 16384
##$TD0= 1
##$TE= 0
##$TE2= 300
##$TE3= 300
##$TEG= 300
##$TL= (0..7)
0 120 120 120 120 120 120 120 
##$TP= (0..7)
150 150 150 150 150 150 150 150 
##$TP07= 0
##$TPNAME0= <>
##$TPNAME1= <>
##$TPNAME2= <>
##$TPNAME3= <>
##$TPNAME4= <>
##$TPNAME5= <>
##$TPNAME6= <>
##$TPNAME7= <>
##$TPOAL= (0..7)
0.5 0.5 0.5 0.5 0.5 0.5 0.5 0.5 
##$TPOFFS= (0..7)
0 0 0 0 0 0 0 0 
##$TUNHIN= 0
##$TUNHOUT= 0
##$TUNXOUT= 0
##$USERA1= <user>
##$USERA2= <user>
##$USERA3= <user>
##$USERA4= <user>
##$USERA5= <user>
##$V9= 5
##$VALIST= <valist>
##$VCLIST= <CCCCCCCCCCCCCCC>
##$VD= 0
##$VDLIST= <DDDDDDDDDDDDDDD>
##$VPLIST= <PPPPPPPPPPPPPPP>
##$VTLIST= <TTTTTTTTTTTTTTT>
##$WBST= 1024
##$WBSW= 4
##$XGAIN= (0..3)
0 0 0 0 
##$XL= 0
##$YL= 0
##$YMAX_a= 1079114
##$YMIN_a= -1054235
##$ZGOPTNS= <>
##$ZL1= 120
##$ZL2= 120
##$ZL3= 120
##$ZL4= 120
##$ABSF1= 10
##$ABSF2= 0
##$ABSG= 5
##$ABSL= 3
##$ALPHA= 0
##$AQORDER= 0
##$ASSFAC= 0
##$ASSFACI= 0
##$ASSFACX= 0
##$ASSWID= 0
##$AUNMP= <proc_1d>
##$AZFE= 0.1
##$AZFW= 0.1
##$BCFW= 1
##$BC_mod= 2
##$BYTORDP= 1
##$COROFFS= 0
##$CY= 11.3945322036743
##$DATMOD= 1
##$DC= 2
##$DFILT= <>
##$DTYPP= 0
##$F1P= 16.9975609425685
##$F2P= -3.02152046262296
##$FCOR= 0.5
##$FTSIZE= 0
##$FT_mod= 4
##$GAMMA= 1
##$GB= 0.15
##$INTBC= 1
##$INTSCL= 1
##$ISEN= 128
##$LB= 0.24
##$LEV0= 0
##$LPBIN= 0
##$MAXI= 10000
##$MC2= 0
##$MEAN= 0
##$ME_mod= 0
##$MI= 1.114404
##$NCOEF= 0
##$NC_proc= 0
##$NLEV= 6
##$NOISF1= 3.799351
##$NOISF2= 2.8
##$NSP= 1
##$NTH_PI= 0
##$NZP= 0
##$OFFSET= 15.70392
##$PC= 1
##$PHC0= -9784.315
##$PHC1= 12.00082
##$PH_mod= 1
##$PKNL= yes
##$PPARMOD= 0
##$PSCAL= 0
##$PSIGN= 0
##$REVERSE= no
##$SF= 200.130013532006
##$SI= 16384
##$SIGF1= 3
##$SIGF2= 2
##$SINO= 400
##$SIOLD= 16384
##$SREGLST= <1H.CDCl3>
##$SSB= 0
##$STSI= 0
##$STSR= 0
##$SW_p= 3612.71676300578
##$SYMM= 0
##$S_DEV= 0
##$TDeff= 0
##$TDoff= 0
##$TI= <>
##$TILT= no
##$TM1= 0
##$TM2= 0
##$TOPLEV= 0
##$USERP1= <user>
##$USERP2= <user>
##$USERP3= <user>
##$USERP4= <user>
##$USERP5= <user>
##$WDW= 1
##$XDIM= 8192
##$YMAX_p= 0
##$YMIN_p= 0
$$ End of Bruker specific parameters
$$ ---------------------------------
##NTUPLES= NMR FID
##VAR_NAME=  TIME,          FID/REAL,        FID/IMAG
##SYMBOL=    X,             R,               I
##VAR_TYPE=  INDEPENDENT,   DEPENDENT,       DEPENDENT
##VAR_FORM=  AFFN,          ASDF,            ASDF
##VAR_DIM=   8192,          8192,            8192
##UNITS=     SECONDS,       ARBITRARY UNITS, ARBITRARY UNITS
##FACTOR=    0.0002004,     1,               1
##FIRST=     0,             0,               0
##LAST=      1.6414764,     0,               0
##MIN=       0,             -1054235,        0
##MAX=       1.6414764,     1079114,         0
$$ Real data points
##PAGE= N=1
##DATA TABLE= (X++(R..R)), XYDATA
0@%%%%qJ6j2K0m0M8n1O7q8J04j27J54j84K24k66L12l69M31m99N80o70P66q74R99
28E33j133J281j451J633j828K048k294K555k842L163l511L890m310M777n287N850
44C074o478P179p969Q861r877J1053j2425J4046j6007J8439k1531K5616l1310
57a7329L9826n4046Q3267k41416Q08111M60701j303526p84116P02723Q91461k11676
68C73980n50637o4011K24448J7394O0925J56776q2938l62976n5775L62035K45950
79C25171k35447l41432k2877K93846K51905p4976l60227j65752L31855M08273
89D10339j76331n28592l2211N25579J99580m36681l13184K90542L07074j89138
99E6977k52291J45365J94127j37050j41424J78200J41480k06281j64961K23045
$$ plain form
0 0 0 0 0 0 -8 8 -4 16 -24 24 -27 40 -48 56 -71 83 -101 123 -143 169 -200 231 -268 312 -358 408 -466 533
28 533 -600 681 -770 863 -965 1083 -1211 1344 -1498 1665 -1846 2044 -2266 2511 -2776 3074
44 3074 -3404 3775 -4194 4667 -5210 5843 -6582 7464 -8543 9896 -11635 13981 -17329
57 -17329 22497 -31549 51718 -189698 618413 1079114 -224412 -1008528 -305805 585656 373980
68 373980 -176657 -240668 -16220 1174 62099 218875 135937 -227039 -282814 79221 325171
79 325171 89724 -251708 -274585 19261 271166 196190 -164037 -329789 2066 410339
89 410339 234008 -294584 -326795 198784 398364 -38317 -351501 -60959 246115 56977
99 56977 -195314 -49949 144178 7128 -134296 43904 185384 -20897 -185858 37187
109C7187K13950k10140k81769J32080L01562m3465k91468o0077K20472J38205
119A56537r9201j42207o615J11720J02867l2184j48342n6057J46655J20959j29521
130B4611j85491P1461K00998j8098j86705j8311J50888L1813r6735J6894R4318
141H5643p0778j40790R6405K24043o2989l11893o0508L10468J92542k24487k84327
152b46671P1527K81786Q5323j70941j50472M2874J35486N6377o0108q5682j7291
163e7792M1974K6500m944L022n613n8412l9200Q9114J22746n3318j80331j0513
175a26767K07945R9018j80130j66478J15810J86814n9906j89681J820J62486L1099
186H2030j30565m9353J03332O8193n6804n4822K9514L6636j0117o501J2737k0128
$$ plain form
109 37187 251137 40997 -240772 -108692 192870 149405 -142063 -202140 18332 156537
119 156537 57336 -84871 -91486 20234 123101 90917 -57425 -113482 33173 154132 24611
130 24611 -160880 -89419 111579 93481 -93224 -111535 39353 71166 -25569 -8675 85643
141 85643 14865 -125925 -29520 194523 131534 -180359 -240867 69601 262143 37656 -246671
152 -246671 -175144 106642 191965 21024 -129448 -86574 48912 105289 45181 -40501 -57792
163 -57792 -15818 10682 5738 8760 3147 -55265 -94465 -5351 117395 64077 -116254 -126767
175 -126767 81178 180196 66 -166412 -50602 136212 76306 -113375 -111555 50931 82030
186 82030 -48535 -97888 5444 73637 16833 -37989 -8475 28161 18044 11543 24280 4152
198D152m6049N179O0358K4585n5069o4590J0524Q0679O3078l5037j00431l2422
210h5043R7467J02937l9180j27638l6391Q3287O8124k8842n6664k2506J737K3720
222a8992N3815K8719o3257p6534L8389J17326K0930j10687p2362O6466Q6640k2506
234D7947q4075j8867N3515L4136k3846l3527J977L0822K5743r210l1293r204L0498
247A4616L1156j7711m4978j7060K7123L1612q66l2208l7178K408N4757N2292k8845
260C5118q3350j8675Q8978P7716m9347j09235j8410Q7206O2965m0320q0056k1561
272f8971M7175N4485N845m2241m0970J1097N5463L2608l0381n1894n479M1127
284G864K8197k2640m3013r618L2293K8495j6328l8745l47M6590K8671l4105m5883
$$ plain form
198 4152 -41897 -36718 23640 48225 -6844 -71434 -60910 19769 82847 47810 -52621 -85043
210 -85043 12424 115361 76181 -51457 -87848 -4561 63563 34721 -21943 -44449 -42712 -18992
222 -18992 34823 63542 285 -76249 -37860 79466 100396 -10291 -82653 -16187 70453 47947
234 47947 -36128 -54995 -1480 32656 8810 -24717 -22740 8082 33825 24615 -6678 -15882 14616
247 14616 45772 28061 -16917 -33977 -6854 24758 23892 -8316 -45494 -43086 11671 63963 35118
260 35118 -48232 -66907 22071 99787 50440 -58795 -77205 10001 72966 32646 -47410 -68971
272 -68971 -21796 32689 38534 -3707 -44677 -33580 21883 54491 24110 -27784 -33263 7864
284 7864 36061 13421 -29592 -39210 -6917 21578 5250 -33495 -33842 12748 41419 7314 -38569
297c8569J6560N8672J5335n2832m9193J5945N3072K0221l5314m8877r174M3450
309a0704N1951M4n6322m3869L1260P3299K2801n8512o6676P933O7760L8540l8812
322A8693o6720j3576N1298M8866r884m7471k0863K9054L7631L583k3799j7501
334a0689L317J1098N697l112q802o726j034L516L110K030N941N789m898j2145
348f908J120K3158J8667j6392l7133j1665L1976L4662j2028m9140k5321L3513
360a5491M9750L705m2932l1929J9512M3766J6143k3796l2109q083K0118K3333
372B1987J832k5219k7796K014L0558K0442j4348k6874j617K4819J7980q074j5864
385a60l12J0035j520j1825j074J1653J959j8185j5404J1533K6585O905k1145j9009
$$ plain form
297 -38569 -22009 36663 51998 -834 -50027 -34082 18990 39211 3897 -44980 -54154 -10704
309 -10704 41247 41291 -15031 -58900 -27640 45659 68460 9948 -56728 -48795 18965 57505 18693
322 18693 -48027 -61603 -10305 38561 28677 -18794 -39657 -10603 27028 30611 6812 -10689
334 -10689 -7372 3726 9423 6311 -2491 -9217 -10251 -6735 -3625 -1595 4346 10135 5237 -6908
348 -6908 -5788 17370 36037 19645 -17488 -29153 2823 37485 25457 -23683 -49004 -15491
360 -15491 34259 37964 -4968 -36897 -17385 26381 42524 18728 -13381 -21464 -1346 21987
372 21987 23819 -1400 -29196 -27182 3376 23818 9470 -17404 -19021 5798 23778 15704 -160
385 -160 -472 9563 8043 -3782 -4856 6797 8756 -9429 -24833 -13300 13285 20190 -955 -19964
399a9964Q662K4698J3255q690k1684j5344O063K4188J4522j9645l6180r363L2292
412g190L5246o209l8049k1191K2453L9267J1693k7339l3278j219L0212K2804j4071
425A3129l1645j2500J5557J9749M747r199j2060m143Q632J8056Q771j2636j8124
438a1666J036J5336O077j0188p830J354j445o424M559J4071O834j5278j6288P938
452a1914K5551J4286j6505k7472m782K3683K2118q359k9280j5809J3878K3717
464I112Q009j2096j7465q009J4012K6446J2442k4199l3104K736L7683K0296k6162
477I701l6211R13K9242J4666j4264j4726K177Q825L156L813O142l661j1730m471
491f428J0441J0487m692j3277n587L999N081K067K999J114p688q741P891K0002
$$ plain form
399 -19964 -11302 13396 26651 17961 -3723 -19067 -13004 11184 25706 6061 -30119 -39482 -7190
412 -7190 28056 21847 -16202 -37393 -14940 24327 36020 8681 -24597 -25816 4396 27200 13129
425 13129 -18516 -31016 -15459 4290 9037 -162 -12222 -16365 -7733 10323 19094 6458 -11666
438 -11666 -10630 4706 10783 595 -7235 -5881 -7326 -13750 -9191 4880 11714 -3564 -19852 -11914
452 -11914 13637 27923 11418 -16054 -20836 2847 24965 16606 -12674 -28483 -14605 9112
464 9112 17121 5025 -12440 -20449 -6437 20009 32451 8252 -24852 -22116 15567 35863 9701
477 9701 -26510 -25597 3645 18311 4047 -10679 -8502 323 3479 7292 13434 9773 -1957 -6428
491 -6428 4013 14500 9808 -3469 -9056 -5057 24 2091 5090 6204 -1484 -10225 -2334 17668
505A7668P304j8695k2131M133K4537J2442j7157k6644m744K1028J9916m689k1496
518h528j0293J1580J8168O237q448j2056n759O055J2032M763j3135j6553R59J6354
532A376P300j1475r453P732Q624l041m309O310Q067n675j2017m80R323M206l584
547B904q324r383p62J5162J5956p047k6146q607K6922K6933p051l0496j5881J5468
561a0352K7163Q254k2038l1705m550L2532L0258j3470m0380j1759L0864L0138
573B4955l962k3955j3386L826J3511J6022R19k2943k2364Q455L0994R189k3400
586b139k0942P764K1534P103o159p331m869K689P806L853n289o442L66J070o789
601g775J844J3905M929j7572j4879J4028K5504K20k1913j1235J0781J2918K287
$$ plain form
505 17668 24972 6277 -15854 -11721 12816 25258 8101 -18543 -23287 -2259 17657 12968 -8528
518 -8528 -18821 -7241 10927 17164 8716 -3340 -9099 -3044 8988 13751 616 -15937 -14978 1376
532 1376 8676 -2799 -12252 -4520 4104 1063 -3246 3064 11131 5456 -6561 -7041 2282 6488 2904
547 2904 -5420 -14803 -15565 -403 15553 8506 -17640 -26247 675 27608 20557 -9939 -25820 -10352
561 -10352 16811 25065 3027 -28678 -33228 -696 29562 16092 -24288 -36047 -5183 24955
573 24955 20993 -2962 -16348 -12522 989 17011 17930 -5013 -27377 -18922 12072 21261 -2139
586 -2139 -23081 -15317 6217 13320 7161 -170 -5039 -2350 5456 9309 4020 -2422 -2056 -986 -7775
601 -7775 -5931 7974 12903 -4669 -19548 -5520 19984 20204 -1709 -12944 -2163 10755 13042
614A3042m740j0127j1236J230J8076J1901j3330k1100J045J9858J2724n197j3151
627a005p802K329J4041J3891r674k5433p594K2859J9849j2430k3591j771J8918
640B587Q671n015n525l11j414P47N946L198m088p740k479J770K928N312J631j0657
656d439r713R608J7517j166j7697k744J3205M443r789m190J0322J098j5916o784
670a6245J5838J2465q732j6104n0J1503Q600l24m979o522m322O091J0082r76p761
685a436n460l522P66R742J2419m675k4025j0698K5178K9882q754l5007j2919K4861
699c648K6122m072k3161j6386M022K0149J4551p549k3911j0068J7392K3162Q51
712A7454j7173j4167J980J3413J5131K315k1512k4285O838L5106J5445k8328l3263
$$ plain form
614 13042 8302 -1825 -13061 -11831 6245 18146 4816 -16284 -15239 4619 17343 12146 -1005
627 -1005 -8807 -6478 7563 21454 11780 -13653 -21247 1612 21461 9031 -14560 -16331 2587
640 2587 11258 6243 718 407 -1007 -260 5686 8884 4796 -2944 -5423 -3653 -725 4587 6218 -4439
656 -4439 -14152 -4544 12973 11807 -5890 -8634 4571 9014 -775 -4965 5357 6455 -9461 -16245
670 -16245 -407 12058 3326 -12778 -12828 -1325 7275 6951 1972 -4550 -8872 -2781 7301 6325 -1436
685 -1436 -6896 -10418 -9652 90 12509 7834 -16191 -26889 -1711 28171 19417 -15590 -28509 -3648
699 -3648 22474 18402 -4759 -21145 -17123 3026 17577 10028 -13883 -23951 -6559 16603 17454
712 17454 281 -13886 -11906 1507 16638 18953 -2559 -26844 -20006 15100 30545 2217 -31046
725c1046P220L4984J5529j7314k2915k855J5570J6172J755j4347j3758j52J3046
738A889P931l892o739n316k957M720J2832O704j2580j5168N735J9283K687j4609
752E20p220Q309M840p928m266R006N857q689r826L356J1715O532m390j1419n603
767i206Q070J5020J338j6679j2855Q389J4323P60j0956m977L144J887K286N377
781E921J435r755p379Q495J2604j593j4095o313O516R509P35p387p626l68R630
796C29Q453m432j1022r16J1022M589p346m954N309K413p657m217Q948P031p482
811F8j2253L113J1500N188m025p728l988M149Q594N213o033j1988l062P791Q043
826D582J665n177q838n289N579J7139N098j5173j7588N816K1720R059j6236j3728
$$ plain form
725 -31046 -23826 11158 26687 9373 -13542 -16397 -827 15345 17100 2753 -11005 -11157 1889
738 1889 9820 5928 -811 -6127 -9084 -4364 8468 15172 2592 -12576 -6841 12442 15129 520
752 520 -6700 1609 6449 -1479 -5745 3261 9118 429 -9397 -6041 5674 12206 7816 -3603 -9206
767 -9206 -1136 13884 15222 -1457 -14312 -5923 8400 9160 -1796 -6773 -3629 -1742 544 5921
781 5921 7356 -2399 -9778 -1283 11321 9728 -4367 -10680 -4164 5345 6080 -1307 -8933 -9301 329
796 329 8782 4350 -6672 -7588 3434 8023 677 -4277 1032 3445 -4212 -8429 519 7550 68
811 68 -12185 -9072 2428 7616 3591 -4137 -8125 -3976 4618 9831 3798 -8190 -11252 -3461 4582
826 4582 6247 1070 -7768 -13057 -7478 9661 14759 -414 -18002 -12186 9534 18593 2357 -11371
840a1371N61R649O872p61m615o621l888N676J0802L188p640p714o5P395Q112l86
856I194q251j0871J383J2904P292p681j2782n15R873P698j110p021n363K10Q837
871C797Q878l666j3812m576Q820J0490k307r082n610J949O957M415r6o993n630
886f466L003R392M376p363p305R44N288L10o77M8j921k878R11L765L501n88m703
903c63m300K308O514N884l897j0515n124Q997R695k249j0507n131L784O433L264
918D793o11m698o050O71R451O993n973j1833j179P930O981l421o974l413K534
933d799M340K600n90l346k330Q81M285J057R35l368k805j910M325M631j219p093
949d406l342M079N748J248l112k713k010J299N724M843m061q881l531Q856P909
$$ plain form
840 -11371 -10810 -1161 5711 4950 335 -6286 -10174 -4498 6304 9492 1852 -5862 -5927 1468 9580 9194
856 9194 943 -9928 -8545 4359 11651 3970 -8812 -9327 546 8244 7134 113 -5250 -5040 3797
871 3797 12675 9009 -4803 -9379 -559 9931 7624 -1458 -7068 -5119 1838 6253 6157 -836 -6466
886 -6466 -3463 5929 10305 2942 -4363 -3419 1869 2179 1502 1550 -371 -3249 -2338 1427 4928 4340 -363
903 -363 -4663 -2355 4159 10043 6146 -4369 -9493 -496 9199 6950 -3557 -8688 -4904 1529 4793
918 4793 4182 -516 -6566 -5895 3556 10549 4576 -7257 -8436 -506 6475 3054 -3920 -7333 -4799
933 -4799 -459 2141 1551 -1795 -4125 -3244 1041 2098 3033 -335 -3140 -5050 -725 3906 2687 -4406
949 -4406 -7748 -3669 2079 3327 215 -2498 -4508 -3209 2515 7358 3297 -5584 -9115 -259 7650
964G650k969r343m780N079O964K597k611o400l463M517Q292K234n812p935j008
979f988O460O929L50q231p487J850R876O149m641r402k169O219P612J242m822
994B947p126k239N040Q446J710r480q692K827J0198N679m890q884p65M991O270
1009F032J105l968n044j311L224M845Q07m606m787m30M121M615l09l676m044R72
1025b454N549K739q63n377j642Q91K417K868N0n364m524J947O991K648n328n916
1041e368Q67N300L970q42m124l388k61M143L770q69n190m713K166N779K996k230
1057B006n146k961L580N863J998l625o054j071M465M604J35m097n438m09M139
1072b011O288M21o371o383K963Q124L941n127p000k001N290N282J131n451m845
$$ plain form
964 7650 4681 -4662 -9442 -4363 2601 5198 2587 -3813 -7276 -2759 5533 7767 1955 -5980 -6988
979 -6988 -528 6401 6751 -1480 -8967 -7117 2759 8908 4267 -5135 -7304 -1085 6527 7769 2947
994 2947 -4179 -6418 -1378 7068 8778 -702 -9394 -6567 3631 9310 4420 -4464 -5229 -238 6032
1009 6032 7137 3169 -1875 -3186 38 4883 5690 1084 -3703 -4133 -12 4603 4294 618 -3426 -2454
1025 -2454 3095 5834 4971 -406 -2048 -1157 1260 4128 4178 -1186 -5710 -3763 3228 5876 548 -5368
1041 -5368 -4501 799 4769 3927 -197 -3585 -3846 297 4067 3198 -1992 -6705 -4539 1240 4236 2006
1057 2006 -3140 -6101 -2521 3342 5340 1715 -4339 -5410 -945 3659 3794 -303 -5741 -6150 -2011
1072 -2011 4277 4698 -1673 -8056 -5093 3031 6972 1845 -5155 -7156 -1866 3416 4547 -904 -5749
1087e749m28M539O448l03n775o651M231N919L831m065m246k446K186N575J827
1102D893l546o096k58L619N019L69l961k909j115M226M920m53n122m006K185N092
1118B857J966k383m407k277K063M495K579k104n491j937M110O173N74n441n015
1133d238J449M826L401j006n369l202J225N229L376k906n369j459L801M772N92
1148E122l614l628l93L296L510L23m618l990J261M453K293k138k373k468J577
1163a387L253K202r70m416j810J772N415p43l016l128n80L550J979N62k794l131
1179c242k78L741L630j138l711k642J784K003K066j545j786k842M65L791L477
1194C773l819k994j215K532L991J467k632m501o68J936O502p88n410m022J920
$$ plain form
1087 -5749 -6177 -1638 4810 4507 -1268 -7919 -3688 2231 6062 1997 -2249 -4695 -2509 3066 4893
1102 4893 1347 -4749 -5007 -1388 3631 4000 39 -2870 -3985 241 5161 4708 -414 -4420 -2235 2857
1118 2857 4823 2440 -1967 -4244 -2181 2314 4893 2789 -2702 -4639 -529 5644 6218 777 -4238
1133 -4238 -2789 2037 5438 4432 -937 -4139 -2914 2315 5691 2785 -2584 -4043 -242 4530 5122
1148 5122 1508 -2120 -2513 783 4293 4616 -2 -3992 -2731 1722 4015 1877 -496 -2964 -1387
1163 -1387 1866 4068 3098 -1318 -3128 -1356 4059 3316 300 -2828 -3408 142 2121 2683 -111 -3242
1179 -3242 -3520 221 3851 2713 -998 -3640 -1856 147 2213 668 -1118 -3960 -3495 296 3773
1194 3773 -46 -3040 -4255 -1723 2268 3735 1103 -3398 -4066 -2130 4372 3584 -1826 -5848 -3928
1209c928N356J771k737l704j158J824M970K763l120n852k309N504M346P61o687
1224b200k746O50N690L187k127n213l549L193O613K313m538l868r4L275M292j333
1240C545j912o459L88N807L880j496o515j512L415M283J152l162m939M86L187
1255A48L816J448o085k095M58L569J388p92p07k726j913M941L078J20p167k479
1271d998M028M905Q32m507k178j859L679K931k70j454l623O80K992L403o69k801
1287A091k395j548K979M308j106n000k509K127N474n53l415k823J717J222Q12
1302C81L14n30j706j118J640K251L68j276j150j256N58J689K764l589k927J887
1318a700K698p6k397N3p29K002Q7q72K892k350k146j186L639M209l031n180j482
$$ plain form
1209 -3928 1428 3199 462 -3242 -4400 -2576 2394 5157 2037 -3815 -6124 -620 3726 4487 -2200
1224 -2200 -4946 -4296 1394 4581 2454 -2759 -6308 -3115 3498 5811 1273 -2595 -2689 586 4878 3545
1240 3545 1633 -4826 -4438 1369 5249 3753 -2762 -4274 -859 3424 4576 1414 -3525 -3039 148
1255 148 3964 5412 -673 -2768 -2310 1259 2647 1855 1148 -1578 -3491 1450 4528 4648 -2519 -4998
1271 -4998 -970 3935 4767 260 -1918 -3777 -98 2833 2563 1109 -2514 -1834 1158 4561 3892 1091
1287 1091 -1304 -2852 127 4435 3329 -1671 -4180 -2053 3421 2868 -547 -3370 -1653 -431 381
1302 381 695 165 -1541 -2659 -1019 1232 1600 324 -826 -2082 -1524 165 2929 -660 -3587 -1700
1318 -1700 998 922 -1475 -1422 -2151 -149 -62 -934 1958 -392 -2538 -3724 -85 4124 1093 -4087 -5569
1335e569M649M407J061n852m907K273M755O263m333q777K72M930M068l91l417
1350e68k376j121K992L631K679m582o490K61P006M005l250m759l203L911N432
1365C568K585n470o271J265O178L081l902k910M17Q41k17K281J657r31n773j023
1381d624N643M644l542o456O68N261J993j728k910q00J437M99K760j435p93j033
1397d16L47k75O59J683k87l376j042L944L422l147m737K02N352J442j903k735
1413h67k76J190l48J331K153k758k602j53M243P99j833j823j358R75K640K518
1429C831j019m040m878M079O907r15n257k020J439K013K006j95o13l289k205M350
1445A94L759j845m411j097P80K093K626l79j781l960Q31O188M30l842l321K082
$$ plain form
1335 -5569 -920 3487 4548 -1304 -6211 -3938 817 7080 2747 -6030 -5758 -828 3240 2849 -568
1350 -568 -2944 -4065 -1073 2558 5237 655 -5835 -5574 1432 5437 2187 -2572 -5775 -1864 3568
1365 3568 6153 683 -5588 -4323 1855 4936 1034 -1876 -1459 -618 -835 1446 3103 2172 -3601 -4624
1381 -4624 1019 5663 2121 -4335 -3667 1594 3587 1859 -1051 -1851 -414 85 2845 1410 617 -416
1397 -416 -69 -344 315 1998 1711 -1665 -2707 1237 4659 1512 -3225 -3023 2329 3771 1868 -867
1413 -867 -1143 47 -301 1030 3183 425 -2177 -2330 1913 2712 879 -944 -2302 -1327 1313 3831
1429 3831 2812 -1228 -6106 -2027 4880 3965 -1292 -3312 -1873 140 2146 1951 1338 -1951 -4156 194
1445 194 3953 2108 -2303 -3400 -2620 -527 2099 1720 -61 -4021 -3190 2998 3428 -414 -3735 -1653
1461a653K823j223n21J419k20l519r29M703L360l274n550J150M280P75l11k070
1477g60j190O62K605J244k418k971J295K223O77j107j961J079q31k06L841J786
1493C968m476m281K400P244nn529l873K191L880M42r71j168k534n72M105L378
1509D199j723m723j046L062L406o28q93l745m01J636L746J970m317l588Q04L680
1525A439J343j532m43j133j133J051L623M80m236j827J947K466p7j548j178K36
1541e22j527J775K786k81k511k296J597L695J59k980q17K12m11J841R80j847j682
1558a829l21L722O79j776k162j16K087M10R97l98k565j410K178K924o00l507j336
1575c023K693J631n67p66m60j162n52K333L340k043m358j228M327K551j694k510
$$ plain form
1461 -1653 1170 -53 -574 845 625 -2894 -3823 880 4240 966 -4584 -3434 846 1621 1310 -760
1477 -760 -1950 -1288 1317 2561 143 -2828 -1533 690 1367 260 -1701 -622 -1453 -1659 2182 3968
1493 3968 -508 -4789 -2389 4855 4850 -679 -4552 -2361 1519 1961 990 -178 -2712 -3284 821 4199
1509 4199 2476 -2247 -3293 -231 3175 2547 1654 -2091 -2492 -856 2890 4860 543 -3045 -2241 1439
1525 1439 2782 1250 807 -326 -1459 -408 3215 3695 -541 -2368 -421 2045 1968 420 -758 -522
1541 -522 -2049 -274 2512 2231 -280 -2576 -979 2716 2875 -105 -922 -710 -1121 720 1700 -147 -1829
1558 -1829 -2150 1572 2251 475 -1687 -1803 284 694 1691 1293 -1272 -2682 -504 2420 1820 -1687 -3023
1575 -3023 -330 1301 734 -32 -492 -1654 -2206 127 3467 1424 -2934 -4162 165 2716 1022 -1488
1591a488m30m08J427K507M3k424l120J597M160P06k077j899j031L27K740K012
1607B642j517l748o91K751L091r99k555q74O84R27J403j90m44k360n06K668K281
1624B563j274k759k63J731Q52O28q48q26j247M33K456N02j156k678J011J780P17
1641A622r19o17q96j176K010K291m99k550j636K314J817Q4j143j138o63M83J830
1658A214J566j656l292L33L068K012j435k511q95J178J481J503p64k597j604J452
1674i47L157Q67k551k542P9K005K181pk037k289L25K571K140j761k017j630J633
1691h23K019R54r52k390j475J420K601J113k701j998K69K684J747k092r17j577
1707b118J215J312J248j000j593k187K179J160R34j418q85o72P68K464M44j354
$$ plain form
1591 -1488 -1918 -2326 -899 1608 1651 -773 -3893 -2296 1864 2570 493 -1406 -2437 -2110 630 2642
1607 2642 1125 -2623 -3314 -563 2528 1529 -1026 -1900 -1216 -289 1114 924 480 -1880 -2386 282 2563
1624 2563 1289 -1470 -1733 -2 850 1478 630 -196 -1443 -1010 1446 1948 792 -1886 -875 905 1622
1641 1622 703 86 -810 -1986 24 2315 1816 -734 -2370 -56 1761 1845 702 -436 -1099 -616 1214
1658 1214 2780 1124 -2168 -1835 1233 3245 1810 -701 -1596 -418 1063 2566 1802 -795 -2399 -947
1674 -947 2210 3077 526 -2016 -1937 68 2249 2242 205 -2084 -1759 812 2952 1191 -826 -2456 -823
1691 -823 1196 2150 1198 -1192 -2667 -1247 1354 2467 -234 -2232 -1963 721 2468 376 -541 -2118
1707 -2118 -903 409 1657 657 -936 -3123 -944 216 1150 -268 -1153 -1825 -1057 1407 1851 497
1723D97k579R36J720J597j320j033j192L46R51J72Q67j168j733J133J993M80j335
1740C32j206L89N11R93K84r08j846j66J054J825Q6j619j603J44K087J381l64k118
1758g44r34P74K163K51o80k142m5J162J716O18j908j709J31J542K080k25k228
1775a78j378Q10J987J112j577j123j253J509J203O46o63k074n30J537J705K47
1791A980j563j556J63J962R15m48j593j042M94J439J051p19j614j024J112J842
1807A399L51j054k140j11J664J908l51k184q77L23K054N41n62j619o51L59J691
1824G41P25j184j422j44P46K142k83j255j705M35J102J259J4j570j264M06J408
1841A51J060m01j514j074O00J757Q52j112j822j27R23J525J97j133j554N87R69
$$ plain form
1723 497 -2082 -1146 574 2171 851 -182 -1374 -1028 -77 95 962 -206 -1939 -806 1187 1667 332
1740 332 -874 -485 26 1019 1303 395 -1451 -1617 -563 1262 1348 -271 -1874 -1730 357 1738 1374 -744
1758 -744 -1678 -904 1259 1510 830 -1312 -1357 -195 1521 2139 231 -1478 -1347 195 2275 2050 -178
1775 -178 -1556 -746 1241 2353 776 -347 -1600 -91 1112 1758 1095 -979 -1509 28 1733 1980
1791 1980 417 -1139 -976 986 1901 1453 -140 -1182 -688 751 1802 1083 -531 -1555 -443 1399
1807 1399 1750 696 -1444 -1555 109 2017 1666 -518 -1395 -1072 982 1523 961 -658 -1309 -950 741
1824 741 1466 282 -1140 -1284 -538 1604 1321 66 -1639 -1204 -102 1157 1171 -399 -1663 -1257 151
1841 151 1211 810 -704 -1778 -1178 579 1431 319 -1503 -1630 -707 818 1015 -118 -1672 -1085 -116
1858a16J041n8j333q35J2J464J267m18j753m75L11J183R32j096j227l59J275R51
1876G66J94j078r11M78Q01J133n1j813p85L01J476R90q39j149j036Q86J518L36
1894A217p05r60R83p21J864m6j608o90k52J697J075j383p77r19J239M81J059L0
1912A584k468j46L43K201M57j994p74k13O98K342k03j816r73q7J624J498j008
1929A065j738r76J341J596M18j065j740m38J723J219K26j523j206n34K527K31
1945A126q19m34j050R49N99N65m99j748n08J038J084P23o55j637k2J382J130K53
1963A477q23j370k35K88J204k90l94o79k02p41J686J492k536k95m44J757J471
1980A366o39j852j54J902m23R96m24o90j392K39K057p14J12j661L73J291m33P06
$$ plain form
1858 -116 925 867 -466 -1301 -1289 175 1442 1024 -729 -1204 -893 290 1222 126 -1101 -1460 -185 766
1876 766 960 -118 -1029 -551 250 1383 1332 -481 -1266 -965 511 1501 662 -487 -1523 -637 881 1217
1894 1217 512 -448 535 -186 1678 1632 24 -666 -918 779 1854 471 -306 -1225 14 495 1554 1584
1912 1584 -884 -1030 -687 1514 1971 -23 -797 -1010 -312 2030 1827 11 -962 -1049 575 2073 1065
1929 1065 -673 -1649 -308 1288 1706 641 -1099 -1537 186 1405 1631 108 -1098 -1632 895 1126
1945 1126 307 -127 -1177 -228 371 936 437 -1311 -1819 -781 303 1026 371 -1266 -1288 94 1224 1477
1963 1477 654 -716 -951 -663 541 251 -143 -822 -1024 -1765 -79 1413 -1123 -1418 -1862 -105 1366
1980 1366 727 -1125 -1279 623 200 1196 772 82 -1310 -1071 986 272 384 -1277 -904 387 -46 660
1998F60o03j411l15K967O67j654j624l69J558J041n16l01r53r11K064Q55O16j005
2016G66j733k73K608J015j178k304j216J806J700O66j090j498n77J904N77L89
2032A562j754n2m67J163Q30r12q59k13n26K062J633j581j843K70J308J55L98j153
2050B1q39N5R48K65l88L63j712O19J357M41j443Q59j872m63J439J679j515m48
2068f34nQ40K08M09l68m52r34M79J66K023j637l95o37J119J078j579m86O69m48
2087e84O19R05o0j045j274J48J333m79n84m96O85Q10o8J09K5q2q99P35J099n54
2107C43o57r75J400P74j55n36r80o19J028J831m28k284m31Q12O89m16p5L49O40
2126C10n82q06K049mk413o56J437J089J18m50j357J35m6K395l74Q4k000k05J746
$$ plain form
1998 660 57 -1354 -1669 1298 1965 311 -1313 -1682 -124 917 401 100 -853 -1764 300 1155 1771 766
2016 766 -967 -1240 1368 2383 1205 -1099 -2315 -509 1191 1857 767 -731 -1308 596 1173 1562
2032 1562 -192 -244 -711 452 1282 370 -489 -702 -1228 834 2467 886 -957 -687 621 776 1174 21
2050 21 -818 -763 185 450 62 425 -1287 -668 689 1130 -313 546 -1326 -1789 -350 1329 -186 -634
2068 -634 -639 201 409 818 450 -2 -936 -457 -291 1732 95 -300 -937 182 1260 -319 -805 -136 -584
2087 -584 35 940 880 -165 -1439 -1291 42 -437 -1021 -1517 -832 -22 -90 19 44 -38 -937 -202 897 343
2107 343 -314 -1289 111 885 730 194 -786 -1405 -377 1454 1026 -1258 -1689 -877 -188 -604 -679 -330 310
2126 310 -272 -1078 971 967 -1446 -2102 -665 424 542 92 -1265 -1130 -1176 1219 845 929 -1071 -1276 470
2145D70J225j186J25j309L88K82N46R49o3k890Q56J686J711k793q3J96j71N64
2163E03J63j175K59j134J055M74R08j180m40N83L90J72k29q09n27J039L42J415
2181A809r92j430k20K127j0r74k97J24K38R48O02j612q35j325J894J685l59k068
2199f95j31J52M91Q38%j38j148j066J587J123p8j727o01O35J381p6j43j93j248
2218a037K11R19J220n62j334J59k08N42M70K53p55j187O23J488L55j364j260J101
2236c66L79l10K35R1l09n05J58J343K55j609r55J292J127p46l32k14L25Q3K46
2255A88L79q23q29M23J320J3q30l76K11J65R4P82l72j162o29J438J540p16j522
2274g06m69P53J074Mj56n47r56K57J237R46q55j830J16J459R06n17l63p51m8K05
$$ plain form
2145 470 1695 509 634 -675 -287 -5 541 1490 1427 -1463 -607 1079 2790 -3 -86 110 -61 503
2163 503 666 -509 -250 -1384 -329 145 1053 -127 -567 16 406 578 349 -460 -987 52 394 1809
2181 1809 817 -613 -833 1294 1284 310 13 137 375 1323 1925 313 -522 -1847 47 1732 1373 -695
2199 -695 -826 -674 -183 655 655 517 -631 -1697 -110 1013 935 -792 -1393 -758 623 547 404 211 -1037
2218 -1037 -826 93 1313 751 -583 -424 -632 -90 380 633 -122 -1309 -686 802 1157 -207 -1467 -366
2236 -366 13 -297 -62 29 -280 -785 -627 716 971 -638 -1593 -301 826 80 -252 -466 -141 -58 188
2255 188 567 -256 -1085 -662 658 671 -159 -535 -324 -159 -65 717 345 -817 -1446 -8 1532 816 -706
2274 -706 -1175 -422 652 656 500 -47 -1003 -746 491 1437 582 -1248 -1132 327 1233 716 353 -398 -446 -241
2294b41J141O11j538n12J63J018J85k46l04q68J53O73R05j24j022n48O72P12l39
2313D91q05N11l19j5L65N45R4j253l01J073M48k74r88L20M43n10M97Q6j39o99
2333d30l6J092L9o73l49J53K02N3K35k11p21j5O03R89q02o85l09J100J23r4k58
2354Fj84o16M0J353J00l43j343R9J073N92n41n42n06L6N89M33K54j079m07K94
2374f92J063K50n32p81j93P95K20O08o87p94l02J000J009l93j004k11K50M20L79
2393D05J41l86p08K22Q57L99p87q57l4R03J51O0n61j85k47N14N85L22r34n90Q55
2414A25M99J45l55o85j16J93P45M86r94l92l04Q03L24q3l11l69j07Q03K56J17
2434G80p55k84o2Q73L03l34p99q4K42O11J81n72m65o3P09L17K28q07m36NM45P98
$$ plain form
2294 -241 900 1511 -27 -539 -376 642 827 581 277 -591 -438 235 1140 1016 -6 -554 118 830 491
2313 491 -314 197 -122 -137 228 773 867 -386 -687 386 834 560 -428 -108 335 -175 322 408 269 -430
2333 -430 -466 626 665 -8 -357 -204 -2 51 286 75 -646 -661 -58 931 129 -556 -865 235 358 264 6
2354 6 -178 -794 -754 599 699 356 -987 -888 185 777 236 -306 -812 -776 -187 246 500 -579 -986 -692
2374 -692 371 621 89 -692 -885 -90 130 738 51 -743 -1045 -45 964 571 -433 -644 -394 26 405
2393 405 546 160 -548 -326 531 930 143 -714 -748 155 306 366 -195 -380 -627 -113 472 794 -140 -730 125
2414 125 624 769 414 -271 -387 -194 551 1037 43 -349 -653 150 474 391 80 -289 -396 407 663 780
2434 780 25 -259 -321 552 855 521 -278 -362 -120 491 672 100 -365 -428 281 598 826 19 -417 -412 33 831
2456H31o29k03o2j57p3O90k92k00q05J123k76O4l28N6j12K64O66j93n34n10N29
2477a51K36K29k84k44l92J64N63N79p11n17j18L92L63K32j59o48n77J073M4Nl36
2498b57j26j92O59J37k66k98k49M58J29K12P9r84M2M25R57o20j33o38P6Q40L36
2519E87j08j032J28K2P79L4m48l79r7P90k4K61k63p63L23K17J00M05n62m63L38
2540a55N51K78p64k28j45L94L21Pk30n35M61q1J64O37l58r8j49J86K27K77o52
2561A08l39K9K98M26M3q28K26k47N48K22k56k19k48J13O57o0l98q0n09Q76K5J85
2583E72n11k59j08N14oj1k08n69L46O44N3j43l18l89M0N20J78j50n62k15L62L85
2605A65K63m28m07L0O33J2o3n79j99l9P64K39l27p57K43K27M47J91k85o73m5L29
$$ plain form
2456 831 202 -1 -63 -220 -293 397 105 -95 -900 223 -53 11 -317 -261 -373 -109 557 364 -170 -680 -151
2477 -151 85 314 30 -214 -606 -442 121 700 -11 -528 -646 -254 109 341 182 -466 -1043 30 74 79 -257
2498 -257 -383 -575 84 221 -45 -343 -592 -134 -5 207 286 -698 -656 -231 726 106 -27 -665 -589 251 587
2519 587 479 -553 -425 -403 376 410 -38 -417 -514 276 252 513 250 -513 -190 27 127 532 -30 -493 -155
2540 -155 396 674 -90 -318 -463 -69 252 259 29 -506 -45 -126 38 675 317 219 70 256 483 760 108
2561 108 -231 -202 96 522 565 -263 -37 -284 264 486 230 11 -237 -124 533 473 75 -5 -514 362 387 572
2583 572 61 -198 -306 208 202 191 -17 -586 -240 404 457 314 -4 -393 -353 167 345 195 -367 -582 -220 165
2605 165 428 0 -407 -377 256 268 205 -374 -573 -612 152 391 64 -693 -450 -223 224 415 130 -543 -588 -259
2627b59N46k39l41k74K6O69L02m67k83k59L15O12j37o74R4k25R75j31J94j318
2647h74N08K0J14R32o71j84j06n57J163N42m79p67j058J914n5K53n50q6m85O20
2667A94j05n49J061p47k98n11M42K110k090O57j082J515K78R5j921O72J263j515
2685e31M8J75rj90K26J095j219o61L09j83J135M7r8j93o09M75L74J69K07q21K7
2706b27K27L01m03P8k45J11P5M61J79q96k18P59M48o13J7k45o9P6L66j61L00j378
2728a057k6J080K39j70m49n39J017M42n84Q81m54p46Q39l90N91j186P57l23m58
2747e36R43j052R39J45j002J97K0j53J58r93J048J042j2k00o43l37j84n58J124
2766e4MQ8k19m90J206o87K72k46l65Q17q04P0N54m27o21J588m88L80j404Q47K16
$$ plain form
2627 -259 287 48 -293 -567 -541 128 430 -37 -320 -579 -264 348 211 -463 -369 -594 381 250 444 -874
2647 -874 -366 -346 -232 700 29 -155 -261 -818 345 887 408 -359 -1417 497 442 695 145 59 -426 194
2667 194 89 -460 601 -146 -444 -955 -513 1597 -493 164 -918 597 875 970 -951 -279 984 -531
2685 -531 -483 -308 -317 -507 -281 814 -405 -1066 -757 -940 195 242 144 -49 -658 -183 191 360 567 -254 -227
2706 -227 0 301 -102 -24 -269 -158 -83 378 557 -339 -557 202 650 37 54 -191 -260 -184 182 21 321 -1057
2728 -1057 -1083 -3 236 66 -383 -922 95 537 -47 834 380 -366 473 83 674 -512 245 -78 -536
2747 -536 407 -645 294 439 -563 -366 -346 -499 -341 -1334 -286 756 744 544 -99 -436 -620 -1178 -54
2766 -54 -50 38 -181 -671 535 -152 120 -126 -491 326 -478 -408 146 -281 -902 686 198 578 -826 21 237
2787B37o61R48N26j250j74L66K10N21o37k05k32L48L33j49m52j03L24O07J51m00
2807C08j62j75J29K37k67N13m94M1m44P08K0n53j04j20N5J018o42N43m23o35K70
2828a77P12J69p49n38N05J53J57L68l18l65o35P38P82k13k89j014O63O2o9J18
2848F0L94o52j93N50L2K33p30o01J406n45j126J34O22Q20Q19o18j257j95L45Q31
2868C29J037j548n6jm01R88j024Q45R5n47j0M78J54m33o24M72M73k45J88n43O83
2889C10o06K49K87K30q82l43L61O81K9o54K83%k90M14N8J17r85J30J255j74J62
2910F32k24o78l59J036n32J61L87o97J36p8J14N70K36n11k80K77j98Q1n02j31
2930e60Q15P55n18l76l58L86k20P7O2k98M42l25M03O07r08j98j74J374p93k46
$$ plain form
2787 237 -424 524 1050 -200 -374 -8 202 723 86 -119 -351 -3 330 181 -271 -374 -50 557 708 308
2807 308 146 -29 100 337 70 583 89 130 -314 394 414 -139 -243 -363 -308 710 68 611 188 -447 -177
2828 -177 535 704 -45 -583 -78 75 232 600 282 -83 -718 20 802 589 300 -714 -51 11 -58 60
2848 60 454 -198 -391 159 191 424 -306 -907 499 -46 -1172 -1038 -416 404 1223 605 -652 -847 -502 329
2868 329 1366 -182 -238 -239 -640 348 -676 169 264 -283 -293 185 339 -94 -718 -246 227 -18 170 -373 310
2889 310 -296 -47 240 470 -412 -755 -394 287 316 -338 -55 -55 -345 69 127 244 -741 -611 644 470 632
2910 632 408 -270 -629 407 -125 36 423 -274 -138 -216 -102 468 704 193 -87 190 -8 73 -429 -560
2930 -560 255 1010 492 116 -242 144 -76 1 63 -235 207 -118 285 892 -16 -214 -388 986 193 -53
2950e3J152j044l56mQ78m14k98m21P84L75q51NL48Q5j98J24J66k2q70M30J44J163
2972A123r09o30J83P89j085j54q5J148j201M22N86o0Kk65K15j148P11N21N63q2
2992F44j115m65J258K43L81j335k42J157K96p66R8p41K28J71J153O1j280J15N4
3011h5k9M35o8j358L08Q04M67m87n05J00j89L31J278o93q84R63p48r84K940j992
3031c96N84N54j914J328k60j55Q14k99r42J030o3J31qK83j364M55J418q68q76
3050e48K80Q07Nk11m56mm8Q2P10q59R4J29L26l84P2k18K07j20N88j23j41j59k85
3073b56k16R59j49k14L2Q42j218P63m59kk44l59P41l00J61l06L28j7M74k08J031
3094A383o83j137J26M84J233j378p2m55J537k345J161j99pJ20J078J94k95n09
$$ plain form
2950 -53 1099 55 -301 -305 573 159 -139 -560 224 599 -252 -247 101 186 -12 112 278 256 -614 -184 -40 1123
2972 1123 214 -416 -233 556 -529 -683 -768 380 -821 -399 187 127 129 -136 79 -1069 -358 163 726 644
2992 644 -471 -936 322 565 946 -389 -631 526 822 56 154 -587 -359 -188 965 1026 -254 -139 -85
3011 -85 -114 321 253 -1105 -797 7 474 -13 -518 -418 -607 -276 1002 309 -575 388 -360 -1344 1596 -396
3031 -396 188 742 -1172 156 -104 -259 555 256 -686 344 281 412 404 687 -677 -222 1196 328 -548
3050 -548 -268 539 544 333 -123 -127 -175 -93 617 -242 -148 -19 307 -77 -5 -223 -16 -136 452 329 188 29 -256
3073 -256 -472 487 338 124 156 998 -220 543 84 82 -162 -521 220 -80 81 -225 103 86 560 352 1383
3094 1383 700 -437 -311 173 1406 28 -44 -499 1038 -1307 -146 -345 -352 -232 846 1040 745 236
3112B36m73J043J98j018r64R47k10j04M00J17K21j328R36k51L53l23j1n1R14r59
3132c27P57l71J224j443o38N51o41J247j192J075j30j661J141K0R93j063J5l72
3150h15J750j028j85J37m98Q17q4L06l33ln80R06l56j2op42N86N74k38L04n33
3171c3j98J016r18k85N79M0K17j62k60j03k79O21r95P75K06JR5q38M65l52J186
3192G78j219M47L67m83L58k30O7L91m89J33k27P7j030M89O79j004O71j80m00N74
3212b31J086K02j087J08j87r4n81M73L14n18L28J5k85L93L38m12j26Q01j59m56
3232g8K18m87N14k97K99P2P3n39L59k20r9M35m06L9L21r5J59m83j68j07Q44m76
3254a22L94j96l04K07L34k47p6l88J38J69m9k6R9k5l48O01L4N4k03rl13K66J65
$$ plain form
3112 236 -237 806 1004 -14 -978 -31 -241 -345 55 172 393 -935 1 -250 103 -220 -231 -282 632 -327
3132 -327 430 59 1283 -160 -798 -247 -888 359 -833 242 112 -1549 -408 -388 605 -458 -443 -815
3150 -815 935 -93 -278 -141 -639 178 94 400 67 64 -516 390 34 22 16 -726 -140 434 196 500 -33
3171 -33 -231 785 -133 -418 161 201 418 256 -4 -107 -386 235 -760 15 221 222 317 -521 -56 -408 778
3192 778 -441 6 373 -110 248 18 85 476 -13 120 -107 -30 -1060 -571 108 -896 -225 -405 -805 -231
3212 -231 855 1057 -30 78 -109 -203 -784 -311 3 -515 -187 -172 -457 -64 274 -138 -264 537 378 -78
3232 -78 140 -347 167 -130 169 241 314 -225 134 -86 -185 250 -156 -117 204 109 268 -215 -383 -490 354 -122
3254 -122 272 76 -228 -21 313 66 -10 -398 -260 -91 -140 -166 -67 -92 -440 161 195 249 46 37 -276 -10 155
3277A55j87k3l97L13L41l00n1J05N81p09M5M00n07oJ4K88J60K29j27p14N27N1
3299A88lJ06k00KK59j80k79Q3oO7L3pJ8j75RJ10M10k40l17Q3j09L58n13M36K40
3324C73n50Rm0L3J30Q0N4l52k75Q74Kj14n03l92J420o47K63k45M7q66J181N68
3346A050k3j219q3L97k84K37m15R8m34P39k5R9O41n21j24J25o44L18j07p15J202
3367C12L14p66j31O04p41P54k69O95o13n98J06J88J07L17l75j94K63J50l08K28
3387D3n74K01J63J54R9k69K93j60J7K25l65m4J5n1L65r6q5k9N6l1K41J49o61L68
3411B4k52j6M16j60j79Q6j80j25n1J33L13l81Q3J28J36J06K10l80l10N23P3K08
3433D05p53L06k38L73N07k73o01j3P1K35k53k0M43o01K11L51qJ67M8n55l62J324
$$ plain form
3277 155 -32 -55 -452 -139 202 -98 -149 -44 537 -172 -127 273 -234 -240 -226 62 222 451 324 -390 137 188
3299 188 185 291 91 93 352 172 -107 -24 -30 37 70 63 81 -94 -85 25 435 195 -122 -39 -148 210 -303 133 373
3324 373 -177 -168 -208 -175 -45 35 89 -263 -538 336 338 224 -279 -671 749 102 365 120 167 -699 482 1050
3346 1050 1027 -192 -275 122 -162 75 -340 -242 -676 63 38 137 778 257 133 258 -386 -68 -175 -890 312
3367 312 626 -140 -271 333 -408 346 77 772 159 -439 -333 -145 -38 279 -96 -290 -27 123 -185 43
3387 43 -531 -330 -167 -13 86 -183 110 -50 -33 192 -173 -217 -202 -253 112 16 -69 -98 -42 -73 168 317 -344 24
3411 24 -228 -244 172 12 -167 -81 -261 -386 -437 -304 9 -372 -289 -161 -25 81 291 -89 -399 124 197 405
3433 405 -348 -42 -280 93 600 327 -274 -287 -216 19 -234 -254 189 -412 -201 150 142 309 357 -198 -560 764
3455G64p81M26m03NL00k76j38j73N70l66K84n83R70q99k05P12m00O69M92k93o58
3476A7L82n60M10j049J162j09j81r9M99o53p3M14M08l90O11r83r5L50Q40q05p27
3497f31M14O52l89K78m63m72J003m9j147Q45j31p0m77l0J236j69j104J21Q06k24
3517aR9m25N32J0j080J074m15Q03m28p74J234o57j23l92Q69m21n07N33m49J026
3537E08r30L12M76k21n14m08J59L14N96p5K04n76L89n28L70j38m50K96PJ177q87
3558H1jk7j221J253j95k31n8M86n47Q28K85p30P69r8l56l5p9N46o35J3l06M08
3580A50o7p47o31J559k14M56L14m06n98L85R8k39k26M75q62R5N81k41J60K8M5
3601A15Q3n36n25J008q03P19J59N29j224O88N11J22j253J5P53n65M29j42j023
$$ plain form
3455 764 -17 409 6 11 311 35 -103 -276 294 -72 212 -371 599 -300 -505 207 -193 476 968 675 17
3476 17 399 -161 249 -800 362 253 72 -27 472 -181 -254 160 568 178 789 -194 -289 61 901 96 -631
3497 -631 -217 435 46 324 -139 -611 392 343 -804 41 -90 -160 -637 -667 569 400 -704 -583 223 -1
3517 -1 98 -327 205 215 -865 209 -206 597 169 -605 629 -28 -151 -543 326 -95 -602 -69 -518 508
3537 508 -422 -110 366 145 -369 -777 -618 -304 292 217 421 -155 234 -294 76 -62 -512 -216 -209 968 81
3558 81 80 53 -1168 85 -110 -341 -399 87 -460 368 653 -77 692 594 238 203 124 670 35 48 -258 150
3580 150 83 -664 -1295 264 50 506 820 414 -184 201 299 60 -166 309 -553 -458 123 -118 42 70 115
3601 115 198 -338 -863 145 -658 61 220 749 -475 213 724 846 -407 -392 361 -204 225 83 -940
3620i40M99J49M08K95k44l05N73q62N01O7j27j76J95j69R69j57j275J192p81p92
3640i80P68Q65j29m17pj53j03N88n80O5Q90j151J408j478J55P57m22J23rk9p43
3661e82k80J290l78R9L96m13k24L6k74J56M85J14p41K56O8m84J339l57n58N31
3681D79J06n59O14q62J75O49o01M16o82L42l77L25j64R64n10O11j780O15J319
3700A080n21n64l72L19j71J023m76k59j12k00L89J29k23o90M88j15n85J190K5
3719C55k54n76K76j09P13k45M18k87j134R99r26K4J133j057LP99m84O19k27p48
3739g08O92m71J014p29m45Q62M74l73l79J6k1l40Q2N25m36K90o28K73N07j34j48
3760g7K2j61M19j96k19N70l94J1Lk9L79l61J9j6K33k87K24K1n48J08N43l28J1
$$ plain form
3620 -940 -441 -292 116 411 167 -138 435 -427 74 141 14 -162 33 -136 833 676 -599 593 -188 -980
3640 -980 -212 653 524 107 100 -53 -156 432 -148 -83 807 -344 1064 -414 -259 498 76 199 190 161 -582
3661 -582 -862 428 50 149 545 132 -92 -56 -330 -174 311 425 -316 -60 8 -476 863 506 -52 479
3681 479 585 26 640 -222 -47 602 1 417 -265 77 -300 25 -139 825 315 926 -854 -239 1080
3700 1080 559 -5 -377 -58 -229 794 318 59 -53 -253 136 265 42 -648 -160 -275 -860 330 355
3719 355 101 -475 -199 -308 405 160 578 291 -843 156 -770 -746 387 -670 -667 132 -352 267 40 -708
3739 -708 -16 -487 527 -202 -647 215 689 316 -63 -47 -68 -408 -326 199 -237 53 -575 -302 205 71 -77
3760 -77 -55 -216 203 7 -212 358 -36 -25 -22 -51 328 -33 -14 -30 203 -84 140 161 -387 -279 264 -64 -53
3783e3Q5l52J45J63j49Q22o48oL11p54O94l99o6M58n8l14M68p42r7L73N2L2l14
3806c49J15K7J04j74J59L95l63j19K9j11M25l49P4L40J05k40k4m7k33L01k98L80
3828A47J01k46j39L16L9l37J91J5j18L3J88o7l35K47l45K44L82j64k70J01j94
3849b11k6M9K31n5J2J33J36j45M6j96j1K62m11J2M9M78nj19J93L65n76q04Q54
3872B61l17K01M55m33n04J79M67j57q92N79K06k08k66m0j35J060j52p04l97J045
3892B48n46l68J133m45K43k50J46m75j94O61N91m52n33p58Q32j55K30N32m09k5
3912Fo0q8N83m54o32N61P61o07j03O49j7p12O66m36j665J933m3J52j001k53J080
3933C20p71M04oj048O71q8M56J66k93O02o43L09j85k9K82l43K75j72P59o52k18
$$ plain form
3783 -53 32 -320 -175 -12 -161 661 13 7 318 -436 258 -141 -207 251 193 -121 347 -395 -492 -119 -67 -35 -349
3806 -349 -234 -207 -103 -277 -118 277 -86 -205 -176 -287 138 -211 -137 203 308 68 44 -3 -236 65 -233 147
3828 147 248 2 -137 179 218 -119 72 87 -31 2 190 123 -212 35 -310 -66 316 152 -118 -17 -211
3849 -211 -237 -188 43 -12 0 133 269 124 170 -26 -37 225 -186 -174 -125 353 348 229 422 787 211 -593 261
3872 261 -56 145 600 167 -337 -158 309 152 -740 -161 45 -163 -429 -469 -604 456 304 -400 -797 248
3892 248 -298 -666 467 22 265 15 161 -314 -508 153 744 292 -241 -999 -167 -322 -92 440 31 6
3912 6 -54 -142 441 -13 -645 -84 677 70 -33 616 599 -113 553 117 -1548 385 342 494 -507 -760 320
3933 320 -451 -47 -53 -1101 -430 -518 -62 104 -189 413 -230 79 -106 -135 147 -196 79 -93 666 14 -204
3954b04L96j00k85O90n25R5m2P2l83J57K73j27O8j94n4L24K5k18R5j15nJ90k23
3977i0K23q1k07N4J4K70k14P9j11J38K2j70P9J39k01L57k86m8p8r2J06J37o6j22
4001a48Q4l2JJ80J27p5m18K99P8k49L53m52J78K19l7K1J29j04j25n5R7m3J2j50
4025a10K54m00J41k0N7J42M9m00N11K39l87j61m0P5j11K89Nm39M08l11L13l3k25
4048a54K60q1r5j22P8O80m01j96J76k54o6p3J51R0K94j06l9J37l70n8o5L03k54
4071a65K57k72K79N1k60L05j25J08k75M90n1k81j70k6J26M7M90n35M84p10J80
4092e3K20p02M99J49n35R62o77P09l03j292J66L80J87j90Q32o49J54Q45r09L51
4112A44k3j34J31r87L62n11J819q75n80N20n69J720j562J346j680N66n41J90n99
$$ plain form
3954 -204 192 92 -193 497 -28 67 25 97 -286 -129 144 17 85 -109 -163 161 186 -32 63 -52 -57 133 -90
3977 -90 133 52 -155 -101 -87 183 -31 48 -63 75 97 -73 6 145 -56 301 15 -33 -111 -203 -97 40 -26 -148
4001 -148 -64 -96 -95 85 212 137 -281 18 96 -153 200 -252 -74 145 108 129 258 154 29 -26 71 28 40 -110
4025 -110 144 -256 -115 -135 -78 64 113 -287 224 463 76 -85 -125 -50 -161 128 133 -306 102 -209 104 71 -154
4048 -154 106 25 -70 -192 -114 566 165 -31 145 -109 -175 -248 -97 -7 287 181 142 279 -91 -149 -214 89 -165
4071 -165 92 -180 99 150 -110 195 70 178 -97 393 342 61 -109 -135 -9 38 528 -7 477 -233 -53
4092 -53 167 -535 -36 113 -422 540 -137 572 269 -1023 -857 -477 -290 -480 352 -297 -143 702 -207 144
4112 144 121 -13 118 -869 -507 -1018 801 -74 -654 -134 -703 1017 -545 801 -879 -313 -854 -664 -1263
4131a263J622M59m2j423J614j150l4l67J01R6R36p32p99J351j730J005n5O9l80
4150g22K30m86O36N47M59j285Q62k5L41q54R5j92K18p42Q00J88K06m76J284j413
4170c29J168p3j606J131q85J050k26L4j049P12Q69o12j198J499m30n2L35P3p68
4189c57L4j50Q67q06J96N0N52r76P61m39M54p69L58O44p66K97K10l50L08n8m98
4210d38L95L0J18mm08K2K96J81P6n85N83r6L1j72jm67L83J14K4K09j56l56L5M05
4234B19j70m29K19K46j73J94r0m64L03J6O6L88l75K30j77K39k82J8j14L23m16
4255b29J04P04n93j84J37L69m41J63j06j56K86J27O05o00m23l49L36O65k70m4
4275A01m1L54l41K59l06K26l86K69l82m26R87m47k10K5L17o23J016k61j66N79
$$ plain form
4131 -1263 359 818 776 -647 967 -183 -217 -584 -483 -387 549 -183 -982 369 -1361 -356 -411 -342 -722
4150 -722 -492 -978 -342 205 664 -621 241 216 557 -297 -202 -394 -176 -918 -118 70 276 -200 1084 -329
4170 -329 839 766 -840 291 -594 456 230 264 -785 -73 796 184 -1014 485 55 3 338 411 -357
4189 -357 -323 -473 394 -412 -216 -166 386 -590 171 -268 186 -583 -225 419 -347 -50 160 -190 118 60 -438
4210 -438 -43 -13 105 101 -307 -285 11 192 268 -317 266 170 201 29 28 -439 -56 58 82 291 135 -221 -186 219
4234 219 49 -380 -161 85 -88 106 16 -448 -145 -129 -63 325 -50 180 3 242 -40 -22 -136 187 -229
4255 -229 -125 579 -14 -198 -61 308 -133 30 -76 -232 54 181 786 186 -237 -586 -250 415 145 101
4275 101 60 414 73 332 26 252 -134 135 -247 -673 314 -133 -343 -318 -1 -624 392 131 -35 544
4295E44J93j417P66N71r45N06k33m51Q19jO4M72l87j364Q46Q42r79O25j963J004
4315d88M22Q3O24r84m64J282O68j132N93p14O43l41J31j122J065o2j07N84r61
4334b80P56J01r50O17m05O86r38P93p52Q23n34J89m15L30o48K83O27r7j101J904
4354I89j91j65k00j125L48j9Q19r5k01m93J421j77j089J006j161K58K34l69N3
4373a57K98o2lL82m82L16n00N12K5q96j73J060N2O74n62K97j567J233q93j93k08
4394h47O20R29j305J587m71K87p61o61O61j03l65K87J078n99j347J049o20K83
4412b98j27P56p62K70j01J421j104R41j518M70N92q69N68L77k65r45J657p09L70
4431G24o42K98j07n5m04Q4j098J322r65J020o72J82P54m73O79q81J32m8k72K77
$$ plain form
4295 544 737 -680 86 657 -288 218 -15 -466 353 352 416 888 501 -863 -17 825 -154 471 -1492 -488
4315 -488 -66 17 641 -343 -807 475 1143 11 604 -110 533 192 323 -799 266 204 97 681 -280
4334 -280 476 577 -373 244 -161 525 -413 380 -372 451 -83 106 -309 21 -627 -344 283 186 -915 989
4354 989 798 633 433 -692 -344 -363 456 361 160 -333 1088 911 -178 828 -333 -75 159 -210 -157
4373 -157 141 79 76 458 -24 292 -208 304 329 -567 -740 320 372 1046 484 781 -786 447 -446 -639 -847
4394 -847 -227 702 -603 984 513 800 39 -622 39 -64 -429 -142 936 337 -1010 39 -581 -298
4412 -298 -425 331 -431 -161 -262 1159 55 996 -522 -52 540 -329 239 616 351 -594 1063 354 724
4431 724 82 380 273 218 -186 -102 -1200 122 -843 177 -495 -313 441 -32 647 -234 -102 -150 -422 -145
4451a45K80m19J92n33Q11q55L52P51j695J583j66M74k25o71l53J036o62P38j38
4470C55q20O56k25K01n5j46P5M18r36O94J0m77R3l10R14j90m44k96O71m17R66
4491G37j88n83j006L12k20N27Q47m87M69j415j12J000K69o49%M73m75M91K32l53
4511a31j7m14n49J238j43Q58p05K54k78R2q12J03J415j376K6P41N63m90m94L15
4531A96j51lM22M93r62j84Q5J91m01O21k17J42p3k58j16p3L62K16j055R27j48
4552A4k55J84Q8L52k87j54L43l53j98M8M73m78M24k33K1K39n41M21J57n33J58
4573a10N07m87q7k03L58j09L11r24M49K85K54M03o02K11k29k61L18L9j9q2k16
4594a94J40j18M72k33l15L61q3RJ0j44J90m9l7J42K0m99J70K64l75M23j23Q5J56
$$ plain form
4451 -145 135 -284 -92 -625 186 -669 -317 434 -1261 322 156 630 405 -266 -619 417 -245 493 355
4470 355 -465 191 -34 167 112 -34 41 459 -477 217 227 -250 -157 -467 447 257 -187 -483 188 -229 737
4491 737 549 -34 -1040 -728 -948 -421 426 -61 408 -1007 -1119 -119 150 -499 -499 -26 -501 -10 222 -131
4511 -131 -148 -562 -1111 127 -16 842 137 391 113 205 -607 -504 911 -465 -439 302 865 375 -119 196
4531 196 45 42 464 957 -5 -189 -104 87 -314 307 90 232 159 -99 -215 -288 74 290 -765 162 14
4552 14 -241 -57 31 383 96 -58 285 -68 -266 -218 255 -223 201 -32 -11 228 -313 108 265 -268 -110
4573 -110 397 -90 -177 -380 -22 -131 180 -744 -295 -10 244 647 45 256 27 -234 84 123 104 22 -194
4594 -194 -54 -172 300 67 -248 113 30 39 49 -95 95 46 9 151 171 -328 -158 106 -269 154 31 116 272
4617B72n01N01l05Jj07o7M5L16l5l70J83J78l49J48P7l8r4J5q1K31l21MM50m30
4641b77L42q7N29l63Nj63K55k66j12Q2J5j22J66o5J87j81j12K2J21j65N13l39
4663a5K65j2l34L28k96j29K57J04l16J61J54k35L81l31J40j87o3N1P5K2K1j07
4685f6K03m60j0M61l67j41L44O4k24J25N2K0j38J11R3r3p7L05pk85K70l22M15
4708B73m27J17J9Q5K61j59j55j05K98l89K97k15K55J52m01r0L25o4pj95N4K94
4730B23k04qj15P0J46p7k40K6J70j9j3k06M39l04P0k12P1LR0K44j93K93m42J73
4754a5L1J58r9k07n7L49l08J60J3j82j43J39J03R6j18M88j71j37M0m47K91Qj28
4777a36K57n9j21K27m21K16o0L71j6l87r5L36n5o7R7o7k23R9n1K97l82K83m4o9
$$ plain form
4617 272 -229 272 -33 -32 -139 -206 -161 155 120 -250 -67 111 -238 -90 -13 -51 -145 -130 -211 20 -301 -297 153 -277
4641 -277 65 -22 507 144 149 -14 241 -25 -137 -55 -40 -162 4 -61 126 -55 -167 -145 -24 -189 324 -15
4663 -15 250 238 -96 232 -64 -193 64 168 -148 13 167 -68 313 -18 122 -65 -128 -77 -2 20 41 -66
4685 -66 137 -323 -333 128 -239 -380 -36 28 -196 -71 -19 1 -137 -26 67 -26 -103 202 195 -90 180 -142 273
4708 273 -154 -37 -18 67 328 169 14 -91 207 -182 115 -100 155 307 -94 -184 141 77 70 -125 -71 223
4730 223 19 11 -104 -34 112 35 -205 -179 -9 -28 -41 -247 192 -112 -42 -254 -183 -180 -90 154 -39 254 -188 -15
4754 -15 16 174 75 -132 -189 160 -148 12 25 -157 -300 -161 -58 38 -80 408 237 100 140 -307 -16 -8 -136
4777 -136 121 62 -59 168 -253 -37 -97 274 258 -129 -224 112 57 -10 87 20 -203 -104 -155 142 -240 43 -1 -70
4801g0p0K77j45R3l82K72j18K96j1j13j2l02L56j25L4J48j68M67m43k10K27l56
4823c55L16P6K8j6k5J61r8l28J79M09l89J5P2J46L4j67k30j38QL22q0J88j39n5
4847f6K18k12l8J77J3j19J6O3j72J71J90l27k18K43L4j67L30k57N2J40j8N1j4
4870I0k07L57q7K2o3L8J00k17l94L29P5r7J63j38K27m71N20m01K99J05m7j93l37
4893c27M25j63j11K03m86J77L86m5o1L3J14k46r7Q7L18k57j70K18k29M78k61K37
4915B23k08j36j25M04j65J53j18J23q2J30n0L3m52J99J97k17P4k66L41j18K07
4936A47qq6j05K80m27q3J60M5j64K84%J29l41K40j64K00j1j03j00j57R0N62k45
4959A43k46k41L08J09k33n4K96j17p1J27L4r0O0l97K43L06J10l71J57j50J44k2
$$ plain form
4801 -70 -140 137 -8 85 -297 -25 -143 153 142 29 17 -285 71 -54 -20 128 -40 427 -16 -226 1 -355
4823 -355 -39 37 65 49 24 185 87 -241 -62 347 -42 -27 45 191 225 58 -172 -310 -302 20 -60 128 -11 -66
4847 -66 152 -60 -98 79 92 -27 -11 52 -120 51 241 -86 -304 -61 -27 -194 136 -121 -69 71 53 104 90
4870 90 -117 240 153 175 112 150 250 33 -361 -32 43 -54 109 -29 198 -273 247 -154 145 250 203 10 -327
4893 -327 98 -65 -176 27 -459 -282 104 59 -2 31 145 -101 -198 -111 207 -50 -220 -2 -231 247 -14 223
4915 223 15 -121 -246 158 -7 146 28 151 69 199 149 182 -270 -71 126 -91 -17 -283 58 -60 147
4936 147 139 53 -52 228 -199 -282 -122 -77 -241 43 43 172 -169 71 -93 107 96 -7 -107 -264 -174 388 143
4959 143 -103 -344 -36 73 -160 -214 82 -35 -106 21 55 -35 25 -372 -129 177 287 -84 73 -77 67 45
4981D5k47K26L9l09N9L66n8j2r9J8L67o30L56k10n8L58l60J16K6K21o6k49L02
5004B01k55MJ11oj33J97Q9j57j2k5k9N6j97J02j56J35N6K5k92K62P0N7R9n08J0
5029b96J92K5K68q4r3m2l47N47j16pO1j63k03M12K2m2j61J50m5O6N2j01j34j09
5053a48K07k76L36l47K22o9J23M30n04L26l74O8k01J07k47M10l5q7mK5K08m70
5075c00M11J7K0j76M7j12K6J82k18L4j40J86J14m1M1j62J16r7L71n63M39m98K20
5098h3J98k15K03p1j02Q7j01j27K50j2j14J01j45K05k87K28j75L12j11J28J47
5119C16n52M26p4pk56K23j57k8N8J17l85N23j47k9q4N9l9O0p4j90K37K28j97m86
5143d58L05J83J90k16J15j8J06n7p0m18M30k77lJ22J13J52L11q94N83m7K0k02
$$ plain form
4981 45 -202 24 63 -246 -187 179 121 109 10 28 395 -235 121 -89 -147 211 -149 -33 -7 214 148 -101 201
5004 201 -54 -50 61 55 -78 119 208 51 39 14 -15 41 -156 -54 -210 -75 -19 6 -286 -24 46 103 202 -306 -296
5029 -296 -104 -79 189 105 12 -30 -377 170 54 47 108 -55 -258 154 176 134 -27 123 78 144 196 95 -39 -148
5053 -148 59 -217 119 -228 -6 -75 48 478 -26 300 -74 -6 -207 -100 -347 63 28 -59 -63 -38 170 -300
5075 -300 111 128 148 -28 19 -93 -67 115 -103 -69 -209 -23 91 50 91 -71 45 -52 319 -244 195 -303 -83
5098 -83 115 -100 103 32 -70 17 -84 -211 39 27 -87 14 -131 74 -213 15 -160 152 41 169 316
5119 316 -236 190 116 109 -147 76 -81 -109 -51 66 -319 204 57 28 -56 3 -36 24 -50 -240 -3 225 28 -458
5143 -458 -153 30 220 4 119 101 207 150 80 -338 92 -185 -188 -66 47 199 510 -384 199 152 172 -30
5165c0L74o5j44K60k12j34p95M17P1R6P39j191J029J131j805O38j05m82k55N15
5185E2J62J3m40J51j38L78j27k37M24m38J63L5J40J52m81K70j73K26k95J40J71
5206A48k27l38L68Q5R3L27k96l59N7N24m03j40J24k4K33j77Q3p6r0J34K1J48P6
5229B91n54K24j13K50N6k66K72K05j79j61J24J32k95J27k10K23k18K96o12L93
5249a5L24o10K11%M9nJ95j98K13k52K86j21j89K91k52M80m45L50j37j21l37L73
5271I0j41K46n0k29K19l43J17j37K21l37Q4P05n02K41k5j92l59J99M13j064J003
5292A59K52q03K87M46m85k28n9M25l09O29l90K30n15J44K6K57j99N06n63K38k0
5313B8o9J88j47n5k09K45J62m81J002o69J32l79l3L62M2K4j54%J7k08r3L00N1
$$ plain form
5165 -30 344 279 135 395 183 49 -746 -329 -258 -162 577 -614 415 1546 -259 379 274 -208 -463 52
5185 52 214 227 -213 -62 -200 178 51 -186 238 -200 -37 -2 138 290 -191 79 -94 132 -163 -23 148
5206 148 -79 -417 -49 36 129 456 160 -199 -142 382 -21 -161 -37 -61 172 -5 78 2 -88 46 67 215 291
5229 291 -263 -39 -152 98 154 -112 160 365 186 25 149 281 -14 113 -97 126 -92 204 -408 -15
5249 -15 309 -301 -90 -90 -41 -46 149 -49 164 -88 198 77 -112 179 -73 407 -38 312 175 54 -283 90
5271 90 -51 195 145 -84 135 -208 -91 -228 -7 -344 -260 445 -57 184 159 -33 -392 -193 220 -844 159
5292 159 411 -392 -105 341 -144 -372 -431 -6 -315 314 -76 154 -361 -217 -191 66 -133 373 -190 48 28
5313 28 -41 147 0 -55 -264 -19 143 -338 664 -5 127 -252 -285 77 119 143 -11 -11 6 -202 -295 5 56
5336E6nJ26j52K7k49k29M96J7K96m21K26m78M76j56J07k90J22l10O12m23j0J63
5358Ap46j64P81k80P06K22l36o52r3O39j98l06L91m97M67K12j76n68L55O71j53
5379B76j44R7P44q29M63q88M68J40q63M48K85q87Q03K53k53K24j82o33J12M43
5399G7j85K20p0j95J75M06J11o97n75J069n28P82j195L19k44P61o33P75l16k86
5419b29l25M56K53k81Q94J3j244O73J13n75M75j94O1O63l90n99L43k4n75j29Q63
5440B42j014J056k18j10k91K27L00p39Q26n3R2j62j046R30p60N46P64r06o7J54
5460b29L81r59R17p21O55n78J649j593l11J192j326L31P51k43k17m2o82J559j138
5479f04J205k46l81R04p46o85R16p2o30J495r01m21m59N31P86l64j022N10N97
$$ plain form
5336 56 51 177 25 52 -197 -426 70 87 383 -38 188 -290 186 30 137 -153 -31 -341 271 -152 -162 1
5358 1 -745 -909 -128 -408 298 520 184 -468 -561 78 -120 -426 -35 -532 -65 147 -29 -597 -242 429 276
5379 276 132 229 973 144 607 -281 187 327 -536 -88 197 -690 113 366 113 337 155 -478 -366 77
5399 77 -108 112 42 -153 22 428 539 -158 -733 336 -192 590 -605 -286 -530 231 -402 373 57 -229
5419 -229 -554 -98 155 -126 768 781 -463 210 323 -252 223 29 90 753 363 -236 107 83 -492 -621 242
5440 242 -772 284 66 -44 -335 -108 192 -547 279 226 318 156 -890 40 -720 -174 590 -316 -383 -229
5460 -229 152 -807 110 -611 44 -534 1115 -478 -789 403 -923 -592 159 -84 -301 -343 -1025 534 -604
5479 -604 601 355 -26 878 132 -553 363 291 -339 1156 255 -166 -625 -94 692 328 -694 -184 413
5498D13L39q45O61j110P3O91k11N07Jn76o62P81Q7j64q4n91J463q12P88n10k92
5519e3k39K68J41o0l13O74k80k18j00j59L55J39R4n23J68o6L58q3o04K22K37l52
5541c94N17K95m84n22O98l05K97J75m14J48K49l5l58L70m06l1m2O97Q7l97j63
5562a8q85P69J300j256Q07r82K35L75l37L4l05M31o41J033k56p49l57P66o87R00
5582A77l82J031j44r54J97j31Q4M82m83L85m87L12K33j20m35J69J97m53P1N0K72
5603G1M2m34J49L47k6J60j97M9n13O30l45n5J50J55j38l37M01k6j52J6j29ll5
5626b20M25j32j31K39k51P6n3K82k9l59j1M09l5o4k04Q7RN6q0j51L77j50QO5m94
5651c31k1O09m59M70n06K65m29N04k77m52M95J54J17l80K57M3k48m00O16N80l08
$$ plain form
5498 413 752 -93 568 -542 -469 222 11 518 519 -57 -719 62 149 -15 -99 -690 773 -39 749 239 -53
5519 -53 -292 -24 117 57 -256 418 138 -80 -180 -339 16 155 249 -274 -106 -172 186 103 -501 -279 -42 -394
5541 -394 123 418 -66 -588 110 -195 102 277 -137 11 260 225 -133 237 -169 -200 -242 455 542 145 -18
5562 -18 -903 -134 1166 -90 717 -265 -30 345 8 42 -263 168 -473 560 304 -445 -802 -36 -723 177
5582 177 -205 826 682 -272 -75 -206 -122 360 -123 262 -225 87 320 200 -235 -66 131 -322 -251 -201 71
5603 71 113 -321 -172 175 149 309 112 161 -352 278 -67 -122 28 183 45 -292 109 83 -69 -53 -182 -185 -220
5626 -220 205 73 -58 181 -70 6 -47 235 206 -153 -164 245 210 146 -58 29 38 94 14 -137 240 90 98 163 -331
5651 -331 -352 257 -202 268 -238 27 -402 102 -175 -627 -132 22 139 -241 16 59 -189 -589 27 607 299
5672B99p71M23J98n06MP9O0l34J88J24P0O9M45m8m10L50k66L6j91N28n28q22O38
5695c65R2l08J425p39n62Q73m8l90j46K40j03J44k09J33Kl03J23L10J67k49K05
5716B92j94l69L57k52K04m4n8J08j5j87N4J36q1l2o8qM9M18m12K61J93k24k66
5739a38P2j65L16J83m61M49m30J81J3J17j04j16J20J40k6j37K33p5k4m9k10o2
5761a73J34k26k0L66j66J13J69k29J79K4k44O3J9N34n37k83L41k0Kk56J29K84
5783B03j84L9j05J45m13M78K35l66m2j88J92K74J31k77q9K18l96J52q0r8K86R2
5805B07j36mk89K06Pj6KO12j12l31n05J89n0K58K61K02j231M39Q5J80R42j289
5827c73m4P79mj03k21l0k39o2K70M17p20PO09n61j17M45J05p13M31k9Q5M07J65
$$ plain form
5672 299 -472 -49 149 -357 -353 -274 -214 -548 -360 -236 -166 -97 348 300 -110 240 -26 10 -181 347 -181 -1003 -365
5695 -365 -273 -581 844 105 -457 416 368 -22 -168 72 -31 113 -96 37 39 -264 -141 169 336 87 292
5716 292 98 -271 86 -166 38 -6 -64 44 29 -158 -104 32 -49 -81 -149 -157 -108 310 -102 159 352 128 -138
5739 -138 -66 -231 85 268 -193 256 -174 7 20 137 33 -83 37 177 151 14 247 172 148 99 -111 -173
5761 -173 -39 -265 -285 81 -85 28 197 -32 147 171 -73 -10 9 543 6 -277 64 44 46 -210 -81 203
5783 203 19 58 -47 98 -315 163 398 32 -10 -198 -6 268 399 122 33 251 -145 7 -73 -171 115 207
5805 207 71 67 -222 -16 -9 -25 -23 589 477 146 -359 -170 -220 38 299 501 -730 -291 -206 -26 916 -373
5827 -373 -417 362 358 255 34 4 -235 -297 -27 390 -330 -323 286 -275 -392 53 158 -555 -124 -153 -68 339 504
5850E04l07KK26j180J034rk75k33L64o63P72l3m35j70Q13o40J30O76l41k49L77
5871C63o28q7K57j59J82J2K37k11Q6k40O53m52K02o2l08J79j00O7J90k12N4N7
5893H0j03J97k92N1K77M3k39N8j53J37j80J89J95k16Q8p2l9J54n4k76K83J39j33
5916A34j44l6L22l31L70n17M31l67O0Q6q6j16L51M9k84L60p0l55L19Q3M8p1k36
5939@O7n3L36n51K57L9M3k0K03m09L79k33j04pl9J28J28om22J10K1L42l64K53
5963I8l10K19n7l7l2J71M5n5q1j52J14O3O0o3O2r5q3O5j3K07j07r6J32k00p7R1
5989a31J14p5j32j11R30k09o67K30K42m91L31m2J8k38J43J2J97L3j48L5j66J10
6011a5K24j86N0o5LJ80q5j37n2j7J31J14J77k54j54J86k74K03p9j44J38pN1j5
$$ plain form
5850 504 197 199 425 -755 279 270 -5 -238 126 -537 235 202 -233 -403 410 -230 -100 576 235 -14 363
5871 363 -265 -352 -95 -254 -72 -60 177 -34 52 -188 465 13 215 153 -155 24 -76 -9 181 -31 23 80
5893 80 -23 174 -118 -67 210 253 14 72 -81 56 -124 65 260 44 132 60 21 175 121 -155 128 267 134
5916 134 -10 -46 276 -55 315 -202 229 -138 -78 8 -78 -194 157 206 -78 282 212 -143 176 259 307 236 0
5939 0 67 14 350 -201 56 95 138 118 321 -88 291 58 -46 -53 -92 36 164 158 -264 -154 -133 209 -155 98
5963 98 -212 7 -50 -87 -119 52 97 42 -39 -191 -77 -14 46 -17 45 -50 -133 -68 -81 126 19 -77 55 -145 -222 -131
5989 -131 -17 -92 -224 -335 595 386 -281 -51 191 -300 31 -11 7 -231 -88 -76 121 154 6 41 -125 -15
6011 -15 209 23 73 8 11 191 106 -31 -83 -100 31 145 322 68 -86 100 -174 29 -50 -194 -56 -63 -12 -27
6035b7j01J82j40ok3M9%K80j96J93k81K76l86K99J11k86P2r7m75K31k87J019k24
6058A83k65r2q10M77N41j17K93j03L62l03n04j1L99J70J40l50n9k82M04j96J78
6079E5K40p45M28mj91K3J21M1k49N29j63j90k73J81p2j63L93jK6K61k10J25K6
6102A88k23q2L5R2K9l2P4lq4j84J58j2j02J36K33o2k54j75K80M0k05j9J11j22
6126a83OJ62l9J30l69J3K57j15K85M4k93L69m18L70j28j21M5K9J87l90J18J12
6148G1k43m0K93k8L5l00K41o9r7K12K2k43R4j20P6R1J91m68M11l1j51j42L26j66
6172c5J67k89L31q0J89l40J24j90n1o4N30l12p8M19k38j76K3k75oP28J84n54m42
6195d35J123j014N43L04j41m23j49l7L44J82k44r0k22L82k73L28O9l93J61k86
$$ plain form
6035 -27 -128 54 -86 -92 -115 -66 -66 214 18 211 -70 206 -180 119 230 -56 16 -81 -556 -325 -612 407 183
6058 183 -82 -174 -984 -507 34 -83 210 107 469 166 -338 -349 50 220 360 10 -49 -331 73 -123 55
6079 55 295 -450 -22 -26 -217 -194 -73 -32 -281 248 85 -105 -378 -197 -269 -432 -39 -40 -14 247 37 162 188
6102 188 -35 -117 -82 10 39 7 81 78 -6 -190 -32 -44 -146 -10 223 161 -93 -268 12 52 -153 -172 -61 -183
6126 -183 -177 -15 -54 76 -293 -280 -23 -138 147 191 -102 267 -151 219 91 -30 15 44 231 -159 -41 71
6148 71 -172 -212 81 53 88 -212 29 -40 -137 75 97 -146 -52 -172 -96 -5 186 -282 129 98 -53 -195 131 -35
6172 -35 132 -157 174 94 283 -57 67 -123 -174 -238 292 -20 -98 321 83 -93 -70 -345 -351 377 561 7 -435
6195 -435 688 -326 217 521 380 -43 -192 -229 115 297 53 -37 -259 123 -150 178 247 -146 15 -271
6215b71K96J34q5k27O3L67j03n0j15kK73o59N70k99j48P9j41n2M74l51N25m82
6237b04L82j068N40L63K33m24r50P15N23o49O99m44O22n87K67r3j55R71l48J76
6257E69k59m13o7j29K81o93P72p86K93O27j43j04L07j66m2N02n28J51o38J091
6277F25J39r37P60k20O6L91o45m03J74K73n43rO11j60L88k75l36O61j336R51J68
6298C43q1J54l99m2M40m22M12o10KM02l11j38P17p22K16j16J19J32O9k92L95j48
6320A20j23K2j50p1J29j99M54n9m8j12j85M74j99k50K51r2p6L62P9l46n5J58J36
6343B20p7k08m5L61j46k66K61k00N2K54L6l27N3P1p1J79mk12r0M6N1M6j81J60
6367c7l0J07r2K26j95n6J22k30j8J62J48j86J27n2o0K59k30L50l25r0K25o0j26
$$ plain form
6215 -271 25 159 74 -153 -90 277 174 124 9 7 280 -379 191 -108 -256 -177 -318 -370 104 -247 278 -204
6237 -204 178 -890 -350 13 246 -178 -1128 -413 110 -539 160 -284 338 -249 18 -75 -230 741 393 569
6257 569 310 -103 -170 -299 -18 -711 61 -725 -432 195 52 -52 255 89 47 549 21 172 -466 625
6277 625 764 -173 587 367 433 824 179 -224 -50 223 -320 -329 282 122 510 235 -101 560 -776 175 343
6298 343 262 416 17 -25 415 -7 405 -205 -203 199 -112 -250 467 -255 -39 -155 -36 96 165 -127 268 120
6320 120 -3 19 -131 -202 -73 -272 182 123 75 -37 -222 252 53 -197 54 -38 -114 248 327 -19 -74 84 220
6343 220 143 -65 -110 251 105 -161 100 -100 -48 206 242 -85 -32 39 -32 147 143 -69 -159 -113 -62 -16 -197 -37
6367 -37 -67 40 -52 174 -21 -77 45 -185 -203 -41 107 -79 48 -4 -64 195 -35 315 -10 -100 125 65 -61
6390f1K92j45J78k88l0p9K76l0m0M3Ll26n3o3N16m91L47P1O0l91J03N9p4J67K9
6415G3j93L48q7j8j21k11j00J87K34p2P4l12m1K79J38j63k25J12O6J20k72P3k45
6438c56K38K56j24j37l2J52J8N1j31J57q8K30r9k69J77q1q5k9R9J79j98j5O7k5
6462d5k06K70l20J68K8k0J01J59q9K8j30J66J6K1k50k5K72k92M66n45J55O8o3
6485f7j55J80%J03m25N92L8n7M1k51l6p2L52k81M26l29k30J63K12k21K48l26r3
6508a88J34N6l3K28k10J92l26L38p2k01P6j73J17J02L9L7n4j34N03l03m3j84L79
6531B80k36K4k2J50k44J42J42k29Q9j19j02L45k77j2J47j37J01Rl01J78rj72M69
6554B16O5q7k26R7o1N4j2K04k44k0J08n51N29k8J33p4j82R2J1k85l8K94n1J44
$$ plain form
6390 -61 231 86 264 -24 -54 -133 143 113 73 116 119 -207 -260 -323 193 -298 49 120 180 -211 -108 -49 -123 44 73
6415 73 -120 228 141 123 2 -209 -309 -122 112 40 114 -198 -239 40 178 15 -210 -98 -32 88 -184 -111 -356
6438 -356 -118 138 14 -123 -155 -3 15 66 -65 92 4 234 135 -134 43 -38 -123 -152 -53 126 -72 -87 -20 -45
6462 -45 -251 19 -301 -133 -105 -125 -24 135 46 74 -56 110 126 147 -103 -128 144 -148 318 -227 -72 -4 -67
6485 -67 -222 -42 -42 61 -364 228 266 209 250 -1 -37 -109 243 -38 388 59 -171 -8 204 -17 231 -95 -188
6508 -188 -54 2 -31 197 -13 179 -147 191 119 -82 -6 -179 -62 40 79 116 62 -72 431 128 85 -99 280
6531 280 44 68 46 196 -48 94 236 7 96 -23 -125 220 -57 -69 78 -59 42 51 -250 -72 -81 -253 216
6554 216 281 194 -32 65 4 58 46 250 6 -14 94 -457 72 44 177 103 -79 13 24 -261 -299 -5 -56 88
6578H8J02l62N03k58m0n5j37J05J33L6k6m26M68l35J56K8J16r1k52M02N3j62j09
6601f3KL7L21k37k69J5R9J58j87K18K50J95o72M1K51M7j67j18J71j65p8J76j3
6624A2j72Q2J37m2j57J80j83N6K74q6l05M78n55L48j46K12p9j80n3Q0J38P9j83
6647f5M39j96n4r7Q4M4k78lJ90l66J40K36j18p3L4L03o71N07p2M23p17Q63k97
6670B56l03m67L73N19p71O75o03L24k73K27J40n5k3k42J64m2j4J50O9L3k98K02
6692D1J8j78L21n6k65K25k45N2J54j3R0j46J65p9l90L20p9p6m7j12L36j7j26r8
6716b05K06J20p0k98R7J01K0J94J06P9l75J67m0j35j29J74J43l76q2N19j82j58
6738a24n6J30l8K86l16M98m51M2J44m0n12N67p21N45k03m77R54n41O86P9j496
$$ plain form
6578 88 190 -172 331 73 33 -22 -159 -54 79 115 89 -337 131 -204 -48 -20 96 5 -247 155 208 46 -63
6601 -63 -61 -24 297 60 -209 -194 -95 63 -124 94 344 539 -133 -92 159 206 39 -79 92 -73 -151 25 12
6624 12 -160 -78 59 17 -140 40 -143 -87 187 101 -204 274 -281 67 -79 133 54 -126 -179 -99 39 118 -65
6647 -65 374 178 124 27 111 155 -123 -126 64 -302 -162 74 -44 -117 -83 220 -451 56 -16 407 -310 553 256
6670 256 -47 -514 -141 378 -393 282 -321 3 -270 -43 97 42 19 -223 -59 -101 -115 35 104 137 -161 41
6692 41 59 -119 202 146 -119 106 -139 -87 67 54 144 -2 163 84 -306 14 -65 -141 -188 -300 36 19 -107 -205
6716 -205 1 121 51 -247 -150 -49 -29 165 271 350 -25 142 102 -33 -162 12 155 -221 -303 216 34 -124
6738 -124 -180 -50 -88 198 -118 380 -71 -29 115 75 -437 130 -591 -46 -249 -726 228 -313 373 452 -1044
6759a044J325n98P69j49On01k96Q35m45m21K42J77K10nk73K6M72q53N93L7k09
6780a02J74J37n91N79pJ05p33P81n14N62j286O23J048j205O3q9Q2OQ68r08j55
6801e62M64M10q31J183j93j457K355j798K26J74p46N79m67N69M70K27r84N29O77
6820H25q06k23N67k17o21N79q2K22o47J146n86o34K75M16K74j092N52K31l33K03
6840D9j4J16J0J4J03k42O76m66n24J56N0j32N9L01p8j47q43L84k03J06J076m23
6862B8n33R35n10j95R03m29j446J310J48j51R81j990L1J290r07k19J083n10N58
6881C77J76j96l5K7pq82K43J49J86l23k16j93L58O12r08J183r95O09n5r91P41
6902a40P20n65J50L26j42k97K47n83M22O6o1m51j45P65j79j92p5K85m71M29J80
$$ plain form
6759 -1044 281 -317 452 303 309 -192 -488 347 -98 -519 -277 -100 110 105 -168 -142 330 -523 70 107 -102
6780 -102 72 209 -382 197 190 295 -438 343 -171 391 -895 -272 776 -429 -366 -455 -373 -367 501 -407 -562
6801 -562 -98 312 -519 664 471 -986 1369 -429 -203 -29 -775 -196 -663 -94 376 603 -381 148 825
6820 825 19 -204 363 146 -475 104 22 244 -403 743 157 -477 -202 214 488 -604 -52 179 -154 49
6840 49 35 151 161 175 278 36 712 246 -278 -122 -72 -204 -145 156 78 -69 -912 -528 -731 -625 451 28
6862 28 -505 430 -80 -275 628 199 -1247 63 211 60 1041 -949 -918 372 -535 -754 329 -181 377
6881 377 553 357 322 349 342 -540 -297 -148 38 -285 -501 -694 -336 276 -632 551 -444 165 110 -881 -140
6902 -140 580 15 165 491 349 52 299 -284 138 204 143 -308 -453 312 133 -59 -134 151 -320 109 289
6923B89m18j9K63l20J57K26j91K29M16m47l1O0o31O30q30J087n61N17j57k93M3
6944A9J95q69J014K91r35k66k76Q48o92P25K79k94j092P49K82N75L47j158n8j22
6964d38j92K35J063n29l73n6P41p05O8K81j80J65K13J83m74l05O14k67k41j50
6984c47K56J96j38j55L33l24j09j52M71M24p66N55l43k25l6J04N32L01q42j07
7004c72r8O55j49L76k81k8l6n93O75K58n92O4J33jk39K43q28J111o26L88l6L13
7026C37k31o87N94o7m5P4K01m98N5K07N5L56m23N03n06M1j69K59j28J9L86m05
7048g2O37k28m0j65P2k35J12j0J77n24k8N01J36j19j78l24O6j34N38n80r7o4K14
7071c45J079p35%j72R28p81j9N12m94n79O06r5k4N3k26N23r32Q21N29K81j441
$$ plain form
6923 289 -129 -148 115 -205 -48 178 -13 216 632 185 154 214 -417 213 -617 470 -91 426 269 -24 19
6944 19 214 -655 359 650 -285 -551 -827 21 -671 54 333 39 -1053 -304 -22 553 900 -258 -316 -438
6964 -438 -630 -395 668 139 -234 -290 451 -254 -186 95 -85 80 293 476 2 -303 311 44 -197 -347
6984 -347 -91 105 -33 -188 145 -179 -288 -440 31 455 -311 244 -99 -324 -360 -256 276 577 -265 -372
7004 -372 -470 185 36 412 131 103 67 -526 149 407 -185 -121 12 11 -228 15 -813 298 -328 60 24 337
7026 337 106 -581 13 -54 -99 -25 176 -322 -267 -60 -5 351 -72 431 -75 -34 -203 56 -72 -53 333 -72
7048 -72 565 337 297 132 204 -31 81 71 248 -276 -304 197 333 214 36 -288 -222 -356 182 -398 -495 -559 -345
7071 -345 734 -1 -1 -173 755 -26 -45 467 -27 -606 0 -95 -119 -66 -292 231 -701 120 649 930 -511
7092e11P9k99p1J77O46m9J2q1Mk19K02L18k40j67K89KK23k62j26N38k36l62m86
7115f19N02l20L00L04m7k94L10J98m06K91j61l56j05L07L09j23k65P43l79j28
7135F1j10J54M6j84k30j12L19J34j47J42m25O44k75k10L06L2j62l99M50r5M2Q7
7157F8L53k69j77j67R5j24L43k3k45K69l52K94k14k5K17m46N09j5q7j23K03l50
7179b66M67p9M7Q3k34k04J34j82K41M6L0J34j71q4L29o14M48j33J81k34l9j10
7201b10P67q41N19l91k14K10P13n52M74n75q3m76L06k71Q37j79n53N00o58K90
7221c87Q41o71nj37J30J13K41j33J07N22j235j84O07J09K01m1j44R3m7L4k13j09
7243c08K31J72k03K40k50Pj53K76m8j71J11q1J22R5p1O2j9k50L08q3k41M16n41
$$ plain form
7092 -511 -432 -731 -802 -625 21 -28 -16 -97 -93 -312 -110 208 -32 -199 90 92 315 53 -73 465 229 -133 -619
7115 -619 -117 -437 -137 167 120 -174 136 334 -72 219 58 -298 -403 -96 213 90 -175 568 189 61
7135 61 -49 105 151 -33 -263 -375 -56 78 -69 73 -352 292 17 -193 113 145 -17 -416 34 -61 -19 68
7157 68 421 152 -25 -192 -97 -221 122 99 -146 123 -229 65 -149 -174 43 -403 106 91 4 -119 84 -266
7179 -266 201 122 169 252 18 -186 -52 -234 7 53 83 217 46 -38 291 -323 125 -8 173 -61 -100 -210
7201 -210 557 -284 235 -156 -370 -160 553 1 475 -100 -183 -659 -353 -624 213 34 -519 -19 -677 -387
7221 -387 454 -217 -222 -359 -229 -116 125 -8 99 621 -614 -798 -191 -82 119 78 -66 27 -20 14 -199 -308
7243 -308 -77 95 -108 132 -118 -111 -264 12 -36 -207 -96 -177 -55 40 -31 31 12 -238 70 -13 -254 162 -379
7266c79M64j17j52L05j68l7R4L9r8L60l93K15l32L33j90n3R5k39K61LJ4j10J1
7289g4N46m75J08N1n30M91l9J4k1j40J70j59p3L22k81J97k75L19k39n4L28qj8
7312A60k06J48l04J07R1J57n13K91J22n4j31N0J09j33K87n5o6M2ok24K80q7L98
7335D63o46Q9O6K58r4n7l90J24Q2K71l02l5M60n48L90l30N8J41M8pK0L39l89j68
7359a57L00j26j81j00L95m04L67j33R7N3K0j01L5L6M8r7L10n53K12K2r4l5P0q3
7383i9P35q43N36n99P84j302K42M82o55O42M14l59M62L74j59m66p79M90R58q57
7403Aq84L89K7O43k1J46l52n9o61Q78r66M56P53m49J72J97k92r2O30j266N08k61
7425e03m42J051K19k06K38m43P7j36L10M99j302K80N91p84N78OJ67o20L81L43
$$ plain form
7266 -379 85 -32 -184 121 -47 -84 10 49 -49 311 -82 133 -199 134 -56 -109 -14 -253 8 11 25 -85 -74
7289 -74 472 -3 105 156 -374 117 78 92 71 -69 101 -58 -131 191 -90 107 -168 151 -88 -142 186 178 160
7312 160 -46 102 -202 -95 -4 153 -360 -69 53 -1 -132 -82 27 -106 181 126 60 102 96 -128 152 65 463
7335 463 -183 -94 -28 230 136 79 -311 -187 -105 166 -136 -171 289 -259 131 -199 -141 0 48 41 61 400 11 -157
7359 -157 143 17 -164 -264 131 -273 94 -39 58 111 131 30 65 101 149 52 362 -191 21 43 -51 -86 -16 -99
7383 -99 636 -207 329 -270 514 -788 -546 -64 -719 -77 337 -22 440 814 655 189 -590 -100 858 1
7403 1 -883 -494 -467 176 155 301 -51 -110 -771 107 -859 -403 350 -99 73 270 -22 -114 516 -750 -242 -503
7425 -503 -945 106 325 119 357 -86 -9 -145 165 664 -638 -358 233 -551 27 33 200 -420 -39 304
7445C04o38M97K30n67R76r95J39K9l72K86k30N63n29N92p1J75J27o75k67J122
7465F96o52K14J051p17m17r2o04L69P82j192n7j50P26j94J96l5k88N32k33k5K19
7486A29L69p34L46J29j02l11M98k52K51j11m95M39m81K11j41k51J52J61j16N29
7506B20p5l53K91n54Q41m31r98J553q93N08M69K78j029p9K84j16L78n18L13j3
7526G6j62L6k02L0M22O7l71Ro6M34m05R9J76o1R0n3j13l45M47j7k31O3J47Q9j28
7551C1Nk6O2o6k29L83j16o5K43m31p1M76J92k40j4k33q24Q19J10k52N05o03K62
7574h2j13q60M52O22L89j39o77J022j41o15J23N0K29o96L06r7K20k4K1K32k86
7595f4N1J08Jq5j62j7R0J02j33K80k4j97o0Q7%J68R5k72K32M9ok51P8J5o2j18
$$ plain form
7445 304 -334 163 393 -174 802 -193 -54 -25 -397 -111 -341 222 -307 285 214 389 516 -159 -426 696
7465 696 44 258 1309 592 175 83 -521 -152 630 -562 -619 -769 -43 -237 -41 -76 -364 168 -65 -90 129
7486 129 498 -236 110 239 137 -174 324 72 323 212 -283 156 -325 -114 -255 -506 -354 -193 -309 220
7506 220 145 -208 83 -471 370 -61 -1059 494 -399 109 578 856 -173 -252 32 -84 294 -224 89 76
7526 76 -86 -50 -252 -222 200 267 -104 -95 -161 273 -132 -33 143 82 172 119 6 -339 108 91 -140 -77 70 159 31
7551 31 36 10 72 6 -223 160 44 -21 222 -209 -280 196 388 148 134 -99 -923 -104 6 -246 259 -344 -82
7574 -82 -195 -1055 -603 19 408 269 -408 614 473 -142 -19 31 260 -436 -130 -227 -7 -31 -10 222 -64
7595 -64 -13 95 96 11 -151 -168 -78 24 -109 171 147 -50 -110 -23 -23 145 240 -32 200 249 243 -8 70 85 23 -95
7621i5J05J87J04l1l64j77L12N82j349K08O46l74J49l40O55m59L14J8K0N3l52
7642a88P6J49p9O6J82k21l04K65K39L4l46K13L8j70L38k42m00M07k11L10m58N67
7664B65l22K02j03k92N2K43j66J78m17L08J94k80K07J5Nk10L03l87J59p5L13k17
7686b5l3k6J16k37K07k1j49M66k41Q5o7J6j38pP9K1j19J29J38j35j45K94k22n37
7710e51L77k75J36P7Q9J22J72q8j9J53j15l40J57L4J10k2j17L3N3J9lj30J33N5
7734F0k0n1K69j46j29K44o7q9l7j59J30J14J60l92J18k70M79j99j93K95M3j83
7756b3J55j05n6L0oR0Nl01M17k06j96K93K27n58K43j18K0J62Q1n3jj29N51q45
7780c23L44r4K97l01J11k02Q8M8K56m51P69m81K17p0K31p80N72m57mK74n25k22
$$ plain form
7621 -95 10 197 301 270 -94 -271 41 623 -726 -518 128 -246 -97 -437 218 -241 73 91 111 164 -188
7642 -188 -112 37 -42 24 206 -15 -319 -54 185 219 -127 86 124 -46 292 50 -350 57 -154 156 -302 265
7664 265 -57 145 42 -250 -198 45 -121 57 -360 -52 142 -138 69 84 89 -121 182 -205 -46 -121 192 -25
7686 -25 -58 -84 32 -205 2 -19 -168 298 57 142 75 91 -47 -54 25 46 -73 56 194 59 -86 208 -14 -551
7710 -551 -174 -449 -313 -236 -147 -25 147 59 40 193 78 -262 -105 -71 39 17 -100 -67 -14 5 2 -128 5 60
7734 60 40 -11 258 112 -17 227 160 71 34 -125 5 119 279 -113 5 -265 214 15 -178 117 160 -23
7756 -23 132 27 -29 1 -5 85 90 -211 206 0 -196 97 324 -234 9 -109 -89 73 154 101 100 -29 522 -323
7780 -323 21 -73 224 -77 34 -168 -80 -32 224 -227 542 61 278 208 439 -341 231 -226 -230 44 -481 -703
7802g03O10l68J65M46n3K42r73M60l56r7K74Q31m71l23j35P30j66k64j76K06K77
7823A56l3J78l38J48o42m7P46j36n3J14J34n53Q76q14j28N11l32P63k1n52K58
7844B35N86k17j45k33K15o48kk60P11K09j478J007k02M31o79M24k19O96j94k35
7864Bk75J11J99j61o60K30O32J87k69pj270K070j020l55K08J46L41n26Q58q18
7884c77r8n2N90P63j598P65k52O77p39M71m8q72Q58p73L46k17J636n74n51Q1o42
7905f06o52O15N04k87R47J37r51P05k89n36o3j63J243p08n71O56p71K0J096L61
7925F87m29M04n81N85p96L45J31r92M27j48j3R30p84N05k31m27M32o52O98K93
7945C84l11l13J67K01k37j48J02J01k57M69k55J20j25M5K49K3k47m95J09R54p57
$$ plain form
7802 -703 -93 -461 -296 150 97 339 -634 -174 -530 -627 -353 478 7 -316 -451 279 113 -151 -327 -121 156
7823 156 123 301 -37 111 -531 -578 168 32 -21 93 227 -326 550 -264 -392 119 -213 550 529 -23 235
7844 235 821 604 459 226 441 -207 -209 -469 242 451 -1027 -20 -222 209 -470 -46 -265 431 237 2
7864 2 -273 -162 37 -124 -784 -554 78 265 -4 -11 -1281 789 -231 -586 -378 -232 109 -417 441 -377
7884 -377 -475 -527 63 826 -772 -7 -259 418 -321 150 102 -770 88 -685 -339 -556 1080 506 -45 36 -606
7905 -606 -1258 -643 -139 -426 521 658 -293 412 123 -413 -476 -639 604 -104 -675 -19 -790 -770 326 687
7925 687 258 662 81 666 -130 215 346 -646 -219 -367 -380 550 -234 271 40 -387 45 -607 91 384
7945 384 73 -240 -73 128 -109 -257 -155 -54 -311 158 -97 23 -102 -57 192 215 -32 -527 -418 536 -221
7966b21j29L21M10k83k18o3L65N4K2n29R54m85k77P43k2j497M33R37j244L04O20
7987A95Q2j41m03O03k89q0N2N2j76j3J32J62l23J97L37m27qJ13R0m2N7k57J24
8010C7j85J44k19L78k83K21L2P7n00L76k42J74j09j12K57j17J73k45J81J26j41
8031B3j42K43k68K59l61L61l13K72k7k24L02J17l00J54k54K28l7P7Nj17J46L27
8053D71l56k1j36J61n6J41j66j18M6NL09l15N6k51J55J48j20M5L42n87N33j36
8075A50j51L3kj35K81j26j28O9j64J32k81K78j23J86k95L21OO6m7j42J12j49j58
8098b67L07l78M19J9k52N16k84L01l52O73j95n62M87M7m95j1P38k87m70J67J49
8119B70j02k9j08K54K05j264O45o1j23K87q2J12j71K66N45r71K67O89q14N41l39
$$ plain form
7966 -221 -350 -29 381 98 -120 -183 182 236 258 -271 683 198 -79 664 642 -855 -422 515 -729 -425 195
7987 195 277 136 -267 336 47 -33 19 71 -105 -118 14 176 -147 50 387 -40 -48 65 155 113 170 -87 37
8010 37 -148 -4 -223 155 -128 93 125 202 -298 78 -164 10 -99 -211 46 -71 102 -143 38 164 23
8031 23 -119 124 -144 115 -246 115 -198 74 47 -177 125 242 -58 96 -158 70 33 110 115 -2 144 471
8053 471 115 94 -42 119 63 204 38 -80 -34 -29 280 -35 21 -230 -75 73 -47 -2 340 -247 286 150
8075 150 -1 32 30 -105 176 50 -78 -9 -173 -41 -322 -44 -167 19 -276 45 51 117 70 -72 40 -109 -267
8098 -267 40 -338 81 100 -152 364 80 381 29 702 507 -55 432 479 -16 -27 711 424 -46 121 270
8119 270 168 139 31 285 490 -774 -129 -190 -313 -26 -108 4 -167 99 644 -327 -60 629 -185 356 17
8140A7MK34n00R4K7k00N39l95J23J42k8kr3M6J9J96l33o1k5L73j39j17P9j28K52
8165A24l3r1o4J1k54J83K44j17q6rMK48j94o0J13P7J4n0J10j36K5j07J63J93l70
8190f2N5
$$ plain form
8140 17 21 255 -245 -151 -124 -324 215 -180 -57 85 57 55 -38 8 27 223 -110 -171 -196 177 38 -79 0 -128 124
8165 124 91 0 -64 -53 -307 -124 120 3 -83 -92 -88 160 -34 -94 19 96 110 60 170 34 59 -48 115 308 -62
8190 -62 -7
8191g
$$ Imaginary data points
##PAGE= N=2
##DATA TABLE= (X++(I..I)), XYDATA
0@%%%qJ6rRl2M8m8O4q8J04j26J56j88K25k66L10l69M36n06N86o77P79q90J017
27E43j156J306j478J666j867K093k346K616k911L242l603L994m427M906n429O007
43C156o653P376q183R091j0127J1318j2703J4338j6300J8711k1751K5716l1143
56a7154L9053n1677P5001j31964N18985N94523j494452n86550R48534R13522m66723
67C41098p26412J4478M08761O5055l3202N9330p8740k76327M2679L79562J56152
78C52434l28322l15304R6138L33906J33410k00648l29898m2287L65211L05799
88C70439k59445m69480Q0071N51883J28109m86291k72039L61701L13121k41324
98G6745k93900J50865K15530j39722j66037J57447J41392j86305j41387K26548
$$ plain form
0 0 0 0 0 -8 8 -1 8 -24 24 -24 40 -48 56 -70 86 -102 123 -143 167 -202 234 -272 314 -363 416 -474 543
27 543 -613 693 -785 881 -986 1107 -1239 1377 -1534 1708 -1895 2099 -2328 2578 -2851 3156
43 3156 -3497 3879 -4304 4787 -5340 5978 -6725 7613 -8687 10024 -11727 13989 -17154
56 -17154 21899 -29778 45223 -86741 432244 1026767 -467685 -1054235 -105701 807821 341098
67 341098 -385314 -370836 37925 102980 69778 129108 50368 -225959 -183280 196282 352434
78 352434 24112 -291192 -195054 138852 272262 71614 -258284 -300571 64640 370439
88 370439 110994 -358486 -278415 273468 401577 -84714 -356753 4948 318069 76745
98 76745 -217155 -66290 149240 9518 -156519 928 142320 -43985 -185372 41176
108D1176J93800k16645k47481J75992K93396r5482l11677j8081K54644R8286j68282
119c54j49240M4942J35639O5252o7497j23454m629J57935R4814j40318j58705
130a45615R8514J91470n1759k05597j0028J66094K8077j22133r379R3760l7970
141d566j03025R7580J85755q5340k72014Q009L20150J22752k85469k55933J46449
152a25652K91385R861k35758j28008J09982J58529K1663r4224p4106K1522P0946
163B6140K9852k2893k1116j2850l8054j7030P4546P6134p9649j54480K8278K05457
175I4335O1531j92885j31361J54366J84765q5939j92796K5100J72379J0392j53039
186e3152m6869J13429N8198q0121o1391M6203N3386j1081j5655J3574o171k6439
$$ plain form
108 41176 234976 18331 -229150 -53158 240238 144756 -166921 -185002 69642 167928 -354
119 -354 -149594 -104652 30987 96239 28742 -94712 -99341 58594 153408 13090 -145615
130 -145615 -47101 144369 92610 -112987 -123015 43079 71156 -50977 -60356 33404 -4566
141 -4566 -107591 -10011 175744 90404 -181610 -173601 146549 269301 -16168 -272101 -125652
152 -125652 165733 175594 -60164 -188172 -78190 80339 102002 7778 -66328 -44806 26140
163 26140 55992 33099 11983 -867 -38921 -55951 18595 94729 15080 -139400 -111122 94335
175 94335 155866 -37019 -168380 -14014 170751 84812 -107984 -82884 89495 99887 -53152
186 -53152 -100021 13408 71606 -8515 -69906 -23703 29683 18602 2947 16521 10350 -16089
198a6089J6694N3036K876o7841n1222L1729P3588K3810o5403q6256P375J10567
210C2864P6841o7468j17256K089J13712N8120n8065p1389p910K7267K3534K3780
222C6119o298o3677n3864N7882J06030o543j16121m3516R4682Q8037m4440q9783
234d1492k489O5140K4702m2048m0435O602L2045J3280j9323k7764K523L8326K7141
247C6208k1763l7747K402L8613K3799j7977l9949k3690J6076M6027K1218m8078
259d861o9801R503R4916N3428o8852r4247J9365J06111M4278o7451q0019M627
271e3003O3476L8419k4701n6398k7984K8537N3940J4815m1685m1498J6530N3387
283B3835K0989l2317l7859M380L6155J6715k9240l8289N466M2234J3995m1007
$$ plain form
198 -16089 605 53641 56517 -11324 -62546 -30817 42771 66581 1178 -85078 -77703 32864
210 32864 109705 42237 -75019 -72930 40782 98902 40837 -30552 -38462 -11195 12339 36119
222 36119 29821 -33856 -87720 -29838 76192 69649 -46472 -89988 4694 92731 48291 -41492
234 -41492 -43981 21159 45861 3813 -36622 -30020 2025 15305 -4018 -31782 -29259 9067 36208
247 36208 14445 -23302 -20900 17713 41512 23535 -16414 -40104 -24028 21999 43217 -4861
259 -4861 -74662 -65159 29757 83185 14333 -79914 -60549 45562 89840 22389 -57630 -53003
271 -53003 10473 48892 24191 -32207 -60191 -31654 22286 37101 -4584 -46082 -29552 23835
283 23835 44824 12507 -25352 -20972 15183 31898 2658 -35631 -30165 12069 26064 -14943
295a4943l4952L0507N7526L046n5200l0835L8122N4940J218n0189m1031J1170
307c0621M7091L0397k6820n9973k2605N0571O5803j829o7459m4550L8884P3641
319E2530J8036n8602n9187R803N9958L1046l4941n4938q786M0445L3775r889l0065
332a0815r332J6566J8899M845o424r061m580J238K774j80l227j665m47p011p815
347a6235O759K2125J0767j8785k6711O040L8667K3841k5322m7458r238M1415L7049
360D2914j8962n2190k0014L3618M2454J862l4292k4467J1114L1111J9324r654
372B2818k8353j8570J2538K8611O941k7120k8123M580K7634J2305j4988j5768
384a7495N853J5969K441p507J135J0797p70j7751j1123J3825J9164n266k7753
$$ plain form
295 -14943 -49895 -19388 38138 41184 -14016 -44851 -6729 48211 49429 -760 -41791 -30621
307 -30621 16470 46867 20047 -39926 -62531 -11960 53843 52014 -15445 -59995 -21111 52530
319 52530 70566 11964 -47223 -37420 22538 53584 18643 -36295 -45081 -4636 29139 19250 -10815
332 -10815 -20147 -3581 15318 20163 13739 4678 98 1336 4110 3930 703 -962 -1409 -8420 -16235
347 -16235 -9476 12649 23416 4631 -22080 -16040 22627 46468 21146 -26312 -35550 5865 42914
360 42914 23952 -28238 -48252 -14634 27820 29682 -4610 -29077 -17963 13148 32472 22818
372 22818 -5535 -24105 -11567 17044 23985 -3135 -31258 -26678 956 13261 -1727 -17495
384 -17495 -11642 4327 6768 -739 396 11193 10423 -7328 -18451 -4626 14538 9272 -18481
397a8481j3912J7091K5521M937j5847j6685r10J8460K3699L795k5453k9068L966
410b2887L5221K1011k3390m2265r294L3383L4392l560l3925k2455J6877L7478
422B0586J4741k2808l0488j573K3560J6269p244j9127j1875J220J2114J3354O98
435I427j4462j2310R872K0288N483j2132q059L671K462m350Q44P737j747j6988
449a0264j1533J3813K3037N741k2605j9477R553K8889J6607j7035k8751n672K1523
462C826K0218n054k2279j6121K098J7583J9741q21k6229k1315J7013L8729R894
475C7283l2605l0503J2319L3807N655k4437j8078N417J0955J957j504R07k813
488a640p021J551J3324R972p831j3260j196P646M552k506l150l123p032m907R340
$$ plain form
397 -18481 -32393 -15302 10219 15156 -691 -17376 -18286 174 23873 27668 2215 -26853 -22887
410 -22887 12334 33345 9955 -32310 -41604 -8221 26171 22611 -11314 -33769 -16892 20586
422 20586 35327 12519 -17969 -19542 4018 20287 13043 -6084 -17959 -16739 -4625 8729 9427
435 9427 -5035 -17345 -7473 12815 18298 6166 -1893 1778 4240 -110 734 8471 6724 -10264
449 -10264 -21797 -7984 15053 20794 -1811 -21288 -11735 17154 33761 16726 -12025 -17697 3826
462 3826 24044 18990 -3289 -19410 -17312 271 20012 19191 -7038 -28353 -11340 27389 37283
475 37283 4678 -25825 -13506 20301 25956 1519 -16559 -11142 -187 1770 266 1173 -1640
488 -1640 -8661 -7110 6214 16186 8355 -4905 -6101 1545 6097 3591 441 -2682 -9714 -14621 -5281
503e281J5950R1j8426j4148J4321K6710N394k2730k1182N132K4161J1645j5209
516F428k4737n025J7388J6181j485j4644r121L096J2234J1795M47j4037j1632
529a3112N867J7046J744j6048j0979P481Q631m564o214O209P055n246q135O499
543c766J1543K160o116p534m327M679J1334O522j4577k3200O89K8134J9532j7053
557H020k9698l166K7076K5239l222k6134k2362R111L3818J6448k6392l9318j22
570c0702L7617K3107j8037k8829n025J6154J8208Q342p530k0811j2094J7188K8084
583B5672k025l0200j7018J4305K0441J458j3391q297O59P110R187K484n618o220
597a453K652L033k480l28Q887l83j8411j0697J7015K1153o798k5141n154J8696
$$ plain form
503 -5281 10669 10760 -7666 -21814 -7493 19217 24611 1881 -19301 -14169 9992 21637 6428
516 6428 -18309 -23334 -5946 10235 8750 -5894 -15015 -11919 315 12110 12557 -1480 -13112
529 -13112 -7245 9801 11545 -4503 -15482 -8001 630 -3934 -10148 -3939 3116 -2130 -10265 -3766
543 -3766 7777 9937 3821 -3713 -8040 -3361 7973 14495 -82 -23282 -22593 5541 25073 8020
557 8020 -21678 -24844 2232 27471 24249 -1885 -24247 -15136 18682 35130 8738 -30580 -30702
570 -30702 6915 30022 11985 -16844 -21869 -5715 12493 20835 13305 -7506 -19600 -2412 25672
583 25672 23647 -6553 -23571 -9266 11175 12633 -758 -9055 -8396 -1286 7901 10385 4767 -1453
597 -1453 1199 4232 1752 1424 10311 9928 -8483 -19180 -2165 18988 12190 -12951 -18105 591
611E91J4813l098q841o679m076O667J4754L447j8680j8627P280K1303N851j3462
625A243j3624p79R153J4505O179j2593k0500J197K6128J2876k0059k4163M533
638a5904K0237N857j2246q244K024L334K032O161K016m808n139J15M895L085J871
653E286k923j1013m815R745J3992o095j7193j463J7277O111j1136l165J1022J398
667G028j4182k014J5199Q847j4594j6211L751J4984M589n457o923l547J437Q986
681A893Q298k553r610l846K339L911O202M379r656j8861k392K5606K0622j7385
695H947l3635j095L2926K2417j4494k6311p159J5198J9687N552j6652k2994j190
708a8803K1671J8022q553k2838p364J1831J6311Q015o290j8815j3825J5706L1811
$$ plain form
611 591 15404 12306 3465 -3214 -7290 -623 14131 17578 -1102 -19729 -12449 8854 14705 1243
625 1243 -12381 -13160 -4007 10498 16677 4084 -16416 -15219 10909 23785 3726 -20437 -15904
638 -15904 4333 10190 -2056 -10300 -8276 -4942 -2910 3251 5267 459 -4680 -4565 330 3415 5286
653 5286 2363 -8650 -13465 -3720 10272 4177 -13016 -14479 2798 8909 -2227 -5392 5630 7028
667 7028 -7154 -9168 6031 14878 284 -15927 -12176 2808 7397 1940 -4983 -8530 -7093 1893
681 1893 10191 7638 -1972 -5818 -3479 432 6634 11013 1357 -17504 -19896 5710 26332 8947
695 8947 -24688 -25783 7143 29560 15066 -11245 -18404 -3206 16481 22033 5381 -17613 -18803
708 -18803 2868 20890 12337 -10501 -17865 -6034 10277 18292 12002 -6813 -20638 -4932 26879
721B6879K997l4514k6874J8078L5782M504k8102k2007Q037K0943J2284o486j5322
734c801q338P876J4728M833r720j0150j932J518N468Q023J07j4193j0965J0193
748f353J9060m70j7118m971J1597O820p938m396P883L122r468r509O463J1035
762E757J437q640r733N3J1713J2206l356j6543p751J3427J4891m335j4098m289
776i261N867L398MJ342j358p825l935J0423J2036n370j3728k018J0561R036l529
791E643r620n500L162Q537M311p193j0644J808J2126L887q742m200O868L892n722
806a387m054Q613N080r786q218M760J0809J334p548q308J222O402Q397R74p297
821I93q410J436J0976N773l079q945o288l38Q426J1644q95j7833j2104J2627K1436
$$ plain form
721 26879 29876 -4638 -31512 -13434 22348 26852 -1250 -23257 -15220 5723 18007 11521 -3801
734 -3801 -12139 -4263 10465 15298 5578 -4572 -6504 -4986 482 8505 8612 -5581 -16546 -6353
748 -6353 12707 12237 -4881 -9852 1745 8565 627 -3769 4114 7236 -2232 -11741 -5278 5757
762 5757 7194 -1446 -11179 -11126 587 12793 9437 -7106 -14857 -1430 13461 9126 -4972 -9261
776 -9261 -3394 4 8 1350 -8 -7833 -11768 -1345 10691 5321 -8407 -10425 136 9172 5643
791 5643 -3977 -9477 -6315 2222 6533 -660 -11304 -9496 2630 6517 -2225 -6425 443 4335 -1387
806 -1387 -5441 3172 8252 -1534 -9752 -4992 5817 7151 -397 -8705 -7483 -1081 7316 8290 993
821 993 -7417 -5981 4995 10768 7689 -1256 -7544 -7882 544 12188 11293 -6540 -18644 -6017 15419
836A5419J815j9098j1585P869J3519L722n635p044m674n00P925P711l440j0318
850d314m975N386Q537M802k860r532n103O611J2100L262j2634j0965L213J2055
864E583M030p408o690k564L707Q671M597o435j0066p41J1350P645n954j0410k361
879g046N676N356O34l939n847l252L685R104L569q963q082N497O842J583m011
894H06j663o03k88j392L707J488k486n594r03L828N963K704n569q230rJ1042P363
911A0164n543j1549j950P174N847m9m870m978k634L770Q553L406p120r804K731
926f852J0723N113o096p819q20M689M377j53m047l465j031K570L427K027k161
941D82k583j906J826M732L229k590o859k220O360N056k407m916k911J062L109
$$ plain form
836 15419 17234 -1864 -13449 -5580 7939 11661 6026 -1018 -5692 -6192 1733 9444 6004 -4314
850 -4314 -9289 -3903 4634 9436 6576 -2956 -8059 -1448 10652 13914 1280 -9685 -6472 5583
864 5583 9613 2205 -4485 -7049 -3342 5329 9926 3491 -6575 -7316 4034 11679 5725 -4685 -7046
879 -7046 -1370 3986 4620 681 -5166 -8418 -4733 4371 7940 -1023 -9105 -3608 3234 4817 806
894 806 -857 -1460 -1748 -3140 567 2055 -431 -6025 -6928 -3100 2863 5567 -2 -8232 -8241 2801 10164
911 10164 4621 -6928 -8878 -1704 4143 4094 -776 -5754 -8388 -4618 3935 7341 221 -9583 -6852
926 -6852 3871 8984 2888 -4931 -5751 -1062 3315 3162 -885 -4350 -5381 -2811 616 2643 482
941 482 -2101 -4007 -2181 2551 5780 3190 -3669 -5889 471 5527 3120 -1796 -4707 -3645 -536
956e36M403J748n018p146J006J0627N784o279r726j132P156O109r03o229n649
971e785N6O588O373p99p173n165L035Q057M740m082q769m058N179R238J917q242
987A110q765J039R340M940j995p086l845J299O790O586k319r951n229N545J0562
1002H021Q21r595o919K036P687L359j946n608l275K426N070L704j998n372l419
1017e008K471M646K191k619n498k070L052M728J749l512m327M53L212L073Q2j004
1033A619m902k482L373N899J061p265m997L818N017K250k821n004l31J356N514
1048B105J634j776n688j700K778N538J332n347m715j51N062L981J83n053l996
1063e813J935N799L299j646n693k779J969N056L468k641p635l560N432Q912K81
$$ plain form
956 -536 3867 5615 597 -6549 -5543 5084 10868 4589 -5137 -6269 887 6996 6093 -136 -5785
971 -5785 -5729 859 7232 6433 -740 -5905 -2870 5187 9927 5845 -2924 -6982 -1803 7435 9352 1110
987 1110 -7655 -6616 2724 7664 5669 -1417 -5262 -3963 2827 9413 7094 -2857 -8086 -2541 8021
1002 8021 8842 -753 -7672 -5636 2051 5410 3464 -2144 -5419 -2993 2077 5781 3783 -1589 -5008
1017 -5008 -2537 2109 4300 1681 -3817 -5887 -2835 1893 3642 130 -4197 -3744 -532 2541 2623 1619
1033 1619 -3283 -5765 -2392 3507 4568 -2697 -7694 -3876 1141 3391 570 -4434 -4765 -3409 2105
1048 2105 3739 1963 -3725 -5425 -2647 2891 4223 -1124 -5839 -5990 -928 3053 3236 -1817 -5813
1063 -5813 -3878 1921 5220 3574 -2119 -4898 -2929 2127 5595 2954 -4681 -8241 -2809 6103 6384
1078F384o974n522J788O532M441j629o430l609J886O458K832k241p154l057M075
1093b220P687Q15n631m517p71O276M640n29o031l827Q13O076K586k106m963k199
1109c901K363L689L121k098n334k445M346N554N90m502l846J10L393L439J4m015
1125D78m694n6N235M591j739o161l101L936N535J468l642m589j117L425M369O88
1141D626m696m717L31N146L395j610m609k689K089M343K648j812n056k248L576
1156a283M238N59l361m200J5K826L030P08l717k698j54L609M192r69m375j720
1172c300J190K671K366j063l792k338J513L336K843l283l826N99K342L595n50
1187B303k721k058m40J031N191m42l761m097K163K527K696L00l448k577o61N437
$$ plain form
1078 6384 -590 -6112 -4324 2208 6649 5020 -1410 -5019 -3133 3325 6157 3916 -3238 -6295 -2220
1093 -2220 5467 6282 651 -3866 -4637 1639 6279 5750 -281 -4108 -3295 2781 5367 3261 -1702 -3901
1109 -3901 -1538 2151 5272 3174 -2160 -4605 -259 5295 5885 1383 -2463 -2353 1040 4479 4493 478
1125 478 -4216 -4272 963 5554 3815 -2346 -5447 -1511 4024 5492 1850 -2739 -3856 -431 3938 4626
1141 4626 -70 -4787 -4456 690 4085 2475 -2134 -4823 -2734 1609 4257 2445 -2611 -4859 -1283
1156 -1283 2955 3514 153 -4047 -4032 -1206 1824 2532 -1185 -3883 -4037 -428 3764 2795 -1580 -3300
1172 -3300 -2110 561 2927 1864 -1928 -4266 -2753 583 3426 143 -3683 -3084 -742 2853 2303
1187 2303 -418 -2476 -2916 -1885 3306 2864 -897 -4994 -2831 -304 2392 2692 -756 -3333 -3994 1443
1203A443L743l337m915p87K324N321L56l601m807O72L256L763q2l314m115Q14
1219c266N674L774j196o200l647N109N355L0m571n532o8N711M461j619m907l079
1235c971K401M023L709l259k743k426R73N201J222l028n775j244N385M745j684
1250C529m351l800K650L033M273k483m707j213L151J902O43k139j587r67l69M158
1266A723J820j351n807m24M164N490k624m715k804L201L890K122k751m030n66
1281b662L62L794J027j325l415j697J018M788J432j880m933j745M791M302j548
1296B309m987o06J744J971p42o1l92j583p7K358P77q6j806j548J7K629Q77p8l499
1315b783J816j945M468O4l289j033M73K254N29L95R75k498k471J529L335J522
$$ plain form
1203 1443 5186 1849 -3066 -3853 -1529 3792 4148 547 -4260 -3588 -332 3431 3349 35 -4080 -3266
1219 -3266 2408 6182 4986 -1214 -4861 248 5603 5633 1062 -4470 -4538 1173 5634 4015 -892 -3971
1235 -3971 -1570 2453 6162 2903 160 -2266 -1293 3908 5130 2102 -3673 -4917 468 5213 3529
1250 3529 -822 -4622 -1972 1061 5334 2851 -1856 -3069 82 1984 2627 488 -1099 -2066 -2435 1723
1266 1723 3543 2192 -3615 -4039 125 5615 2991 -1724 -4528 -1327 2563 4685 1934 -2096 -2662
1281 -2662 -2300 1494 2521 1196 -2219 -3916 -2898 1890 3322 1442 -3491 -5236 -445 3857 2309
1296 2309 -2678 -3284 -1540 431 -311 -372 -764 -2347 -2424 -66 711 625 -1181 -2729 -2712 -83 794 716 -2783
1315 -2783 -967 -2912 1556 1620 -1669 -2702 -2229 25 554 949 1924 -574 -3045 -1516 1819 3341
1331C341m471k065O22M487K013j194n143l237L916O360J503o799n019J366N915
1346A595L586l890m650J87J221M048J377k46n306m041K788Q140K894n601o561
1361d459q32O117N569o80p768l216K898O405R84n269l725K602K337Q40r2J151
1377B862j956m102N41O170J883n222n238K558M317J941k132l333J86J036K011
1392A522n76m19j336k95J277L3K76O62j375j531o33K782L403l868m349R41N681
1409B195R44k560k679O85J394K17M09R46k922l206K734L901L49l777k060J238
1425b192J927M55J881j501l724j819M601M457j079o836p7K872K558J9j426j682
1441a566k739J148M381K914l521k913p71K734J618Q57j190k877k428K712O027
$$ plain form
1331 3341 -1130 -3195 -2573 1914 3927 2733 -2410 -5647 -1731 4629 6132 -667 -5686 -4320 1595
1346 1595 5181 1291 -3359 -3172 -1951 2097 3474 3228 -2078 -6119 -3331 4809 7703 2102 -4459
1361 -4459 -5291 826 6395 5715 -2053 -5269 -2371 4034 5018 -251 -3976 -1374 963 1803 1711 2862
1377 2862 906 -3196 -2655 3515 5398 176 -5062 -2504 1813 3754 1622 -1711 -1525 -489 1522
1392 1522 946 527 -809 -1104 173 206 482 1144 -231 -1762 -2395 387 3790 -78 -4427 -3486 2195
1409 2195 3139 579 -2100 -1415 -21 196 605 1551 -1371 -4577 -1843 2058 2407 -1370 -3430 -2192
1425 -2192 -265 190 2071 570 -3154 -4973 -372 4085 3006 -3830 -3907 -1035 1523 1542 116 -1566
1441 -1566 -4305 -3157 1224 4138 617 -2296 -3067 -333 1285 2142 952 -1925 -4353 -1641 4386
1456D386k131l333l495K751M254k044n83l71R39k298L01L310K180m237l558K214
1472a715L928P2j466j774k15J373J562L6k073j901J523L502M56k818q82L25M83
1489D16r38J784J618l536l815M126O151j575o180k362M145M063p02l210j371j057
1505b443J127L679K442m188m224O18M617J970j461k527j798M8K672K755k32m203
1521a148l985L379L214J483l466q68j96n36K519J666o3m219p98K556K556L33k975
1538e48j344J225q29M16L081r85l315j265L455K608k219j823j287K253O65J138
1554A226q84o78k515R15L053Q17k523k643J929J357L47j82o18j243o72K487K130
1571B303j025l662j138M293J047j749j230k37J74K90J442K083k610l560Q43M588
$$ plain form
1456 4386 2255 -1078 -4573 -1822 2432 388 -195 -566 373 -1925 -1624 1686 3866 -371 -3929 -1715
1472 -1715 2213 2285 819 -955 -1170 203 1765 1801 -272 -2173 -650 2852 3308 490 -392 -67 416
1489 416 -522 1262 2880 -656 -4471 -345 5806 4231 -1949 -4311 -166 3897 3195 -15 -1386 -2443
1505 -2443 -1316 2363 4805 617 -3607 -2989 1628 3598 2137 -390 -2188 -2140 532 3287 3055 -1148
1521 -1148 -5133 -1754 1460 2943 -523 -1391 -1587 -2123 396 2062 1999 -2220 -3018 -462 2094 2427 -548
1538 -548 -1892 -667 -1496 -1080 2001 1016 -2299 -3564 -109 2499 280 -1543 -2830 -577 88 1226
1554 1226 342 -336 -2851 -1936 1117 1934 -589 -3232 -1303 54 401 219 -399 -1642 -2314 173 2303
1571 2303 1278 -2384 -3522 771 1818 69 -1161 -1398 -1224 -934 508 2591 -19 -3579 -2736 1852
1587A852J751k751k778l13J670K046P63r28k996j668K468L485P80l262k531O99
1603a713K441J550Rj488k979N9L435J966j972k705p63K364J472n24j72j243j166
1620a429k8K665J711k245j911J29K260O92j094m15n88q15J270J560M94j800j718
1637a262R29J767P44j919l84q82P07J165N77p4k950p1K062J790q29j970q35M95
1655i40J035J499J17k029k399J108L438R53k454k577Q9K083J329L46j086k145
1671a633j156K347K784m12l272j637J447K622P53j238k072j440J306K473J164
1686B036j965k737M3K279J951l10j527j702n18J608K683M6l484j502J683K793
1702A377M68k001j400m71R85K185j21k26k131M15N79K386j287j084j900L69J452
$$ plain form
1587 1852 3603 852 -1926 -2239 -569 1477 2240 1312 -1684 -3352 -884 2601 3381 119 -2412 -1713
1603 -1713 728 2278 2287 799 -2180 -2121 1314 3280 1308 -1397 -2160 204 1676 1152 980 -263 -1429
1620 -1429 -1457 1208 2919 674 -1237 -1108 1152 1844 750 335 -253 -1068 202 1762 2256 456 -1262
1637 -1262 -333 1434 2178 259 -125 -1007 -300 865 1442 1368 -1582 -1653 409 2199 1370 -600 -1435 -940
1655 -940 95 1594 1711 -318 -2717 -1609 1829 2782 328 -2249 -2160 -77 1252 1598 512 -1633
1671 -1633 -2789 -442 2342 1930 -1342 -2979 -1532 1090 1843 605 -1467 -2907 -1601 872 2036
1686 2036 71 -2666 -2623 -344 1607 1297 -230 -1932 -2450 -842 1841 1887 -1597 -3099 -1416 1377
1702 1377 1845 -156 -1556 -2027 -1042 1143 1022 796 -1335 -920 -341 2045 758 -326 -2226 -1857 -405
1719d05J573J63j869q00J68K745L16j271j454J02L22J451M5l68j071j578K533
1736F02N15L87j850j274J049J348Q28l05j277r60JJ547J751q83k139j101J247
1753e14K094O66j543j699m72J725J866n7j847j706M62J685J436o99j812j317R23
1770h09J863J372j299k078j031J969J746M50j866j871J71J738J654r41j465j294
1786a691M87J497J728p22k474r96J565J461P91j314j476n90J355J389K61j098
1802A73j709m50J662J727l40j739j591O87K175R58j212j538o68J413J319o0q73
1819f6j325n0Q20J512o08o59j013k30J500J136Q0j708j393L92K280O72r40j602
1837a202l13R08J428K13p00j453l24Q32J635M79j994j068J19J672J565j033j498
$$ plain form
1719 -405 1168 1331 -538 -1338 -1170 1575 1891 620 -834 -732 -410 1041 1086 718 -353 -1931 602
1736 602 1117 1504 -346 -1620 -571 777 1605 1300 23 -937 -936 611 2362 1479 -660 -1761 -514
1753 -514 1580 2246 703 -996 -1468 257 2123 2066 219 -1487 -1025 660 2096 1397 -415 -1732 -809
1770 -809 1054 2426 1127 -951 -1982 -13 1733 2183 317 -1554 -1383 355 2009 1068 -397 -1691
1786 -1691 -1204 293 2021 1299 -1175 -2171 -606 855 1646 332 -1144 -1734 -379 1010 1271 173
1802 173 -1536 -1986 -324 1403 1063 -676 -2267 -1580 595 1553 341 -1197 -1865 -452 867 807 -66
1819 -66 -1391 -1441 -621 891 283 -376 -1389 -1619 -119 1017 1097 -611 -2004 -1612 668 1340 400 -1202
1837 -1202 -1515 -607 821 1034 334 -1119 -1443 -611 1024 1503 -491 -1559 -1440 232 1797 764 -734
1854g34m06J074J170P0n20j359k79R67J116L5q26j692K08J407J478o04j304q09
1872a008j84J921R76n78j294r14L74J843O51j015j283m20M44J766O33j550k188
1889a826J146J167J302j35k012p18K15J119J852j261r83j176l24K905Q32j392
1905G11j669r1J52K650j73j642j154l01J802J622o66j514j079J304N95O96J91
1922A434k770K11R16J561N8k049j078L17J592O12L03j638o77L26J190J017o63
1939F62j114j347P58J420O59k40k360l69K309O64k51p03j314k49P79J844n29q35
1957b16j443J278J371n71M17j464j039O59J773k40l34o53r50J259m25J813j399
1974a64j322m31J219K267L59k423j610J870J382o03K27q08O75r63K17J122K69
$$ plain form
1854 -734 -1140 -66 1104 1174 654 -705 -984 -17 1099 1134 308 -1384 -1176 231 1709 1105 -199 -1008
1872 -1008 -1192 729 1705 1127 -167 -1081 -707 1136 1787 772 -511 -931 -487 1279 1912 362 -1826
1889 -1826 -680 487 1789 1654 -358 -1076 -861 258 2110 849 -134 -1310 -1634 1271 2103 711
1905 711 -958 -1049 -897 1753 1580 -62 -1216 -1517 285 1907 1241 -273 -1352 -48 547 1243 1434
1922 1434 -1336 -1125 -209 1352 1410 -639 -1717 -1400 192 804 1107 -531 -1208 -882 308 1325 662
1939 662 -452 -1799 -1041 379 1038 798 -1562 -1931 378 1042 791 88 -1226 -1475 -696 1148 619 -216
1957 -216 -1659 -381 990 419 836 -628 -1667 -1008 765 525 191 -462 -1412 -153 -578 1235 -164
1974 -164 -1486 -1917 -698 1569 1928 -495 -2105 -235 1147 544 771 -37 638 -325 -108 1014 1283
1991A283j465j160P61J066N45n88r61j137J263J521J255j606j302n26J905K003
2007B857k442j527O96M11R56L96j61j449l57J92J037J545k027j624Q47O96L30
2024C76J86j76k877J597K293Q90j704j255r43J990K38J82p43J62r76J76K479o36
2042A259q12k204N73K518o99nn05l64J68P09R17o73k394K01J191J77P17L65o98
2061D41j891N06P73J188o21j966J22K510m61j838O36p18J199m92J011j75j54j147
2079a077P42P04L77q83j179J406j153J231P78p67r88q46J271J781o74j808J006
2096g9o61O09N16p00m95N88m09J547O06p81j175m00J280L96j004P29q21n42J90
2115f06K441K22l513j795K976K584j189j255k48m11J152l67J179O0j503k188J967
$$ plain form
1991 1283 -182 -1342 -581 485 1030 442 -519 -1656 -393 1128 2383 777 -525 -1051 854 2857
2007 2857 415 -1112 -416 -5 951 1347 1186 -263 -620 -428 609 2154 127 -1497 -650 46 376
2024 376 562 386 -2491 -894 1399 2289 585 -670 -1613 377 615 797 54 216 -760 -584 1895 1259
2042 1259 447 -1757 -1184 1334 635 630 125 -239 -71 638 1555 882 -1512 -1311 -120 57 774 1139 441
2061 441 -1450 -944 -171 1017 396 -1570 -1448 1062 601 -1237 -601 -1319 -120 -612 399 224 70 -1077
2079 -1077 -335 369 746 -137 -1316 90 -1063 168 946 179 -809 -1655 -384 1397 723 -1085 -79
2096 -79 -740 -131 385 -315 -810 -222 -631 916 1522 741 -434 -834 446 842 -162 567 -254 -796 -606
2115 -606 1835 2057 -1456 -3251 -275 2309 1120 -135 -383 -794 358 -9 1170 1230 -273 -2461 -494
2132d94J742m44m58k195J851j330K002L76k71k186R58J480M70n40j765O68N44
2149D08o82J261J219j745j892J000J486l30o89j923P10L023r47n52n46N60j297
2166i36M23J258q6j989K37J545n4P56p58j541K41K24J746M18k514L64R73M43J737
2185B487k529j284J79J559k92K05J1j278r50K378J243m13l174j62J507O77J65
$$ plain form
2132 -494 1248 804 346 -1849 2 -1328 674 1050 779 -1407 -449 1031 1501 961 -804 -136 408
2149 408 -274 987 2206 461 -1431 -431 1055 725 36 -1887 -1177 1846 899 347 -199 361 -936
2166 -936 -513 745 659 -1330 -1093 452 398 1154 396 -1145 -904 -680 1066 1484 -1030 -666 307 750 2487
2185 2487 -42 -1326 -1147 412 120 325 336 -942 -1892 486 1729 1316 -1858 -2020 -513 164 329
$$ [...]
8191A21
##END NTUPLES=NMR FID
##END=
