##TITLE=1H_290-X
 200.13MHz, CDCl3,
 8 sc
 
 28.1.2025
##JCAMPDX= 6.0         $$ Bruker NMR JCAMP-DX V2.0
##DATA TYPE= NMR FID
##DATA CLASS= NTUPLES
##ORIGIN= UXNMR, Bruker Analytische Messtechnik GmbH
##OWNER= pz
$$ XWIN-NMR		Version 3.5
$$ Tue Jan 28 16:13:55 2025 Russian Standard Time (UT+4h)  she@DPX200
##.OBSERVE FREQUENCY= 200.1313
##.OBSERVE NUCLEUS= ^1H
##.DELAY= (6, 6)
##.ACQUISITION MODE= SIMULTANEOUS
##.ACQUISITION SCHEME= undefined
##.AVERAGES= 8
##.DIGITISER RES= 18
##SPECTROMETER/DATA SYSTEM= spect
##.PULSE SEQUENCE= zg30
##.SOLVENT NAME= DMSO
##.SHIFT REFERENCE= (INTERNAL, DMSO, 0, 14.3821)
##AUDIT TRAIL= $$ (NUMBER, WHEN, WHO, WHERE, WHAT)
$$ ##TITLE= Audit trail, XWIN-NMR		Version 3.5
$$ ##JCAMPDX= 5.01
$$ ##ORIGIN= Bruker BioSpin GmbH
$$ ##OWNER= she
$$ F:/spectra/data/she/nmr/H-C/1/audita.txt
$$ ##AUDIT TRAIL=  $$ (NUMBER, WHEN, WHO, WHERE, WHAT)
(   1,<2025-01-28 16:13:03.93 +0400>,<she>,<DPX200>,
      <created by zg, POWCHK disabled, PULCHK disabled
       configuration hash MD5:
       00 E9 B6 7A A2 85 ED C7 34 08 36 98 17 FE 4E 26
       data hash MD5: 16K
       59 74 4E BE 0A 05 46 24 2F 86 D3 99 FD 56 6C 7B>)
$$ ##END=
$$ 
$$ hash MD5
$$ B0 0C 63 C2 82 F6 98 FE 61 6D 4D 4A 95 AA 88 A8
##$RELAX= 
##$RELAX= 
##$RELAX= 
##$RELAX= 
##$RELAX= 
##$RELAX= 
$$ Bruker specific parameters
$$ --------------------------
##$DU= <F:/spectra>
##$EXPNO= 1
##$NAME= <H-C>
##$PROCNO= 1
##$TYPE= <nmr>
##$USER= <she>
##$AMP= (0..31)
100 100 100 100 100 100 100 100 100 100 100 100 100 100 100 100 100 100 
100 100 100 100 100 100 100 100 100 100 100 100 100 100 
##$AQSEQ= 0
##$AQ_mod= 1
##$AUNM= <au_zg>
##$AUTOPOS= <>
##$BF1= 200.13
##$BF2= 200.13
##$BF3= 200.13
##$BF4= 200.13
##$BF5= 200.13
##$BF6= 200.13
##$BF7= 200.13
##$BF8= 200.13
##$BYTORDA= 1
##$CFDGTYP= 0
##$CFRGTYP= 5
##$CHEMSTR= <none>
##$CNST= (0..31)
1 1 145 1 1 1 1 1 1 1 1 1 1 1 1 1 1 1 1 1 1 1 1 1 1 1 1 1 1 1 1 1 
##$CPDPRG= <>
##$CPDPRG1= <>
##$CPDPRG2= <>
##$CPDPRG3= <>
##$CPDPRG4= <mlev>
##$CPDPRG5= <mlev>
##$CPDPRG6= <mlev>
##$CPDPRG7= <mlev>
##$CPDPRG8= <mlev>
##$CPDPRGB= <>
##$CPDPRGT= <>
##$D= (0..31)
0 0.7 0 0 0 0 0 0 0 0 0 0.03 0 0 0 0 0 0 0 0 0 0 0 0 0 0 0 0 0 0 0 0 
##$DATE= 1738066383
##$DBL= (0..7)
120 120 120 120 120 120 120 120 
##$DBP= (0..7)
150 150 150 150 150 150 150 150 
##$DBP07= 0
##$DBPNAM0= <>
##$DBPNAM1= <>
##$DBPNAM2= <>
##$DBPNAM3= <>
##$DBPNAM4= <>
##$DBPNAM5= <>
##$DBPNAM6= <>
##$DBPNAM7= <>
##$DBPOAL= (0..7)
0.5 0.5 0.5 0.5 0.5 0.5 0.5 0.5 
##$DBPOFFS= (0..7)
0 0 0 0 0 0 0 0 
##$DE= 6
##$DECBNUC= <off>
##$DECIM= 32
##$DECNUC= <off>
##$DECSTAT= 4
##$DIGMOD= 1
##$DIGTYP= 9
##$DL= (0..7)
0 120 120 120 120 120 120 120 
##$DP= (0..7)
150 150 150 150 150 150 150 150 
##$DP07= 0
##$DPNAME0= <>
##$DPNAME1= <>
##$DPNAME2= <>
##$DPNAME3= <>
##$DPNAME4= <>
##$DPNAME5= <>
##$DPNAME6= <>
##$DPNAME7= <>
##$DPOAL= (0..7)
0.5 0.5 0.5 0.5 0.5 0.5 0.5 0.5 
##$DPOFFS= (0..7)
0 0 0 0 0 0 0 0 
##$DQDMODE= 0
##$DR= 18
##$DS= 0
##$DSLIST= <SSSSSSSSSSSSSSS>
##$DSPFIRM= 0
$$ [...]
##$SUBNAM0= <"">
##$SUBNAM1= <"">
##$SUBNAM2= <"">
##$SUBNAM3= <"">
##$SUBNAM4= <"">
##$SUBNAM5= <"">
##$SUBNAM6= <"">
##$SUBNAM7= <"">
##$SUBNAM8= <"">
##$SUBNAM9= <"">
##$SW= 18.0517328524113
##$SWIBOX= (0..15)
0 0 2 0 0 0 0 0 0 0 0 0 0 0 0 0 
##$SW_h= 3612.71676300578
##$TD= 16384
##$TD0= 1
##$TE= 0
##$TE2= 300
##$TE3= 300
##$TEG= 300
##$TL= (0..7)
0 120 120 120 120 120 120 120 
##$TP= (0..7)
150 150 150 150 150 150 150 150 
##$TP07= 0
##$TPNAME0= <>
##$TPNAME1= <>
##$TPNAME2= <>
##$TPNAME3= <>
##$TPNAME4= <>
##$TPNAME5= <>
##$TPNAME6= <>
##$TPNAME7= <>
##$TPOAL= (0..7)
0.5 0.5 0.5 0.5 0.5 0.5 0.5 0.5 
##$TPOFFS= (0..7)
0 0 0 0 0 0 0 0 
##$TUNHIN= 0
##$TUNHOUT= 0
##$TUNXOUT= 0
##$USERA1= <user>
##$USERA2= <user>
##$USERA3= <user>
##$USERA4= <user>
##$USERA5= <user>
##$V9= 5
##$VALIST= <valist>
##$VCLIST= <CCCCCCCCCCCCCCC>
##$VD= 0
##$VDLIST= <DDDDDDDDDDDDDDD>
##$VPLIST= <PPPPPPPPPPPPPPP>
##$VTLIST= <TTTTTTTTTTTTTTT>
##$WBST= 1024
##$WBSW= 4
##$XGAIN= (0..3)
0 0 0 0 
##$XL= 0
##$YL= 0
##$YMAX_a= 299450
##$YMIN_a= -356125
##$ZGOPTNS= <>
##$ZL1= 120
##$ZL2= 120
##$ZL3= 120
##$ZL4= 120
##$ABSF1= 10
##$ABSF2= 0
##$ABSG= 5
##$ABSL= 3
##$ALPHA= 0
##$AQORDER= 0
##$ASSFAC= 0
##$ASSFACI= 0
##$ASSFACX= 0
##$ASSWID= 0
##$AUNMP= <proc_1d>
##$AZFE= 0.1
##$AZFW= 0.1
##$BCFW= 1
##$BC_mod= 2
##$BYTORDP= 1
##$COROFFS= 0
##$CY= -3
##$DATMOD= 1
##$DC= 2
##$DFILT= <>
##$DTYPP= 0
##$F1P= 0
##$F2P= 0
##$FCOR= 0.5
##$FTSIZE= 0
##$FT_mod= 4
##$GAMMA= 1
##$GB= 0.15
##$INTBC= 1
##$INTSCL= 1
##$ISEN= 128
##$LB= 0.25
##$LEV0= 0
##$LPBIN= 0
##$MAXI= 10000
##$MC2= 0
##$MEAN= 0
##$ME_mod= 0
##$MI= 1.114404
##$NCOEF= 0
##$NC_proc= 0
##$NLEV= 6
##$NOISF1= 3.799351
##$NOISF2= 2.8
##$NSP= 1
##$NTH_PI= 0
##$NZP= 0
##$OFFSET= 14.38212
##$PC= 1
##$PHC0= 254.8041
##$PHC1= 6.792229
##$PH_mod= 1
##$PKNL= yes
##$PPARMOD= 0
##$PSCAL= 0
##$PSIGN= 0
##$REVERSE= no
##$SF= 200.129724274929
##$SI= 16384
##$SIGF1= 3
##$SIGF2= 2
##$SINO= 400
##$SIOLD= 16384
##$SREGLST= <1H.CDCl3>
##$SSB= 0
##$STSI= 0
##$STSR= 0
##$SW_p= 3205.1282051282
##$SYMM= 0
##$S_DEV= 0
##$TDeff= 0
##$TDoff= 0
##$TI= <>
##$TILT= no
##$TM1= 0
##$TM2= 0
##$TOPLEV= 0
##$USERP1= <user>
##$USERP2= <user>
##$USERP3= <user>
##$USERP4= <user>
##$USERP5= <user>
##$WDW= 1
##$XDIM= 8192
##$YMAX_p= 0
##$YMIN_p= 0
$$ End of Bruker specific parameters
$$ ---------------------------------
##NTUPLES= NMR FID
##VAR_NAME=  TIME,          FID/REAL,        FID/IMAG
##SYMBOL=    X,             R,               I
##VAR_TYPE=  INDEPENDENT,   DEPENDENT,       DEPENDENT
##VAR_FORM=  AFFN,          ASDF,            ASDF
##VAR_DIM=   8192,          8192,            8192
##UNITS=     SECONDS,       ARBITRARY UNITS, ARBITRARY UNITS
##FACTOR=    0.0002768,     1,               1
##FIRST=     0,             0,               0
##LAST=      2.2672688,     0,               0
##MIN=       0,             -356125,         0
##MAX=       2.2672688,     299450,          0
$$ Real data points
##PAGE= N=1
##DATA TABLE= (X++(R..R)), XYDATA
$$ plain form
0 0 0 0 0 0 0 0 0 0 0 0 0 0 0 0 0 -1 8 -8 8 -8 8 -8 9 -15 16 -16 21 -24 25 -30 33 -37 43 -47 53 -59 66 -72 80
39 80 -89 98 -107 121 -129 143 -158 174 -190 212 -232 255 -281 310 -343 383 -427 480 -543 620
59 620 -715 836 -992 1206 -1510 1968 -2718 4082 -7048 15920 -92371 -356125 102450 201580
73 201580 -135352 -21336 160778 -23759 -98859 82396 86189 -109838 -55450 91175 -49936
84 -49936 -69685 117501 8518 -121269 31874 64790 -45710 -33877 39031 42689 -45621
95 -45621 -28081 85714 -13860 -89603 71404 43849 -98354 8347 86846 -23002 -61045
106 -61045 28973 54209 -58641 -44778 86259 -22485 -95984 87388 40421 -98543 52225
117 52225 67466 -90977 -13709 77269 -21459 -61004 34959 62825 -44083 -37972 72553 -13549
$$ packed form
0@%%%%%%%%%%%%%%%jRj6J6j6J6j6J7k4L1l2L7m5M9n5O3p0Q0r0J00j12J25j38J52
39H0j69J87k05K28k50K72l01L32l64M02m44M87n36N91o53P26q10R07j023J163
59F20j335J551j828K198k716L478m686O800j1130K2968j08291k63754M58575R9130
73B01580l36932J14016J82114j84537p5100J81255L793j96027N4388J46625j41111
84d9936j9749J87186j08983j29787J53143L2916j10500J1833P2908L658q8310
95d5621J7540J13795r9574p5743J61007k7555j42203J06701P8499j09848l8043
106f1045R0018K5236j12850J3863J31037j08744p3499J83372m6967j38964J50768
117E2225J5241j58443P7268R0978r8728l9545R5963K7866j06908O111J10525q6102
$$ plain form
129 -13549 -80208 49667 25634 -61802 27665 38816 -35529 -13045 14994 2385 -23397 -7916
141 -7916 53107 -234 -41985 53261 15931 -67771 22904 34150 -46604 -7184 33126 685
153 685 -30309 -12210 33524 -17611 -46533 58466 28751 -61299 31802 46660 -49564 -4427
165 -4427 35783 -19541 -24008 13767 21751 -21349 -23343 41252 -2831 -49852 44501 24790 -61277
178 -61277 14955 39605 -35407 -14242 25643 6799 -23358 -12365 38102 -2097 -45982 41389
190 41389 31298 -52840 19273 42257 -40093 -12225 27765 -9824 -21275 3515 22310 -14602
202 -14602 -31841 34968 8332 -52397 29104 36238 -44714 7655 41490 -21542 -17908 15748
214 15748 8965 -14524 -12362 30035 3381 -38882 24297 19640 -47398 7297 30385 -29284 -6183
$$ packed form
129a3549o6659J29875k4033q7436Q9467J1151p4345K2484K8039j2609k5782J5481
141g916O1023n3341m1751R5246l7330q3702R0675J1246q0754L9420M0310l2441
153F85l0994J8099M5734n1135k8922J04999k9715r0050R3101J4858r6224M5137
165d427M0210n5324m467L7775P984m3100j994O4595m4083m7021R4353j9711q6067
178f1277P6232K4650p5012K1165L9885j8844l0157J0993N0467m0199m3885Q7371
190D1389j0091q4138P2113K2984q2350K7868L9990l7589j1451K4790J8795l6912
202a4602j7239O6809k6636o0729Q1501P134q0952N2369L3835o3032L634L3656
214A5748o783k3489K162M2397k6654m2263O3179m657o7038N4695K3088n9669K3101
$$ plain form
227 -6183 23725 -1759 -12931 -2698 21795 780 -29493 26202 22867 -42104 9461 32993
239 32993 -32752 -8922 26642 -8317 -15030 4179 13897 -6618 -23108 22459 13368 -38913 15134
252 15134 30331 -36174 -168 33466 -16744 -10773 18273 5781 -10304 -9450 17786 3222 -32092
265 -32092 15715 21409 -37572 2537 29175 -25918 -9865 21957 -3007 -9678 3189 15108
277 15108 2002 -19344 16853 17309 -31983 6528 27529 -28046 -7823 23114 -12116 -13654 6763
290 6763 6012 -4271 -12692 14840 12072 -26947 9366 25690 -27645 -2279 28297 -14476 -10590
303 -10590 16139 1996 -7997 -5401 10702 4077 -24041 8380 18482 -29459 -423 26679 -20557
316 -20557 -8414 22304 -4416 -9315 5991 9134 -562 -13650 12163 14116 -25271 3815 24304
$$ packed form
227f183K9908k5484j1172J0233K4493k1015l0273N5695l335o4971N1565K3532
239C2993o5745K3830L5564l4959o713J9209R718k0515j6490M5567r091n2281N4047
252A5134J5197o6505L6006L3634n0210N971K9046j2492j6085Q54K7236j4564l5314
265c2092M7807N694n8981M0109K6638n5093J6053L1822k4964o671J2867J1919
277A5108j3106k1346L6197M56m9292L8511K1001n5575K0223L0937l5230j538K0417
290F763p51j0283q421K7532k768l9019L6313J6324n3335K5366L0576m2773L886
303a0590K6729j4143r993K596J6103o625k8118L2421J0102m7941K9036K7102m7236
316b0557J2143L0718k6720m899J5306L143r696j3088K5813J953l9387K9086K0489
$$ plain form
329 24304 -23469 -7131 22392 -11817 -11769 9430 1260 -5820 -6872 8967 8792 -18565 6976 21884
343 21884 -20963 -2796 24842 -13220 -10434 15616 -893 -7875 -1527 6477 2887 -16611 4897
356 4897 16114 -22314 -2959 23527 -16195 -9268 20255 -4057 -9004 7143 5499 -941 -8695
369 -8695 7310 11122 -18670 1149 20024 -18952 -6306 20811 -10962 -10511 11408 -1070 -5799
382 -5799 -2310 3967 5634 -12517 2845 16530 -15087 -2454 20684 -10716 -7388 14950 -3355
395 -3355 -6706 2475 1884 1434 -9635 1393 12020 -15129 -4203 17906 -12817 -8303 17194 -4250
409 -4250 -7205 9217 2584 -1990 -3672 4023 7850 -13394 14 16943 -15308 -7401 18664 -9773
423 -9773 -10691 12579 -1473 -6606 1797 2948 1754 -8633 2509 12708 -12841 -1785 19409
$$ packed form
329B4304m7773J6338K9523l4209M8K1199q170p080j052J5839j75k7357K5541J4908
343B1884m2847J8167K7638l8062K786K6050j6509o982O348Q004l590j9498K1508
356D897J1217l8428J9355K6486l9722O927K9523k4312m947J6147j644o440p754
369h695J6005L812k9792J9819J8875l8976J2646K7117l1773M51K1919j2478m729
382e799L489O277J667j8151J5362J3685l1617J2633K3138l1400L328K2338j8305
395c355l351R181n91m50j1069J1028J0627k7149J0926K2109l0723M514K5497k1444
409d250k955J6422o633m574j682P695L827k1244J3408J6929l2251P907K6065k8437
423i773r18K3270j4052n133Q403J151j194j0387J1142J0199k5549J1056K1194
$$ plain form
436 19409 -11311 -7842 16808 -5215 -8515 7948 1136 -3224 -4070 1967 5807 -12202 -1588 14718
450 14718 -12476 -5897 17212 -7670 -8059 12446 -177 -3929 3243 3780 3382 -7840 -161 10810
464 10810 -12648 -5436 15919 -9020 -8929 13517 -3741 -8704 5113 1359 -744 -2962 2636 8847
478 8847 -9786 -2320 15822 -9669 -7680 17898 -4009 -10853 9263 931 -7766 -3402 4052 4490
492 4490 -11075 390 15653 -12771 -8367 19684 -6065 -12138 15559 3106 -8975 3387 5235
505 5235 -493 -7827 2192 11064 -11896 -5590 16703 -10099 -12520 15236 -1889 -11055 8365
518 8365 4234 -4114 -2685 2349 6279 -7967 -2115 15732 -6239 -9042 14686 -2652 -12162 7548
532 7548 2815 -5222 -1851 1696 4017 -9203 -5217 13449 -5944 -9795 17074 489 -11938 9834
$$ packed form
436A9409l0720L469K4650k2023l300J6463o812m360q46O037L840j8009J0614J6306
450A4718k7194O579K3109k4882l89K0505j2623l752P172N37l98j1222P679J0971
464A0810k3458P212K1355k4939R1K2446j7258m963J3817l754k103k218N598O211
478H847j8633P466J8142k5491J989K5578k1907o844K0116q332q697M364P454M38
492D490j5565J1465J5263k8424M404K8051k5749o073K7697j2453j2081J2362J848
505E235n728p334J0019Q872k2960O306K2293k6802k421K7756j7125r166J9420
518H365m131q348J429N034L930j4246N852J7847k1971k803K3728j7338r510J9710
532G548m733q037L371L547K321j3220L986J8666j9393l851K6869j6585j2427K1772
$$ plain form
546 9834 3229 -8110 1915 4265 1424 -4463 -304 8800 -9334 -8451 14211 -5831 -12324 14601
560 14601 827 -12685 6650 4088 -6098 -1158 4554 5444 -6066 -1561 12345 -7066 -9422
573 -9422 14155 -1793 -11133 9998 2010 -8361 361 816 329 -3999 -1986 9693 -3551 -8381
587 -8381 12015 -905 -10865 10202 3941 -6981 4321 3430 -2326 -3304 -1169 6049 -4996 -5902
601 -5902 12214 -2899 -12706 10418 1307 -12387 6029 6161 -3977 -479 2457 3489 -4923 -4330
615 -4330 10823 -1845 -8739 11972 1007 -11925 6000 2019 -7693 1582 2421 334 -2096 -2960
629 -2960 5915 -2828 -7905 10440 1450 -9618 9297 3913 -9092 3064 3446 -3129 -508 1033
643 1033 3615 -3681 -5632 7589 -2771 -10201 9937 2152 -10355 6356 3697 -6677 1199 2423
$$ packed form
546I834o605j1339J0025K350k841n887M159R104j8134Q83K2662k0042o493K6925
560A4601j3774j3512J9335k562j0186M940N712Q90j1510M505J3906j9411k356
573i422K3577j5948r340K1131p988j0371Q722M55m87m328K013J1679j3244m830
587h381K0396j2920r960K1067o261j0922J1302q91n756r78K135P218j1045r06
601e902J8116j5113r807K3124r111j3694J8416J32j0138L498K936J032q412N93
615d330J5153j2668o894K0711j0965j2932J7925l981r712R275Q39k087k430q64
629b960Q875q743n077J8345q990j1068J8915n384j3005J2156L82o575K621J541
643A033K582p296j951J3221j0360p430K0138p785j2507J6711k659j0374P876J224
$$ plain form
657 2423 1164 -402 -1269 6787 -1259 -7385 7520 599 -9570 6901 3354 -7334 2285 1194
671 1194 -2914 -1208 -1832 4658 -76 -5887 8239 1653 -10326 6837 4749 -8436 3730 5752
685 5752 -3403 -1028 747 1890 -3208 -5111 7512 -488 -9462 8467 1932 -11963 5277 4979
699 4979 -7426 1954 4683 -844 -1350 -513 4291 -1195 -5690 7652 1342 -8822 5816 2352 -9009
714 -9009 2337 2527 -3513 441 -83 2177 229 -5337 5571 2415 -7783 5865 4977 -7650 2594
729 2594 4095 -4752 -310 1319 960 -834 -3624 4776 230 -8639 6067 3286 -9683 4733 5949
744 5949 -7172 742 4109 -1810 -812 73 4102 422 -5237 5520 2015 -9084 4301 3968 -7996
759 -7996 2137 3501 -4558 -380 394 590 392 -3345 4837 2891 -6636 4892 4778 -7722 2609
$$ packed form
657B423j259j566q67Q056q046o126J4905o921j0169J6471l547j0688R619j091
671A194m108J706o24O490m734n811J4126o586j1979J7163k088j3185J2166K022
685E752r155K375J775J143n098j903J2623q000q974J7929o535j3895J7240k98
699D979j2405R380K729n527n06Q37M804n486m495J3342o310j0164J4638l464j1361
714i009J1346J90o040L954n24K260j948n566J0908l156j0198J3648q88j2627J0244
729B594J501q847M442J629l59j794k790Q400m546q869J4706k781j2969J4416J216
744E949j3121P914L367n919R98Q85M029l680n659J0757l505j1099J3385l33j1964
759g996J0133J364q059M178P74J96j98l737Q182j946r527J1528j14j2500J0331
$$ plain form
774 2609 4746 -5041 137 2119 -1045 -1030 -2996 3036 853 -6987 4640 4020 -8801 3014 5673
789 5673 -6701 788 4939 -1880 -135 557 2380 393 -5079 3881 2866 -8001 2820 4295 -7496
804 -7496 1095 3917 -4477 105 1442 105 820 -2918 2897 2969 -6079 2983 5306 -6793 1451 5096
820 5096 -4741 -17 2153 -1394 -102 -1681 1631 1693 -5900 2114 3940 -7532 1697 5475 -5699
835 -5699 833 4434 -2284 458 1041 694 1688 -3599 1735 3151 -6219 1125 3991 -7014 258 3783
851 3783 -4303 538 1961 -1346 1610 -1052 1120 3179 -4468 1650 4434 -5810 1204 4608 -4773
866 -4773 185 2949 -2426 408 -636 -332 1910 -3674 956 3637 -5467 918 5028 -5335 506
881 506 4468 -3200 732 1991 -784 1643 -1579 700 2754 -4559 553 3748 -5577 126 3658
$$ packed form
774B609K137r787N178J982l164J5j966O032k183p840J1627o20j2821J1815K659
789E673j2374P489M151o819J745O92J823j987n472Q960j015j0867J0821J475j1791
804g496Q591K822q394M582J337j337P15l738N815P2r048R062K323j2099Q244L645
820E096r837M724K170l547J292j579L312O2p593Q014J826j1472R229L778j1174
835e699O532L601o718K742N83l47R94n287N334J416r370P344K866j1005P272L525
851C783q086M841J423l307K956k662K172K059p647O118K784j0244P014L404r381
866d773M958K764n375K834j044L04K242n584M630K681r104O385M110j0363N841
881E06L962p668L932J259k775K427l222K279K054p313N112L195r325N703L532
$$ plain form
896 3658 -4938 274 2929 -2743 1146 669 -288 2501 -2429 675 4102 -4296 492 4465 -4193 137
912 137 3163 -3548 218 613 -1692 1492 -2186 -232 3305 -4339 181 4911 -4444 290 4927 -3537
928 -3537 103 2948 -1819 696 -255 -127 1918 -3635 453 3434 -5618 316 4903 -5270 -302
943 -302 4474 -3462 -422 2286 -1043 805 -901 1125 2845 -3611 980 4397 -4695 195 4137
958 4137 -4149 -554 2417 -2672 144 -560 -1040 2222 -2681 -5 4775 -3549 -168 4926 -3272 -641
974 -641 3587 -1542 15 425 -774 1952 -3284 -768 3866 -4246 -1283 5396 -4002 -1987 4841 -2399
990 -2399 -1490 2540 -21 423 -818 613 2751 -3678 38 4831 -4434 -1156 4977 -3890 -1925 3223
1006 3223 -2307 -682 1150 -852 1253 -1832 -126 3357 -2989 -372 4981 -2833 -721 4080 -2495
$$ packed form
896C658q596N212K655n672L889m77r57K789m930L104L427q398M788L973q658M330
912A37L026o711L766L95k305L184l678J954L537p644M520M730r355M734M637q464
928c537L640K845m767K515r51J28K045n553M088K981r052N934M587j0173M968
943c02M776p936L040K708l329J848j706K026J720o456M591L417r092M890L942
958D137q286L595K971n089K816p04m80L262m903K676M780q324L381N094q198K631
974f41M228n129J557M10j199K726n236K516M634q112K963O679r398K015O828p240
990b399R09M030k561M44j241J431K138o429L716M793r265L278O133q867J965N148
1006C223n530J625J832k002K105l085J706L483o346K617N353p814K112M801o575
$$ plain form
1021 -2495 -623 1638 -1594 948 -734 -1260 2993 -2904 -2232 4194 -2732 -2430 4431 -1457 -1404 2511
1037 2511 -459 333 -158 -344 3076 -2119 -1065 4751 -2906 -2751 4435 -2344 -2806 3489 -1131 -1333
1053 -1333 819 -657 977 -1461 -702 3837 -2044 -1179 4911 -2756 -2216 4222 -1408 -1677 2709 -477
1069 -477 -324 -540 -1369 1972 -2085 -1881 3862 -2022 -2142 3921 -1961 -1660 3119 -985 -246 1811 -926
1086 -926 1575 -606 -1491 2795 -1776 -1647 3910 -1738 -2239 2571 -2062 -1355 1399 -1340 1013 262
1102 262 -1029 2615 -1052 -2268 3983 -1021 -2288 4119 -776 -2005 1956 -910 -798 -255 -1040 1901
1118 1901 -1139 -1896 3484 -2062 -2997 3988 -1171 -2575 3694 -393 -1798 1460 -274 30 -157 -346
1134 -346 2601 -1424 -1763 3594 -2305 -2745 3465 -1180 -2047 2390 -952 -624 614 -1144 1259 -164
$$ packed form
1021b495J872K261l232K542j682n26M253n897O72O426o926L02O861n888N3L915
1037B511k970P92m91j86L420n195J054N816p657J55P186o779m62O295m620k02
1053a333K152j476J634k438P59M539n881Q65O090p667N40O438n630k69M386l186
1069d77J53k16q29L341m057K04N743n884j20O063n882L01M779m104P39K057k737
1086i26K501k181q85M286m571J29N557n648n01M810m633P07K754k739K353p51
1102B62j291L644l667j216O251n004j267O407m895j229L961k866J12N43p85K941
1118A901l040p57N380n546r35O985n159j404O269m087j405L258j734L04j87j89
1134c46K947m025l39N357n899m40O210m645q67M437l342L28J238j758K403j423
$$ plain form
1150 -164 -1097 3271 -612 -2184 3023 -994 -2502 2307 -714 -817 853 -1360 522 -510 -2250 2781
1166 2781 -347 -2169 3793 -204 -2913 2824 60 -1870 1533 359 511 -178 -985 2127 -1109 -2402
1182 -2402 3366 -718 -2905 3215 -278 -3276 1979 -116 -1371 857 -35 1308 -234 -1327 2481
1197 2481 -742 -2126 3381 -279 -2260 2658 -195 -1993 1047 -768 -18 87 -1211 1651 -435
1212 -435 -2764 2420 -7 -2735 2849 810 -1780 1613 407 -240 382 -908 1451 -312 -2113 2402
1228 2402 -201 -3620 2262 -83 -2962 2141 496 -1216 886 -166 421 309 -1193 2589 89
1243 89 -2491 2685 -41 -3155 1942 376 -2138 1150 179 -373 -67 -1157 1152 108 -2468 2320
1259 2320 729 -2817 2157 693 -2277 1153 392 -491 829 -620 915 496 -1985 1647 409 -2970
$$ packed form
1150a64r33M368l883j572N207m017j508M809l021j03J670k213J882j032j740N031
1166B781l128j822N962l997k709N737k764j930L403j174J52o89q07L112l236j293
1182b402N768m084k187O120l493k998N255k095j255K228q92J343j542j093L808
1197B481l223j384N507l660j981M918k853j798L040j815P50J05j298K862k086
1212d35k329N184k427k728N584k039k590L393j206o47O22j290K359j763j801M515
1228B402k603l419N882k345k879N103j645j712K102j052N87j12j502L782k500
1243H9k580N176k726l114N097j566k514L288r71n52L06j090K309j044k576M788
1259B320j591l546M974j464k970L430p61q83J320j449J535m19k481L632j238l379
$$ plain form
1275 -2970 2188 538 -2859 1300 549 -1666 901 12 350 927 -1203 1490 736 -2388 1886 989
1291 989 -2627 1637 704 -2072 779 -308 -747 523 -1323 749 709 -2272 1562 1167 -2581 1588
1307 1588 1313 -1990 1569 861 -923 778 -576 -57 368 -1889 933 914 -2562 1375 844 -2701 1413
1324 1413 876 -1720 943 306 -336 800 -1185 584 1007 -1995 1290 1086 -2036 1205 825 -1849
1340 -1849 1045 -12 -1092 909 -1004 -293 905 -2038 572 1228 -2027 1049 1595 -1724 1191 1139
1356 1139 -1119 1095 -158 -284 793 -1465 26 960 -2389 616 1041 -2281 976 1223 -1868 900
1372 900 594 -807 1083 -110 186 860 -1279 600 894 -2157 1090 1009 -2170 930 344 -1864 770
1389 770 -149 -865 883 -836 242 1284 -1361 842 1132 -1556 1180 864 -1547 751 261 -922
$$ packed form
1275b970N158j650l397M159p51k215K567q89L38N77k130K693p54l124M274q97
1291I89l616M264r33k776K851j087m39J270j846K072m0k981L834l95l748M169
1307A588k75l303L559p08j784J701j354N19M25k257K822j9l476L937n31l545M114
1324A413n37k596K663o37o42J136j985J769M23l002L285k04l122L241l80k674
1340a849K894j057j080K001j913P11J198k943K610O56l255L076N46l319K915n2
1356A139k258K214j253j26J077k258J491R34l349L005M25l322L257K47l091K768
1372I00l06j401J890j193K96O74k139J879K94l051L247q1l179L100n86k208K634
1389G70r19p16J748j719J078J042k645K203K90k688K736l16k411K298m90j183
$$ plain form
1405 -922 744 -840 -271 1112 -1665 368 1331 -2095 691 1155 -1634 546 904 -1108 790 210
1421 210 -154 995 -1154 749 1162 -1988 918 1333 -2494 288 1059 -2058 537 288 -1048 677
1437 677 -366 -176 945 -1152 631 1125 -1547 787 1208 -1661 662 585 -1367 755 -183 -847 1016
1454 1016 -969 -137 1146 -1472 325 1233 -1452 459 1306 -1105 543 264 -361 1041 -529 -3
1470 -3 1249 -1567 101 1594 -2027 52 1176 -1390 181 618 -749 353 -144 -13 1073 -948
1486 -948 275 1309 -1435 415 1607 -1552 279 1146 -1125 188 222 -858 466 -519 -334 920
1502 920 -1298 59 1338 -1517 370 1536 -1233 634 903 -946 679 -3 -508 1165 -916 -337
1518 -337 1415 -1371 -330 980 -1382 -88 654 -892 644 366 -714 959 -587 -138 1399 -932
$$ packed form
1405i22J666j584N69J383k777K033R63l426K786M64k789K180L58k012J898n80
1421B10l64J149k149J903M13l150K906M15l827K782P71l117K595k49j336J725
1437F77j043J90J121k097J783M94k672K334M21k869K323p7j952K122r38o64J863
1454A016j985Q32J283k618J797R08k685J911Q47k411J648k79o25J402j570N26
1470cJ252k816J668J493l621K079J124k566J571M37j367J102m97J31J086k021
1486i48J223J034k744J850J192l159J831Q67k271J313L4j080J324r85J85J254
1502I20k218J357J279k855J887J166k769J867K69j849J625o82n05J673k081N79
1518c37J752k786J041J310k362J294P42j546J536k78j080J673j546M49J537k331
$$ plain form
1534 -932 5 1672 -1112 133 901 -990 125 508 -741 554 -312 -666 984 -1344 -381 1482 -1254
1551 -1254 -249 1714 -1122 0 1116 -806 440 268 -517 642 -753 -282 798 -1327 39 1205
1567 1205 -1373 -125 1028 -1256 -9 973 -915 270 258 -397 954 -658 -190 1271 -1134 -2
1583 -2 1301 -1098 47 771 -1204 336 206 -1009 870 -260 -195 1539 -864 -423 1476 -868 107
1600 107 1401 -615 299 614 -554 615 -497 -294 827 -991 -410 1508 -1166 -902 1395 -912
1616 -912 -415 1198 -293 18 234 -70 709 -501 -101 1344 -927 -216 1513 -1312 -699 855 -1079
1633 -1079 -192 699 -731 292 -32 -533 785 -576 -318 1533 -833 -269 1212 -911 -115 872 -520
1650 -520 308 16 -574 790 -771 -895 1333 -1144 -826 1618 -644 -652 999 -303 67 462 -88 885
$$ packed form
1534i32R37J667k784J245P68j891J115L83j249J295q66l54J650k328R63J863k736
1551a254J005J963k836J122J116j922J246j72p85J159j395M71J080k125J366J166
1567A205k578J248J153k284J247R82j888J185j2o55J351j612M68J461k405J132
1583bJ303k399J145P24j975J540j30j215J879j130O5J734k403M41J899k344R75
1600A07J294k016R14L15j168J169j112K03J121j818N81J918k674K64K297k307
1616i12M97J613j491L11K16l04P79j210M00J445k271P11J729k825O13J554j934
1633a079Q87Q91j430J023l24n01J318j361K58J851k366N64J481k123P96R87j392
1650e20Q28k92n90J364j561j24K228k477L18K444k262qJ651j302L70L95n50R73
$$ plain form
1668 885 -331 -110 1256 -721 -733 1533 -949 -961 1577 -485 -870 538 -406 25 -44 -264 894 -541
1686 -541 -606 1330 -836 -669 1515 -281 -492 999 -299 -392 14 -563 701 -352 -673 1374 -659
1703 -659 -959 1377 -688 -1004 1067 -137 43 521 -294 451 -55 -569 1322 -371 -928 1700 -379
1720 -379 -895 1071 -447 -735 576 -565 162 -48 -659 928 -128 -695 1420 -133 -820 1406 -123
1737 -123 -964 944 -186 -416 299 -369 520 -239 -986 979 -358 -1358 1244 -89 -943 1015 -161
1754 -161 -337 798 -187 438 352 -271 935 67 -1177 1074 -302 -1078 1157 -139 -641 597 -468
1771 -468 -167 535 -794 659 310 -914 1176 38 -991 874 67 -919 1002 -15 -225 475 -638
1788 -638 126 368 -891 657 146 -1372 1209 -133 -1065 991 -164 -589 776 39 1 444 -889
$$ packed form
1668H85j216K21J366j977j2K266k482j2K538k062l85J408r44M31o9k20J158j435
1686e41o5J936k166J67K184j796k11J491j298r3M06n77J264j053l21K047k033
1703f59l00K336k065l16K071j204J80M78q15P45n06n14J891j693n57K628k079
1720c79n16J966j518k88J311j141P27k10o11J587j056n67K115j553o87K226j529
1737a23q41J908j130k30P15o68Q89p59p47J965j337j000K602j333q54J958j176
1754a61j76J135r85O25q6o23J206q68j244K251j376p76K235j296n02J238j065
1771d68L01P02j329J453l49j224K090j138j029J865q07r86J921j017k10P00j113
1788f38P64K42j259J548n11j518K581j342r32K056j155m25J365p37l8M43j333
$$ plain form
1805 -889 461 466 -951 842 -43 -1145 838 -270 -949 936 -562 -259 647 -618 280 385 -900
1822 -900 693 209 -700 974 386 -987 1053 -25 -594 648 -516 -99 382 -897 439 89 -1116
1839 -1116 787 196 -1033 957 302 -749 909 -110 -397 431 -719 28 350 -935 757 227 -1326
1856 -1326 658 62 -1152 890 132 -582 620 -166 15 464 -568 473 621 -892 887 239 -1203
1873 -1203 893 -150 -740 614 -285 -462 527 -777 -112 403 -790 575 592 -881 433 444 -664
1890 -664 730 106 -251 526 -257 -167 603 -942 308 583 -966 767 159 -1021 264 -43 -495 595
1908 595 50 -55 519 -567 116 597 -891 602 748 -812 672 435 -840 475 -98 -603 380 -575
1926 -575 10 556 -927 108 647 -868 555 443 -670 606 307 -546 452 -178 -350 546 -819 70
$$ packed form
1805h89J350Nj417J793q85j102J983j108o79J885j498L03R06j265Q98J05j285
1822i00J593m84r09J674n88j373K040j078n69J242j164M17M81j279J336l50j205
1839a116J903n91j229J990o55j051J658j019k87Q28j150P47L22j285J692n30j553
1856a326J984n96j214K042p58p14J202p86J81M49j032J041J48j513J779o48j442
1873a203K096j043n90J354q99j77R89j304O65N15j193J365J7j473J314J1j108
1890f64J394o24l57P77p83R0P70j545J250K75j549J733o08j180J285l07m52J090
1908E95n45j05N74j086O83M81j488J493J46j560J484k37j275J315n73n05R83r55
1926e75N85N46j483J035N39j515J423j12j113J276k99q53R98o30j72Q96j365Q89
$$ plain form
1944 70 368 -1069 317 518 -1107 398 400 -768 479 -86 -412 538 -395 -28 934 -672 189 747 -780
1963 -780 359 580 -881 512 12 -541 375 -330 -248 503 -655 -52 745 -817 306 616 -712 416
1981 416 435 -291 460 127 -445 326 -500 -220 423 -625 97 533 -823 101 451 -787 167 132 -765 490
2001 490 144 -264 851 -404 -110 694 -637 296 556 -899 380 162 -755 464 19 -702 682 -481
2019 -481 -329 673 -428 260 733 -729 194 346 -596 676 -18 -433 756 -181 -508 594 -467 20
2037 20 413 -978 82 583 -874 22 257 -558 438 8 -299 600 -87 -68 588 -404 146 592 -738
2056 -738 159 351 -982 152 322 -631 335 94 -213 698 -407 -75 562 -477 247 604 -620 356
2074 356 384 -767 521 8 -656 517 -147 -354 405 -417 -21 301 -512 -23 319 -745 570 388 -464
$$ packed form
1944G0K98j437J386K01j625J505Kj168J247n65l26R50r33L67R62j606Q61N58j527
1963g80J139K21j461J393n00n53R16p05Q2P51j158O03P97j562J123L10j328J128
1981D16J9p26P51l33n72P71q26K80O43j048P22M36j356R24L50j238R54l5q97J255
2001D90l46m08J115j255K94Q04j331R33K60j455J279k18r17J219m45p21J384j163
2019d81J52J002j101O88M73j462R23J52r42J272o94m15J189r37l27J102j061M87
2037B0L93j391J060N01j457Q96K35q15R96m30l07Q99o87J9O56r92N50M46j330
2056g38Q97J92j333J134J70r53R66k41l07R11j105L32O37j039P24L57j224R76
2074C56K8j151J288n13o64J173o64k07P59q22L96L22q13M89L42j064J315j82q52
$$ plain form
2093 -464 567 4 -410 472 -503 -69 725 -783 63 535 -773 48 358 -677 175 -20 -373 560 -155
2112 -155 -271 571 -626 129 885 -359 349 593 -621 105 525 -718 322 39 -206 461 -549 -165
2130 -165 398 -676 80 563 -729 203 292 -615 330 203 -407 567 -164 -169 682 -431 -322 361 -854 -245
2150 -245 791 -566 -166 170 -592 415 -185 -266 565 -194 51 758 -603 -203 800 -624 0 518
2168 518 -371 272 -233 -349 361 -562 -453 802 -475 -199 691 -745 -217 522 -379 231 334 -162 537
2187 537 -150 -346 520 -461 -334 814 -696 -198 588 -805 -224 344 -496 258 178 -413 624 -154 -408
2206 -408 662 -124 -17 789 -551 -140 650 -468 -64 243 -650 345 -125 -407 617 -206 -462 712
2224 712 -326 -152 671 -365 223 467 -264 160 264 -300 543 -278 -552 507 -570 -498 518 -171 -292
$$ packed form
2093d64J031n63m14Q82r75M34P94j508Q46M72j308Q21L10j035Q52j95l53R33p15
2112a55j16Q42j197P55P56j244P08K44j214P26M20j243J040k83k45O67j010L84
2130a65N63j074P56M83j292R32Q9r07R45j27o10R74p31nQ51j113J09O83j215O09
2150b45J036j357M00L36p62J007o00q1Q31p59K45P07j361M00J003j424O24N18
2168E18q89O43n05j16P10r23J09J255j277K76Q90j436N28P39r01O10J03m96O99
2187E37o87j96Q66r81J27J148j510M98P86j393N81N68q40P54q0n91J037p78k54
2206d08J070p86J07Q06j340M11P90j118M04L07q93R95m70k82J024q23k56J174
2224G12j038J74Q23j036N88K44p31M24J04n64Q43q21k74J059j077P2J016o89j21
$$ plain form
2243 -292 452 -255 -72 120 -492 626 3 -326 714 -217 -188 778 -460 -233 587 -551 93 322 -615
2262 -615 103 238 -410 296 -222 -318 701 -296 -409 556 -288 5 558 -369 78 315 -349 316 -370 -532
2282 -532 488 -286 -499 430 -241 -376 449 -375 -115 446 -204 527 16 -418 688 216 -525 677 -208
2301 -208 -565 513 -303 -450 524 -229 34 87 -313 524 90 -56 629 -146 -354 661 -157 -333 331 -179
2321 -179 -50 350 -436 297 200 -466 657 -122 -492 602 -121 -572 436 -157 32 379 -219 101 192 -261
2341 -261 483 369 -361 528 139 -432 513 14 -479 411 -325 -118 154 -402 11 119 -624 647 98 -640
2361 -640 745 103 -411 547 -112 -54 478 -204 36 67 -707 218 -13 -637 328 171 -416 419 183 -228
2381 -228 572 23 19 323 -172 168 103 -539 190 100 -450 384 27 -362 365 -118 -380 234 -195 61 365
$$ packed form
2243b92P44p07J83J92o12J118o23l29J040r31K9R66j238K27Q20j138O44K29r37
2262f15P18J35o48P06n18r6J019r97j13R65q44K93N53r27M47K37o64O65o86j62
2282e32J020p74k13R29o71j35Q25q24K60N61o50P31n11m34J106m72p41J202q85
2301b08l57J078q16j47R74p53K63N3m00Q37m34j46O85p75k08J015q18j76O64n10
2321a79J29M00p86P33r7o66J123p79l70J094p23m51J008n93J89L47n98L20R1m53
2341b61P44j14p30Q89l89n71R45m99m93Q90p36K07K72n56M13J08p43J271n49p38
2361f40J385o42n14R58o59N8N32o82K40L1p74R25k31o24R65j57n87Q35k36m11
2381b28Q00n49mL04m95L40o5o42P29r0n50Q34l57l89P27m83k62O14m29K56L04
$$ plain form
2402 365 -594 198 272 -454 429 197 -514 559 107 -249 465 -251 42 364 -293 122 100 -743 346 219
2422 219 -342 203 77 -417 367 32 79 348 -458 144 256 -404 364 387 -776 436 25 -583 180 -245
2442 -245 -399 291 -526 -171 373 -400 179 430 -639 303 296 -574 226 55 -42 471 -241 -186 192 -439 95
2463 95 349 -477 -62 231 -441 338 249 -476 347 -161 -235 310 -188 237 249 -540 -10 240 -360 201 -15
2484 -15 -378 197 45 -258 294 -16 -141 174 -187 -147 560 -286 348 540 -326 401 218 -496 42 -17 -355
2505 -355 257 -152 -274 377 -364 119 348 -438 186 107 -403 304 81 -317 307 -154 -82 273 -175 -134 411
2526 411 -292 199 137 -274 161 48 -449 269 118 -193 397 -164 78 488 -88 -8 364 -226 -4 183 -339
2547 -339 187 104 -253 29 -5 -241 184 -121 22 241 -490 -46 231 -491 331 43 -455 410 -12 -213 240
$$ packed form
2402C65r59P92P4p26Q83k32p11J073m52l56P14p16K93L22o57M15k2q43J089j27
2422B19n61N45j26m94P84l35M7K69q06O02J12o60P68K3j163J212m11o08P63m25
2442b45j54O90q17L55N44p73N79K51j069R42pq70Q00j71r7N13p12N5L78o31N34
2463I5K54q26M15K93o72P79q9p25Q23n08p4N45m98M25J2p89N30K50o00N61k16
2484a5l63N75j52l03N52l10j25L15l61M0P07q46O34J92q66P27j83p14N38n9l38
2505c55O12m09j22O51p41M83K29p86O24p9n10P07k23l98O24m61P2L55m48M1N45
2526D11p03M91o2m11M35j13m97P18j51l11N90n61K42M10n76Q0L72n90K22J87n22
2547c39N26q3l57K82l4k36M25l05J43K19p31M44K77p22Q22k88m98Q65m22k01M53
$$ plain form
2568 240 -88 -252 284 -54 11 179 -363 154 386 -572 138 293 -496 380 -130 -390 242 -184 -29 338
2588 338 -184 -220 390 -251 349 96 -575 109 77 -354 236 -115 -120 227 -397 -18 223 -199 90 226 -446
2609 -446 176 166 -338 182 -28 -386 295 -190 -295 260 -386 22 304 -485 184 137 -520 91 -26 -212 381
2630 381 -18 -104 333 -334 94 278 -279 92 57 -434 68 -3 -403 184 -8 -257 291 -29 162 449 -158
2651 -158 -74 282 -315 113 137 -64 144 30 -240 267 -22 -196 560 -340 -214 263 -331 -230 411 -98 3
2672 3 13 -167 209 207 -161 314 -140 -218 321 -79 -28 375 -148 -50 65 -347 55 97 -274 219 -135 -251 351
2695 351 -138 -124 340 -399 53 353 -423 271 188 -301 160 -73 -430 377 -351 -166 428 -235 -26 259 -300
2716 -300 93 137 -263 305 153 -22 307 -181 -200 358 -390 -23 436 -499 -274 388 -330 -130 280 -345 171
$$ packed form
2568B40l28j64N36l38O5J68n42N17K32r58P10J55p89Q76n10k60O32m26J55L67
2588C38n22l6O10o41O00k53o71O84l2m31N90l51nL47o24L79K41m22K89J36o72
2609d46O22j0n04N20k10l58O81m85j05N55o46M08K82p89O69m7o57O11j17j86N93
2630C81l99q6M37o67M28J84n57L71l5m91N02p1m00N87j92k49N48l20J91K87o07
2651a58Q4L56n97M28K4k01K08j14k70N07k89j74P56r00J26M77n94J01O41n09J01
2672CJ0j80L76kl68M75m54p8N39m00N1M03n23R8J15m12M02M2l71M93l54j16O02
2695C51m89J4M64p39M52L00p76O94q3m89M61k33l57Q07p28J85N94o63K09K85n59
2716c00L93M4m00N68j52j75L29m88j9N58p48L67M59r35K25O62p18K00M10o25N16
$$ plain form
2737 171 38 -246 340 -83 -146 686 -271 190 337 -297 -9 155 -402 -42 68 -211 236 -85 -416 314
2757 314 -108 -35 498 13 -37 347 -371 221 493 -176 290 108 -173 121 -201 -101 259 -361 -74 356 -212
2778 -212 43 30 -411 30 -12 -143 332 -70 -241 284 -150 -172 385 -366 -27 208 -252 -64 214 -225 210
2799 210 -147 -48 55 -320 -330 206 -112 -330 113 -98 -9 311 -234 70 8 -317 96 -17 -177 352 -312
2820 -312 -61 409 -303 -100 171 -298 -125 102 -98 20 64 -274 241 -118 -367 409 -80 99 215 -65
2840 -65 -34 181 -299 32 -20 -212 223 -91 -390 341 -144 -242 408 -292 -213 248 -150 -26 156 -385 -126 -162
2862 -162 -510 213 -40 -261 518 -4 -28 176 -151 48 206 -161 243 12 -164 389 81 -371 142 -35
2882 -35 -342 485 -194 -194 226 -43 -40 55 -442 345 100 -499 174 -137 -318 398 113 -68 281 -488 -66 280
$$ packed form
2737A71j33k84N86m23o3Q32r57M61J47o34K88J64n57L60J10k79M47l21l31P30
2757C14m22P3N33m85n0L84p18N92K72o69M66j82k81K94l22J00L60o20K87M30n68
2778b12K55j3m41M41m2j31M75m02j71N25m34k2N57p51L39K35m60J88K78m39M35
2799B10l57R9J03l75j0N36l18k18M43k11Q9L20n45L04o2l25M13j13j60N29o64
2820c12K51M70p12K03K71m69J73K27k00J18M4l38N15l59k49P76m89J79J16k80
2840f5L1K15m80L31n2j92M35l14k99P31m85r8O50p00P9M61l98J24J82n41K59l6
2862a62l48P23k53k21P79n22k4K04l27J99J58l67M04k31j76N53l08m52N13j77
2882c5l07Q27o79%M20k69LR5m97P87k45n99O73l11j81P16k85j81L49p69M22L46
$$ plain form
2904 280 -301 196 129 -398 78 176 -508 28 9 -217 211 -196 39 215 -122 75 232 -153 169 52 -402
2925 -402 202 108 -270 330 -66 -243 202 -65 -22 271 -271 -184 316 -242 115 165 -484 252 -26 -182 -91 -169
2947 -169 74 282 -282 168 296 -97 276 -74 -336 15 26 -127 105 14 -23 260 124 51 263 -192 166
2968 166 251 -335 148 243 -135 319 20 -268 329 -203 -142 170 -423 34 150 -320 108 242 -253 24 84
2989 84 -345 305 -226 -219 304 -61 96 213 -197 -213 9 -174 125 -163 -280 211 109 -350 213 -51 -264
3010 -264 451 -286 96 264 -260 -144 50 -172 373 59 -460 494 -59 -147 -39 -17 -104 197 -304 -120 229
3031 229 -175 103 208 -337 232 334 -363 124 -114 -61 214 -428 -128 18 -401 180 438 -234 238 -40
3051 -40 -149 157 139 -275 256 -202 -170 188 -224 -178 33 -161 2 104 -311 266 274 -273 -120 -100 -229 257
$$ packed form
2904B80n81M97o7n27M76R8o84N36j9k26M28m07K35J76l37J97J57l85L22j17m54
2925d02O04r4l78O00l96j77M45k67M3K93n42Q7N00n58L57N0o49P36k78j56R1p8
2947a69K43K08n64M50J28l93L73l50k62L51J1j53K32r1l7K83j36p3K12m55L58
2968A66Q5n86M83R5l78M54k99k88N97n32O1L12n93M57J16m70M28J34m95K77O0
2989H4m29O50n31PN23l65J57J17m10j6K22j83K99k88j17M91j02m59N63k64k13
3010b64P15p37L82J68n24J16J94k22N45l14n19R54n53q8J08K2q7L01n01J84L49
3031B29m04K78J05n45N69J02o97M87k38N3K75o42L00J46m19N81K58o72M72k78
3051d0j09L06j8m14N31m58L2L58m12M6K11j94J63J02m15N77Qn47J53K0j29M86
$$ plain form
3073 257 -120 -40 136 -57 128 404 -272 9 146 -387 222 108 -179 -6 -195 -253 206 -218 84 132 -415
3094 -415 94 26 -101 4 58 -70 321 -133 -262 297 -107 -2 317 -213 -87 217 -88 102 109 -358 10
3115 10 -113 -203 16 138 -25 340 -49 137 320 -333 129 203 -419 292 -29 -424 193 -294 -190 52 173
3136 173 -333 341 -146 -143 -18 -316 90 283 83 105 65 -414 316 -52 -197 95 -54 -79 285 -147 134 10
3158 10 -339 283 -77 -157 -90 -85 -165 145 -178 -189 219 -125 -38 175 -345 103 221 -141 67 48 -401 138 -152
3181 -152 12 80 -205 -2 330 -434 -15 181 -169 235 59 -274 192 1 -68 318 -109 -91 141 -310 -92
3202 -92 143 -188 -62 11 -371 257 344 -102 424 -8 -50 351 10 -231 191 -145 -130 227 17 163 119 -316
3224 -316 -67 213 -163 212 -105 -20 300 -114 116 348 -205 375 204 -257 101 250 -80 108 18 -2 91
$$ packed form
3073B57l77Q0J76j93J85K76o76K81J37n33O09j14k87J73j89n8M59m24L02M8n47
3094d15N09o8j27J05N4j28L91m54j29N59m04J05L19n30J26L04l05J90Pm67L68
3115A0j23r0K19J22j63L65l89J86J83o53M62P4o22P11l21l95O17m87J04K42J21
3136A73n06O74m87LJ25k98M06J93k00K2m0m79P30l68j45K92j49k5L64m32K81j24
3158A0l49O22l60q0O7Nq0L10l23j1M08l44Q7K13n20M48J18l62K08j9m49N39k90
3181a52J64O8k85K03L32p64M19J96l50M04j76l33M66j91o9L86m27J8K32m51K18
3202i2K35l31J26P3l82O28Q7m46N26m32m2M01l41k41M22l36J5L57k10J46m4m35
3224c16K49K80l76L75l17Q5L20m14K30K32n53N80j71m61L58J49l30J88r0k0R3
$$ plain form
3245 91 -244 -49 261 -202 93 140 -158 18 167 -31 174 -61 -228 144 -93 79 164 104 -143 114 -114
3266 -114 221 238 -198 30 53 -295 40 -34 -316 344 88 -87 370 -288 -78 120 -51 54 283 -430 164
3287 164 181 -136 308 10 67 320 -176 -181 312 20 89 518 -359 67 24 -143 261 -5 -304 239 -109 -91
3309 -91 64 -208 -28 369 -43 -31 -10 -360 56 -104 -92 264 -183 -101 193 -67 82 216 -103 -129 149 -101
3331 -101 197 175 -268 162 101 -45 202 -160 -87 322 85 -116 61 -60 175 117 -324 119 205 -209 184 -48
3353 -48 -171 194 -198 -94 79 -201 202 23 -237 171 -41 20 76 -34 -156 290 38 -114 246 -98 -153
3374 -153 179 -145 125 154 -257 161 10 -9 16 -82 -170 283 102 -272 416 -177 -53 180 -250 101 226 -244
3396 -244 17 136 -127 197 87 -121 248 206 -144 174 -220 52 164 -231 146 75 -354 167 19 -98 412
$$ packed form
3245I1l35J95L10m63K95M7k98J76J49j98K05k35j67L72k37J72Q5o0k47K57k28
3266a14L35J7m36K28K3l48L35p4k82O60k56j75M57o58K10J98j71J05K29p13N94
3287A64J7l17M44k98N7K53m96nM93k92O9M29q77M26m3j67M04k66k99N43l48J8
3309i1J55k72J80L97m12J2K1l50M16j60J2L56m47Q2K94k60J49J34l19k6K78k50
3331a01K98k2m43M30o1j46K47l62P3M09k37k01J77j21K35n8m41M43Q6m14L93k32
3353d8j23L65l92J04J73k80M03j79k60M08k12O1N6j10j22M46k52j52L60l44n5
3374a53L32l24K70K9m11M18j51j9K5r8q8M53j81l74O88n93J24K33m30L51J25m70
3396b44K61J19k63L24j10k08L69m2l50L18l94K72J12l95L77p1m29N21j48j17N10
$$ plain form
3417 412 -269 -229 347 -31 74 -18 -75 -67 116 -241 -38 105 -281 348 -42 -101 29 -56 39 307 36 45 268
3440 268 -263 113 70 -102 114 96 -110 44 2 -39 114 -55 -62 127 -148 23 -71 -77 274 -39 -343 141 61
3463 61 -67 281 119 -175 240 81 -227 46 -182 83 37 -168 158 205 -126 87 -80 -79 152 -62 -58 90
3485 90 -45 -13 110 -264 98 107 -194 156 84 -161 258 -105 52 82 -71 48 86 -152 144 90 -50 190 49
3508 49 -62 127 100 -304 119 -166 76 101 -122 -55 86 -237 21 -35 -258 160 -32 -245 320 121 72 230
3530 230 -41 -91 -145 -151 4 210 -256 123 220 -103 191 31 -282 -136 -85 43 200 -27 29 129 48 -3 184
3553 184 -235 252 69 -95 -23 7 -14 67 -279 -34 109 -151 -227 169 -45 -138 84 -202 116 -70 -204 140
3575 140 -72 7 100 -66 -194 121 -371 117 267 -48 68 120 -40 149 -29 80 156 -133 -71 204 -91 -7
$$ packed form
3417D12o81M0N76l78J05r2n7QJ83l57K03J43l86O29l90n9J30q5R5K68k71RK23
3440B68n31L76m3j72K16j8k06J54m2m1J53j69pJ89k75J71r4oL51l13l04M84q0
3463F1j28L48j62k94M15j59l08K73k28K65m6k05L26M7l31K13j67JK31k14MJ48
3485I0j35L2J23l74L62Rl01L50p2k45M19l63J57L0j53J19L8k38K96n4j40K40j41
3508D9j11J89k7m04M23k85K42K5k23O7J41l23K58n6k23M18j92k13N65j99m9J58
3530B30k71n0n4oJ55K06m66L79R7l23K94j60l13J46N1J28J57k27N6J00q1n1J87
3553A84m19M87j83j64P2L0k1Q1l46K45J43k60p6L96k14r3K22k86L18j86j34L44
3575A40k12P9R3j66j28L15m92M88J50l15J16N2j60J89j78J09P6k89O2K75k95Q4
$$ plain form
3597 -7 233 -82 117 -16 32 50 -88 -138 195 313 -164 104 -58 136 158 -44 151 -33 -126 15 150 -202
3619 -202 134 -51 -150 215 24 -380 52 145 -179 -116 -236 -25 -133 -192 61 133 -279 124 -72 -51 -55 -142 -112
3642 -112 -68 -282 14 98 -238 -84 -124 -158 149 50 157 210 -43 -68 99 0 -186 201 -276 148 14 -384 106
3665 106 77 -112 236 -24 -109 379 -157 85 88 -108 74 -94 -194 -61 47 -473 -21 240 -80 331 -80
3686 -80 -5 22 -63 40 -79 -159 -124 -207 -254 168 93 86 390 -114 -219 110 120 127 34 -189 144 101 -207 186 74
3711 74 -287 89 27 -244 54 -44 160 232 -204 -191 202 -212 125 5 -74 65 275 -142 112 194 -53 46 -253
3734 -253 -72 133 -172 128 126 -402 -65 240 -9 47 147 -235 439 -75 147 89 -87 77 252 -253 -229 291
3756 291 -307 36 115 -71 147 39 -22 295 -209 -118 8 -37 -89 235 -172 89 59 -362 -42 131 18 89
$$ packed form
3597gK40l15J99j33M8J8j38n0L33J18m77K68j62J94K2k02J95j84r3J41J35l52
3619b02L36j85r9L65j91m04M32R3l24O3j20K11j08n9K53P2m12M03j96K1mq7L0
3642a12M4k14K96Q4l36J54m0l4L07r9J07N3k53k5J67r9j86L87m77M24j34l98M90
3665A06k9j89L48k60q5M88n36K42Lj96J82j68j00J33J08n20M52K61l20M11m11
3686h0P5K7q5J03j19q0L5q3m7M22p5pL04n04j05L29J0Pr3k23L33m3l08L93j12
3711G4l61L76o2k71K98r8K04P2m36J3L93m14L37j20p9J39K10m17K54Q2k47R9k99
3734b53J81K05l05L00kn28L37L05k49N6J00l82O74n14K22n8j76J64J75n05K4N20
3756B91n98L43P9j86K18j08o1L17n04R1J26m5n2L24m07K61l0m21L20J73j13P1
$$ plain form
3778 89 257 157 140 -97 -209 39 -99 131 -119 -208 297 131 -300 209 106 -97 201 66 -84 80 -151
3799 -151 67 481 -84 72 3 -28 -123 -76 -202 312 -72 -31 256 -243 -215 197 -8 54 93 16 213 -29 -45
3822 -45 103 -173 -128 156 -98 -231 4 -30 -24 260 17 234 110 -31 148 66 -14 203 64 -147 205 -4
3844 -4 -202 312 -56 -138 120 -35 241 103 111 36 77 -39 87 -175 79 59 -53 94 117 -14 202 76 -263
3867 -263 61 -173 -141 109 87 -228 390 62 -101 137 -221 15 101 -21 54 63 -269 146 -32 -84 189 -153
3889 -153 28 127 -12 117 25 -199 -145 57 -258 251 -226 16 119 65 -213 187 -20 -127 111 -103 -131 228
3911 228 -58 -41 91 29 175 -59 -266 60 198 -342 197 -199 -145 60 39 88 79 -68 101 -89 -193 236
3933 236 6 -98 230 -120 -92 27 -70 -65 -14 -97 74 -50 -159 158 -31 -263 60 31 -154 215 -39 -18 190
$$ packed form
3778H9J68j00j7k37j12K48j38K30k50q9N05j66m31N09j03k03K98j35j50J64k31
3799a51K18M14n65J56o9l1r5M7j26N14l84M1K87m99K8M12k05O2L9p7J97k42j6
3822d5J48k76M5K84k54j33K35l4OK84k43K17j24j41J79q2q0K17j39k11L52k09
3844dj98N14l68q2K58j55K76j38Qp5M1j16J26k62K54k0j12J47K3j31K16j26l39
3867b63L24k34L2K50k2l15O18l28j63K38l58K36Q6j22P5Rl32M15j78n2K73l42
3889a53J81R9j39J29r2k24N4K02l15N09m77K42J03n4k78M00k07j07K38k14k8L59
3911B28k86J7J32o2J46k34k07L26J38n40N39l96N4K05k1M9rj47J69j90j04M29
3933B36k30j04L28l50K8J19r7NN1q3J71j24j09L17j89k32L23k9j85L69k54K1K08
$$ plain form
3956 190 -29 -15 137 6 -7 -74 -157 271 62 -57 102 -132 -59 63 -293 -20 186 -131 -77 -36 -26 83 156
3979 156 74 -29 -190 -410 51 -102 -37 42 -75 -49 32 -175 111 354 -114 -21 46 -173 4 227 -115 245
4001 245 -60 -54 66 41 -69 14 -187 -149 -203 -185 137 -191 -306 98 -96 -120 189 89 -45 87 -3 -135 55
4024 55 -235 -47 -23 -122 75 33 -190 248 -2 -111 67 -69 -81 130 -240 -28 52 -149 -41 -29 -72 200 -92
4047 -92 105 194 -181 2 270 -238 -167 -28 -53 114 37 -83 27 -17 -195 175 -72 41 135 -117 80 -32
4069 -32 -118 -24 113 57 119 15 -35 132 54 -7 294 -56 -15 114 -43 -133 205 -84 59 128 194 186 -88 12 294
4094 294 39 -229 202 -165 -33 18 -170 141 18 -104 64 -95 -158 160 -70 68 33 -244 12 87 87 -69
4116 -69 -115 -14 -58 258 -416 -9 -76 -118 127 -81 -114 287 30 170 162 -65 -141 67 -247 186 -126 -121 247 147
$$ packed form
3956A90k19J4J52j31j3o7q3M28k09j19J59k34P3J22l56K73K06l17N4M1J0J09P3
3979A56q2j03j61k20M61j53O5P9j17K6Q1k07K86K43m68R3O7k19J77K23l42L60
4001B45l05OJ20k5j10Q3k01L8n4J8L22l28j15M04j94k4L09j00j34J32r0j32J90
4024E5k90J88K4r9J97m2k23M38k50j09J78j36j2K11l70K12Q0k01J08J2m3K72k92
4047i2J97Q9l75J83K68n08P1J39k5J67p7j20J10m4j78L70k47J13R4k52J97j12
4069c2q6R4J37n6O2j04n0J67p8o1L01l50M1J29j57r0L38k89J43O9O6qk74J00K82
4094B94k55k68M31l67J32N1j88L11j23j22J68j59o3L18k30J38l5k77K56P5%j56
4116f9m6J01m4L16o74M07o7m2K45k08l3M01k57J40qk27p6K08l14M33l12NL68j00
$$ plain form
4140 147 137 -43 70 -9 20 -229 20 120 83 170 8 -261 -9 -275 -144 310 -22 41 284 101 -62 144
4162 144 -84 -52 27 -32 51 206 -170 227 331 147 22 -152 18 -31 -96 43 206 -179 -8 -120 -117 27 -78
4185 -78 -69 190 -27 -80 211 -119 -214 113 -143 -28 120 -135 32 72 -68 -103 -181 -279 152 14 -73 -16 -149 35
4209 35 81 -153 -27 168 -166 145 -80 -131 39 244 -137 249 -102 -86 -35 -156 -176 122 34 -116 -42 -100 -156
4232 -156 46 -113 -123 -187 -76 70 19 -1 -1 -222 -113 5 -127 83 71 -295 136 -147 -90 138 -10 72 213
4255 213 -46 -93 -80 -9 15 57 -84 72 94 -27 117 -116 -257 229 -9 91 112 -96 276 -104 53 -160
4277 -160 110 5 210 -2 54 242 5 113 -13 31 74 196 8 -130 51 -157 140 -17 -323 111 -60
4298 -60 90 -10 150 30 85 -48 -17 -93 27 5 -24 29 179 -25 -159 172 45 -174 144 85 -13 57 -125
$$ packed form
4140A47j0j80J13p9K9k49K49J00l7Q7j62k69K52k66J31M54l32O3K43j83j63K06
4162A44k28L2P9n9Q3J55l76L97J04j84j25j74J70m9o5J39J63l85J71j12LJ44j05
4185g8RK59k17n3K91l30r5L27k56J15J48k55J67M0j40l5p8r8M31j38q7N7j33J84
4209C5M6k34J26J95l34L11k25n1J70K05l81L86l51J6N1j21k0K98q8j50P4n8n6
4232a56K02j59j0o4J11J46n1k0%k21J09J18j32K10j2l66M31k83N7K28j48Q2J41
4255B13k59m7J3P1K4M2j41J56K2j21J44k33j41M86k38J00K1k08L72l80J57k13
4277a60K70j05K05k12N6J88k37J08j26M4M3J22j88j38J81k08K97j57l06M34j71
4298f0J50j00J60j20N5j33L1p6J20k2k9N3J50k04j34L31j27k19L18n9r8P0j82
$$ plain form
4321 -125 -32 12 -121 65 -38 -172 56 -16 -60 88 120 -232 -36 46 -10 -62 -125 -155 -9 -54 179 74 -99 128
4345 128 8 -130 60 -105 -6 30 -192 -26 152 -25 -100 58 190 58 -84 33 157 140 156 -157 -85 99
4367 99 -140 52 -87 197 -50 6 21 -117 260 34 110 107 -271 -181 251 -193 -49 -93 -123 176 10 -8 -33 -46
4391 -46 -102 -42 110 -51 137 -89 -43 153 -28 -4 128 -57 151 -83 -156 -11 -230 -34 -96 4 65 30 61
4414 61 104 -159 34 143 207 21 -21 47 -39 20 34 28 -28 -192 21 -4 80 75 87 -61 84 135 27 370 -162 301
4440 301 82 -75 40 124 -176 -10 55 -293 38 23 -33 282 111 -45 -67 144 -146 71 29 -70 79 -76
4462 -76 25 -138 25 34 -28 -251 66 73 -102 368 29 54 5 29 18 -79 -210 168 -115 -23 -79 -19 205 -9 33
4487 33 -32 53 -215 65 -8 172 -191 -117 -76 99 -124 -100 -28 97 27 187 -163 88 60 89 -78 5 73 99 102
$$ packed form
4321a25R3M4j33J86j03j34K28p2m4J48L2l52J96Q2n6n2o3l0J46m5K33j05j73K27
4345A28j20j38J90j65R9L6k22J66J78j77p5J58J32j32j42J17J24j7J6l13P2J84
4367I9k39J92j39K84k47N6J5j38L77k26P6ll78R0M32m44J44m4l0K99j66j8k5j3
4391d6n6O0J52j61J88k26M6J96j81K4J32j85K08k34p3J45k19J96o2J00O1l5L1
4414F1M3k63J93J09O4j86m2O8q6N9J4on6j64K13k5Q4nJ2j48J45N1j08L43n32M63
4440C01k19j57J15Q4l00J66O5l48L31j5n6L15j71j56k2K11k90K17m2r9J49j55
4462g6J01j63J63Ro2k23L17Pj75M70l39K5m9K4j1r7j31L78k83R2n6O0K24k14M2
4487C3o5Q5k68K80p3J80l63P4M1J75k23K4P2J25p0J60l50K51k8K9j67Q3O8K6L
$$ plain form
4512 102 -66 118 -32 -291 -35 69 -34 44 3 47 144 -14 143 123 -23 39 19 -67 148 43 -208 36 -176
4535 -176 -124 -9 85 -143 16 99 -128 124 -109 71 126 101 215 64 -56 119 -68 12 132 172 116 107 -218
4558 -218 112 -33 -67 125 62 -55 15 -7 -58 71 2 50 -132 -153 -57 -42 -232 -58 -35 -105 157 174 -37 -1 -178
4583 -178 85 138 -46 1 -191 -61 23 112 97 -14 66 78 217 -47 186 40 45 4 160 -96 7 121 -321
4606 -321 -34 -92 6 171 -66 -267 -31 8 189 137 13 67 -199 -131 -29 123 -15 74 -58 -45 -37 -189 255
4629 255 -39 -123 209 -50 35 57 57 106 -31 96 66 257 -141 35 -15 -340 -12 36 57 50 80 -56 -84 -105 -178
4654 -178 29 -26 -48 -199 -64 -56 -142 -59 130 -46 -198 345 -32 24 30 125 54 157 66 -139 -79 -92 205 129 -69
4679 -69 -36 215 141 38 -62 -47 -138 -184 127 -61 -77 -114 -1 -7 -2 53 -94 -68 77 -158 75 -66 -305 97 -125
$$ packed form
4512A02j68J84j50k59K56J04j03P8m1M4R7j58J57k0j46O2k0q6K15j05k51K44k12
4535a76N2J15R4k28J59Q3k27K52k33J80N5k5J14j51j20J75j87Q0J20M0n6rl25
4558b18L30j45l4J92o3j17P0k2n1J29o9M8j82k1R6J5j90J74K3p0K62J7k11L6j77
4583a78K63N3j84M7j92J30Q4Q9j5j11Q0J2J39k64K33j46Nm1J56k56J03J14m42
4606c21K87n8R8J65k37k01K36L9J81n2j24N4k66O8J02J52j38Q9j32J3Qj52M44
4629B55k94q4L32k59Q5K2%M9j37J27l0J91l98J76n0l25L28M8K1pL0j36k8k1p3
4654a78K07n5k2j51J35Qq6Q3J89j76j52N43l77N6OR5p1J03r1k05O0j3K97p6j98
4679f9L3K51p4j03j00J5r1m6L11j88j6l7J13oNN5j47K6J45k35K33j41k39M02k22
$$ plain form
4704 -125 10 62 54 46 56 96 139 265 -28 -32 -99 -130 -29 116 -130 184 148 159 -1 46 -72 -34 2 -54 135 -26
4730 -26 107 136 -171 223 -129 82 100 105 63 184 15 -172 5 -37 -49 123 82 -42 92 -95 -135 46 62 262
4754 262 -30 -114 92 -70 -9 65 -113 21 251 -41 130 66 -11 -24 -1 134 29 -275 -105 31 29 113 189 52
4778 52 94 317 -60 46 -228 48 -64 -278 -144 -33 -29 79 195 33 -123 -46 -90 75 -96 -13 -5 65 -35
4801 -35 -14 93 91 141 -85 -139 124 -102 -45 37 -55 -3 89 100 -52 -45 92 -32 287 -60 -87 -111 -135 -101 -162 -94 -73
4828 -73 -84 44 89 -13 50 -96 -125 -17 -55 119 -106 -90 48 -148 27 -80 -66 51 52 -94 56 163 -142
4851 -142 -130 108 -101 146 -4 -152 13 -61 -33 98 -44 24 65 -81 -11 115 77 -19 75 -49 121 -27 -84
4874 -84 204 -61 24 49 -94 163 91 -40 -108 84 -105 -102 -162 -96 -64 111 -133 32 -176 90 130 -108 40 -4
$$ packed form
4704a25J35N2qqJ0M0M3J26k93mo7l1J01J45k46L14l6J1j60M7j18L8L6n6J89j61
4730b6J33K9l07L94l52K11J8Nm2J21j69j87J77m2j2J72m1j24J34j87m0J81J6K00
4754B62k92q4K06j62O1P4j78J34K30k92J71o4p7j3K3J35j05l04J70J36kQ4P6j37
4778E2M2K23l77J06k74K76j12k14J34J11MJ08J16j62j56P7m4J65j71Q3QP0j00
4801c5K1J07kN0k26n4K63k26N7Q2r2N2R2J1j52PJ37j24L19l47k7k4k4L4o1O8K1
4828g3j1J28M5j02O3j46k9J08l8J74k25J6J38j96J75j07J4J17Jj46J50J07l05
4851a42J2K38k09K47j50j48J65p4K8J31j42O8M1j46P0J26l8r6R4j24J70j48n7
4874h4K88k65Q5K5j43K57p2j31o8J92j89Lo0O6L2J75k44J65k08K66M0k38J48m4
$$ plain form
4898 -4 69 219 73 -12 145 233 -77 -122 -180 -111 -108 111 200 -200 29 -96 66 53 174 -15 89 -25 146 -11
4922 -11 160 136 -41 91 1 98 -156 18 -131 -216 21 210 -40 -191 298 -15 65 219 46 -11 178 -131
4944 -131 -163 53 -149 71 142 13 -18 -52 -7 26 42 11 187 -98 53 -23 84 174 72 -5 39 -19 61 -118 -111
4969 -111 -16 -127 159 172 11 -245 39 -62 44 149 135 -60 210 -58 27 120 106 92 74 16 127 61 56 -89
4993 -89 68 -95 74 246 16 -47 -48 -81 -153 -122 -40 107 -110 -53 176 -75 -83 -147 115 -72 236 -14 41 -26 -117
5018 -117 -61 134 -60 24 108 37 -55 -60 108 -206 -19 248 27 -157 18 47 38 140 32 -110 109 -127 -76 76
5042 76 9 152 13 -165 78 84 72 89 -44 41 137 69 -161 160 -41 -89 1 85 92 -25 -254 -53 -16 -147 -33
5067 -33 -13 -89 4 134 49 21 -160 -36 71 -205 71 11 54 116 -188 -217 -166 76 -35 8 22 -224 123 -102
$$ packed form
4898dP3J50j46q5J57Q8l10m5n8O9LK19Q9m00K29j25J62j3J21j89J04j14J71j57
4922a1J71k4j77J32r0R7k54J74j49q5K37J89k50j51M89l13Q0J54j73n7J89l09
4944a31l2K16k02K20P1j29l1l4M5L3J6l1J76k85J51p6J07R0j02p7M4n8Q0j79P
4969a11R5j11K86J3j61k56K84j01J06J05j4j95K70k68Q5R3j4j4j8n8J11o6nj45
4993h9J57j63J69J72k30o3jl3p2L1Q2J47k17N7K29k51qo4K62j87L08k50N5o7r1
5018a17N6J95j94Q4Q4p1r2nJ68l14J87K67k21j84J75K9rJ02j08j42K19k36N1J52
5042G6o7J43j39j78K43Oj2J7j33Q5R6o8k30L21k01m8R0Q4Pj17k29K01L7j31J14
5067c3K0p6R3J30q5k8j81J24J07k76K76o0M3O2l04k9N1K42j11M3J4k46L47k25
$$ plain form
5091 -102 34 63 -282 69 -98 26 25 -142 -8 84 62 -18 -30 -151 74 93 26 -59 -45 -53 63 2 140 134 -118
5116 -118 -102 45 -160 -24 52 -7 67 -164 55 100 -31 -180 -28 65 -61 -124 94 -77 183 -2 96 -2 -129
5139 -129 51 166 -44 106 166 268 -7 -32 129 60 -140 -131 -219 24 -132 -52 -153 -95 -57 -152 -27 158 -99
5162 -99 107 -82 -160 165 -14 -104 -63 143 179 89 76 131 -198 -230 -91 -138 115 -245 145 -136 -44 -86 89 18
5186 18 -89 144 33 41 278 -66 44 -108 -260 -26 176 -107 26 103 26 -4 95 19 30 65 -118 63 3 25
5210 25 0 21 26 -2 -72 101 -103 4 29 60 -246 55 -126 115 86 77 -47 36 37 -10 63 -16 27 101 123 -125 -109
5237 -109 -98 57 -18 81 10 62 -146 71 -46 -33 -18 -137 40 -231 165 35 1 -62 53 121 135 62 29 33 18
5262 18 73 -104 -12 -52 46 83 -84 35 47 195 96 -214 -26 -8 -157 -75 6 -14 -284 97 -11 216 -117 -259
$$ packed form
5091a02J36K9l45L51j67J24jj67J34R2k2q0j2j21K25J9o7q5J4qJ16o1J38ok52
5116a18J6J47k05J36P6n9P4k31K19M5j31j49J52R3j26o3K18j71K60j85R8r8j27
5139a29J80J15k10J50O0J02k75k5J61o9k00Rq8K43j56Q0j01N8L8r5J25J85k57
5162i9K06j89p8L25j79r0M1K06L6r0j3N5l29l2J39m7K53l60L90k81R2m2J75p1
5186A8j07K33j11QK37l44J10j52j52K34K02k83J33P7p7l0R9p6J1L5j83J81o0K2
5210B5k5K1Nk8p0J73k04J07K5L1l06L01j81K41k9rj24Q3Jm7P3p9M3P4K2k48J6
5237a09J1J55p5R9p1N2k08K17j17J3J5j19J77k71L96j30l4o3J15O8J4p3l3Mj5
5262A8N5j77R2m0R8L7j67J19J2J48r9l10J88J8j49Q2Q1k0k70L81j08K27l33j42
$$ plain form
5286 -259 14 248 187 26 -115 62 -8 119 -25 93 68 81 -81 -139 82 -185 66 -80 19 185 151 101 45
5309 45 -81 -163 19 218 -50 24 -23 216 60 -110 -144 -32 -181 29 -155 -78 134 53 96 23 -67 -146 48 18
5333 18 15 249 -215 81 91 6 4 256 -56 50 -13 110 141 154 67 130 -162 75 10 175 258 -131 -3 -120 128
5358 128 -195 103 -62 176 -109 134 -88 242 -90 -99 -105 -136 88 -21 94 -87 143 -83 74 -139 -302 -28
5380 -28 -152 46 17 70 125 -136 80 -97 73 -22 24 34 -41 142 -173 -2 246 170 27 -79 -6 111 -35
5403 -35 14 11 -210 2 -250 -205 23 110 -60 -13 11 -110 -24 -132 -36 212 -16 -104 14 -48 -78 -118 18 -118 103
5428 103 139 28 -20 -22 -57 34 34 170 -85 -83 -84 32 -92 -61 -104 -308 -204 9 -130 -136 71 -95 -81 -67 87 -43
5454 -43 32 21 9 382 -125 -93 -38 -116 154 -67 52 -51 -90 1 -77 40 -49 -35 -27 -122 -150 75 -20 -122 -67 -162
$$ packed form
5286b59K73K34o1j61j41J77p0J27j44J18k5J3j62n8K21k67K51j46R9J66l4n0n6
5309D5j26q2J82J99k68P4m7K39j56j70l4J12j49K10j84P7K12q1M3p3r0p9J94l0
5333A8lK34m64K96J0q5kK52l12J06o3J23L1J3q7O3k92K37o5J65Q3l89J28j17K48
5358A28l23K98j65K38k85K43k22L30l32rol1K24j09J15j81K30k26J57k13j63K74
5380b8j24J98k9N3N5k61K16j77J70r5M6J0p5J83l15J71K48p6j43j06P3J17j46
5403c5M9lk21K12k52M5K28Q7j70M7K4j21Q6j08R6K48k28q8J18o2l0m0J36j36K21
5428A03L6j11m8kl5R1%J36k55KjJ16j24L1m3k04J04K13j39oK07j66J4J4J54j30
5454d3P5j1j2L73n07L2N5p8K70k21J19j03l9R1p8J17q9J4Qr5k8K25r5j02N5r5
$$ plain form
5480 -162 -14 -76 -183 -76 -140 -22 105 -30 -50 13 -62 -205 55 -32 -300 165 89 27 -38 -190 46 28 -90
5503 -90 -9 -72 50 126 -1 -3 71 -108 -18 50 90 163 172 -216 -46 -62 -102 -198 -82 247 59 -23 18 141 27 -87
5529 -87 -117 158 45 117 88 -202 -15 35 -38 -27 169 232 242 -53 -5 -71 91 -77 -156 115 -38 19 -19 -76 75
5554 75 2 43 73 122 -35 -20 -38 -166 -70 -34 -90 108 -175 51 240 32 -50 94 18 -84 -37 -73 27 128 232
5579 232 59 -261 -178 26 -109 32 -66 -87 -67 37 -118 -95 27 60 214 4 -107 -53 36 -52 -118 23 40 -65
5603 -65 -100 -36 41 22 13 64 -211 261 -207 -204 34 182 17 20 92 117 -95 -57 -6 -90 -285 163 -93 -158 -84 -128 86
5630 86 -131 -254 -32 -32 -104 5 96 -67 33 76 131 113 -28 -28 -9 -37 -241 -94 23 -113 184 107 19 115 5
5655 5 42 200 36 46 -32 -111 -94 34 -62 -114 39 -53 -195 -166 26 7 52 100 320 139 6 -270 17 42 -185
$$ packed form
5480a62J48o2j07J07o4J18J27j35k0O3p5j43K60q7k68M65p6o2o5j52K36j8j18
5503i0Q1o3J22P6j27kP4j79R0O8M0P3Rl88J70j6m0r6J16L29j88q2M1J23j14j14
5529h7l0K75j13P2k9k90J87N0p3J1J96O3J0k95M8o6J62j68p9K71j53N7l8n7J51
5554G5p3M1L0M9j57J5j8j28R6L6n6J98k83K26J89k08q2J44p6j02M7l6J00J01J04
5579B32j73l20Q3K04j35J41r8k1K0J04j55K3J22L3J54k10j11N4Q9q8o6J41J7j05
5603f5l5O4P7j9rN1k75M72m68LK38J48j65LP2K5k12L8N1q4j95M48k56o5P4m4K14
5630H6k17j23K22%p2J09R1j63J00M3N5j8j41%J9k8k04J47J17j36K97p7q8R6j10
5655EL7J58j64J0p8p9J7J28r6n2J53r2j42K9J92j9M5M8K20j81j33k76K87K5k27
$$ plain form
5680 -185 -11 61 83 -14 319 -64 -35 70 -146 179 -87 -140 76 50 150 113 69 -218 -40 139 23 107 73
5703 73 65 -60 130 80 74 90 101 62 93 159 117 108 17 123 228 154 140 -92 18 -1 -283 -149 29 133 -161 81
5729 81 163 20 -10 -162 43 -154 61 -100 -54 155 62 -66 -213 160 -28 156 -25 10 50 22 167 22 85
5752 85 -35 45 -234 -61 55 -89 3 224 14 -54 121 -52 -159 -175 115 84 176 89 166 83 10 31 4 84 -35
5777 -35 -15 26 78 31 -41 -47 -52 221 145 66 133 -215 47 -97 -146 14 210 124 130 -35 -54 -6 157 1 36 33 -127
5804 -127 -76 14 -99 -45 9 -29 -82 -105 141 212 -90 -15 62 -272 -126 -2 -112 18 -84 201 85 56 72 -20
5828 -20 128 -108 48 235 83 -154 191 -7 -49 158 38 86 135 -83 -38 33 -33 90 217 28 -117 128
5850 128 68 41 -3 -82 38 104 103 65 51 -43 2 126 -47 -176 -109 -109 -195 132 107 288 36 121 49 129 -88 5 -52
$$ packed form
5680a85J74P2K2r7L33l83K9J05k16L25k66n3K16k6J00l7m4k87J78J79j16Q4l4
5703G3qj25J90n0oJ6J1l9L1O6m2rr1J06J05p4j4k32J10j9k82J34J78J04k94K42
5729H1Q2j43l0j52K05j97K15j61M6K09r3j28j47L73j88J84j81L5M0k8J45j45O3
5752H5j20Q0k79J73J16j44R2K21k10o8J75j73j07j6K90l1R2q7P7q3p3K1k7Q0j19
5777c5K0M1N2m7p2onK73p6p9O7l48K62j44m9J60J96q6Oj65j9M8J63j56L5lj60
5804a27N1R0j13N4N4l8n3k3K46P1l02P5P7l34J46J24j10J30j02K85j16k9J6r2
5828b0J48k36J56J87j52k37L45j98m2K07j20M8M9k18M5P1o6J23J27j89j45K45
5850A28o0k7m4p9J20O6jl8j4r4M5J24j73j29O7%q6L27k5J81k52Q5p2Q0k17R3n7
$$ plain form
5877 -52 -46 16 -23 155 -232 -96 -6 55 91 34 -92 75 48 166 -45 101 -18 125 100 8 92 89 166 184 109 56
5903 56 -102 -242 -14 22 35 -77 99 28 57 -29 -36 37 -56 166 20 73 -45 99 -31 -111 12 134 50 -4 84
5928 84 -191 -58 67 55 116 -135 -79 125 54 47 -66 0 -33 -156 71 178 -64 3 -169 -192 -95 42 15 -269
5952 -269 115 6 23 -11 -50 60 -56 -60 120 88 93 -148 7 -49 -9 15 -42 73 -34 14 -49 28 -30 139 -78
5977 -78 -37 -59 -39 62 4 69 -109 -33 55 -59 79 42 -4 -231 -35 102 116 73 -76 -274 32 82 25 -34 197
6002 197 46 222 6 -95 -158 -287 216 30 -206 -45 26 -57 128 121 115 12 101 54 -49 95 -7 49 -119
6025 -119 36 -112 -16 -27 -85 152 -336 104 26 -212 -68 55 128 99 -51 9 49 -134 26 139 36 87 110
6048 110 224 93 -92 141 -138 92 -100 -10 114 15 83 8 3 -136 60 162 95 -17 130 -94 -42 71 156
$$ packed form
5877e2OO2l9J78l87J36R0O1L6n7j26J67k7J18k11J46j19J43k5r2Q4lP7J8p5n3
5903E6j58j40K28L6J3j12J76p1K9q6pP3r3K22j46N3j18J44j30q0J23J22q4n4Q8
5928H4k75J33J25j2O1k51N6K04p1pj13O6l3j23K27J07k42O7j72k3R7J37k7k84
5952b69L84j09J7l4l9J10j16mJ80l2Nk41J55n6M0K4n7J15j07M8o3P7n8J69k17
5977g8M1k2K0J01n8O5j78P6Q8j14J38l7m6k27J96J37J4m3j49j98L06N0n7n9K31
6002A97j51J76k16j01o3j29N03j86k36J61P1q3J85poj03Q9m7j03J44j02N6j68
6025a19J55j48R6j1n8K37m88M40p8k38J44J23P3k9j50O0M0j83J60J13j03N1K3
6048A10J14j31j85K33k79K30j92R0J24r9O8p5nj39J96J02o7j12J47k24N2J13Q5
$$ plain form
6071 156 12 83 -58 183 -279 20 202 -122 47 -180 81 -67 -107 -55 35 -131 -65 95 -16 121 -17 86
6093 86 148 94 156 70 17 165 -139 114 70 -141 -61 -82 -75 26 18 -17 -38 -456 104 -42 100 24 2 -59 146 -33
6119 -33 48 79 -264 -73 -12 -63 26 -78 -123 126 -5 -180 -117 -83 14 98 -187 -210 55 -123 -67 91 3 -143 -49
6144 -49 -95 -124 -37 -109 8 -74 127 36 131 -109 -64 145 -15 -217 29 12 -130 -81 -247 225 -74 103 -41 36
6168 36 -19 93 -48 29 -102 40 60 -205 -188 -68 152 41 101 -100 195 138 -85 -14 -119 270 83 25 17 -16
6192 -16 41 -202 169 -113 23 65 134 -16 153 267 -48 57 -126 151 116 -57 125 181 51 10 -90 153
6214 153 -146 -328 62 -21 -151 6 -140 -15 23 -31 120 -73 -17 -56 -18 -97 -19 -14 -6 87 -242 -297 -38 -35 -218
6239 -218 1 -143 -172 -179 -116 145 154 239 -7 54 -189 -21 -80 59 -88 -267 -182 -200 -237 -43 254 161 -88 144
$$ packed form
6071A56j44P1j41K41m62K99J82l24J69k27K61j48m0N2R0j66O6J60j11J37j38J03
6093H6O2n4O2q6n3J48l04K53m4k11Q0k1PJ01ql5k1m18N60j46J42p6k2o1K05j79
6119c3Q1L1l43J91O1n1Q9j04m5K49j31j75O3L4R7Q4k85k3K65j78N6J58q8j46R4
6144d9m6k9Q7p2J17q2K01r1R5k40M5K09j60k02K46j7j42M9j66M72k99J77j44P7
6168C6n5J12j41P7j31J42K0k65J7J20K20j11O0k01K95n7k23P1j05L89j87n8ql3
6192a6N7k43L71k82J36M2O9j50J69J14l15J05j83K77l5j73J82N6j30m1j00K43
6214A53k99j82L90q3j30J57j46J25L8n4J51j93N6l9L8p9P8NQR3l29n5K59Lj83
6239b18K19j44k9pO3K61RQ5k46O1k43J68n9J39j47j79Q5j8l7J94K97r3k49K32
$$ plain form
6263 144 -254 -40 87 287 52 -13 -250 35 95 -127 -139 140 110 132 -227 -192 225 71 -206 -128 -102 -50 122
6286 122 85 55 -51 -39 56 -155 125 99 -122 58 -50 -143 176 -18 91 -178 -35 206 -139 61 -8 167
6308 167 -13 -12 133 210 96 -84 -47 223 41 145 36 166 97 -28 91 -158 22 94 161 145 -70 57 -62
6331 -62 -38 -122 -65 11 49 105 -33 -47 -8 -107 -51 11 -117 17 -6 11 137 145 -14 30 -15 -161 215 -12 33 49 -114
6358 -114 211 -1 28 -95 88 125 -68 67 -41 -255 -101 156 -10 145 98 -110 -37 -83 94 109 26 -170
6380 -170 239 -214 1 121 23 75 -58 18 -121 -30 144 111 88 -94 -132 151 -42 -86 -52 -56 -51 -14 -54 185 -37
6405 -37 -4 77 54 146 102 74 -95 32 -42 186 200 38 -86 -5 -127 96 -71 -50 -58 297 8 -151 -147 38 38 -42
6431 -42 157 -30 40 72 162 -177 36 8 103 200 20 -218 276 -35 92 -34 -6 -6 -75 7 -118 -62 -36 -204 21
$$ packed form
6263A44l98K14J27K00k35o5k37K85O0k22j2K79l0K2l59L5M17j54k77P8K6N2J72
6286A22l7l0j06J2R5k11K80k6k21J80j08r3L19j94J09k69J43K41l45K00o9J75
6308A67j80JJ45P7j14j80L7K70j82J04j09J30o9j25J19k49J80P2O7j6k15J27j19
6331f2K4q4N7P6L8N6j38j4L9r9N6O2j28J34k3J7J26Qj59M4m5j46L76k27M5J6j63
6358a14L25k12K9j23J83L7j93J35j08k14J54K57j66J55m7k08P3m6J77J5q3j96
6380a70M09m53K15J20r8N2j33P6j39R1J74l3k3j82l8K83j93m4L4mNL7m0K39k22
6405c7L3Q1k3R2m4k8j69J27p4K28J4j62j24Q1j22K23j67K1qL55k89j59MJ85%q0
6431d2J99j87P0L2R0l39K13k8R5R7j80k38M94l11J27j26K8%o9Q2j25N6K6j68K25
$$ plain form
6456 21 35 46 -105 -78 -108 94 -108 -25 -103 246 300 -1 53 -64 -129 -4 -9 -51 354 -56 98 -141 -233 -72 29
6481 29 50 -10 19 165 1 -64 -168 46 -107 -294 -166 115 -16 -335 134 -180 52 -113 116 31 -52 -6 -94
6504 -94 -184 196 161 -3 115 -75 186 19 7 -55 137 2 -64 -27 -71 -96 -39 51 128 104 100 -18 78 -11 -64 67
6530 67 173 106 -130 -141 -191 114 -8 91 -60 -124 -41 -140 117 29 -119 11 -159 91 -64 -121 -26 -23 -32 -131 175
6555 175 53 164 -75 109 -31 -40 -78 100 49 122 28 -24 -40 -61 57 63 35 141 8 156 233 -95 -52 -1 31
6580 31 56 118 31 0 -118 139 -14 11 105 -72 -17 90 78 -17 -80 3 -122 -63 -112 17 215 -95 41 -208 -158
6605 -158 101 168 102 -118 -139 80 141 16 189 -90 -139 -82 176 -1 37 -25 -276 226 189 86 35 83 -83 -158
6629 -158 117 90 113 0 74 -135 -165 -82 31 114 -32 101 -79 135 -60 -178 133 52 -120 -172 -85 -114 -68 88
$$ packed form
6456B1J4J1j51K7l0K02k02Q3p8L49N4l01N4j17o5J25nm2M05m10J54k39r2J61J01
6481B9K1o0K9J46j64o5j04K14j53j87J28K81j31l19M69l14K32j65K29q5q3M6q8
6504i4r0L80l5j64J18j90K61j67j2o2J92j35o6L7m4k5N7R0P7k4mj18R6q9n3J31
6530F7J06o7k36j1n0L05j22R9j51o4Q3r9K57q8j48J30j70K50j55n7R5Lrr9L06
6555A75j22J11k39J84j40rl8J78n1P3r4n2j6k1J18Ok8J06j33J48P7l28M3N1L2
6580C1K5O2q7l1j18K57j53K5R4j77N5J07j2r5o3Q3j25N9m9J29J98l10J36k49N0
6605a58K59O7o6k20k1K19O1j25J73k79m9N7K58j77L8o2k51N02l7j03n1M8j66p5
6629a58K75k7K3j13P4k09l0Q3J13Q3j46J33j80K14j95j18L11q1j72n2Q7k9M6J56
$$ plain form
6653 88 -30 -145 80 164 51 -120 168 -23 -187 146 -47 82 -2 -132 -163 -149 226 189 230 58 152 -109 -234
6676 -234 86 28 -36 40 -28 -28 5 94 -111 250 214 -49 227 -61 -123 -114 -183 -98 -6 -98 222 -90 -152 142 95 -209
6702 -209 -80 -38 -125 43 -77 -70 227 -39 -135 224 -46 -112 23 -44 169 143 37 99 -60 34 75 -313 28 28
6726 28 -99 94 115 -65 -36 57 -12 -35 -30 83 42 -122 -52 -102 -106 -40 91 -84 109 -12 -39 -100 86 52 21 69
6752 69 -2 -20 -207 76 166 -71 70 -26 95 -24 -94 -87 -129 100 27 -21 130 97 -261 12 -21 -41 35 29 9 -155
6778 -155 67 41 51 47 31 -74 -10 71 142 38 8 60 -74 28 -46 -23 321 67 23 -13 -28 -204 -16 -145 99
6803 99 134 67 115 34 80 -131 204 140 -71 48 -186 -83 65 75 153 227 146 15 50 -183 -29 100 110 -119
6827 -119 -7 -89 -78 -19 -224 -20 -16 -181 -94 202 -9 205 5 88 -56 179 -158 10 21 41 24 -67 -125 130
$$ packed form
6653H8j18j15K25Q4j13j71K88j91j64L33j93J29q4j30l1J4L75l7M1j72R4k61j25
6676b34L20n8o4P6o8%L3Q9k05L61l6k63K76k88o2Ro9Q5R2r2L20l12o2K94m7l04
6702b09J29M2q7J68j20PK97k66r6L59k70o6J35o7K13k6j06O2j59R4M1l88L41%
6726B8j27J93K1j80K9R3o9k3NJ13m1j64P0n0mO6J31j75J93j21k7o1J86l4l1M8
6752F9p1j8j87K83R0k37J41r6J21j19p0Pm2K29p3m8J51l3l58K73l3k0P6ok0j64
6778a55K22k6J0mj6j05O4Q1P1j04l0N2j34J02p4K3L44k54m4l6j5j76J88j29K44
6803I9L5o7M8q1M6k11L35o4k11J19k34J03J48J0P8P4q1j31L5k33J54J29J0k29
6827a19J12q2J1N9k05K04Mj65Q7K96k11K14k00Q3j44K35l37J68J1K0j7r1n8K55
$$ plain form
6851 130 -5 50 38 29 52 133 250 163 22 123 -48 87 68 -12 216 219 -44 76 84 -25 67 29 94 122 -42 82
6877 82 -53 -15 82 172 -97 20 -131 8 11 -30 44 224 -75 -130 -1 -274 -81 12 18 -17 -113 -16 -5 152 50
6902 50 24 135 287 -54 -151 55 29 64 215 -185 101 -82 -9 69 -45 -98 -208 -27 18 210 -188 -112 114
6925 114 -98 -216 39 -162 -76 -220 38 -41 170 87 60 -25 95 73 23 122 94 -129 95 75 -100 -16 -218 -2
6949 -2 -209 -46 77 185 -39 -50 47 102 72 -8 16 -42 125 117 -116 175 72 77 63 356 -109 115 96 -41 -109
6974 -109 210 27 62 122 -16 57 -16 -79 -74 -175 -96 -214 -155 117 -115 -65 34 -173 -95 164 -136 10 146 136
6998 136 45 -278 338 -39 -33 47 147 69 -169 20 -139 74 -273 -58 -56 207 -104 66 -118 94 -3 -49 37
7021 37 -152 -60 -147 40 -34 45 -115 -289 51 -173 -21 129 -52 10 -74 34 -18 38 83 88 22 -31 145 -157 31
$$ packed form
6851A30j35N5j2rK3Q1J17q7j41J01j71J35j9q0K28Lk63J20Qj09R2l8O5K8j64J24
6877H2j35L8R7R0k69J17j51J39Lm1P4J80k99n5J29k73J93R3Ol5r6R7J1J57j02
6902E0k6J11J52l41r7K06k6L5J51m00K86j83P3P8j14n3j10J81M5J92l98P6K26
6925A14k12j18K55k01Q6j44K58p9K11q3k7q5J20k2n0R9k8k23K24k0j75Q4k02K16
6949bk07J63J23J08k24j1R7N5l0q0K4n8J67qk33K91j03Nj4K93m65K24j9j37o8
6974a09L19j83L5O0j38P3p3o3Nj01P9j18N9K72k32N0R9k07P8K59l00J46J36j0
6998A36r1l23O16l77OQ0J00p8k38J89j59K13l47K15KK63l11J70j84K12r7m6Q6
7021C7j89R2q7J87p4P9j60j74L40k24J52J50j81O2q4J08n2N6M5No6n3J76l02J88
$$ plain form
7046 31 -60 42 -8 -148 -32 -30 55 -115 3 70 -53 -157 153 112 166 86 94 193 -21 -356 -100 104 38 116 -125
7071 -125 7 149 -208 29 -17 -205 -62 -263 -281 -161 -67 -41 42 -72 114 -11 14 75 202 -22 4 49 -106
7094 -106 -56 62 -49 -118 53 -19 -62 -96 -17 37 -231 -62 -27 82 -192 14 62 56 18 -90 49 -58 -68 -27 -105
7119 -105 37 -198 -122 -76 149 122 112 -14 -168 83 -190 -97 225 39 -152 7 7 197 59 81 37 -84 25
7142 25 0 242 73 17 -31 139 -171 -5 53 -31 17 85 -128 -113 117 3 -22 -18 64 -148 117 -33 -23 -168 -53
7167 -53 -21 -26 -84 -88 -49 121 -43 -28 66 -58 -71 3 237 -101 109 -44 -56 -90 224 -126 187 80 22 -171 -122
7192 -122 -169 -117 196 45 0 -44 93 -82 139 -93 -159 46 17 -252 2 154 -130 23 -309 119 -92 56
7214 56 136 -73 -82 106 -61 17 88 210 157 -107 -150 -102 -137 -91 -34 51 13 52 232 -143 43 42 -27 -136 -99 -18 65
$$ packed form
7046C1r1J02n0j40J16KQ5j70J18O7j23j04L10m1N4q0QR9k14l35K56K04o6P8k41
7071a25J32J42l57K37m6j88J43k01j8J20R4K6Q3j14J86j25K5O1J27k24K6M5j55
7094a06N0J18j11o9J71p2m3l4P9N4k68J69L5J09k74K06M8ol8j08J39j07j0M1p8
7119a05J42k35P6M6K25k7j0j26j54K51k73R3L22j86j91J59%J90j38K2m4j21J09
7142B5k5K42j69n6m8J70l10J66N8q4M8O8k13J5K30j14k5MQ2k12K65j50J0j45J15
7167e3L2nn8mL9J70j64J5R4j24j3P4K34l38K10j53j2l4L14l50L13j07n8j93M9
7192a22m7N2L13j51m5m4J37j75K21k32o6K05k9k69K54J52k84J53l32M28k11J48
7214E6Q0k09rJ88j67P8P1J22n3k64m3M8l5M6N7Q5l8L9J80l75J86jo9j09L7Q1Q3
$$ plain form
7241 65 -64 7 -188 -189 39 29 95 -263 -3 -42 17 170 166 5 55 120 214 20 37 43 142 -64 -126 124 -173 -92
7267 -92 116 -21 -26 45 -59 19 83 31 39 -95 -44 -71 22 -248 163 -162 102 138 -31 -9 44 -189 -11 161 59
7292 59 -137 6 -30 -82 -35 -24 -15 -55 227 59 184 51 49 -201 -33 259 109 200 -161 61 -122 91 102 -118
7316 -118 -7 -153 190 13 -138 329 -82 -51 240 -98 103 88 39 215 30 147 99 -28 -28 -8 62 -119 -25
7339 -25 39 -17 -9 -97 26 88 -103 67 -6 -39 95 -50 4 100 -64 104 -11 -37 37 -152 -131 -128 136 -105 -62 -59
7365 -59 55 -121 56 -21 -17 -8 196 -199 89 -197 -179 6 -78 -93 -13 -94 -9 22 140 71 -43 110 -58 32 44
7390 44 102 67 -44 -216 122 -37 -89 -53 129 -45 209 -128 -111 -235 44 -33 -12 -59 155 179 66 -172 -59
7413 -59 184 40 -59 119 -1 -30 -27 -24 -99 9 71 6 -11 -51 -120 128 42 -69 75 242 -40 -95 135 31 41
$$ packed form
7241F5j29P1j95jK28j0O6l58K60l9N9J53mj61N0O5R4j94J7OR9k06o2K50k97Q1
7267i2K08j37nP1j04P8O4n2Qj34N1k7R3k70M11l25K64L6j69K2N3k33J78J72j02
7292E9j96J43l6n2M7J1Rm0K82j68J25j33kk50J68K92j50R1l61K22j83K13J1k20
7316a18J11j46L43j77j51M67m11L1K91l38K01j5m9J76j85J17m8j27%K0P0j81R4
7339b5O4n6Qq8J23O2j91J70p3l3J34j45N4R6j64J68j15k6P4j89K1LK64k41M3L
7365e9J14j76J77p7MRK04l95K88k86J8J85q4j5Q0q1Q5L1J18o9j14J53j68R0J2
7390D4N8l5j11j72L38j59n2L6J82j74K54l37J7j24K79p7K1m7K14K4j13k38J13
7413e9K43j44r9J78j20k9LLp5J08O2o5j7m0o9K48q6j11J44J67k82n5K30j04J0
$$ plain form
7438 41 -155 6 -8 91 -22 25 -41 -164 143 -27 110 -137 -121 219 103 17 244 -21 -84 80 132 164 14
7461 14 -189 147 -86 70 205 -127 -11 -107 158 168 -75 145 -65 135 228 84 132 227 261 -119 -2 15 56
7484 56 47 -169 120 16 157 -45 -254 -41 219 -247 136 149 24 82 221 -136 -15 6 -66 129 16 -157
7506 -157 166 28 -86 -8 -20 -139 -110 31 -44 -12 -9 23 -21 168 142 1 141 -32 -51 -75 34 -47 15 -71 -203
7531 -203 -48 -94 107 11 -243 -1 -32 -68 -110 64 96 -103 108 152 27 105 -150 165 219 -23 169 102 257
7554 257 57 31 -142 -140 76 -197 -90 -32 -10 54 -101 -162 189 76 81 206 -29 17 -108 19 -116 -14 -107 -29
7578 -29 -104 -32 5 100 -104 64 125 -102 -5 -117 -37 51 8 -76 111 178 136 49 -54 -24 29 -28 -20 2 -36 -32 -55 -44
7606 -44 -139 -36 -122 153 -28 -166 -43 -93 -200 69 -45 -276 162 -22 -160 170 103 167 125 -69 -92 -190 227
$$ packed form
7438D1j96J61j4R9j13M7o6j23L07j70J37k47J6L40j16q6K27k65o3J64N2L2j50
7461A4k03L36k33J56J35l32J16r6K65J0k43K20k10K00R3j44M8R5L4l80J17J7M1
7484E6rk16K89j04J41k02k09K13K60m66L83J3j25N8J39l57J21K1p2J95j13j73
7506a57L23j38j14P8j2j19K9J41p5L2LL2m4J89k6j41J40j73j9k4J09q1O2q6j32
7531b03J55m6K01r6k54K42l1l6m2J74L2j99K11M4j25P8k55L15N4k42J92o7J55
7554B57k00k6j73KK16k73J07N8K2O4j55o1L51j13NJ25k35M6j25J27j35J02r3P8
7578b9p5P2L7R5k04J68O1k27R7j12Q0Q8m3q4J87O7m2q7j03L0N3n7QK2l8Mk3J1
7606d4r5J03q6K75j81j38J23n0j07K69j14k31M38j84j38L30o7O4m2j94k3r8M17
$$ plain form
7629 227 -29 120 61 53 -22 98 -48 -112 -53 154 -45 -21 146 -54 34 146 -144 -66 103 -82 139 144 247 -17
7653 -17 24 -47 -66 88 -23 -126 52 -97 70 -138 10 -116 -51 141 -20 -8 229 43 -160 33 -43 -118 43
7676 43 60 69 244 -50 81 -37 -205 41 17 148 -49 26 -87 109 -84 18 -61 141 -14 -74 258 14 53
7699 53 39 -156 -3 -90 -289 158 39 1 -89 63 73 -58 57 -20 139 -78 133 -3 -142 157 -32 -37 115
7722 115 47 -163 -112 -185 65 78 -54 -104 -32 -16 -126 -57 19 -54 243 86 22 -18 195 -61 -228 226 3 -68
7746 -68 178 -63 -258 -37 -37 22 -9 56 162 -41 -195 -53 -125 77 -153 -49 41 -186 -124 51 -34 48 -20 -23 -73
7771 -73 -7 64 -126 23 -53 -76 106 81 -113 178 129 116 -194 -6 -62 -33 -109 -110 -116 -34 179 215 58 -68 103 -62
7797 -62 112 28 -33 -84 78 -98 -36 -33 -131 -143 11 21 -152 -13 215 -20 18 -28 59 -190 -135 -76 130 -189 3
$$ packed form
7629B27k56J49n9qp5J20j46o4N9K07j99K4J67k00Q8J12k90P8J69j85K21NJ03k64
7653a7M1p1j9J54j11j03J78j49J67k08J48j26O5J92j61J2K37j86k03J93p6p5J61
7676D3J7RJ75k94J31j18j68K46k4J31j97P5j13J96j93J02p9K02j55o0L32k44L9
7699E3j4j95J53q7j99M47j19l8r0J52J0j31J15p7J59k17K11j36j39K99j89nJ52
7722A15o8k10N1p3K50J3j32n0P2J6j10O9P6p3K97j57o4m0K13k56j67M54k23p1
7746f8K46k41j95K21%N9l1O5J06k03j54J42p2K02k30J04R0k27O2J75q5Q2o8ln0
7771g3O6P1j90J49p6k3J82k5j94K91m9j3l10J88n6K9p6joQ2K13L6j57j26J71j65
7797f2J74q4o1n1J62j76O2Lr8j2J54J0j73J39K28k35L8m6Q7k49N5N9K06l19J92
$$ plain form
7822 3 -85 -11 96 -69 -119 19 31 177 -131 -32 -45 15 4 55 -88 33 -176 -63 3 -79 -48 56 -193 -23 -168
7847 -168 -211 60 -243 -43 -108 108 84 170 15 263 -16 -168 -128 81 104 90 2 85 80 184 194 -93 60 -18
7871 -18 -39 69 -244 -98 79 -221 -103 -53 -224 -236 205 185 40 32 -108 -59 -56 -119 -7 -109 89 39 43 163 -57
7896 -57 -31 -100 259 111 -273 -67 -137 20 -48 105 -29 232 -79 -92 192 225 195 0 42 -106 53 166 66
7919 66 -7 -38 140 144 -205 -53 -126 -97 42 40 115 -65 -2 -77 -140 -30 -70 -294 -25 -41 -52 151 192 131 31 23 -4
7946 -4 99 45 53 -170 -53 78 -65 27 177 -26 -4 -22 36 117 163 -36 -180 231 64 -17 -28 1 -120 6 -136
7971 -136 -109 46 235 -142 -93 -181 22 91 -112 36 195 150 221 -2 -171 29 -13 -131 122 290 130 -192
7993 -192 -179 -113 172 95 20 -111 -157 -246 233 -150 22 317 -96 73 -314 58 -128 -117 198 136 20 130 55
$$ packed form
7822Cq8P4J07j65n0J38J2J46l08R9j3O0j1N1j43J21k09J13O6q2L1J04k49J70j45
7847a68m3K71l03K00o5K16k4Q6j55K48k79j52M0K09K3j4q8Q3nJ04J0k87J53p8
7871a8k1J08l13J46J77l00J18N0j71j2M41k0j45qj40M9Lo3J12j02J98n0MJ20k20
7896e7K6o9L59j48l84K06p0J57o8J53j34K61l11j3K84L3l0j95M2j48J59J13j00
7919F6p3l1J78Ml49J52p3K9J39kP5j80O3p5o3J10m0k24K69j6j1K03M1o1j00qk7
7946dJ03n4Qk23J17J31j43R2J50k03K2j8N8Q1M6j99j44M11j67q1j1K9j21J26j42
7971a36K7J55J89l77M9q8K03O9k03J48J59m5P1k23j69K00m2j18K53J68j60l22
7993a92J3O6K85p7p5j31m6q9M79l83J72K95m13J69l87L72j86J1L15o2j16J10p5
$$ plain form
8016 55 144 32 58 145 -237 -99 -97 -102 161 63 -25 -87 -82 -76 -10 51 197 -190 49 10 -37 183 295 -79 3 -51 88
8043 88 -5 -19 -42 -46 219 134 -29 -35 24 -93 -53 48 -220 46 15 -155 -148 -288 94 108 235 171 2 -184 141
8068 141 151 -112 76 -187 47 96 56 47 -111 -108 -65 41 110 -156 -123 -47 -31 -223 -209 -179 -210 147 -182 21 -17
8093 -17 -45 91 -97 -53 177 49 12 -61 -18 273 65 113 206 55 83 79 -105 -65 -133 -89 203 -83 64 -139 132
8118 132 -14 133 155 -9 9 149 -31 24 44 -23 46 -126 -101 23 -33 -88 134 -138 75 -41 -240 -5 -95
8141 -95 -27 -27 333 -127 33 37 -57 237 -40 122 -57 -25 33 32 -104 72 65 -100 50 34 -28 -74 24 152 -169 -13
8167 -13 -112 244 -153 -108 37 -75 -89 -85 -15 87 -79 3 -109 -253 170 19 -16 32 197 131 -12 -46 80 4
$$ packed form
8016E5Q9j12K6Q7l82J38KnK63r8q8o2NOO6O1J46l87K39l9m7K20J12l74Q2n4J39
8043H8r3j4k3mK65q5j63oN9j17M0J01k68K66l1j70Pj40L82J4J27o4j69j86L25
8068A41J0k63J88k63K34M9m0rj58LM3J06O9k66L3P6J6j92J4L0l1L57l29K03l8
8093a7k8J36j88M4K30j28l7p3M3K91k08M8R3j51K8mj84M0o8M4K92k86J47k03K71
8118A32j46J47K2j64J8J40j80N5K0o7O9j72K5J24n6n5K22k72K13j16j99K35r0
8141i5O8%L60m60J60Mr4K94k77J62j79L2N8jj36J76pj65J50j6o2m6R8J28l21J56
8167a3r9L56l97M5J45j12j4MP0J02j66Q2j12j44M23j51l5M8J65o6j43l4J26p6
8191D
$$ Imaginary data points
##PAGE= N=2
##DATA TABLE= (X++(I..I)), XYDATA
$$ plain form
0 0 0 0 0 0 0 0 0 0 0 0 8 -8 8 -16 16 -16 24 -32 33 -40 50 -64 72 -88 104 -120 136 -160 184 -210 241 -276
32 -276 312 -354 399 -451 506 -566 633 -706 787 -873 968 -1072 1187 -1310 1447 -1594 1756
49 1756 -1935 2132 -2349 2588 -2856 3154 -3494 3878 -4319 4831 -5435 6162 -7048 8165
63 8165 -9620 11598 -14458 18963 -27151 46709 -195116 -14262 299450 -146829 -88495 141396
75 141396 3021 -127059 78856 101797 -81505 -72557 119387 15920 -71460 88872 35143
86 35143 -143071 10243 89098 -43695 -49236 40471 34038 -35821 -40046 65316 7490 -96441
98 -96441 42089 73006 -90261 -14195 96261 -17742 -69573 29062 58241 -38627 -51693
109 -51693 75576 17081 -98095 56351 73344 -104706 3425 84237 -82779 -41902 87078
$$ packed form
0@%%%%%%%%%%Qj6J6k4L2l2M0n6O5p3R0j14J36j60J92k24K56k96L44l94M51n17
32b76N88o66P53q50R57j072J199j339J493j660J841k040K259k497K757l041L350
49A756l691M067m481M937n444O010o648P372q197R150j0266J1597j3210J5213
63H165j7785K1218k6056L3421m6114P3860k41825J80854L13712m46279N8334K29891
75A41396j38375j30080K05915K2941j83302Q948J91944j03467q7380J60332n3729
86C5143j78214J53314P8855j32793n541Q9707o433o9859m225J05362n7826j03931
98i6441J38530L0917j63267P6066J10456j14003n1831R8635K9179r6868j3066
109e1693J27269n8495j15176J54446J6993j78050J08131Q0812j67016M0877J28980
$$ plain form
120 87078 -7261 -64753 32563 64324 -35290 -53318 58688 14265 -82198 35358 59020 -59489
132 -59489 5545 53022 -39475 -27504 20674 613 -18043 -8128 37235 7927 -51853 27328
144 27328 34251 -62898 10122 61231 -32428 -12642 45090 425 -32950 -13867 23465 -5112
156 -5112 -48811 33945 39786 -66146 1967 59807 -43225 -21212 49855 -6972 -24530 20136
168 20136 21888 -15609 -26397 28251 11526 -51144 23430 41368 -56625 -2485 56301 -27467
180 -27467 -24499 31881 5563 -25151 -14081 24900 5198 -47402 20116 43148 -49609 -3797
192 -3797 54947 -29579 -22472 40782 1779 -20182 8891 19726 -8725 -32109 20127 19676 -50352
205 -50352 7820 47147 -41875 -14919 46252 -18721 -28879 21184 12765 -10731 -8237 23313
$$ packed form
120H7078r4339n7492R7316L1761r9614j8028J12006m4423r6463J17556K3662j18509
132e9489O5034M7477r2497J1971M8178k0061j8656R915M5363k9308n9780P9181
144B7328O923r7149P3020N1109r3659J9786N7732m4665l3375J9083L7332k8577
156e112m3699Q2756N841j05932O8113N7840j03032K2013P1067n6827j7558M4666
168B0136J752l7497j0788N4648j6725o2670P4574J7938r7993N4140N8786q3768
180b7467K968N6380k6318l0714J1070L8981j9702n2600O7518K3032r2757M5812
192c797N8744q4526P107O3254l9003k1961K9073J0835k8451k3384N2236m51p0028
205e0352N8172L9327q9022K6956O1171o4973j0158N0063q419k3496K494L1550
$$ plain form
217 23313 13171 -35200 10347 33007 -39075 -6530 41772 -22695 -19101 26669 -3078 -19599
229 -19599 -2288 13801 3844 -26762 11895 31128 -34600 -5687 43231 -22004 -19423 33878
241 33878 -1495 -19678 7016 11308 -4381 -19998 11967 20500 -33846 -1553 37172 -29376
253 -29376 -16897 37422 -11430 -22365 19625 7054 -12300 -5921 14601 11397 -23340 7312
265 7312 31881 -28203 -10987 35160 -19157 -22924 23220 -2069 -18005 2381 9288 896 -16779
278 -16779 7102 23491 -23041 -3694 35630 -17198 -16690 29275 -4059 -18895 10519 6458 -6179
291 -6179 -10695 6012 12887 -23428 -4206 28508 -20461 -15114 31602 -7126 -18931 19011 5698
304 5698 -10058 -1032 8743 7247 -16503 1153 23955 -20411 -11455 29954 -13225 -20225 22061
$$ packed form
217B3313j0142m8371M5547K2660p2082L2545M8302o4467L594M5770k9747j6521
229a9599J7311J6089r957l0606L8657J9233o5728K8913M8918o5235K581N3301
241C3878l5373j8183K6694M292j5689j5617L1965Q533n4346L2293L8725o6548
253b9376J2479N4319m8852j0935M1990j2571j9354O379K0522l204l4737L0652
265G312K4569o0084J7216M6147n4317l767M6144k5289j5936K0386O907q392j7675
278a6779K3881J6389m6532J9347L9324n2828N08M5965l3334j4836K9414m061j2637
291f179m516J6707O875l6315J9222L2714m8969N347M6716l8728j1805L7942j3313
304E698j5756R026R775j496k3750J7656K2802m4366Q956M1409m3179p000M2286
$$ plain form
317 22061 -1582 -17661 5364 6587 -2368 -10554 5799 17529 -17393 -4463 29520 -13424 -15737
330 -15737 26389 -3456 -18124 11731 3670 -8749 -4737 4319 7854 -15052 -3707 21915 -15088
343 -15088 -13727 25819 -5748 -17519 17900 4622 -10206 2301 6705 3987 -10912 -804 18036
356 18036 -14522 -12125 24097 -8819 -18760 19541 186 -15955 6950 5660 -3861 -5979 3152
369 3152 12230 -11918 -5339 22815 -9583 -13746 23245 -2971 -16297 12914 2610 -9620 -413
382 -413 2132 3853 -9072 -4203 15508 -9905 -11318 20054 -4600 -14628 15983 1837 -10304
395 -10304 5903 4119 1107 -4122 -1294 12121 -8573 -10515 17412 -6046 -15798 15857 88
408 88 -14300 7542 3389 -5916 -1818 2171 7834 -6896 -4168 18141 -6587 -12869 19404 -1677
$$ packed form
317B2061k3643j6079K3025J223q955q186J6353J1730l4922J2930L3983m2944k313
330a5737M2126k9845j4668K9855q061j2419M012R056L535k2906J1345K5622l7003
343a5088J361L9546l1567j1771L5419j3278j4828J2507M404k718j4899J0108J8840
356A8036l2558K397L6222l2916r941L8301j9355j6141K2905j290r521k118R131
369C152R078k4148O579K8154l2398m163L6991k6216j3326K9211j0304j2230R207
382d13K545J721j2925M869J9711k5413j413L1372k4654j0028L0611j4146j2141
395a0304J6207j784l012n229K828J3415k0694j942K7927k3458r752L1655j5769
408H8j4388K1842m153r305M098L989N663j4730K728K2309k4728o282L2273k1081
$$ plain form
422 -1677 -15966 12864 3039 -11188 2263 2442 -818 -5661 -1529 11582 -7875 -8888 17880 -5114
436 -5114 -14865 16319 1349 -12746 9222 4838 -4613 -1042 1906 5746 -6826 -5592 14337 -6525
450 -6525 -13152 15191 -2590 -14924 11195 2806 -8805 3529 3424 1157 -3890 -1973 11870 -4559
464 -4559 -8398 17067 -1177 -13812 11998 1069 -13140 4385 2647 -4379 -2211 -241 6223
477 6223 -6001 -7097 14488 -2687 -12360 16317 3077 -14329 8832 6146 -8424 -690 5208
490 5208 4353 -6993 -4062 13232 -7871 -15516 16367 9 -18067 12080 7114 -13267 1892
503 1892 6958 -1478 -4711 1541 11244 -5664 -8917 15877 -1960 -16155 13993 4967 -14810 5673
517 5673 6042 -7989 -3753 1249 3833 -4778 -5267 13027 -1290 -13267 12537 4342 -13828 7412
$$ packed form
422a677j4289K8830r825j4227J3451J79l260m843M132J3111j9457j013K6768k2994
436e114r751L1184j4970j4095K1968m384r451L571K948L840j2572J234J9929k0862
450f525o627K8343j7781j2334K6119q389j1611J2334j05k267n047J917J3843j6429
464d559l839K5465j8244j2635K5810j0929j4209J7525j738p026K168J970O464
477F223j2224j096K1585j7175r673K8677j3240j7406K3161k686j4570P734N898
490E208q55j1346K931J7294k1103p645L1883j6358j8076L0147m966k0381J5159
503A892N066q436l233O252R703j6908l253K4794j7837j4195L0148r026j9777K0483
517E673L69j4031M236N002K584q611m89J8294j4317j1977K5804q195j8170K1240
$$ plain form
531 7412 8518 -6022 -721 2824 2418 -5355 -6838 10954 -443 -14102 11943 4931 -17067 5218
545 5218 7546 -9992 1051 6933 788 -2291 -1127 7592 -3233 -9689 12935 1963 -14861 10953
559 10953 6277 -16138 2869 7329 -8133 -2182 4534 2887 -4519 -4663 9618 -1741 -11497 12579
573 12579 5210 -12793 8099 7164 -9945 115 4057 -888 -1709 -2545 6123 -815 -11313 7411
587 7411 3533 -13123 6368 8112 -9390 1754 5618 -3718 -1943 658 5612 94 -6483 9240
601 9240 2163 -14383 6747 7000 -13123 2685 8965 -6641 -3098 2287 845 -3428 -4789 8335
615 8335 2835 -10339 8102 6110 -12637 3973 7875 -7388 1210 5149 -1472 -1815 -3302 2669
629 2669 -38 -8514 6392 5095 -11433 4119 7018 -10526 799 7306 -3059 -370 2683 2585
$$ packed form
531G412J106j4540N301L545m06p773j483J7792j1397j3659K6045p012k1998K2285
545E218K328j7538J1043N882o145l079J164Q719j0825o456K2624j0972j6824K5814
559A0953m676k2415J9007M460j5462N951O716j647p406j44J4281j1359r756K4076
573A2579p369j8003K0892r35j7109J0060L942m945q21q36Q668o938j0498J8724
587G411l878j6656J9491J744j7502J1144L864r336J775K601M954n518o577J5723
601I240p077j6546K1130K53k0123J5808O280j5606L543N385j442m273j361J3124
615H335n500j3174J8441j992j8747J6610L902j5263Q598L939o621l43j487N971
629B669k707q476J4906j297j6528J5552K899j7544J1325O507j0365K689L053r8
$$ plain form
643 2585 -1287 -5331 5812 2287 -10478 6784 6576 -11645 2045 6190 -8479 -1151 4481 -783
657 -783 -607 -1433 3365 1289 -7426 5247 5478 -8740 4299 7553 -7903 167 4238 -3782 -952
672 -952 -294 2159 1307 -6673 3338 3805 -10916 2306 8486 -8189 664 8163 -3664 -2412 2456
687 2456 1530 -469 -3425 5716 3258 -9790 4119 5960 -12056 1335 8607 -7932 -1511 5842
701 5842 -2476 -2779 -109 2612 1233 -4990 5302 4989 -8519 3161 6924 -8201 598 6228 -3995
716 -3995 -829 892 -756 -221 -5106 1580 4245 -7424 1583 7420 -7338 -332 6885 -3914 -911
731 -911 3867 690 113 -2876 2419 2734 -7805 2743 6705 -8921 310 7989 -7560 -2838 5471
746 5471 -2444 -2249 1199 2157 1079 -4919 3185 5041 -7315 2115 8118 -6586 -320 6326 -4457
$$ packed form
643B585l872m044J1143l525j2765J7262k08j8221J3690M145j4669P328N632n264
657g83J76q26M798k076q715J2673K31j4218J3039L254j5456Q070M071q020K830
672i52O58K453q52p980J0011M67j4721J3222O180j6675Q853P499j1827J252M868
687B456r26j999k956R141k458j3048J3909J841j8016J3391P272j6539O421P353
701E842q318l03K670K721j379o223J0292l13j3508J1680L763j5125Q799N630j0223
716c995L166J721j648N35m885O686K665j1669R007N837j4758P006P217j0799L003
731i11M778l177n77k989N295L15j0539J0548L962j5626R231P679j5549M722Q309
746E471p915J95L448R58j078n998Q104J856j2356R430O003j4704O266O646j0783
$$ plain form
761 -4457 -1977 2198 -1008 -186 -2895 1138 3313 -6758 596 6604 -6858 -468 7667 -3880 -1097
776 -1097 4546 -673 -694 -685 1500 2370 -5575 1276 5979 -8152 -1089 7491 -6303 -2622 6069 -2262
792 -2262 -2143 1050 894 985 -3343 2015 5645 -6274 299 7343 -6225 -1751 6358 -3595 -2255 2960
808 2960 -1385 -508 -2097 31 3608 -5259 -371 6652 -5475 -1805 6870 -3608 -2167 4508 -1009
823 -1009 -262 402 370 2466 -3964 -585 5376 -5614 -2172 6667 -4971 -3002 5024 -2408 -1780 2035
839 2035 -172 1489 -1342 223 4752 -3850 -606 6438 -4661 -2036 5652 -3665 -2400 2833 -2225
854 -2225 -251 -235 -909 2955 -2865 -1048 5423 -3607 -1752 6444 -3310 -1939 4554 -1909 -805 1316
870 1316 -880 1608 -1649 -1206 4227 -3776 -2132 5527 -4318 -2574 5145 -3020 -1997 3142 -1097
$$ packed form
761d457K480M175l206Q22k709M033K175j0071P354O008j3462O390Q135j1547K783
776a097N643n219k1RK185Q70p945O851M703j4131P063Q580j3794L681Q691q331
792b262J19L193j56R1m328N358L630j1919O573P044j3568M474Q109r953J340N215
808B960m345Q77j589K128L577q867M888P023j2127L670Q675j0478J441O675n517
823a009P47O64l2K096o430L379N961j0990L442Q839j1638J969Q026p432O28L815
839B035k207J661k831J565M529q602L244P044j1099K625P688r317J265N233n058
854b225J974J6o74L864n820J817O471r030J855Q196r754J371O493o463J104K121
870A316k196K488l257M43N433q003J644P659r845J744P719q165J023N139m239
$$ plain form
885 -1097 401 356 -535 3428 -2036 -1102 5355 -3606 -2081 5607 -3511 -2575 4091 -2664 -900 1461
901 1461 -1913 1082 -1064 -1701 4050 -2447 -1816 5553 -2189 -1774 5157 -1870 -1072 2650 -1767 602
917 602 -111 -1899 2922 -2502 -2634 4652 -3198 -2929 5149 -2574 -2407 4261 -999 -337 1667 -643 2089
934 2089 -1020 -1208 4412 -3454 -2103 5689 -3436 -2917 5567 -2456 -2870 3055 -1310 -819 310 -378
950 -378 2162 -2325 -1014 4836 -2807 -2024 5831 -2029 -2036 4354 -1631 -1019 1245 -1573 1432 -1130 -2428
967 -2428 3353 -2431 -3027 4443 -2046 -2599 4552 -308 -1139 2217 -522 1395 -677 -1649 4452 -1874
983 -1874 -3278 5099 -1911 -4523 4653 -963 -3839 2648 13 -1224 -180 -322 2410 -1983 -1634 5403
999 5403 -1747 -3208 5768 -1424 -3540 4545 -702 -2380 2137 -690 -288 -629 -1873 2445 -1827 -2742
$$ packed form
885a097J498m5q91L963n464R34O457q961J525P688r118R36O666o755J764K361
901A461l374K995k146o37N751o497O31P369p742M15O931p027P98L722m417K369
917F02p13j788M821n424j32P286p850K69Q078p723J67O668n260O62K004k310K732
934B089l109j88N620p866J351P792r125N19Q484q023m14N925m365M91J129o88
950c78K540m487J311N850p643P83P855p860pO390n985O12K264k818L005k562j298
967b428N781n784n96P470o489n53P151m860q31L356k739J917k072r72O101o326
983a874j404Q377p010k612R176n616k876O487k635j237J044j42K732m393L49P037
999E403p150j461Q976p192k116Q085n247j678M517k827M02l41j244M318m272r15
$$ plain form
1015 -2742 4335 -1376 -3173 4214 -1080 -2356 3035 -657 -95 1242 -1363 2471 -758 -3445 3695
1030 3695 -723 -4160 3556 -459 -3661 2042 -506 -1372 573 -764 2161 -175 -2530 4097 -582
1045 -582 -3883 4649 306 -3931 3740 507 -2525 1148 -428 -255 -140 -1587 2864 -789 -3404 4093
1061 4093 -666 -4368 4272 526 -3138 3032 775 -1399 795 -786 1610 8 -2179 3391 -146
1076 -146 -3941 3163 -380 -3876 2740 41 -1836 1746 -687 20 588 -1641 2321 817 -2297 3383
1092 3383 150 -3350 2617 -131 -2828 2022 -343 -702 863 -1940 971 76 -3281 2721 961
1107 961 -3579 3163 1181 -3107 2040 768 -1323 1167 -444 890 317 -2520 2362 -189 -4059
1122 -4059 3271 671 -4058 2739 708 -3244 1465 315 -784 688 -258 1785 14 -2501 3013
$$ packed form
1015b742P077n711j797P387n294j276N391l692N62J337k605L834l229k687P140
1030C695m418l437P716m015l202N703k548q66J945j337K925k336k355O627m679
1045e82l301Q532m343m237P671l233l032L673j576J73J15j447M451l653k615P497
1061D093m759l702Q640l746l664O170k257k174K194j581K396j602k187N570l537
1076a46l795P104l543l496O616k699j877L582k433P07N68k229L962j504l114N680
1092C383l233l500N967k748k697M850k365l59J565k803K911q95l357O002j760
1107I61m540O742j982m288N147j272k091K490j611J334n73k837M882k551l870
1122d059P330k600m729O797k031l952M709j150j099J472r46K043j771k515N514
$$ plain form
1137 3013 189 -3187 3492 1072 -3021 2113 -42 -2415 647 -1089 48 722 -1743 1755 642
1152 642 -3076 2234 923 -2473 2759 1117 -1337 1395 -193 -201 388 -1912 1460 842 -3248 2013
1168 2013 1135 -4346 1539 1526 -2724 1373 997 -585 149 -860 1294 201 -2391 2836 1247 -3525
1184 -3525 2362 1405 -4008 1361 1322 -2218 711 328 -174 26 -1947 1077 811 -2768 2347 1555 -3193
1201 -3193 2118 1383 -2508 1231 880 -539 825 -887 676 443 -2844 1376 1369 -3351 1301 1681 -3049
1218 -3049 425 788 -1071 569 -96 1065 1123 -1794 1751 1404 -3485 1528 1969 -3335 876 1538 -2518
1235 -2518 -174 132 -382 343 -1078 1231 1352 -2377 1397 1698 -3053 1373 2264 -2165 837 973 -1171
1252 -1171 39 -725 416 959 -2070 1086 1614 -3263 745 1805 -2771 314 1503 -1040 544 198
$$ packed form
1137C013k824l376O679k420m093N134k155k373L062j736J137O74k465L498j113
1152F42l718N310j311l396N232j642k454K732j588qN89k300L372o18m090N261
1168B013q78n481N885j3m250M097l76j582P34j009K154j093k592N227j589m772
1184c525N887r57n413N369l9l540K929l83n02K00j973L024k66l579N115p92m748
1201c193N311p35l891L739l51j419J364j712J563k33l287M220pm720M652L80m730
1218c049L474L63j859J640o65J161N8k917L545l47m889N013M41n304M211O62m056
1235b518K344L06n14P25j421K309J21l729L774L01m751M426Q91m429L002J36k144
1252a171J210p64J141N43l029L156N28m877M008J060m576L085J189k543J584l46
$$ plain form
1268 198 156 983 -1379 1203 2016 -2431 1205 2132 -3051 369 1433 -2371 196 648 -730 588 -1228
1285 -1228 87 1207 -2271 643 2546 -2144 660 2133 -1926 388 990 -954 521 -286 -92 989
1301 989 -2142 -88 1711 -2652 172 2169 -2149 488 1458 -1365 665 419 -254 1191 -1107 366
1317 366 1924 -2098 108 1962 -2588 -101 2067 -1966 168 918 -1276 730 -183 -282 1541 -1440
1333 -1440 100 1723 -1978 -123 1739 -1802 321 1469 -1206 782 293 -918 961 -1034 -616
1348 -616 1690 -1956 -485 1500 -1869 -190 1441 -1288 509 927 -391 1198 -59 -460 1495 -1429
1364 -1429 -349 1732 -1968 -239 1754 -2056 -148 1219 -1690 14 428 -567 885 -522 0 1503
1380 1503 -1308 182 1904 -1751 148 1710 -1980 301 1008 -1244 403 -196 -563 1086 -1193 -471
$$ packed form
1268A98m2Q27k362K582Q13m447L636R27n183L420J064l804K567M52j378J318j816
1285a228J315J120l478K914J903m690K804J473m059K314O02j944J475q07J94J081
1301I89l131K054J799m363K824J997m318K637R70k823K030k46o73J445k298J473
1317C66J558m022K206J854m550K487K168m033K134P50k194K006r13r9J823k981
1333a440J540J623l701J855J862l541K123J148k675J988m89j211J879j995M18
1348f16K306l646J471J985l369J679J631k729J797M18j318J589j257m01J955k924
1364a429J080K081l700J729J993l810J908J367k909J704M14r95J452j407N22J503
1380A503k811J490J722l655J899J562l690K281P07k252J647n99l67J649k279P22
$$ plain form
1396 -471 1383 -1511 0 1816 -1454 402 1067 -997 732 516 -424 960 -732 -414 1690 -1467
1412 -1467 -745 2018 -1542 -707 1526 -1056 -292 429 -675 780 -273 28 1588 -1438 27 2205
1428 2205 -1367 -253 2369 -1334 -385 1147 -1230 29 229 -791 697 -861 -455 1668 -1074 -144
1444 -144 1957 -1330 -47 1949 -1288 260 917 -916 738 63 -846 1225 -896 -920 1608 -1163
1460 -1163 -775 1425 -1251 -291 974 -889 562 112 -742 1544 -603 -747 1984 -998 -671 1832
1476 1832 -1000 -813 1225 -1009 -251 355 -962 447 -797 -651 1390 -1195 -504 1968 -1089 -913
1492 -913 1593 -875 -502 934 -774 219 229 -551 911 -609 -892 1631 -1113 -705 1551 -1172 -421
1509 -421 1294 -972 257 642 -715 722 99 -776 1279 -485 -827 1640 -806 -696 1357 -969
$$ packed form
1396d71J854k894J511J816l270J856O65k064J729k16r40J384j692L18K104l157
1412a467P22K763l560Q35K233k582P64P21j104J455j053L01J560l026J465K178
1428B205l572J114K622l703R49J532k377J259K00j020J488j558M06K123k742R30
1444a44K101l287J283J996l237J548O57j833J654o75r09K071k121k4K528k771
1460a163L88K200k676R60J265j863J451m50q54K286k147j44K731k982L27K503
1476A832k832J87K038k234P58O06j317J409j244J46K041k585O91K472l057J76
1492i13K506k468L73J436j708R93J0p80J462j520k83K523k744M08K256k723P51
1509d21J715k266J229L85j357J437o23q75K055j764l42K467k446J10K053k326
$$ plain form
1525 -969 -172 504 -1006 455 -153 -819 1057 -249 -783 1630 -533 -705 1633 -311 -474 1032 -410
1542 -410 198 239 -866 711 -375 -1099 1608 -682 -1141 1571 -815 -1161 1252 -792 -513 869 -461
1559 -461 552 144 -592 1238 -415 -694 1802 -798 -905 1489 -685 -841 1191 -800 -134 501 -762
1576 -762 588 -15 -641 1245 -456 -760 1516 -481 -406 1066 -545 -212 840 -824 487 165 -1071
1593 -1071 878 -222 -952 1249 -647 -1095 1315 -290 -621 959 -556 87 426 -344 1095 -135
1609 -135 -1171 1634 -358 -1318 1357 -585 -1257 1200 -361 -1004 389 -520 251 55 -389 1356 -244
1626 -244 -783 1687 -404 -1067 1413 -369 -861 969 -655 -444 369 -808 565 -46 -788 984 -156
1643 -156 -1142 1414 -68 -892 1037 -133 -43 838 -491 429 135 -1253 1372 35 -995 1400 -24
$$ packed form
1525i69P97O76j510J461o08o66J876j306n34K413k163j72K338j944j63J506j442
1542d10O08M1j105J577j086p24K707k290m59K712k386l46K413k044K79J382j330
1559d61J013m08p36J830j653k79K496k600j07K394k174j56K032j991O66O35j263
1576g62J350o03o26J886j701l04K276j997P5J472j611L33J052j664J311l22j236
1593a071J949j100p30K201j896m48K410j605l31J580j515O43L39p70J439j230
1609a35j036K805j992r60K675j942o72K457j561o43J393r09P71j96m44J745j600
1626b44n39K470k091o63K480j782m92J830j624K11Q13j177J373o11p42J772j140
1643a56r86K556j482q24J929j170R0Q81j329R20k94j388K625j337j030K395j424
$$ plain form
1660 -24 -1354 804 -324 -675 575 -107 251 231 -868 832 -347 -992 1630 230 -1128 1389 13
1677 13 -1124 803 -219 -249 194 -490 533 -158 -1143 1078 -53 -1434 1248 289 -961 1063 166
1694 166 -454 378 -385 626 331 -806 999 58 -1529 791 -59 -1384 802 309 -1019 559 -265
1711 -265 -15 159 -735 1099 612 -1212 1247 254 -1564 834 189 -1074 767 79 -371 68 -944
1728 -944 16 110 -979 787 539 -1655 935 475 -1513 786 426 -304 604 -272 236 472 -935 605
1746 605 245 -1366 614 580 -1482 747 381 -1078 523 -27 -92 691 -511 507 593 -1125 685 668
1764 668 -1185 887 800 -941 522 -84 -904 358 -640 -211 390 -1047 262 537 -1117 429 592
1781 592 -939 818 415 -689 562 -119 -257 604 -641 234 616 -1203 231 492 -1598 285 372
$$ packed form
1660b4j330K158j128l51J250o82L58k0j099J700j179o45K622j400j358K517j376
1677A3j137J927j022l0M43o84J023o91r85K221j131j381K682r59j250K024q97
1694A66o20Q32p63J011k95j137J805r41j587K320q50j325K186m93j328J578q24
1711b65K50J74q94J834m87j824K459r93j818K398o45j263J841o88m50M39j012
1728i44R60R4j089J766k48k194K590m60j988K299l60p30R08q76N08K36j407J540
1746F05l60j611J980l4k062K229l66j459J601n50o5P83j202J018Q6j718J810j7
1764F68j853K072q7j741J463o06q20J262r98M29O01j437J309K75j654J546J63
1781E92j531J757m03j104J251o81j38Q61j245Q75L82j819J434K61k090J883Q7
$$ plain form
1798 372 -871 340 191 -590 569 -383 -67 677 -620 497 1041 -1401 454 750 -1200 307 379
1815 379 -830 572 -219 -507 255 -1017 147 521 -1012 537 766 -975 641 483 -847 773 42
1832 42 -252 779 -372 -65 710 -897 193 931 -1244 262 596 -961 450 381 -550 555 -253 -67
1850 -67 573 -767 241 727 -1086 325 768 -1080 352 565 -1117 194 45 -619 293 -345 -284 547
1868 547 -839 -23 698 -796 296 627 -1069 525 462 -691 555 19 -232 615 -598 -224 902
1885 902 -904 -151 746 -1006 150 553 -650 398 141 -447 600 -455 -219 877 -794 65 993
1902 993 -1052 74 674 -787 288 206 -389 314 -424 -252 688 -782 33 897 -704 233 1140 -627
1920 -627 262 706 -649 510 3 -474 454 -605 -187 737 -832 -140 780 -857 45 619 -771 180
$$ packed form
1798C72j243J211j49p81J159r52L16P44j297J117N44k442J855K96j950J507P2
1815C79j209J402p91k88P62j272J164L74j533J549K29j741J616j58j330J620p31
1832D2k94J031j151L07P75j607J090P38k175J506L34j557J411o9r31J105q08J86
1850f7O40j340J008M86j813J411M43j848J432K13j682J311j49o64R12o38O1Q31
1868E47j386Q16P21j494J092L31j696J594o3j153J246n36k51Q47j213L74J126
1885I02j806P53Q97j752J156M03j203J048k57n88J047j055K36J096j671Q59R28
1902I93k045J126O00j461J075q2n95P03p38J72R40j470Q15Q64j601R37R07j767
1920f27Q89M44j355J159n07m77R28j059M18R24j569O92R20j637R02N74j390R51
$$ plain form
1938 180 347 -348 763 -40 -397 834 -445 -35 649 -599 -82 903 -754 84 402 -629 303 -18
1956 -18 -439 351 -532 -441 988 -746 -151 910 -629 77 722 -455 143 277 -692 554 -48 -683 633
1975 633 -415 -376 821 -815 -143 810 -686 174 391 -517 428 159 -366 869 -167 -235 655 -401
1993 -401 -330 778 -569 -223 615 -961 124 230 -564 532 -162 -149 702 -293 62 896 -724 57 870
2012 870 -721 -26 347 -879 507 170 -881 432 -345 -574 445 -236 -211 661 -320 261 569 -497
2030 -497 191 365 -611 844 -79 -537 647 -359 -486 639 -397 -305 538 -619 -241 411 -548 234
2048 234 -42 -424 658 -88 -405 833 -410 -196 776 -526 84 647 -662 -72 413 -328 118 156 -615
2067 -615 692 -533 -344 659 -551 238 553 -431 122 709 -600 373 306 -496 395 0 -526 756
$$ packed form
1938A80J67o95J111q03l57J231j279M10O84j248N17R85j657Q38L18j031R32l21
1956a8m21P90q83R1J429j734N95J061j539P06O45j177N98J34r69J246o02o35J316
1975F33j048L9J197j636O72R53j496Q60K17r08R45k69n25J235j036o8Q90j056
1993d01P1J108j347L46Q38j576J085J06p94J096o94J3Q51r95L55Q34j620P81Q13
2012H70j591O95L73j226J386l37j051J313p77k29J019o81K5Q72r81N81L08j066
2030d97O88J74r76J455r23m58J184j006j27J125j036R2Q43j157L78O52r59P82
2048B34k76l82J082p46l17J238j243K14R72j302O10N63j309N90M85p41M46L8p71
2067f15J307j225J89J003j210P89L15r84N53N87j309R73o7q02Q91l95n26J282
$$ plain form
2085 756 -400 -486 647 -685 -68 516 -612 59 471 -714 487 -98 -557 701 -177 -422 696 -576
2103 -576 -202 678 -461 -11 523 -599 45 -11 -524 442 -310 -339 669 -468 -448 815 -500 -288 598
2122 598 -416 134 465 -372 252 -218 -207 602 -563 -295 824 -483 -403 561 -579 4 601 -393 158
2141 158 123 -313 476 2 -559 819 -285 -337 716 -323 -327 406 -653 -25 251 -619 662 17 -554
2160 -554 674 -442 -572 902 -145 -422 677 -219 -43 284 -497 393 -58 -532 645 -172 -421 609
2178 609 -300 -588 758 -281 -254 564 -349 317 204 -516 468 22 -207 955 -139 -582 662 -425
2196 -425 -374 543 -201 -227 331 -462 206 66 -658 397 -40 -414 873 -23 -274 466 -302 -156 372 -347
2216 -347 205 263 -715 318 -130 -734 435 -55 -438 448 -222 -467 560 -172 -198 292 -411 349 99 -388
$$ packed form
2085G56j156q6J133j332O17N84j128O71M12j185J201n85m59J258q78k45J118j272
2103e76L74Q80j139M50N34j122O44n6n13R66p52k9J008j137K0J263j315K12Q86
2122E98j014N50L31q37O24m70J1Q09j165K68J119j307Q0R64j140N83N97r94N51
2141A58l5m36P89m74n61J378j104n2J053j039mP33j059O28K76q70J281o45n71
2160e54J228j116j30J474j047k77J099q96J76L27p81Q90m51m74J177q17k49J030
2178F09r09k88J346j039K7Q18r13O66j13p20R84m46k29J162j094m43J244j087
2196d25N1R17p44k6N58p93O68j40p24J055m37l74J287q96k51P40p68J46N28p19
2216c47N52N8r78J033m48o04J169m90l83Q86o70k45J027p32k6M90p03P60k50m87
$$ plain form
2236 -388 655 -198 -654 628 -3 -653 722 -87 -527 201 -398 156 328 -402 307 -35 -670 614 38
2255 38 -691 554 -25 -493 529 -365 -126 173 -452 76 90 -451 358 22 -587 470 -260 -452 539 21
2275 21 -25 325 -441 75 554 -478 638 230 -689 645 87 -753 255 -64 -380 403 -214 -48 453
2294 453 -437 420 120 -653 563 135 -684 393 -70 -662 673 -78 -396 272 -398 -118 101 -609 369
2313 369 184 -845 555 93 -375 618 -76 -593 569 -17 43 561 -334 433 320 -399 411 -1 -634
2332 -634 347 90 -350 258 -213 -199 256 -201 225 535 -459 415 430 -590 404 429 -380 458 -37 -449 238
2353 238 -311 98 314 -654 130 278 -550 255 177 -714 256 347 -332 428 97 85 396 -520 78 297 -480
2374 -480 330 368 -687 139 160 -566 226 -70 -155 367 -174 1 230 -437 295 326 -489 238 483 -402 139
$$ packed form
2236c88J043q53m56J282o31o50J375q09m40P28n99N54J72p30P09l42o35J284n76
2255C8p29J245n79m68J022q94K39K99o25N28J4n41Q09l36o09J057p30j92R91n18
2275B1m6L50p66N16M79j032J116m08r19J334n58q40J008l19l16P83o17J66N01
2294D53q90Q57l00p73J216m28q19J077m63n92J335p51l18O68o70K80K19p10R78
2313C69j85j029J400m62m68R93o94n17J162n86O0N18q95P67j13p19Q10m12o33
2332f34R81k57m40O08m71J4M55m57M26L10r94Q74J5j020R94K5q09Q38m95m12O87
2353B38n49M09K16r68P84J48q28Q05p8q91R70R1o79P60l31j2L11r16N98K19p77
2374d80Q10L8j055Q26K1p26P92k96q5N22n41J75K29o67P32L1q15P27K45q85N41
$$ plain form
2395 139 207 -351 376 -329 -73 182 -304 152 377 -604 83 510 -383 244 475 -307 197 112 78 263 15
2416 15 -11 503 -304 -8 537 -515 -104 289 -466 -16 257 -359 233 -97 -49 516 -409 116 492 -388 67
2437 67 507 -268 248 264 -356 239 -158 -184 406 -273 -331 465 -216 -247 481 -517 334 294 -199 166 136 -207
2459 -207 301 -135 -396 460 -349 -207 313 -305 -152 362 -384 18 23 -195 204 -10 -149 323 -72 -64 447
2480 447 -274 -14 401 -379 162 319 -608 107 192 -287 302 -74 -304 298 -169 -213 363 -331 -43 398 -484
2501 -484 165 187 -517 417 -37 -296 400 -197 -264 366 -80 -326 463 -350 173 317 -413 154 136 -245 464
2522 464 -135 -159 302 -289 -250 395 -121 -47 65 -410 -157 107 -430 104 202 -308 244 -140 -46 394 -248 -46
2544 -46 357 -446 -239 318 -345 -6 143 -182 51 -55 -305 393 -300 -228 263 -482 -28 53 -538 171 416
$$ packed form
2395A39O8n58P27p05K56K55m86M56K25r81O87M27q93O27K31p82N04q5l4J85k48
2416A5k6N14q07K96N45j052M11L93p55M50K73o16N92l30M8N65r25N25L76q80M55
2437F7M40p75N16J6o20N95l97k6N90o79n8P96o81l1P28r98Q51m0m93L65l0l43
2459b07N08m36k61Q56q09J42N20o18J53N14p46M02Nk18L99k14j39M72l95QN11
2480D47p21K60M15p80N41J57r27P15Q5m79N89l76k30O02m67m4N76o94K88M41q82
2501d84O49K2p04R34m54k59O96n97o7O30m46k46P89q13N23J44p30N67j8l81P09
2522D64n99k4M61n91L9O45n16P4J12m75K53K64n37N34R8n10N52l84R4M40o42K02
2544d6M03q03K07N57o63L39J49l25K33j06k50O98o93P2M91p45M54Q1n91P09K45
$$ plain form
2565 416 -352 200 222 -111 472 103 -180 358 -184 -240 216 -272 114 178 -406 28 189 -179 174 53 -299
2586 -299 245 -172 -49 336 -412 49 525 -208 -60 340 -371 174 140 -381 214 -112 -170 318 -8 -40 447
2607 447 -205 62 392 -102 112 194 -205 341 51 -409 167 -27 -182 359 -239 122 462 -389 -194 270
2627 270 -222 232 -116 -140 88 41 96 392 -34 -219 404 -60 -2 196 -294 175 347 -406 180 -132 -218 227
2649 227 -219 -321 210 -411 -185 401 -269 37 464 -229 66 168 -433 328 23 -344 262 -365 -240 516
2669 516 -174 -171 26 -420 33 199 -364 130 35 -296 364 205 -167 595 -132 -131 344 -231 -63 202 -409 44
2691 44 66 -461 55 -177 -355 350 -171 104 501 -71 -55 232 -215 47 387 -72 157 34 -357 330 -202
2712 -202 -321 392 -36 -370 374 -246 -243 75 -245 106 -79 -222 291 140 -274 513 -160 -370 251 -200 -82
$$ packed form
2565D16p68N52K2l33N83l69k83N38n42n6M56m88L86O4n84M34J61l68L53j21l52
2586b99N44m17J23L85p48M61M76p33J48M00p11N45l4n21N95l26n8M88l26l2M87
2607D47o52K67L30m94K14Q2l99N46k90m60N76j94j55N41n98L61L40q51J95M64
2627B70m92M54l48k4K28m7N5K96m26j85O23m64N8J98m90M69J72p53N86l12q6M45
2649B27m46j02N31o21K26N86o70L06M27o93K95J02o01P61l05l67O06o27J25P56
2669E16o90LJ97m46M53J66n63M94r5l31O60j59l72P62p27JM75n75J68K65o11M53
2691D4K2n27N16k32j78P05n21K75L97n72J6K87m47K62L40m59K29j23l91O87n32
2712b02j19P13m28l34P44o20LL18l20L51j85j43N13j51m14P87o73k10O21m51J18
$$ plain form
2733 -82 176 -373 -99 130 -309 -27 106 -41 291 -131 -259 399 -195 -339 212 -316 -41 444 -172 193
2753 193 155 -262 93 94 -386 339 -2 -268 65 -177 -191 486 11 -61 107 -306 144 65 -303 349 -38 -258
2775 -258 348 -202 -326 254 -191 -316 238 -365 30 354 -224 201 -29 -385 168 -49 -336 293 -162 -162 298
2796 298 -281 -106 78 -190 168 129 -404 96 75 -526 254 41 -263 277 -148 -26 443 12 123 124 -397
2817 -397 282 -10 -302 262 73 -308 155 106 -70 77 -360 -93 1 -353 256 -114 -263 321 240 -365 219
2838 219 175 -257 414 25 -81 292 -316 -51 144 -388 182 12 -466 430 -51 -253 71 105 -1 246 -263
2859 -263 -79 83 -271 216 -59 -319 141 153 -510 460 7 -374 188 11 29 181 -391 168 162 -385 144
2880 144 240 -469 392 42 -285 171 -289 -120 118 -296 -178 96 -466 248 229 -259 241 149 -484 257 82
$$ packed form
2733h2K58n49K74K29m39K82J33j47L32m22j28O58n94j44N51n28K75M85o16L65
2753A93l8m17L55Jm80P25l41k66L33k42j4O77m75p2J68m13M50p9l68O52l87k20
2775b58O06n50j24N80m45j25N54o03L95L24n78M25k30l56N53k17k87O29m55%M60
2796B98n79J75J84k68L58l9n33N00k1o01P80k13l04N40m25J22M69m31J11Jn21
2817c97O79k92k92N64j89l81M63m9j76J47m37K67R4l54O09l70j49N84q1o05N84
2838B19m4m32O71l89j06L73o08K65J95n32N70j70m78Q96m81k02L24L4j06K47n09
2859b63J84J62l54M87k75k60M60J2o63R70m53l81N62j77J8J52n72N59on47N29
2880A44R6p09Q61l50l27M56m60J69K38m14J18K74n62P14j9m88N00r2o33P41j75
$$ plain form
2901 82 -256 306 -73 -60 111 -200 113 171 -266 162 327 -72 -30 44 -411 -42 -18 -406 399 -280 29 287
$$ packed form
2901H2l38N62l79J3J71l11L13N8m37M28J65l99M2P4m55L69K4l88Q05o79L09K58
$$ [...]
8191a0
##END NTUPLES=NMR FID
##END=
