##TITLE=1H_25-iPr
 CDCl3+DMSO, 8 sc, 
 23.8.2019
##JCAMPDX= 6.0         $$ Bruker NMR JCAMP-DX V2.0
##DATA TYPE= NMR FID
##DATA CLASS= NTUPLES
##ORIGIN= UXNMR, Bruker Analytische Messtechnik GmbH
##OWNER= root
$$ XWIN-NMR		Version 3.5
$$ Fri Aug 23 16:36:50 2019 Russian Standard Time (UT+4h)  she@DPX200
##.OBSERVE FREQUENCY= 200.13155
##.OBSERVE NUCLEUS= ^1H
##.DELAY= (6, 6)
##.ACQUISITION MODE= SIMULTANEOUS
##.ACQUISITION SCHEME= undefined
##.AVERAGES= 8
##.DIGITISER RES= 18
##SPECTROMETER/DATA SYSTEM= spect
##.PULSE SEQUENCE= zg30
##.SOLVENT NAME= CDCl3
##.SHIFT REFERENCE= (INTERNAL, CDCl3, 0, 15.7039)
##AUDIT TRAIL= $$ (NUMBER, WHEN, WHO, WHERE, WHAT)
$$ ##TITLE= Audit trail, XWIN-NMR		Version 3.5
$$ ##JCAMPDX= 5.01
$$ ##ORIGIN= Bruker BioSpin GmbH
$$ ##OWNER= she
$$ F:/spectra/data/she/nmr/H-F/1/audita.txt
$$ ##AUDIT TRAIL=  $$ (NUMBER, WHEN, WHO, WHERE, WHAT)
(   1,<2019-08-23 16:34:52.48 +0400>,<she>,<DPX200>,
      <created by zg, POWCHK disabled, PULCHK disabled
       configuration hash MD5:
       00 E9 B6 7A A2 85 ED C7 34 08 36 98 17 FE 4E 26
       data hash MD5: 16K
       DD 0C 67 C8 66 58 0B B5 24 F3 ED 78 DA FA E6 E8>)
$$ ##END=
$$ 
$$ hash MD5
$$ F6 19 3D D6 42 8E 6A C1 80 5D BF 5F 8B BD 58 58
##$RELAX= 
##$RELAX= 
##$RELAX= 
##$RELAX= 
##$RELAX= 
##$RELAX= 
$$ Bruker specific parameters
$$ --------------------------
##$DU= <F:/spectra>
##$EXPNO= 1
##$NAME= <H-F>
##$PROCNO= 1
##$TYPE= <nmr>
##$USER= <she>
##$AMP= (0..31)
100 100 100 100 100 100 100 100 100 100 100 100 100 100 100 100 100 100 
100 100 100 100 100 100 100 100 100 100 100 100 100 100 
##$AQSEQ= 0
##$AQ_mod= 1
##$AUNM= <au_zg>
##$AUTOPOS= <>
##$BF1= 200.13
##$BF2= 200.13
##$BF3= 200.13
##$BF4= 200.13
##$BF5= 200.13
##$BF6= 200.13
##$BF7= 200.13
##$BF8= 200.13
##$BYTORDA= 1
##$CFDGTYP= 0
##$CFRGTYP= 5
##$CHEMSTR= <none>
##$CNST= (0..31)
1 1 145 1 1 1 1 1 1 1 1 1 1 1 1 1 1 1 1 1 1 1 1 1 1 1 1 1 1 1 1 1 
##$CPDPRG= <>
##$CPDPRG1= <>
##$CPDPRG2= <>
##$CPDPRG3= <>
##$CPDPRG4= <mlev>
##$CPDPRG5= <mlev>
##$CPDPRG6= <mlev>
##$CPDPRG7= <mlev>
##$CPDPRG8= <mlev>
##$CPDPRGB= <>
##$CPDPRGT= <>
##$D= (0..31)
0 1.2 0 0 0 0 0 0 0 0 0 0.03 0 0 0 0 0 0 0 0 0 0 0 0 0 0 0 0 0 0 0 0 
##$DATE= 1566563691
##$DBL= (0..7)
120 120 120 120 120 120 120 120 
##$DBP= (0..7)
150 150 150 150 150 150 150 150 
##$DBP07= 0
##$DBPNAM0= <>
##$DBPNAM1= <>
##$DBPNAM2= <>
##$DBPNAM3= <>
##$DBPNAM4= <>
##$DBPNAM5= <>
##$DBPNAM6= <>
##$DBPNAM7= <>
##$DBPOAL= (0..7)
0.5 0.5 0.5 0.5 0.5 0.5 0.5 0.5 
##$DBPOFFS= (0..7)
0 0 0 0 0 0 0 0 
##$DE= 6
##$DECBNUC= <off>
##$DECIM= 24
##$DECNUC= <off>
##$DECSTAT= 4
##$DIGMOD= 1
##$DIGTYP= 9
##$DL= (0..7)
0 120 120 120 120 120 120 120 
##$DP= (0..7)
150 150 150 150 150 150 150 150 
##$DP07= 0
##$DPNAME0= <>
##$DPNAME1= <>
##$DPNAME2= <>
##$DPNAME3= <>
##$DPNAME4= <>
##$DPNAME5= <>
##$DPNAME6= <>
##$DPNAME7= <>
##$DPOAL= (0..7)
0.5 0.5 0.5 0.5 0.5 0.5 0.5 0.5 
##$DPOFFS= (0..7)
0 0 0 0 0 0 0 0 
##$DQDMODE= 0
##$DR= 18
##$DS= 0
##$DSLIST= <SSSSSSSSSSSSSSS>
##$DSPFIRM= 0
$$ [...]
##$SUBNAM2= <"">
##$SUBNAM3= <"">
##$SUBNAM4= <"">
##$SUBNAM5= <"">
##$SUBNAM6= <"">
##$SUBNAM7= <"">
##$SUBNAM8= <"">
##$SUBNAM9= <"">
##$SW= 24.9336996594482
##$SWIBOX= (0..15)
0 0 2 0 0 0 0 0 0 0 0 0 0 0 0 0 
##$SW_h= 4990.01996007984
##$TD= 16384
##$TD0= 1
##$TE= 0
##$TE2= 300
##$TE3= 300
##$TEG= 300
##$TL= (0..7)
0 120 120 120 120 120 120 120 
##$TP= (0..7)
150 150 150 150 150 150 150 150 
##$TP07= 0
##$TPNAME0= <>
##$TPNAME1= <>
##$TPNAME2= <>
##$TPNAME3= <>
##$TPNAME4= <>
##$TPNAME5= <>
##$TPNAME6= <>
##$TPNAME7= <>
##$TPOAL= (0..7)
0.5 0.5 0.5 0.5 0.5 0.5 0.5 0.5 
##$TPOFFS= (0..7)
0 0 0 0 0 0 0 0 
##$TUNHIN= 0
##$TUNHOUT= 0
##$TUNXOUT= 0
##$USERA1= <user>
##$USERA2= <user>
##$USERA3= <user>
##$USERA4= <user>
##$USERA5= <user>
##$V9= 5
##$VALIST= <valist>
##$VCLIST= <CCCCCCCCCCCCCCC>
##$VD= 0
##$VDLIST= <DDDDDDDDDDDDDDD>
##$VPLIST= <PPPPPPPPPPPPPPP>
##$VTLIST= <TTTTTTTTTTTTTTT>
##$WBST= 1024
##$WBSW= 4
##$XGAIN= (0..3)
0 0 0 0 
##$XL= 0
##$YL= 0
##$YMAX_a= 324072
##$YMIN_a= -636036
##$ZGOPTNS= <>
##$ZL1= 120
##$ZL2= 120
##$ZL3= 120
##$ZL4= 120
##$ABSF1= 10
##$ABSF2= 0
##$ABSG= 5
##$ABSL= 3
##$ALPHA= 0
##$AQORDER= 0
##$ASSFAC= 0
##$ASSFACI= 0
##$ASSFACX= 0
##$ASSWID= 0
##$AUNMP= <proc_1d>
##$AZFE= 0.1
##$AZFW= 0.1
##$BCFW= 1
##$BC_mod= 2
##$BYTORDP= 1
##$COROFFS= 0
##$CY= 11.3945322036743
##$DATMOD= 1
##$DC= 2
##$DFILT= <>
##$DTYPP= 0
##$F1P= 20.1720416913024
##$F2P= 0.152960286110954
##$FCOR= 0.5
##$FTSIZE= 0
##$FT_mod= 4
##$GAMMA= 1
##$GB= 0.15
##$INTBC= 1
##$INTSCL= 1
##$ISEN= 128
##$LB= 0.24
##$LEV0= 0
##$LPBIN= 0
##$MAXI= 10000
##$MC2= 0
##$MEAN= 0
##$ME_mod= 0
##$MI= 1.114404
##$NCOEF= 0
##$NC_proc= 0
##$NLEV= 6
##$NOISF1= 3.799351
##$NOISF2= 2.8
##$NSP= 1
##$NTH_PI= 0
##$NZP= 0
##$OFFSET= 15.70392
##$PC= 1
##$PHC0= -9218.259
##$PHC1= 20.80096
##$PH_mod= 1
##$PKNL= yes
##$PPARMOD= 0
##$PSCAL= 0
##$PSIGN= 0
##$REVERSE= no
##$SF= 200.130013532006
##$SI= 16384
##$SIGF1= 3
##$SIGF2= 2
##$SINO= 400
##$SIOLD= 16384
##$SREGLST= <1H.CDCl3>
##$SSB= 0
##$STSI= 0
##$STSR= 0
##$SW_p= 3612.71676300578
##$SYMM= 0
##$S_DEV= 0
##$TDeff= 0
##$TDoff= 0
##$TI= <>
##$TILT= no
##$TM1= 0
##$TM2= 0
##$TOPLEV= 0
##$USERP1= <user>
##$USERP2= <user>
##$USERP3= <user>
##$USERP4= <user>
##$USERP5= <user>
##$WDW= 1
##$XDIM= 8192
##$YMAX_p= 0
##$YMIN_p= 0
$$ End of Bruker specific parameters
$$ ---------------------------------
##NTUPLES= NMR FID
##VAR_NAME=  TIME,          FID/REAL,        FID/IMAG
##SYMBOL=    X,             R,               I
##VAR_TYPE=  INDEPENDENT,   DEPENDENT,       DEPENDENT
##VAR_FORM=  AFFN,          ASDF,            ASDF
##VAR_DIM=   8192,          8192,            8192
##UNITS=     SECONDS,       ARBITRARY UNITS, ARBITRARY UNITS
##FACTOR=    0.0002004,     1,               1
##FIRST=     0,             0,               0
##LAST=      1.6414764,     0,               0
##MIN=       0,             -636036,         0
##MAX=       1.6414764,     324072,          0
$$ Real data points
##PAGE= N=1
##DATA TABLE= (X++(R..R)), XYDATA
$$ [...]
$$ plain form
3114 -1608 -3080 2109 1503 -3390 86 4916 -491 -4083 2143 4337 -1270 -917 4015 944 -2907
3129 -2907 2237 5434 -967 -2723 3452 2873 -2009 570 4554 -584 -3577 3204 4027 -3110 -2564 3559
3145 3559 636 -3615 1004 3109 -3531 -4331 2971 2359 -4981 -2033 3104 -1936 -4786 1571 2117 -4961
3161 -4961 -3713 3182 89 -4799 96 2798 -3065 -3636 3619 1724 -4648 -1313 4645 -282 -3658
3176 -3658 2795 3596 -3311 -1547 5897 2099 -3765 1394 5139 -1303 -2167 5132 2978 -3844 282
3191 282 5973 174 -3654 3100 3666 -3040 -1442 5335 701 -5343 827 4597 -2551 -3177 3327 1016
3207 1016 -5384 -859 4535 -2162 -5492 1283 2652 -4418 -3009 3734 -1166 -6599 173 4025 -3100
3222 -3100 -4791 2853 914 -5014 12 5005 -2276 -5277 2915 4101 -3049 -1697 5001 498 -4293
$$ packed form
3114a608j472N189o06m893L476M830n407l592O226K194n607L53M932l071l851
3129b907N144L197o401j756O175n79m882K579L984n138k993O781Q23p137N46O123
3145C559k923m251M619K105o640q00P302o12p340K948N137n040k850O357N46p078
3161d961J248O895l093m888M895K702n863n71P255j895o372L335N958m927l376
3176c658O453Q01o907J764P444l798n864N159L745o442q64P299k154o822M126
3191B82N691n799l828O754N66o706J598O777m634o044O170L770p148o26O504k311
3207A016o400M525N394o697l330O775J369p070J409O743m900n433O772L852p125
3222c100j691P644j939n928N026M993p281l001Q192J186p150J352O698m503m791
$$ plain form
3237 -4293 2799 5769 -2511 -3547 4627 3590 -3166 836 5472 -1133 -3743 4663 5083 -3688 -2045
3252 -2045 5068 1084 -4117 2141 4009 -3557 -3655 4970 2375 -5485 -1414 3995 -1996 -4802 2716
3267 2716 2379 -6311 -3299 4873 -120 -6301 -182 3118 -4043 -4025 4032 1074 -6680 -1180 4596 -1333
3283 -1333 -4744 2352 2466 -4411 -1354 5867 276 -5299 1687 5476 -1974 -2244 5079 2304 -4342
3298 -4342 1076 6484 -540 -4023 3681 4687 -2963 -783 5682 596 -4497 2263 5387 -2772 -3399
3313 -3399 4441 1989 -4796 -58 4912 -2363 -5282 2734 2879 -4687 -2687 3789 -1056 -6044 913
3328 913 3618 -4591 -4550 3609 878 -5645 -792 4183 -2633 -5001 2853 3040 -4684 -2487 4720 56
3344 56 -4781 2258 4642 -3136 -2863 5184 2817 -4247 645 5361 -817 -2969 4159 4358 -3812 -601
$$ packed form
3237d293P092K970q280j036Q174j037o756M002M636o605k610Q406M20q771J643
3252b045P113l984n201O258J868p566r8Q625k595p860M071N409n991k806P518
3267B716l37q690L012Q172m993o181O119L300p161J8Q057k958p754N500N776n929
3283a333l411P096J14o877L057P221n591n575O986L789p450k70P323k775o646
3298d342N418N408p024l483P704J006p650K180O465n086n093O760L124q159o27
3313c399P840k452o785M738M970p275k919Q016J45p566K000O476m845m988O957
3328I13K705q209M1Q159k731o523M853M975o816k368P854J87p724K197P207m664
3344E6m837P039K384p778K73Q047k367p064M892M716o178k152P128J99q170L211
$$ plain form
3360 -601 5876 1057 -3849 2422 4649 -2928 -2227 5479 1901 -5031 -193 4783 -1331 -4349 3041
3375 3041 2245 -5029 -1574 4946 -809 -6074 626 3411 -3777 -3939 2876 169 -5911 -439 4122
3390 4122 -2381 -5354 1990 2160 -4157 -1698 3820 -891 -4875 2085 4414 -2907 -3023 4230 2069
3405 2069 -3601 1213 5326 -1702 -3299 4644 4160 -3306 -868 4750 1173 -2703 2776 4383 -3036
3420 -3036 -2303 5360 2684 -3991 -83 4040 -721 -2540 3375 1967 -4447 -1663 4621 -16 -4888
3435 -4888 214 2395 -3606 -2166 3535 -324 -6263 -697 4001 -1970 -4827 911 1323 -3994 -887
3450 -887 3858 -1339 -5565 1088 4223 -1785 -2763 2456 381 -3142 1820 4414 -1736 -3442 3452
3465 3452 3707 -1743 -282 3804 -45 -2326 3880 4814 -2858 -2166 4328 2516 -2316 550 3211 -1793
$$ packed form
3360f01O477m819m906O271K227p577P01P706l578o932M838M976o114l018P390
3375C041p96p274L455O520n755n265O700K785p188j62O815k707o080N472M561
3390D122o503k973P344J70o317K459N518m711l984O960K329p321j16P253k161
3405B069n670M814M113p028j597P943m84p466K438N618l577l876N479J607p419
3420c036P33P663k676o675L908M123m761j819N915j408o414K784O284m637m872
3435d888N102K181o001J440N701l859n939N566M698n971k857N738M12n317L107
3450h87M745n197m226O653L135o008r78N219k075l523M962K594o150j706O894
3465C452K55n450J461M086l849k281O206R34p672O92O494j812m832K866K661n004
$$ plain form
3481 -1793 -2158 3939 2973 -3806 -2015 3279 100 -2763 761 1130 -3650 -1928 3810 442 -4977 -1456
3497 -1456 2134 -1839 -2506 1311 -346 -4992 -1236 3829 -696 -4817 -208 2150 -2272 -1555 2748
3512 2748 -189 -4001 645 4391 -72 -2874 1538 2053 -1100 573 3475 -187 -2422 2342 3796
3527 3796 -876 -879 2608 1380 -1729 2084 3471 -1276 -2046 2880 2721 -2243 -755 2737 -110 -2288
3543 -2288 1493 1940 -2978 -2495 2057 916 -2843 -866 1102 -1775 -2640 1239 182 -3428 -1650 1863
3559 1863 -676 -3012 67 605 -2423 -1467 2030 -843 -2968 -159 2359 -905 -2302 1421 1395 -2059
3575 -2059 333 3073 -93 -2040 1564 2907 -436 -647 1967 1401 -684 1290 2666 -277 -910 2417
3591 2417 1816 -983 207 1917 239 -866 1687 1399 -2065 -1527 1598 421 -2140 -736 1097 -1224
$$ packed form
3481a793l65O097r66o779J791N294l179k863L524L69m780J722N738l368n419L521
3497a456L590l973o67L817j657m646L756N065m525m121M609K358m422P17M303
3512B748k937l812M646L746m463k802M412N15l153J673K902l662k235M764J454
3527C796m672lL487j228l109L813J387m747p70M926j59m964J488L492k847k178
3543b288L781M47m918M83M552j141l759J977J968k877q65L879j057l610J778L513
3559A863k539k336L079N38l028R56L497k873k125K809K518l264j397L723k6l454
3575b059K392K740l166j947L604J343l343k11K614n66k085J974J376k943o33L327
3591B417o01k799J190J710j678j105K553k88l464N38L125j177k561J404J833k321
$$ plain form
3607 -1224 -1781 1041 7 -2810 -1809 996 -423 -2387 -745 -64 -1778 -1143 908 -588 -2545 -376
3623 -376 1386 -600 -1452 633 248 -1296 98 2046 -243 -1747 640 1912 10 119 1696 503
3639 503 -489 1507 2481 340 -946 1778 2065 311 616 1392 349 -513 1194 1468 -621 -890 1027
3656 1027 557 -681 -298 409 -1042 -1347 1166 291 -1911 -1186 -137 -656 -1418 -537 -599 -2042 -1137 31
3674 31 -482 -1464 -1077 -133 -493 -1017 -175 -323 -898 -335 863 243 -598 281 655 212 511 955 472 -172
3694 -172 1068 1690 424 -95 1002 1122 805 822 1284 322 18 1067 1351 322 105 416 487 349 348 561
3714 561 -382 -581 93 150 -844 -746 -546 -839 -868 -455 -632 -1381 -1296 -522 -634 -1015 -982 -892 -686 -702 -304 -207 -958
3737 -958 -670 -234 -45 122 -289 -419 238 739 486 317 493 542 494 1039 815 410 282 663 1105 841 904
$$ packed form
3607a224n57K822j034k817J001K805j419j964J642O81j714O35K051j496j957K169
3623c76J762j986q52K085l85j544J394J948k289j504K387J272j902J09J577j193
3639E03r92J996R74k141j286K724K87j754L05P76j043q62J707K74k089k69J917
3656A027m70j238L83P07j451l05K513q75k202P25J049n19p62Q81o2j443R05J168
3674C1n13r82L87R44l60n24Q42j48n75N63J198o20q41Q79L74m43K99M44m83o44
3694a72J240O22j266n19J097J20l17J7M62r62l04J049K84j029k17L11P1j38jK13
3714E61r43j99O74N7r94R8K00k93k9M13j77p49Q5P74j12l81L3R0K06j6L98R7p51
3737i58K88M36J89J67m11j30O57N01k53j69J76M9m8N45k24m05j28L81M42k64O3
$$ plain form
3758 904 495 426 335 1156 1075 248 273 466 510 200 392 -20 -887 -504 443 -109 -835 -380 -330 -628 -402 -402 -786
3781 -786 -1119 -1156 -309 -488 -1228 -309 -644 -1330 -1083 161 -200 -1351 -712 74 -363 -441 -17 -405 -610 260
3801 260 1062 195 -317 515 886 474 544 1376 716 90 956 1850 591 117 1408 1001 -289 569 1934
3820 1934 453 -442 860 1221 -110 -355 506 -31 -889 -15 721 -947 -1127 -73 249 -1349 -545 209
3838 209 -1029 -1705 184 667 -1477 -1437 -172 -350 -1557 -258 674 -1738 -1313 860 526 -1194 -743
3855 -743 776 -90 -797 675 1218 -767 -531 1801 1161 -99 740 1847 389 209 1985 1527 -523
3872 -523 525 2137 720 -422 1385 1057 -755 -280 1716 518 -1635 -316 1149 -833 -1372 947
3888 947 463 -1794 -549 1146 -432 -1936 -198 210 -1853 -1372 604 -535 -2282 -654 835 -1137
$$ packed form
3758I04m09o9r1Q21q1q27K5J93M4l10J92m12q67L83R47n52p26M55N0k98K26%l84
3781g86l33l7Q47j79p40R19l35o86K47J244l61j151O39P86m37p8M24l88k05Q70
3801B60Q02q67n12Q32L71m12P0Q32o60o26Q66Q94j259m74J291m07j290Q58J365
3820A934j481q95J302L61j331k45Q61n37q58Q74P36j668j80J054L22j598Q04P54
3838B09j238o76J889M83k144M0J265j78j207J299R32k412M25K173l34j720M51
3855g43J519q66p07J472N43j985K36K332o40j260Q39J107j458j80J776m58k050
3872e23J048J612j417j142J807l28j812M75J996j198k153J319J465j982n39K319
3888I47m84k257J245J695j578j504J738M08k063M81J976j139j747J628J489j972
$$ plain form
3904 -1137 -1395 520 -285 -1872 -173 1291 -292 -1749 684 1507 -944 -357 1606 507 -1274 1064
3920 1064 2324 -141 -961 1584 1596 -241 725 2236 187 -966 1572 1974 -650 -258 1467 634 -1358
3937 -1358 811 1787 -1173 -1433 1133 906 -1567 -612 955 -714 -2093 695 877 -2436 -1898 1064
3953 1064 -23 -2312 -544 548 -1714 -1990 1072 295 -2349 -1142 1321 -476 -1761 682 992 -1627
3969 -1627 -739 2197 419 -1605 370 2088 -391 -515 2465 1106 -1289 504 3149 635 -1043
3984 -1043 1427 1856 -716 132 2800 580 -1701 887 2335 -412 -1501 1302 969 -1529 -86 1764
4000 1764 -753 -2396 437 1121 -1675 -1494 1081 -742 -2313 -122 1026 -1926 -2099 1128 150 -2547
4016 -2547 -803 1131 -924 -2373 686 1076 -2143 -1151 1787 294 -1805 385 1807 -1266 -1083 2201
$$ packed form
3904a137k58J915q05j587J699J464j583j457K433Q23k451N87J963j099j781K338
3920A064J260k465q20K545J2j837R66J511k049j153K538M02k624L92J725q33j992
3937a358K169R76k960k60K566k27k473R55J567j669j379K788J82l313N38K962
3953A064j087k289J768J092k262k76L062p77k644J207K463j797j285K443L10k619
3969a627Q88K936j778k024J975J718k479j24K980j359k395J793K645k514j678
3984a043K470M29k572Q48K668k220k281K588J448k747j089K803l33k498J443J850
4000A764k517j643K833O84k796J81K575j823j571K191J148k952j73L227r78k697
4016b547J744J934k055j449L059L90l219R92K938j493k099K190J422l073J83L284
$$ plain form
4032 2201 1582 -1545 500 2498 -63 -1091 2134 2218 -1270 -10 2549 493 -1462 1101 2454 -596
4048 -596 -1001 1744 923 -1612 99 2360 -719 -2097 1203 1338 -2051 -1124 1731 -568 -2250 205
4064 205 1280 -1968 -2306 1112 -20 -2830 -570 1381 -1632 -2536 1080 791 -2280 -1252 1694 -123
4080 -123 -2274 733 1545 -1359 -1130 2425 968 -1958 463 2562 -249 -1181 2095 1776 -1387 165
4096 165 3020 491 -1512 1237 2139 -627 -594 2777 914 -2114 652 2251 -297 -1758 1486 948
4112 948 -2046 -482 1667 -545 -2647 677 1630 -1936 -1555 1058 -372 -2710 -230 1460 -1783 -2544
4128 -2544 711 702 -2476 -734 1873 -1019 -2139 751 1567 -2048 -1204 2079 477 -1933 760 2200
4144 2200 -891 -1001 2403 1700 -1263 417 2725 337 -1149 1760 2255 -1037 -648 2811 1145 -1280
$$ packed form
4032B201o19l127K045J998k561j028L225Q4l488J260K559k056j955K563J353l050
4048e96m05K745q21k535J711K261l079j378L300J35l389R27K855k299j682K455
4064B05J075l248l38L418j132k810K260J951l013r04L616k89l071J028K946j817
4080a23k151L007Q12k904K29L555j457k926K421K099k811r32L276l19l163J552
4096A65K855k529k003K749R02k766L3L371j863l028K766J599k548j461L244n38
4112I48k994J564K149k212k102L324R53l566L81K613j430k338K480J690l243p61
4128b544L255rl178J742K607k892j120K890Q16l615Q44L283j602k410K693J440
4144B200l091j10L404p03k963J680K308k388j486K909M95l292L89L459j666k425
$$ plain form
4160 -1280 920 2235 -687 -939 2281 893 -2278 -208 2392 -279 -2121 813 832 -2170 -942 1971
4176 1971 -278 -3228 -294 1501 -1516 -2184 1038 107 -3095 -573 1467 -1055 -2661 707 1242 -1864
4192 -1864 -925 1559 -189 -2194 719 1901 -1266 -1461 1962 1114 -1239 551 2432 -421 -805 2514
4208 2514 2089 -1245 -230 2719 850 -1183 1485 2206 -1260 -908 2433 1496 -1686 217 2189 -553
4224 -553 -1786 1284 1017 -1843 -957 1824 -450 -2242 -101 1423 -1594 -1494 1178 -322 -2993 -379
4240 -379 1494 -1477 -2468 677 747 -2210 -736 1465 -726 -2543 783 1873 -1382 -1317 1503 598 -1365
4257 -1365 310 2171 -609 -1468 1879 1997 -1055 -38 2199 456 -857 1591 1804 -1420 -527 2583
4273 2583 1134 -1355 479 2332 -866 -880 1998 956 -2246 -375 2373 -134 -2016 466 792 -1615
$$ packed form
4160a280K200J315k922k52L220j388l171K070K600k671j842K934J9l002J228K913
4176A971k249k950K934J795l017o68L222r31l202K522K040k522j606L368N35l106
4192a864R39K484j748k005K913J182l167j95L423q48k353J790J881k853l84L319
4208B514m25l334J015K949j869k033K668P21l466L52L341r37l182J903J972k742
4224e53j233L070k67k860Q86K781k274j792K141J524l017J00K672j500k671K614
4240c79J873k971r91L145P0k957J474K201k191j817L326J090l255O5K820r05j963
4257a365J675J861k780q59L347J18l052J017K237j743j313K448K13l224Q93L110
4273B583j449k489J834J853l198j4K878j042l202J871K748k507j882K482L26k407
$$ plain form
4289 -1615 -922 1326 -456 -2697 -325 1210 -1121 -1947 305 -223 -2316 -365 1511 -1204 -2478 533
4305 533 1413 -1551 -907 1249 -164 -1777 863 2438 -918 -1529 1600 1580 -872 220 1782 -70
4321 -70 -933 1582 1982 -844 -488 1993 1036 -840 1104 1902 -959 -552 2056 1239 -1746 -527 1695
4338 1695 -217 -1382 1019 614 -1978 -848 1632 -181 -2331 -280 1091 -1245 -1510 626 -69 -2249
4354 -2249 -680 1476 -719 -1926 240 271 -1561 -565 1313 -510 -2191 517 1444 -1028 -1021 1153 491
4371 491 -1151 609 1709 -328 -1000 2018 1683 -734 39 1794 644 -827 1275 1910 -564 -363
4387 -363 1940 1229 -560 295 1192 -232 -666 1173 783 -1556 -484 1392 -272 -1690 166 618 -1547
4404 -1547 -1090 532 -494 -2188 -440 1002 -1036 -1815 -114 12 -1378 -652 677 -321 -1440 246
$$ packed form
4289a615O93K248j782k241K372J535k331q26K252n28k093J951J876k715j274L011
4305E33Q80k964O44K156j413j613K640J575l356o11L129k0k452J092J562j852
4321g0q63K515M00k826L56K481r57j876J944P98k861M07K608q17k985J219K222
4338A695j912j165K401m05k592J130K480j813k150K051J371k336k65K136o95k180
4354b249J569K156k195j207K166L1j832R96J878j823j681K708R27k472PK174o62
4371D91j642J760J100k037o72L018l35k417P73J755j150j471K102O35k474K01
4387c63K303p11j789Q55Q97j424m34J839l90k339J072J876j664j418J856M52k165
4404a547M57J622j026j694J748J442k038p79J701J26j390P26J329r98j119J686
$$ plain form
4420 246 805 -726 -763 695 197 -789 646 1284 -545 -916 1435 1089 -509 -43 1852 404 -222 1253
4438 1253 1344 133 -128 1473 1149 -231 403 1205 -321 -276 1123 692 -617 -141 1060 128 -713 133
4456 133 -158 -657 -524 637 73 -1561 -618 451 -639 -1339 -207 -631 -1215 -514 229 -748 -1376 24
4474 24 290 -697 -443 188 -71 -824 206 947 -392 -436 537 873 6 249 795 97 -30 798 958 -111
4494 -111 -1 1061 753 -95 644 719 151 132 1383 645 -265 -127 557 389 -336 158 -140 -338 -195 53
4514 53 -189 -1074 -771 -123 -511 -629 -32 -629 -1005 -412 414 -755 -1138 -493 -416 -399 -535 70 -634 -682 -269
4535 -269 321 -109 -628 18 268 313 375 494 241 -18 510 879 457 397 252 206 709 561 404 320 663 594
4557 594 812 289 360 200 434 615 366 25 -140 -46 -149 -33 -53 -575 -777 -317 -219 -344 -1081 -542 -779
$$ packed form
4420B46N59j531l7J458m98r86J435O38j829l71K351l46j598M66J895j448o26J475
4438A253R1j211k61J601l24j380O34Q02j526M5J399m31j309M76J201r32q41Q46
4456A33k91m99J33J161n64j634R43J069j090p00J132m24n84P01P43r77o28J400
4474B4K66r87K54O31k59p53J030P41j339m4R73L36q67K43N46o98j27Q28J60j069
4494a11J10J062l08q48P39P5n68j9J251p38r10J38O84j68p25M94k98j98J43K48
4514E3k42q85L03O48l88j18N97n97l76N93Q26j169l83O45P7J7j36O05p04m8M13
4535b69N90m30n19O46K50M5O2J19k53k59N28L69m22o0j45m6N03j48j57q4L43o9
4557E94K18n23P1j60K34J81k49l41j65R4j03J16k0n22k02M60R8j25p37N39k37
$$ plain form
4578 -779 -748 -77 -209 -960 -1058 -578 -134 -379 -540 -594 -511 -432 165 -18 -483 -330 55 404 208 382 562 -4
4600 -4 -242 918 757 58 197 727 527 351 977 588 85 440 977 678 -107 560 752 -174 -100 853 391
4621 391 -379 -129 803 -129 -637 101 -150 -648 -597 536 -207 -1126 -450 28 -788 -745 43 -650 -1471 -387
4641 -387 566 -786 -1274 -16 -70 -1125 -217 749 -232 -780 444 748 -362 -497 607 536 -445 486 1376
4660 1376 190 -650 983 993 -83 159 1549 385 -399 1213 1207 -281 -265 907 636 -578 204 1192
4678 1192 -544 -842 417 889 -979 -784 705 -110 -1639 113 340 -1482 -1190 444 -170 -1974 -717
4695 -717 716 -1028 -1291 519 -65 -1474 -987 656 -76 -1253 123 946 -871 -714 1150 606 -1408
4712 -1408 8 1613 -249 -530 1224 1469 -750 -70 2086 775 -839 823 1523 -555 -600 1603
$$ packed form
4578g79L1O71j32p51r8M80M44k45j61n4Q3P9N97j83m65J53L85L49j96J74J80n66
4600dk38J160j61o99J39N30k00j76O26l89n03L55N37k99p85O67J92r26P4R53m62
4621C91p70K50R32r32n08P38k51m98N1J133p43r19O76M78q16M3P88o93q21J084
4641c87R53j352m88J258n4j055R08R66r81n48J224L04j110j35J104p1r81R31Q90
4660A376j186q40J633J0j076K42J390j164p84J612oj488J6J172k71j214P82R88
4678A192j736k98J259M72j868J95J489q15j529J752K27j822K92J634o14j804J257
4695g17J433j744k63J810n84j409M87J643p32j177J376Q23j817J57J864n44k014
4712a408J416J605j862k81J754K45k219O80K156j311j614J662P00k078m5K203
$$ plain form
4728 1603 625 -1206 136 2021 -155 -917 973 771 -1450 -700 1634 -116 -1603 167 672 -1263
4744 -1263 -1171 1080 -419 -2250 -404 997 -1078 -2150 446 160 -1799 -957 1088 -313 -2073 371
4760 371 1244 -1224 -1383 1221 532 -1935 -3 1811 -505 -1540 1405 1645 -869 -152 2001 245
4776 245 -1095 1500 2149 -863 -909 1830 1065 -1097 614 1822 -299 -1489 1558 1415 -1523 -983 1617
4793 1617 450 -1573 426 1094 -1465 -1806 1611 559 -2042 -503 1213 -1024 -1611 831 468 -2385
4809 -2385 -1055 1444 -100 -2279 83 1064 -1586 -1363 1436 180 -2191 -104 1930 -188 -1820
4824 -1820 1060 1416 -1476 -149 2214 374 -1727 1203 2112 -573 -832 1882 1186 -1465 872 2416
4840 2416 -418 -1422 1889 1634 -1244 -494 2067 146 -1819 1259 1891 -1270 -1551 1577 678 -2093
$$ packed form
4728A603r78j831J342J885k176p62J890k02k221P50K334j750j487J770N05j935
4744a263R2K251j499j831J846J401k075j072K596k86j959Q42K045j401j760K444
4760C71Q73k468j59K604o89k467J932J814k316j035K945K40k514P17K153j756
4776B45j340K595O49l012m6K739p65k162J711J208k121j190L047j43k938N40K600
4793A617j167k023J999O68k559l41L417j052k601J539J716k237n87K442l63k853
4809b385J330K499j544k179K362R81k650K23K799j256k371K087K034k118j632
4824a820K880L56k892J327K363j840k101K930R09k685k59K714o96k651K337J544
4840B416k834j004L311k55k878P50K561j921j965L078O32l161k81L128q99k771
$$ plain form
4856 -2093 -321 1251 -968 -2320 923 1024 -2474 -1486 1448 -350 -2467 -9 818 -2006 -1554 1487
4872 1487 638 -2784 -627 1825 -604 -1798 1311 1363 -1866 -518 2831 326 -2003 741 2276 -847
4888 -847 -1016 2350 1046 -1877 539 3101 -280 -1656 1504 1817 -1122 -378 2143 190 -2223 814
4904 814 2268 -1422 -1412 1757 637 -1930 -138 1789 -1431 -2416 1249 1363 -2281 -1605 1574 -494
4920 -494 -2617 500 1412 -2163 -2086 1720 640 -2323 -572 1382 -1003 -1950 1667 1361 -2188 -1152
4936 -1152 2064 381 -2012 984 1965 -1274 -880 2368 1515 -2242 -16 2531 41 -840 1832 1680
4952 1680 -1814 -439 3058 652 -1955 555 2095 -921 -853 2130 813 -2385 -125 2427 -520
4967 -520 -2246 933 1589 -1764 -733 1759 -753 -2890 84 2016 -1490 -2004 1250 -25 -2563 -293
$$ packed form
4856b093J772J572k219j352L243J01l498R88K934j798k117K458Q27k824M52L041
4872A487q49l422K157K452k429j194L109N2l229J348L349k505k329K744J535l123
4888h47j69L366j304k923K416K562l381j376L160L13k939P44K521j953k413L037
4904H14J454l690J0L169j120k567J792J927l220r85L665J14l644O76L179k068
4920d94k123L117R12l575P7L806j080k963J751J954k385r47L617l06l549J036
4936a152L216j683k393K996R81l239L94L248q53l757K226K547k490q81K672j52
4952A680l494J375L497k406k607K510J540l016O8K983j317l198K260K552k947
4967e20j726L179O56l353J031K492k512k137K974J932l506n14L254j275k538K270
$$ plain form
4983 -293 2023 -985 -2881 1060 1374 -1627 -1073 1778 -60 -2377 1016 2175 -1195 -1844 2069 1366
4999 1366 -1537 402 2229 -850 -1767 2045 2352 -1544 -769 2566 657 -1470 1540 2078 -1616 -1356
5015 -1356 2558 1492 -1992 -434 2038 -377 -1707 1232 1382 -2424 -1052 2204 67 -2648 -198
5030 -198 1489 -1632 -1668 1591 473 -3043 -523 2029 -859 -2144 736 787 -1907 -1096 2395 -154
5046 -154 -2905 421 2258 -1216 -1349 1813 1096 -1992 300 2387 -259 -1891 1506 2282 -1061 -501
5062 -501 2420 408 -1774 1383 2557 -1066 -1575 2180 990 -1691 50 2232 -678 -1671 1529 1727
5078 1727 -2099 -1029 2281 -116 -2128 564 1603 -1346 -1971 1419 466 -2409 -602 1902 -1096
5093 -1096 -2414 789 925 -1953 -1074 1707 -568 -2441 364 1607 -1471 -1598 1383 524 -1798 51
$$ packed form
4983b93K316l008j896L941L14l001N54K851j838k317L393J159l370o49L913p03
4999A366k903J939J827l079r17L812L07l896P75L335j909k127L010N38l694K60
5015a356L914j066l484J558K472k415j330K939J50l806J372L256k137k715K450
5030a98J687l121l6L259j118l516K520K552k888j285K880N1k694Q11L491k549
5046a54k751L326J837l474j33L162p17l088K292K087k646j632L397P76l343N60
5062e01K921k012k182L157J174l623n09L755j190k681J741K182k910r93L200J98
5078A727l826J070L310k397k012K692J039k949o25L390r53k875J807K504k998
5093a096j318L203J36k878Q79K781k275j873K805J243l078j27K981q59k322J849
$$ plain form
5109 51 2310 -364 -1886 1423 1898 -1293 -523 2191 401 -1444 1221 2224 -837 -1171 1942 1158
5125 1158 -1544 301 1989 -513 -933 1484 1802 -1384 -727 2318 284 -1695 579 1238 -1744 -1406
5141 -1406 1880 604 -2540 -758 1316 -704 -2109 332 690 -1845 -1079 1694 -349 -2488 -35
5156 -35 920 -1030 -1222 1235 490 -2065 441 2037 -277 -1666 849 1491 -1144 -355 1857 53 -1498
5173 -1498 1148 2128 -326 -827 1678 1052 -1201 519 2119 -285 -1229 1456 1555 -1158 -566 1451 336
5190 336 -1112 502 1098 -973 -1283 1504 578 -1397 -404 1003 -652 -1518 611 151 -1835 -1004 1163
5207 1163 -200 -1989 -160 835 -1315 -1261 1059 176 -1900 -117 1578 -456 -991 478 731 -851
5223 -851 186 1590 14 -1315 792 1969 -344 -508 1177 725 -861 837 1661 -51 -989 1178
$$ packed form
5109E1K259k674j522L309M75l191P70K714j790j845K665J003l061l34L113p84
5125A158k702J845J688k502m20K417L18l186O57L045k034j979K274O59k982L38
5141a406L286j276l144J782K074k020j405K441L58k535P66K773k043k139K453
5156c5R55j950j92K457p45k555K506J596k314j389K515O42k635P89K212j804j551
5173a498K646R80k454n01K505o26k253J720J600k404r44K685R9k713N92K017j115
5190C36j448J614N96k071l10K787r26j975R93J407j655q66K129m60j986Q31K167
5207A163j363j789J829R95k150N4K320q83k076J783J695k034n35J469K53j582
5223h51J037J404j576j329K107J177k313j64J685m52j586J698Q24j712r38K167
$$ plain form
5239 1178 1266 -581 214 1693 -13 -766 710 886 -778 -771 902 404 -990 -176 514 -656 -875 572
5257 572 224 -1303 -913 523 -447 -1287 -112 394 -967 -798 537 -254 -1535 -140 832 -460 -1025
5274 -1025 396 252 -805 -405 1078 -59 -793 462 1046 -35 -219 810 260 -303 558 1281 -29
5291 -29 -402 880 1129 -408 -148 1213 85 -374 652 719 -232 -454 482 515 -659 -250 356 -507 -555
5310 -555 352 -232 -969 -573 -467 74 -986 -168 -193 -737 -195 156 -510 -857 -111 149 -501 -451 -315 -210
5330 -210 -641 -139 591 63 -357 337 611 292 116 219 501 19 251 647 371 -28 429 597 287 348
5350 348 350 198 232 558 544 134 -142 386 261 -43 324 172 -253 -352 441 -156 -392 -327 -414 -241 151 -222
5372 -222 -717 -465 -586 -96 -400 -375 -615 -700 -31 15 -277 -480 -411 -248 -130 60 -254 -287 -393 565 176 -92
$$ packed form
5239A178Q8j847P95J479j706p53J476J76j664PJ673m98j394Q14O90j170k19J447
5257E72l48j527L90J436r70q40J175N06j361J69J335p91j281J395R72j292n65
5274a025J421j44j057M00J483j137p34J255N84j081j84J029n50n63Q61P23j310
5291b9l73J282K49j537K60J361j128m59J026O7r51k22R36L3j174M09O06q63m8
5310e55R07n84p37L96J06N41j060Q18k5n44N42L51o66l47P46K60o50N0J36J05
5330b10m31N02P30n28m20O94K74l19j76J03K82m82K32L96k76l99M57J68l10O1
5350C48Kj52L4L26j4m10k76N28j25l04L67j52m25r9P93n97k36O5q7J73L92l73
5372b22m95K52j21M90l04K5k40q5O69M6k92k03O9J63J18J90l14l3j06R58l89k68
$$ plain form
5394 -92 -132 107 15 357 467 395 -103 182 518 890 96 380 468 102 235 621 388 -16 232 398 265 48
5416 48 340 399 -210 22 431 -100 -670 6 297 -276 -690 -104 -376 -1023 -386 -27 -479 -1003 -56 -161 -796
5437 -796 -260 293 -194 -579 105 628 -598 -571 -61 -11 -305 229 873 103 -435 452 683 -292 -92 879
5457 879 423 -360 714 1090 -170 -303 854 824 -322 499 873 79 -258 895 846 -600 -407 797
5475 797 156 -704 368 707 -675 -661 405 174 -1090 -137 496 -858 -961 195 298 -1338 -730 554
5493 554 -174 -1135 -182 271 -746 -877 670 569 -1219 151 700 -198 -779 590 602 -713 -260 1441
5511 1441 168 -756 612 863 -348 -205 1356 960 -874 446 1650 12 -828 941 1065 -439
5527 -439 -300 1349 194 -1137 533 1120 -860 -850 656 160 -1357 67 862 -640 -1438 472 379
$$ packed form
5394i2m0K39r2L42J10p2m98K85L36L72p94K84Q8l66J33L86k33m04K48J66j33k17
5416D8K92N9o09K32M09n31n70O76K91n73m14N86k72o47O37L59m52n24R47j05o35
5437g96N36N53m87l85O84N23j226K7N10N0k94N34O44p70n38Q87K31r75K00R71
5457H79m56p83J074L76j260j33J157l0j146Q21L74p94l37J153m9j446J93J204
5475G97o41q60J072L39j382J4J066k31j264R53O33j354j03J156J03j636O08J284
5493E54p28r61R53M53j017j31J547j01j788J370N49q98n81J369J2j315M53J701
5511A441j273r24J368K51j211J43J561l96j834J320J204j638q40J769J24j504
5527d39J39J649j155j331J670N87j980J0J506m96j517J424P95j502p98J910r3
$$ plain form
5544 379 -1413 -809 1010 -196 -1512 432 744 -1131 -1067 806 358 -1384 -387 1449 -454 -1595 692
5561 692 948 -1142 -136 1318 -280 -1173 712 1615 -602 -546 1129 783 -998 489 1629 -264 -573
5578 -573 1325 1329 -905 -290 1711 43 -1261 837 1259 -1073 -1135 1416 528 -1373 -262 1353 -565
5595 -565 -1297 606 695 -1594 -1230 973 -247 -1653 41 797 -1594 -1225 1181 169 -1944 -396 1108
5612 1108 -590 -1369 1017 798 -1671 -480 1601 -333 -1333 763 1312 -694 -553 1961 735 -1480
5628 -1480 268 2136 -82 -999 1253 1225 -1333 -240 2044 121 -1604 657 1675 -440 -541 1406
5644 1406 431 -1575 325 1738 -620 -1497 856 792 -1629 -564 1208 -567 -1953 192 1041 -1151
5660 -1151 -1373 1056 188 -2011 -175 1374 -1149 -1695 844 1188 -1655 -494 1480 -153 -1518 554
$$ packed form
5544C79j792O04J819j206j316J944L12j875O4J873m48j742R97J836j903j141K287
5561F92K56k090J006J454j598q93J885R03k217N6J675l46j781J487J140j893l09
5578e73J898Mk234O15K001j668j304K098M22k332o2K551q88j901J111J615j918
5595e65p32J903Q9k289L64K203j220j406J694P56k391L69K406j012k113J548J504
5612A108j698p79K386k19k469J191K081j934j000K096N49k006J41K514j226k215
5628a480J748J868k218r17K252k8k558J093K284j923j725K261J018k115j01J947
5644A406r75k006J900J413k358q77K353o4k421J065J772j775j386K145Q49k192
5660a151k22K429q68k199J836J549k523n46K539L44k843J161J974j633j365K072
$$ plain form
5676 554 1411 -1394 -655 1466 788 -1774 175 1499 -180 -769 1956 1410 -1166 -26 1925 250
5692 250 -1624 747 1723 -987 -940 1743 488 -1631 60 1338 -392 -1485 1267 890 -1683 -491
5708 -491 1083 -220 -1831 520 1139 -1568 -1289 1122 82 -2080 -74 1147 -1101 -1855 1039 896
5724 896 -1609 -1064 1382 -158 -1741 955 1400 -1460 -1002 1843 254 -1456 210 1510 -473 -1011
5740 -1011 1436 1230 -1435 -70 1561 375 -1447 1088 1794 -956 -757 1877 895 -1377 392 2043
5756 2043 -482 -1383 1186 900 -1471 -316 2053 -7 -1786 558 1399 -1238 -1186 1101 -184 -1977
5772 -1977 -138 1546 -797 -1799 952 518 -1533 -505 1864 -747 -1922 637 1244 -1254 -1306 1454
5788 1454 188 -1669 392 1949 -1021 -1689 1276 1509 -977 -300 1880 305 -1046 1007 1806 -1078
$$ packed form
5676E54Q57k805P39K121o78k562J949J324j679n89K725n46k576J140J951j675
5692B50j874K371R76k710M7K683j255k119J691J278j730j093K752l77k573J192
5708d91J574j303j611K351O19k707K79K411j040k162K006J221k248p54K894j43
5724H96k505N45K446j540j583K696M45k860M58K845j589j710J666J300j983n38
5740a011K447k06k665J365J631j186j822K535P06k750J99K634r82k272J769J651
5756B043k525r01K569k86k371J155K369k060j779K344Q41k637N2K287j285j793
5772a977J839J684k343j002K751m34k051J028K369k611j175K559O07k498n2K760
5788A454j266j857K061J557k970o68K965K33k486O77K180j575j351K053P99k884
$$ plain form
5804 -1078 -895 1624 934 -1049 247 1592 -809 -906 1682 1093 -1735 -736 1521 -7 -1280 601
5820 601 1160 -1388 -872 1332 502 -1743 -26 1151 -908 -1187 1041 436 -2156 -792 1642 -187
5836 -187 -1849 336 1017 -1317 -753 1310 -123 -1810 145 1639 -613 -1578 1016 484 -1205 -11
5852 -11 1819 -18 -1445 848 1739 -796 -645 1395 488 -1155 733 2173 -656 -1181 990 1199 -994
5869 -994 -108 1499 -91 -1249 845 1391 -1178 -820 1081 392 -1547 -211 1373 -973 -1479 637
5885 637 626 -1736 -879 1038 -289 -1563 374 743 -1173 -987 1218 408 -1579 -105 929 -949 -1214
5902 -1214 1203 743 -1492 -245 1496 299 -818 717 1451 -675 -248 1689 714 -1413 163 1612
5918 1612 -353 -666 1005 893 -921 -229 1365 0 -818 576 1343 -825 -796 1409 116 -1347 209
$$ packed form
5804a078J83K519o90j983J296J345k401r7K588n89k828R99K257j528j273J881
5820F01N59k548N16K204q30k245J717J177k059k79K228o05k592J364K434j829
5836a87j662K185O81k334N64K063j433j687J955J494k252r65K594n32j689J194
5852a1J830j837j427K293Q91k535J51K040r07j643J888J440k829n25K171K09k193
5869i94Q86J607j590j158K094N46k569L58J901o89j939J336J584k346n06K116
5885F37j1k362Q57J917j327j274J937L69j916J86K205q10j987J474J034j878k65
5902a214K417m60k235J247J741j197j117J535P34k126M27J937r75k127J576J449
5918A612j965l13J671j12j814O92J594j365q18J394P67k168K9K205j293j463J556
$$ plain form
5935 209 788 -769 -1167 893 363 -1654 -341 1111 -540 -1652 116 558 -1199 -1113 1085 -208 -1398
5952 -1398 12 1117 -733 -961 959 464 -1237 -113 1313 -455 -1228 701 1166 -871 -601 1469
5968 1469 348 -954 477 1506 -75 -577 1369 1035 -615 191 1148 357 -1208 899 1141 -605
5984 -605 -533 1130 541 -1040 49 845 -758 -811 1082 281 -1199 -581 1143 38 -924 310 460 -1109
6002 -1109 -693 946 116 -1168 -212 687 -486 -895 598 414 -1006 -73 1045 113 -1023 224 674
6019 674 -631 -600 1208 86 -1099 450 1329 -164 -378 709 495 -304 588 1107 -18 -661 887
6036 887 1094 -388 -383 765 173 -631 312 854 -432 -891 727 399 -868 -399 571 -390 -704 259 496
6055 496 -890 -744 190 40 -1110 -267 489 -749 -761 171 -91 -1201 -550 672 -31 -897 21 500 -601
$$ packed form
5935B09N79j557l98K060n30k017J313J452j651j112J768M42j757Q6K198j293j190
5952a398J410J105j850k28J920m95j701J124J426j768p73J929M65k037K70K070
5968A469j121j302J431J029j581n02J946l34j650Q06R57p91j565K107K42j746
5984f05P2J663n89j581J089P96j603n3J893q01j480O18J724j105r62J234J50j569
6002a109M16J639q30j284R56Q99j173m09J493j84j420R33J118r32j136J247M50
6019F74j305L1J808j122j185J549Q79j493k14J087k14p99Q92N19j125o43J548
6036H87K07j482NJ148n92q04R43N42j286m59J618l28j267M69R70r61l14R63K37
6055D96j386J46R34j50j150Q43P56j238j2R32k62j110O51J222p03q66R18M79j101
$$ plain form
6074 -601 -441 760 199 -796 365 680 15 -156 595 340 -491 355 890 -55 -717 466 747 -296 -69
6093 -69 634 498 -568 113 576 -391 -586 511 294 -398 -160 412 -214 -855 223 46 -708 -678 -27 -84
6113 -84 -526 -99 234 -710 -435 68 -42 -498 -295 311 -342 -532 -83 291 -438 -23 280 177 -375 246
6133 246 422 131 -181 324 597 -40 -11 512 394 -205 27 242 384 -238 667 461 138 315 241 -3 -156
6154 -156 476 252 -55 219 10 -97 94 -22 -78 -331 -175 -2 -154 -454 -301 3 58 -589 74 -278 -445
6175 -445 -489 -159 -242 -330 -521 -340 -22 -199 132 22 -24 134 201 480 -110 -4 -360 292 280 154 57 133 240
6198 240 343 255 631 165 95 -2 249 299 478 332 41 449 655 249 -209 -203 -119 61 71 223 81 -446 -281
6221 -281 309 -150 -381 36 -51 -511 -339 150 -215 -698 -11 69 -292 -259 -37 -268 -564 -280 91 -205 -443
$$ packed form
6074f01J60J201n61r95J161L15o65j71P51k55q31Q46N35r45o62J183K81j043K27
6093f9P03j36j066O81M63r67j95J097k17o92K38N72o26o41J078j77p54L0O51n7
6113h4m42M27L33r44K75N03j10m56K03O06o53j90M49L74p29M15L03j03n52O21
6133B46J76k91l12N05K73o37K9N23j18n99K32K15J42o22R05k06l23J77p4k44j53
6154a56O32k24l07K74k09j07J91j16n6k53J56J73j52l00J53L04N5o47O63l52j67
6175d45m4L30q3q8j91J81L18j77L31j10m6J58O7K79n90J06l56O52j2j26r7P6J07
6198B40J03q8L76m66p0r7K51N0J79j46k91M08K06m06m58OQ4J80J0J52j42n27J65
6221b81N90m59k31M17q7m60J72M89l65m83O87Q0l61L3K22k31k96K84L71k96k38
$$ plain form
6242 -443 169 -186 -150 -199 213 -87 -415 296 686 -93 -90 676 327 85 35 763 129 -174 447 678 -49 -40
6264 -40 420 117 -51 347 377 -319 -153 149 -29 -487 -132 310 -459 -582 145 -30 -455 -149 421 -225 -733
6285 -733 -307 220 -966 -498 691 -98 -1014 -145 338 -290 -687 298 459 -570 -105 532 58 -801 295
6304 295 658 -441 -462 561 664 -512 117 872 243 -476 728 733 -417 -77 874 522 -687 387 657
6323 657 -543 -348 697 267 -746 182 926 -237 -530 531 315 -911 -624 749 -368 -730 42
6340 42 378 -751 -935 620 -121 -1277 -60 710 -631 -1128 565 696 -1072 -115 1009 -29 -1064
6357 -1064 310 864 -289 -631 631 749 -583 238 1260 23 -340 962 759 -746 -248 1486 135
6374 135 -626 558 1087 -174 -447 1081 309 -899 110 1003 -542 -1105 837 403 -1002 -462 728
$$ packed form
6242d43O12l55L6m9M12l00l28P11L90p79LP66l49k42n0P28o34l03O21K31p27R
6264d0M60l03j68L98L0o96J66L02j78m58L55M42p69j23P27j75m25L06N70o46n08
6285g33M26N27j186M68J189p89r16Q69M83o28l97R85J61j029M65O37m74q59J096
6304B95L63j099k1J023J03j176O29P55o29p19J204Nj150L40R51l52j209J074K70
6323F57j200J95J045m30j013R28P44j163k93J061k16j226K87J373j117l62P72
6340D2L36j129j84J555p41j156J217P70j341m97J693J31j768R57J124j038j035
6357a064J374N54j153l42J262J18j332Q21J022j237l63J302k03j505M98J734j351
6374A35p61J184N29j261k73J528p72j208J009Q93j545n63J942m34j405N40J190
$$ plain form
6391 728 -219 -1074 274 826 -1121 -1009 564 54 -1383 -235 833 -460 -1328 1007 647 -1115 -475
6408 -475 1167 -328 -1034 278 812 -845 -247 1161 328 -1070 109 986 -162 -502 967 907 -969
6425 -969 208 1505 -36 -917 535 1096 -588 -277 1503 487 -1044 443 1113 -395 -838 920
6441 920 609 -904 74 1380 -480 -1181 441 906 -899 -824 638 57 -1614 336 994 -1119 -1295
6458 -1295 494 404 -1386 -615 1002 -312 -1674 657 798 -981 -611 1110 159 -1419 289 1254 -612
6475 -612 -858 1215 827 -1064 306 1508 -14 -1156 1119 1204 -788 -546 1465 410 -951 351
6491 351 1204 -452 -850 1075 702 -1340 -148 1182 16 -1219 514 890 -1023 -873 997 133 -1386
6508 -1386 240 1138 -799 -1202 834 299 -1301 -481 1094 -369 -1359 703 983 -1151 -699 1123 -120
$$ packed form
6391G28r47q55J348N52j947J12J573n10j437J148J068j293q68K335l60j762O40
6408d75J642j495p06J312N34j657N98J408q33j398J179Q77j148l40J469o0j876
6425i69J177J297j541q81J452N61j684L11J780j016j531J487O70j508m43J758
6441I20l11j513R78J306j860p01J622M65j805P5J462n81j671J950O58k113j76
6458a295J789r0j790P71J617j314j362K331J41j779L70J721r51j578J708R65j866
6475f12k46K073l88j891J370J202j522j142K275Q5j992K42K011j055j361J302
6491C51Q53j656l98J925l73k042J192J330j166j235J733L76j913J50J870q64j519
6508a386J626Q98j937m03K036n35j600Q20J575j463r90K062K80k134M52J822j243
$$ plain form
6525 -120 -1436 386 1320 -562 -1050 871 620 -1101 35 1709 -226 -1045 645 1215 -869 -391 1490
6542 1490 301 -1040 512 1360 -734 -1005 1180 946 -1303 -34 1509 -304 -1108 1027 1047 -1294
6558 -1294 -884 1327 -57 -1368 178 930 -966 -1292 626 300 -1672 -440 1185 -402 -1445 713
6574 713 770 -1313 -933 1299 102 -1534 160 1084 -1009 -808 907 549 -1393 -159 1678 -246 -966
6591 -966 1041 1180 -1123 -197 1613 556 -1160 672 1544 -393 -774 1145 735 -1145 362 1292 -283
6608 -283 -1239 742 892 -696 -599 1306 27 -1282 443 864 -966 -984 830 625 -1493 -706 1020
6625 1020 -735 -1369 420 340 -1339 -877 1095 -312 -1365 -65 1016 -837 -856 998 524 -1559 -24
6642 -24 1194 -118 -989 909 1231 -962 -116 1647 346 -1197 765 1285 -146 -821 1140 481 -980
$$ packed form
6525a20j316J822R34j882m88J921k51j721J136J674j935q19J690N70k084M78J881
6542A490j189j341J552Q48k094k71K185k34k249J269J543j813q04K135K0k341
6558a294M10K211j384j311J546P52j896l26J918l26j972J232J625j587j043K158
6574G13N7k083L80K232j197j636J694R24k093K01J715l58j942J234J837j924p20
6591i66K007J39k303R26J810j057j716J832Q72j937l81J919m10j880J507R30j575
6608b83r56J981J50j588R7J905j279j309J725M21j830j8J814k05k118P87J726
6625A020j755o34J789q0j679M62J972j407j053J300J081j853j9J854m74k083J535
6642b4J218j312q71J898L22k193Q46J763j301j543J962N20j431o75J961o59j461
$$ plain form
6659 -980 164 1453 -485 -1238 941 966 -639 -415 949 -145 -1206 303 1375 -677 -833 984
6675 984 499 -940 -65 696 -1080 -973 427 550 -1352 -771 953 -337 -1276 332 842 -930 -1163
6692 -1163 915 310 -1241 -161 896 -387 -966 823 853 -1110 -165 796 -36 -961 532 899 -439
6709 -439 -490 1199 485 -969 140 1240 -68 -1235 745 948 -529 -27 1293 -84 -967 456 1106
6726 1106 -775 -720 716 334 -1170 -509 834 -577 -1239 706 633 -1068 -692 645 -126 -1285 193
6743 193 862 -892 -1000 531 214 -1174 -151 678 -511 -1149 751 1089 -989 -372 1122 359 -796
6760 -796 563 1061 -556 -333 805 671 -685 522 1318 -180 -312 1002 683 -840 -335 1192 255
6777 255 -1145 367 668 -525 -351 712 130 -911 -205 753 -297 -988 298 418 -875 -546 844
$$ packed form
6659i80J144J289j938p53K179K5j605K24J364j094j061J509J072k052j56J817
6675I84m85j439Q75P61j776J07J400J23j902N81J724j290r39J608N10j772k33
6692a163K078o05j551J080J057j283n79J789L0j963R45R61q32r25J493L67j338
6709d39n1J689p14j454J109J100j308j167J980K03j477N02J320j377q83J423O50
6726A106j881N5J436l82j504O61J343j411o62J945p3j701L76J337p71j159J478
6743A93O69j754j08J531l17j388J023Q29j189o38J900L38k078O17J494p63j155
6760g96J359M98j617K23J138j34j356J207P96j498j32J314l19j523N05J527r37
6777B55j400J512L01j193J74J063n82j041P06R58j050o91J286J20j293L29J390
$$ plain form
6794 844 -131 -889 231 401 -763 -898 372 -25 -914 -368 819 -290 -409 83 321 -923 -531 817
6812 817 -144 -652 187 705 -351 -704 809 102 -612 -74 868 -89 -593 673 785 -312 -288 901 21
6831 21 -524 548 887 -280 -397 890 511 -622 10 506 -106 -759 217 346 -510 -644 319 241 -582
6850 -582 144 327 -522 -546 427 62 -728 -179 376 -618 -179 691 126 -662 -457 270 -141 -415 -9 429
6870 429 -486 -100 557 417 -299 476 626 455 -210 418 171 -370 365 601 362 -52 486 808 129 -114
6890 -114 284 321 -192 118 203 -10 -383 76 158 -189 -355 17 -304 -448 105 571 -283 -417 238 -92 -490
6911 -490 -453 228 -405 -553 59 225 -677 -341 -75 -93 -345 -12 34 -489 167 420 84 -146 164 434 318
6932 318 -278 189 674 -188 22 646 252 38 314 399 27 125 384 300 103 34 -107 62 15 563 298 0
$$ packed form
6794H44r75p58J120J70j164j35J270l97q89N46J187j109j19M92K38j244L92J348
6812H17r61n08Q39N18j056l53J513p07p14N38R42r57n04J266J12j097K4J189q80
6831B1n45J072L39j167j17J287l79j133O32M96o12o53R76J29q56j34R63p8q23
6850e82P26J83q49k4R73l65p90N49N55r94M39Q70n65p88K05P27m11k74M06M38
6870D29r15L86O57j40p16P75J50j71o65O28k47n41P35K36k39m14N38L22o79k43
6890a14L98L7n13L10Q5k13l73M59Q2l47j66L72l21j44N53M66q54j34O55l30l98
6911d90L7O81o33j48O12J66r02L36K66j8k52L33M6n23O56K53l36k30L10K70j16
6932C18n96M67M85q62K10O24l94k14K76Q5l72R8K59q4j97o9j41J69m7N48k65k98
$$ plain form
6954 0 113 142 -126 -156 -122 67 -219 -177 -184 -62 -234 43 93 -43 -125 17 28 -189 -274 -165 -90 -226 -343 -15
6978 -15 -18 -15 74 -16 -163 -116 297 323 -140 217 229 -143 234 441 27 412 -85 256 214 241 -136 161 97 324
7002 324 25 -1 -153 2 -220 -154 12 -33 313 167 -272 -14 20 -453 -139 -99 -101 -182 -12 17 -131 -76 -95 58
7026 58 46 -239 -96 147 -172 -279 40 -330 -191 -311 113 -293 -84 37 112 -39 281 -127 144 -28 156
7047 156 -12 243 -39 214 528 -17 -81 338 134 65 94 301 -234 177 285 101 -238 361 255 -327 139
7068 139 279 151 -335 -163 101 -187 -253 -88 64 -568 -453 157 -34 -451 -174 87 -313 -140 391 -1
7088 -1 -682 -358 61 -59 -214 25 526 -355 -194 236 55 -74 47 451 37 -345 194 271 -99 -236 554
7109 554 51 -303 413 570 -118 -80 525 65 -394 270 362 -17 -454 416 -20 -364 -59 141 221 -547 -277
$$ packed form
6954@J13K9k68l0L4J89k86M2pJ22j72K77N0j36q2J42J1k17q5J09P5j36j17L28
6978a5lLQ9r0j47M7M13K6m63L57J2l72L77K07m14L85m97L41m2K7l77K97o4K27
7002C24k99k6j52J55k22O6J66m5L46j46m39K58L4m73L14M0kq1J70K9j48N5j9J53
7026E8j2k85J43K43l19j07L19l70J39j20M24m06K09J21P5j51L20m08K71j72J84
7047A56j68K55k82K53L14n45o4M19k04o9K9K07n35M11J08j84l39N99j06n82M66
7068A39J40j28m86J72K64k88o6J65J52o32J15O10j91m17K77K61m00J73N31l92
7088ao81L24M19j20j55K39N01q81J61M30j81j29J21M04m14l82N39P7l70j37P90
7109E54n03l54P16J57o88L8O05m60m59O64R2l79m37Q70m36l44L05K00Q0p68K70
$$ plain form
7130 -277 87 -244 -376 347 -86 -607 -293 51 -348 -559 503 161 -425 -242 181 -377 -379 68 237 -423
7150 -423 -321 327 -56 -683 169 377 11 -188 650 151 -533 -209 501 135 -372 442 758 -70 23 756
7170 756 206 -341 108 721 95 -606 481 652 -310 -102 789 -224 -592 199 434 -366 -456 292 -255 -762
7190 -762 121 498 -663 -628 422 203 -721 -461 257 -231 -452 179 502 -509 -693 373 249 -618 134
7209 134 348 -255 -477 582 577 -490 25 555 -484 -529 360 580 -469 107 743 266 -421 401 824 -67
7229 -67 -322 635 514 -465 121 871 -310 -694 289 868 -686 -379 969 -20 -695 -47 698 -433 -799
7248 -799 344 100 -937 -303 541 -316 -843 504 629 -543 -277 493 39 -936 60 490 -555 -798
7266 -798 564 330 -860 49 772 -249 -646 482 652 -513 8 1134 29 -433 303 780 -272
$$ packed form
7130b77L64l31j32P23m33n21L14L44l99k11J062l42n86J83M23n58kM47J69o60
7150d23J02O48l83o27Q52K08l66j99Q38m99o84L24P10l66n07Q14L16q28R3P33
7170G56n50n47M49O13o26p01J087J71r62K08Q91j013l68P91K35q00r0P48n47n07
7190g62Q83L77j161L5J050k19r24K60P18m88k21O31L23j011j84J066j24q67P52
7209A34K14o03k22J059nj067N15N30j039m5Q89K20j049N76O36m77o87Q22M23q91
7229f7k55R57j21r79N86P50j181l84R83N79j554L07J348r89o75O48P45j131l66
7248g99J143k44j037O34Q44q57n27J347J25j172K66P70m54r75R96M30j045k43
7266g98J362k34j190R09P23j021l97J128J70j165N21J126j105m62P36M77j052
$$ plain form
7283 -272 -539 750 657 -486 33 983 -240 -620 452 501 -708 -691 1015 313 -627 -28 528 -407 -754
7302 -754 564 691 -634 -163 683 -575 -903 405 458 -1132 -503 582 -176 -890 23 292 -627 -500
7320 -500 810 222 -853 -94 807 -118 -1055 586 674 -832 -161 842 172 -687 76 883 -235 -677
7338 -677 669 346 -396 -17 1060 -50 -633 758 1071 -478 -201 527 84 -700 147 738 -885 -944
7356 -944 573 333 -1029 -213 804 -491 -893 377 597 -831 -830 589 -45 -1099 -23 645 -862
7373 -862 -646 825 418 -1071 -18 847 -78 -570 427 492 -719 -225 972 326 -778 389 868 -513
7391 -513 -99 869 265 -800 98 868 102 -586 784 448 -733 -137 620 89 -720 536 776 -359
7409 -359 -575 941 469 -751 102 947 -651 -1134 314 330 -829 -418 513 -93 -1068 77 603 -925
$$ packed form
7283b72k67J289r3j143N19R50j223l80J072M9j209J7J706p02r40N99N56r35l47
7302g54J318J27j325M71Q46j258l28J308N3j590O29J085p58p14R13K69r19J27
7320e00J310n88j075P59R01r25r37J641Q8j506O71J003o70q59P63Q07j118m42
7338f77J346l23p42L79J077j110n83J391L13j549K77P28m43p84Q47N91j623n9
7356i44J517k40j362Q16J017j295m02J270K20j428JJ419o34j054J076O68j507
7373h62K16J471m07j489J053Q65r25m92R97O5j211M94J197o46j104J167M79j381
7391e13M14R68o04j065Q98P70p66o88J370l36j181N96P57n31q09J256K40j135
7409c59k16J516m72j220Q53Q45j598m83J448J6j159M11R31o06r75J145N26j528
$$ plain form
7427 -925 -791 866 419 -1158 -50 684 -298 -808 673 650 -905 -274 880 -84 -857 475 802 -696
7445 -696 -251 960 535 -664 220 704 -59 -544 569 659 -802 -59 1191 63 -872 360 792 -326
7463 -326 -475 812 -4 -915 186 886 -267 -835 607 468 -729 -313 799 -260 -1089 497 334
7480 334 -873 -564 501 113 -1105 183 740 -428 -977 808 473 -979 -354 925 -99 -527 512
7497 512 683 -598 -575 867 323 -581 194 525 -406 -284 875 652 -885 127 1049 -9 -701 621
7515 621 740 -472 -337 837 194 -805 -277 685 -334 -579 198 311 -844 -74 547 -186 -878 324
7533 324 551 -994 -267 651 46 -1106 30 427 -294 -709 434 448 -896 -192 775 -568 -1091 263
7551 263 363 -468 -62 380 204 -379 431 751 -653 -307 759 395 -659 -267 726 -177 -490 614 654
$$ packed form
7427i25J34J657m47j577J108P34r82n10J481k3j555O31J154r64p73J332L27j498
7445f96M45J211m25j199Q84M84p63m85J113R0j461P43J250j128r35J232M32j118
7463c26j49J287q16r11J101P00j153n68J442j39j197M16J112j059q29J586j63
7480C34j207L09J065l88j218J288N57j168n49J785l35j452O25J279j024m28J039
7497E12J71j281K3J442n44r04P75L31r31J22J159k23j537J012R22j058o92J322
7515F21J19j212J35J174o43r99N28R62j019k45P77J13j155P70O21p33o92J202
7533C24K27j545P27R18o05j152J136L97p21m15J143J4j344P04R67j343n23J354
7551B63J00q31M06M42j76n83Q10L20j404L46J066l64j054L92R93r03l13J104M0
$$ plain form
7570 654 -531 -115 877 220 -883 67 782 -215 -391 692 593 -888 -18 632 -416 -681 96 385 -817
7589 -817 -646 494 5 -645 302 524 -455 -471 473 84 -605 -137 538 -400 -727 350 463 -462 -352 907
7609 907 316 -605 88 1017 -500 -387 656 249 -414 1 684 108 -684 393 802 -340 -102 665 359
7628 359 -763 274 745 -273 -379 263 -141 -690 28 570 -213 -309 411 508 -495 -392 434 -142 -423
7647 -423 -116 250 -684 -587 382 -94 -523 -62 298 -201 -451 269 305 -68 -394 476 188 -527 344 212 -199
7668 -199 -51 397 223 -160 -304 428 24 -488 514 520 -372 -189 594 134 -280 292 259 -312 -63 347 358
7689 358 -330 -26 336 27 -279 202 396 -531 -156 489 17 -346 91 329 -455 -98 108 -1 -612 77
7709 77 341 -193 -144 185 -25 -330 -258 212 19 -656 42 170 -530 -245 -62 30 -312 343 193 -103 -325
$$ packed form
7570F54j185M16R92o57j103R50P15r97j76J083r9j481Q70O50j048k65P77K89j202
7589h17J71J140m89o50R47K22r79j6R44l89o89M68O75r38l27J077J13r25J10J259
7609I07n91r21O93R29j517J13J043m07o63M15O83n76p92J077M09j142K38P67l06
7628C59j122J037M71j018j06O42m04n49P18N42p83r6P20R7j003J03Q26n76k81
7647d23L07L66r34R7R69m76m29M61L60m99k50P20L6l73l26Q70k88p15Q71j32m11
7668a99J48M48j74l83j44P32m04n12J002Oq92J83P83m60m14N72l3n71K49M10J1
7689C58o88L04L62l09l06M81J94r27L75O45m72l63M37K38p84L57K06j09o11O89
7709G7K64n34M9L29k10l05P2M70j93o75O98J28p00K85J83R2l42O55j50k96k22
$$ plain form
7730 -325 458 12 -85 205 230 152 -348 233 191 131 -68 334 192 -559 -41 450 164 -59 233 -32 -172 -157
7752 -157 47 -242 -199 2 224 -319 -439 -1 -11 -54 -71 288 -283 -643 61 98 -414 -29 116 67 -16 -89 144
7775 144 -99 -80 358 34 -44 -114 10 238 -144 155 -25 -135 -187 374 135 -18 119 453 129 305 130
7796 130 83 36 26 348 169 34 -63 444 166 -155 161 285 -350 104 101 -287 -85 -98 -145 81 -252 -144 -96
7819 -96 -3 -316 -37 -70 125 -166 -30 -205 -315 197 -403 -129 -128 -20 214 442 -223 70 -13 -5 -61 -124 293
7842 293 -181 248 -236 12 126 258 -44 15 272 75 56 138 -135 88 -7 133 75 -223 -144 -125 213 -6
7864 -6 164 -131 64 -216 76 -170 -138 -362 8 -333 -365 -261 168 28 -434 -18 73 207 -390 -8 -196 -39
7886 -39 -86 44 -146 -314 220 -70 -29 -339 188 303 -134 -105 93 79 -67 117 282 -96 129 337 -34 -161
$$ packed form
7730c25P83m46r7K90K5p8n00N81m2o0j99M02j42p51N18M91k86k23K92k65j40J5
7752a57K04k89M3K01K22n43j20M38j0m3j7L59n71l60P04L7n12L85J45m9q3p3K33
7775A44k43J9M38l24p8p0J24K28l82K99j80j10n2N61k39j53J37L34l24J76j75
7796A30m7m7j0L22j79j35r7N07k78l21L16J24o35M54ll88K02j3m7K26l33J08M8
7819i6R3l13K79l3J95k91J36j75j10N12o00K74JJ08K34K28o65K93q3Qn6o3M17
7842B93m74M29m84K48J14J32l02N9K57j97j9Q2k73K23r5J40n8k98P9J9L38k19
7864fJ70k95J95k80K92k46L2k24L70l41l2J04M29j40m62M16R1J34n97L82j88J57
7886c9m7J30j90j68N34k90M1l10N27J15m37K9J98j4j46J84J65l78K25K08l71j27
$$ plain form
7908 -161 347 105 -415 -141 271 160 -461 22 347 134 -305 -77 258 -385 -71 308 -223 -390 29 24 -72
7929 -72 -417 62 -4 -215 106 25 -188 -159 147 135 -407 -86 208 159 -493 -97 392 -371 -294 271 -181 -434
7951 -434 240 250 -331 -180 341 596 -171 89 717 57 -714 132 571 -42 -237 444 112 -308 366 344 -219
7972 -219 -277 374 302 -273 -142 501 118 -271 21 56 -472 -433 563 22 -664 -24 89 -415 -576 133 130 -158
7994 -158 -233 469 -183 -633 -62 291 -596 -278 480 -286 -831 110 418 -243 135 321 258 -316 -102 785 24
8015 24 -305 484 356 -266 -29 530 134 -463 90 459 147 -507 299 319 -349 242 889 145 -675 520
8035 520 585 -361 -247 597 -20 -869 121 580 -179 -692 116 230 -761 -161 414 -46 -754 143 415 -613
8055 -613 -375 424 -50 -848 -142 380 -158 -581 403 393 -492 26 379 -312 -263 301 632 -255 161 1126 315
$$ packed form
7908a61N08k42n20K74M12j11o21M83L25k13m39K28L35o43L14L79n31j67M19nr6
7929g2l45M79o6k11L21q1k13K9L06j2n42L21K94m9o52L96M89p63P7N65m52k53
7951d34O74J0n81J51N21K55p67K60O28o60p71Q46M39o13j95O81l32m20O74k2n63
7972b19n8O51p2n75J31O43l83l89K92L5n28L9R96n41o86O40J13n04j61P09lk88
7994a58p5P02o52m50N71L53q87L18P58p66n45R41L08o61L78J86o3n74K14Q87p61
8015B4l29P89j28o22K37N59l96n97N53L69l12o54Q06K0o68N91O47p44q20J195
8035E20O5r46J14Q44o17q49R90M59p59n13Q08J14r91O00N75m60p08Q97K72j028
8055f13K38P99m74p98P06N22n38m23R84j0q85N18L53o91M9N64L31q87M16R65q11
$$ plain form
8076 315 -742 237 778 -304 16 700 667 -559 -38 851 118 -694 20 654 -587 -520 556 52 -734
8095 -734 -48 426 -355 -772 333 472 -646 -488 282 -440 -829 -71 405 -461 -218 504 241 -620 -21
8114 -21 590 -280 -521 345 184 -659 -114 655 -86 -793 214 667 -169 -403 673 293 -600 141 878 -106
8134 -106 -516 395 610 -530 -259 1100 -49 -638 365 568 -300 -574 757 417 -614 202 588 -87
8152 -87 -661 472 421 -865 -492 369 -396 -944 381 557 -436 -671 723 5 -654 64 491 -595 -446
8171 -446 703 381 -846 -231 454 92 -683 283 660 -503 -292 621 149 -1036 140 938 -518 -341
8189 -341 505 413
$$ packed form
8076C15j057R79N41j082L20O84l3j226N21Q89p33q12P14O34j241O7J076n04p86
8095g34O86M74p81m17J105J39j118J58P70p22l89P58M76q66K43P22k63q61N99
8114b1O11q70k41Q66j61q43N45P69p41p07J007M53q36k34J076l80q93P41P37r84
8134a06m10R11K15j140K71J359j149n89J003K03q68k74J331l40j031Q16L86o75
8152h7n74J133n1j286L73Q61p65n48J325J76r93k35J394p18o59P18M27j086J49
8171d46J149l22j227O15O85l62p75R66L77j163K11R13m72j185J176P98j456J77
8189c41Q46r2
8191D13
$$ Imaginary data points
##PAGE= N=2
##DATA TABLE= (X++(I..I)), XYDATA
$$ plain form
0 0 0 0 0 0 -8 0 -8 8 -8 8 -16 16 -24 24 -32 40 -48 56 -64 76 -88 102 -118 135 -155 178 -203 229 -257 291
30 291 -328 367 -411 458 -512 570 -630 701 -778 860 -953 1053 -1166 1293 -1435 1591 -1771
47 -1771 1977 -2217 2498 -2833 3240 -3750 4408 -5290 6535 -8435 11654 -18128 36137 -184955
61 -184955 -636036 -66747 324072 28126 -200852 -49731 -118231 -248328 8343 237224
71 237224 -44970 -280112 -68587 123265 9495 -54193 -12679 -51466 -33931 104264 47108
82 47108 -141262 -71563 119194 57676 -38845 59368 48930 -126406 -42315 215401 152055
93 152055 -97552 -79347 43002 -2625 22548 171052 61383 -206163 -132863 140123 127700
104 127700 -29069 -14946 -17359 -109172 4830 197077 64231 -160790 -45790 136620 36015
$$ packed form
0@%%%%qQqJ6j6J6k4L2m0M8n6P2q8J04j20J40j64J90k20K53k90L33l81M32m86N48
30B91o19O95p78Q69r70J082j200J331j479J638j813K006k219K459k728L026l362
47a771L748m194M715n331O073o990Q158r698J1825j4970K0089k9782N4265k21092
61a84955m51081N69289L90819k95946k28978J51121o8500j30097K56671K28881
71B37224k82194k35142K11525J91852j13770o3688M1514l8787J7535J38195n7156
82D7108j88370O9699J90757o1518r6521R8213j0438j75336Q4091K57716o3346
93A52055k49607J8205J22349m5627K5173J48504j09669k67546P3300K72986j2423
104A27700j56769J4123k413r1813J14002J92247j32846k25021J15000J82410j00605
$$ plain form
115 36015 -63144 34453 38310 -62799 18659 113166 -45509 -141403 55920 144586 -36735
126 -36735 -80766 53330 6997 -87392 64747 156693 -54415 -152121 46608 110218 -39029
137 -39029 -21692 88381 -16662 -114226 35511 120294 -19555 -50591 65715 22970 -73935
148 -73935 35945 120351 -14533 -56571 79668 49481 -92771 5674 153778 13129 -128819
159 -128819 8944 98032 -36603 -57008 75890 26275 -115482 -33587 94076 -2082 -97840
170 -97840 -9251 34169 -41501 -32897 10167 -57633 -66433 54167 36536 -118015 -89662 58451
182 58451 20024 -74891 2053 39671 -89961 -87244 91313 84497 -90288 -75655 55444 13027
194 13027 -57214 37162 69410 -63734 -79817 53433 55769 -36225 -6444 31322 -43438 -38271
$$ packed form
115C6015r9159R7597L857j01109Q1458R4507j58675r5894J97323Q8666j81321
126c6735m4031J34096m6333r4389J52139R1946k11108r7706J98729O3610j49247
137c9029J7337J10073j05043r7564J49737Q4783j39849l1036J16306m2745r6905
148g3935J09880Q4406j34884m2038J36239l0187j42252R8445J48104j40649j41948
159a28819J37763Q9088j34635k0405J32898m9615j41757Q1895J27663r6158r5758
170i7840Q8589M3420p5670Q604M3064o7800q800J20600j7631j54551K8353J48113
182E8451l8427r4915P6944L7618j29632K717J78557o816j74785J4633J31099m2417
194A3027p0241R4376L2248j33144j6083J33250K336r1994K9781L7766p4760N167
$$ plain form
206 -38271 75923 46648 -79729 -38297 68911 17728 -43120 23499 24090 -67591 -10546 110872
218 110872 20723 -119041 -25988 100327 28793 -38770 20726 6860 -63342 21237 118681
229 118681 7060 -103958 -7098 78118 7298 -20069 35790 -3440 -63597 16120 77809
240 77809 -15036 -61830 22013 31872 -38147 -3135 52466 -22024 -63759 35843 60448 -43793
252 -43793 -45907 46492 20158 -47541 14895 60699 -31450 -60957 45915 65507 -29487 -28187
264 -28187 37613 3946 -31086 39634 55179 -38317 -44674 43627 37337 -25705 3053 32062
276 32062 -25252 -28835 48936 31219 -51028 -18677 52012 846 -51575 13809 40306 -36127
288 -36127 -38879 37606 14862 -56925 -15239 40637 -13302 -46043 13189 16619 -43468 -20632
$$ packed form
206c8271J14194k9275j26377M1432J07208n1183o0848O6619N91r1681N7045J21418
218A10872r0149j39764R3053J26315p1534o7563N9496j3866p0202Q4579R7444
229A18681j11621j11018R6860Q5216p0820k7367N5859l9230o0157P9717O1689
240G7809r2845m6794Q3843R859p0019L5012N5601p4490m1735R9602K4605j04241
252d3793k114R2399k6334o7699O2436M5804r2149k9507J06872J9592r4994J300
264b8187O5800l3667l5032P0720J5545r3496o357Q8301o290o3042K8758K9009
276C2062n7314l583P7771j7717q2247L2351P0689n1166n2421O5384K6497p6433
288c6127k752P6485k2744p1787M1686N5876n3939l2741N9232L430o0087K2836
$$ plain form
300 -20632 36473 -4979 -50598 1234 28031 -27689 -29127 28947 9157 -44091 -6642 35622
312 35622 -11735 -31254 26308 25001 -34831 -13211 43874 10843 -29515 14435 34556 -17061
324 -17061 -16903 39962 24879 -27353 -2215 36762 1885 -17515 25690 24646 -24498 -8235 38733
337 38733 9474 -29819 5491 28704 -11686 -18861 19656 6567 -29647 -2822 25912 -11499
349 -11499 -32578 6350 12317 -23779 -13483 18713 -8593 -37712 -733 23499 -14438 -27470
361 -27470 5973 2853 -22462 -2385 19046 -11257 -25601 9121 16153 -13596 -8391 17552 1851
374 1851 -16131 9805 22601 -6864 -10726 19191 15312 -9279 3608 20626 -409 -8482 19114
387 19114 18696 -11556 -6285 20110 10299 -8189 4228 11704 -6712 -5940 13920 6366 -13922 -4181
$$ packed form
300b0632N7105m1452m5619N1832K6797n5720j438N8074j9790n3248L7449M2264
312C5622m7357j9519N7562j307n9832K1620N7085l3031m0358M3950K0121n1617
324a7061J58N6865j5083n2232K5138L8977l4877j9400M3205j044m9144J6263M6968
337C8733k9259l9293L5310K3213m0390p175L8517j3089l6214K6825K8734l7411
349a1499k1079L8928N967l6096J0296L2196k7306k9119L6979K4232l7937j3032
361b7470L3443l120k5315K0077K1431l0303j4344L4722P032k9749N205K5943j5701
374A851j7982K5936J2796k9465l862K9917l879k4591J2887J7018k1035q073K7596
387A9114m18l0252N271K6395r811j8488J2417P476j8416P72J9860p554k0288R741
$$ plain form
401 -4181 10146 -4699 -12682 4597 4026 -16467 -10786 8172 -2561 -17542 -4421 4056 -9754
414 -9754 -12018 1055 -1827 -11971 -3319 4184 -6898 -10784 3053 4482 -7425 -3892 7778 1317
428 1317 -6154 3933 10130 516 -513 9038 6443 44 6946 12616 4323 661 9253 10689 3408
443 3408 3918 9411 6641 1771 4797 6653 2094 1982 5218 1938 -2729 861 3815 -1481 -4264 -962
459 -962 -1336 -5110 -5025 -3371 -4546 -6061 -6456 -6241 -5966 -6066 -7397 -6761 -4993 -5385 -7668 -6696 -3690 -2812
477 -2812 -4187 -4006 -2989 -3219 -460 2438 -79 -2242 2369 5051 1953 2224 6951 5417 2315 6356
493 6356 9410 5071 5009 9821 8366 3263 6730 12006 6127 1094 7194 10292 2996 1202 6203 3069
509 3069 -1776 3655 5659 -4343 -5784 3585 1302 -8591 -4250 1694 -7567 -11748 -190 1143 -12042
$$ packed form
401d181J4327j4845p983J7279n71k0493N681J8958j0733j4981J3121Q477j3810
414i754k264J3073k882j0144Q652P503j1082l886J3837J429j1907L533J1670o461
428A317p471J0087O197r614j029R551k595o399O902N670q293l662Q592J436p281
443C408N10N493k770m870L026J856m559j12L236l280m667L590K954n296k783L302
459i62l74l774Q5J654j175j515l95K15K75j00j331O36J768l92k283R72L006Q78
477b812j375J81J017k30K759K898k517k163M611K682l098K71M727j534l102M041
493F356L054m339o2M812j455n103L467N276n879n033O100L098p296j794N001l134
509C069m845N431K004j0002j441R369k283r893M341N944r261m181J1558J333j3185
$$ plain form
524 -12042 -11721 -1019 -3666 -11965 -4840 -556 -10791 -10884 2059 -421 -11835 -4567 4784 -5588
538 -5588 -9594 5599 6439 -9813 -5812 10634 4485 -7402 2783 9378 -3837 -4100 13363 8958
552 8958 -8854 -1371 14013 3581 -5626 7535 8079 -8345 -2127 15676 4307 -12829 482
565 482 11057 -4263 -6900 10371 2601 -17932 -4881 14739 -972 -17761 -2709 4453 -11446
578 -11446 -7790 8498 -4944 -22526 -3454 11963 -7803 -16339 1248 -478 -15400 -1069 14318
591 14318 -8603 -22163 5398 16577 -6842 -9866 10728 2932 -10781 9808 21771 -5066
603 -5066 -12605 16650 19579 -4074 2426 20373 3371 -7605 18071 24057 -5398 -5654 20569
616 20569 12258 -7973 9141 21205 -6337 -13012 17299 17493 -12625 -7019 14174 -1381 -15139
$$ packed form
524a2042L21J0702k647q299P125M284j0235r3J2943k480j1414P268R351j0372
538e588m006J5193Q40j6252M001J6446o149j1887J0185O595j3215k63J7463m405
552H958j7812P483J5384j0432r207J3161N44j6424O218J7803j1369j7136J3311
565D82J0575j5320k637J7271p770k0533J3051J9620j5711j6789J5052P162j5899
578a1446L656J6288j3442j7582J9072J5417j9766q536J7587j726j4922J4331J5387
591A4318k2921j3560K7561J1179k3419l024K0594p796j3713K0589J1963k6837
603e066p539K9255K929k3653O500J7947j7002j0976K5676N986k9455k56K6223
616B0569q311k0231J7114J2064k7542o675L0311J94l0118N606K1193j5555j3758
$$ plain form
629 -15139 9181 12138 -19103 -16324 14754 4954 -20815 -4473 10164 -13947 -17916 12868 8131
642 8131 -25584 -14259 16233 -461 -21106 1476 10699 -16920 -14024 16004 4803 -21508 -2539
655 -2539 15601 -9304 -14816 16542 11209 -21927 -7416 24536 3857 -18361 8789 18461 -14777
668 -14777 -10924 27616 14966 -23042 -6840 23813 5449 -10090 11281 9081 -18058 -2844
680 -2844 27260 5180 -22536 -2312 11811 -7017 -2412 16483 -9717 -33762 3913 29588
692 29588 -11030 -32525 1906 7671 -20157 -5228 20417 -13690 -40216 3032 29476 -9308
704 -9308 -27419 2414 3872 -14751 5800 21305 -13348 -26607 12139 24914 -4004 -4652 11798
717 11798 -4348 -8523 27582 28330 -17620 -16914 25456 21443 -6028 9502 18994 -15176 -13020 36353
$$ packed form
629a5139K4320K957l1241K779L1078r800k5769J6342J4637k4111l969L0784m737
642H131l3715J1325L0492j6694k0645K2582R223k7619K896L0028j1201k6311J8969
655b539J8140k4905n512L1358n333l3136J4511L1952k0679k2218K7150R672l3238
668a4777L853L8540j2650l8008J6202L0653j8364j5539K1371k200k7139J5214
680b844L0104k2080k7716K0224J4123j8828M605J8895k6200k4045L7675K5675
692B9588m0618k1495L4431N765k7828J4929K5645l4107k6526M3248K6444l8784
704i308j8111K9833J458j8623K0551J5505l4653j3259L8746J2775k8918o48J6450
717A1798j6146m175L6105P48m5950P06M2370m013k7471J5530R492l4170K156M9373
$$ plain form
731 36353 29922 -24715 -19632 23837 14589 -9251 9595 11875 -24165 -15111 32182 20093 -28989
744 -28989 -20096 13025 2667 -7374 9786 -3239 -32244 -7138 28063 635 -29600 -6144
756 -6144 6831 -14679 -3302 22388 -9530 -40730 2422 35776 -6946 -31079 6706 14073
768 14073 -18655 -3280 28864 -1662 -32497 5795 32635 -1716 -15395 12064 8798 -10029
780 -10029 11034 24798 -7900 -15496 19738 18058 -12332 1573 22532 -6526 -18799 22109
792 22109 25092 -23214 -18144 27078 11557 -27153 -1576 24716 -11266 -26632 13277 16466 -24419
805 -24419 -17354 17286 189 -25225 -1422 11197 -15923 -14552 12546 -2777 -25318 2427
817 2427 19006 -15461 -21544 15643 9565 -22910 -1198 25997 -9846 -29406 18427 32263 -17462
$$ packed form
731C6353o431n4637N083M3469r248k3840J8846K280l6040R054M7293j2089m9082
744b8989Q893L3121j0358j0041J7160j3025k9005K5106L5201k7428l0235K3456
756f144J2975k1510J1377K5690l1918l1200M3152L3354m2722k4133L7785P367
768A4073l2728J5375L2144l0526l0835L8292K6840l4351j3679K7459l266j8827
780a0029K1063J3764l2698p596L5234j680l0390J3905K0959k9058j2273M0908
792B2109K983m8306N070M5222j5521l8710K5577K6292l5982j5366L9909L189m0885
805b4419P065L4640j7097k5414K3803J2619k7120J371K7098j5323k2541K7745
817B427J6579l4467o083L7187o078l2475K1712K7195l5843j9560M7833J3836m9725
$$ plain form
830 -17462 -22225 22235 16330 -16128 5937 27176 -9267 -22003 22989 30370 -12152 -13514 15714
843 15714 6732 -5039 17757 12658 -23892 -10533 30568 13187 -20946 -1852 12697 -13953
855 -13953 -7548 29577 5413 -42993 -12605 36148 5183 -31938 -2753 11593 -21683 -12879
867 -12879 27272 3147 -42608 -14995 27166 4870 -19948 -2556 -1921 -19080 4358 26916
879 26916 -7467 -30892 2444 19412 -3602 -218 15432 -12655 -25677 23518 40720 -15067
891 -15067 -31495 17361 24853 -8859 3759 25509 -10830 -27594 23657 41845 -11234 -27885
903 -27885 11373 17430 -3693 7650 13425 -18678 -18496 22793 21469 -17219 -13429 7472 -6543
916 -6543 -8050 20851 5812 -37581 -16902 30206 8234 -29665 -5684 12785 -18431 -16366 25592
$$ packed form
830a7462m763M4460n905l2458K2065K1239l6443j2736M4992P381m2522j362K9228
843A5714q982j1771K2796n099l6550J3359M1101j7381l4133J9094J4549k6650
855a3953O405L7125k4164m8406L0388M8753l0965l7121K9185J4346l3276Q804
867a2879M0151k4125m5755K7613M2161k2296k4818J7392O35j7159K3438K2558
879B6916l4383k3425L3336J6968k3014L384J5650k8087j3022M9195J7202n5787
891a5067j6428M8856P492l3712J2618K1750l6339j6764N1251J8188n3079j6651
903b7885L9258O057k1123J1343N775l2103J82M1289j324l8688L790K0901j4015
916f543j507K8901j5039m3393K0679M7108k1972l7899K3981J8469l1216K065M1958
$$ plain form
929 25592 8961 -39305 -17175 29526 7974 -24385 -1513 10538 -15324 -6556 25180 4867
941 4867 -26587 -1962 23191 853 -7054 13984 2862 -17727 10483 31466 -5100 -22031
953 -22031 15605 22180 -11490 -2764 26124 510 -24775 12074 31511 -10324 -22413 16350
965 16350 16220 -16962 -4735 20246 -4441 -22536 7939 16439 -15156 -14312 12137 -754 -19622
978 -19622 2496 11714 -17056 -16218 14081 2326 -24702 -2509 18636 -12038 -23280 11873 13969
991 13969 -21013 -11114 20965 534 -24584 5512 23556 -9651 -17984 15452 14326 -12919 796
1004 796 20859 -2959 -14118 16361 19401 -10750 -5502 18748 3994 -10497 14169 17783 -15542
1017 -15542 -10371 24302 12708 -18593 -1974 18015 -6314 -14165 16377 11815 -24083 -12767
$$ packed form
929B5592j6631m8266K2130M6701k1552l2359K2872J2051k5862Q768L1736k0313
941D867l1454K4625K5153k2338p907K1038j1122k0589K8210K0983l6566j6931
953b2031L7636O575l3670Q726K8888k5614k5285L6849J9437m1835j2089L8763
965A6350j30l3182J2227K4981k4687j8095L0475Q500l1595Q44K6449j2891j8868
978a9622K2118R218k8770Q38L0299j1755k7028K2193K1145l0674j1242L5153K096
991A3969l4982R899L2079k0431k5118L0096J8044l3207q333L3436j126k7245J3715
1004G96K0063k3818j1159L0479L040l0151N248K4250j4754j4491K4666L614l3325
1017a5542N171L4673j1594l1301J6619J9989k4329p851L0542m562l5898J1316
$$ plain form
1029 -12767 21220 4783 -21206 -3013 8901 -13668 -11642 15149 1506 -26512 -8024 16013
1041 16013 -3445 -16503 3401 1523 -18691 -2208 20002 -4832 -25443 2496 17283 -7283
1053 -7283 -8870 12683 921 -17699 6950 24768 -5185 -19257 10211 17829 -5251 -605 16024
1066 16024 -1442 -12840 13932 22430 -7453 -11697 13786 10157 -6715 5701 13619 -9358 -11404
1079 -11404 16986 13370 -15042 -8360 13008 -166 -12112 6970 7994 -17900 -12230 15418 4943
1092 4943 -20057 -6985 9172 -7793 -12716 8111 2575 -20088 -7369 14733 -1010 -17408
1104 -17408 -74 7486 -9567 -5127 12546 -257 -16531 2629 17367 -2894 -10847 8812
1116 8812 8517 -7790 2972 16798 -785 -11655 10410 17422 -4185 -5596 12183 6441 -6550
$$ packed form
1029a2767L3987j6437k5989J8193J1914k2569K026K6791j3643k8018J8488K4037
1041A6013j9458j3058J9904j878k0214J6483K2210k4834k0611K7939J4787k4566
1053g283j587K1553j1762j8620K4649J7818k9953j4072K9468P618k3080M646J6629
1066A6024j7466j1398K6772Q498k9883m244K5483l629j6872J2416P918k2977k046
1079a1404K8390l616k8412O682K1368j3174j1946J9082J024k5894N670K7648j0475
1092D943k5000J3072J6157j6965m923K0827n536k2663J2719K2102j5743j6398
1104a7408J7334P560j7053M440J7673j2803j6274J9160J4738k0261p953J9659
1116H812k95j6307J0762J3826j7583j0870K2065P012k1607j411J7779n742j2991
$$ plain form
1129 -6550 6534 13785 -5180 -8718 11603 10645 -8385 -3597 9471 -1897 -8865 6060 6718 -12405
1143 -12405 -9159 9276 2090 -13613 -3367 4644 -8620 -9543 5747 972 -15470 -6741 8288
1156 8288 -2774 -12117 -198 2865 -9311 -4549 8801 -1121 -12945 345 10063 -2689 -6475
1169 -6475 5963 3986 -6399 3023 12097 -361 -7572 6716 11573 -831 -784 9166 3345 -3410
1183 -3410 6801 11175 -2192 -4602 8700 7571 -3460 763 7633 -997 -4945 5807 5906 -6815
1197 -6815 -5079 5628 1274 -7330 -859 2801 -6105 -6619 3249 326 -9329 -5318 1969 -3675 -7785
1212 -7785 -382 -80 -8124 -4703 3771 -1159 -8430 -1735 3243 -2590 -3684 2829 1025 -4293 660
1227 660 6059 761 -2925 3783 5920 550 984 5793 2900 -121 4797 7402 864 -112 5763 5608
$$ packed form
1129f550J3084P251j8965l538K0321r58j9030M788J3068j1368o968J4925O58j9123
1143a2405L246J8435p186j5703J0246Q011j3264r23J5290m775j6442Q729J5029
1156H288j1062r343J1919L063j2176M762J3350r922j1824J3290R718j2752l786
1169f475J2438j977j0385R422R074j2458p211J4288M857j2404M7R950n821o755
1183c410J0211M374j3367k410J3302j129j1031M223O870q630l948J0752R9j2721
1197f815J736J0707m354q604O471L660q906n14R868k923r655M011P287n644m110
1212g785P403L02q044L421Q474m930p271O695M978n833j094O513j804n318M953
1227F60N399n298l686O708K137n370M34M809k893l021M918K605o538r76N875j55
$$ plain form
1243 5608 237 1816 4790 1296 -245 3335 3144 -1329 -843 2405 260 -2966 -552 635 -2918
1258 -2918 -3147 -454 -1184 -4270 -3119 -1513 -3363 -4516 -1969 -2116 -4113 -3939 -1497 -2093 -3379 -2636
1274 -2636 -1624 -1790 -1682 -539 -797 -1538 -584 929 696 368 781 1343 1846 2566 2387 2077 2676 3105 3385
1293 3385 3425 3107 2634 3572 4012 2563 1803 3521 3786 1830 1300 2480 1974 514 1474 1814 -903 -1569
1311 -1569 1151 725 -2659 -2698 -536 -1924 -3269 -1174 -1828 -5569 -4005 -88 -2403 -6028 -3472 -1363
1327 -1363 -4394 -4549 -500 -1007 -5637 -3335 1495 -1064 -4028 -335 1295 -2635 -929 4759 1366
1342 1366 -3106 1385 5717 1817 -158 5059 3813 -1332 2463 8242 3153 -1837 3984 6862 931
1357 931 740 6207 2720 -3002 2368 7022 -474 -3730 2424 2443 -3955 -606 4175 -3358 -7746 499
$$ packed form
1243E608n371J579K974l494j541L580j91m473M86L248k145l226K414J187l553
1258b918k29K693p30l086J151J606j850j153K547j47j997J74K442n96j286P43
1274b636J012j66J08J143k58p41R54J513k33l28M13N62N03P20j79l10N99M29K80
1293C385M0l18m73R38M40j449p60J718K65j956n30J180n06j460R60L40k717o66
1311a569K720m26l384l9K162j388j345K095o54l741J564L917k315l625K556K109
1327a363l031j55M049n07m630K302M830k559k964L693J630l930J706N688l393
1342A366m472M491M332l900j975N217j246n145L795N779n089m990N821K878n931
1357I31j91N467l487n722N370M654p496l256O154J9o398L349M781p533m388Q245
$$ plain form
1373 499 2892 -5154 -5626 969 -2373 -7986 -1296 3287 -6526 -9483 535 1818 -6139 -4117 2083
1388 2083 -3811 -7116 2964 4452 -6213 -5373 5018 2004 -4254 2260 6245 -2994 -3482 8381
1402 8381 7329 -4074 -293 8843 2198 -2330 7344 8499 -3912 -2074 10448 6454 -4012 2172
1416 2172 7131 -1835 -2656 8601 5183 -8027 -3323 8132 1096 -6272 1692 2723 -8404 -4630
1430 -4630 7585 354 -12865 -4058 5060 -3952 -7929 2366 -856 -11749 -3697 7911 -2406
1443 -2406 -11941 -824 4273 -5916 -4251 6569 -364 -10927 745 10564 -1680 -6865 4697
1456 4697 5095 -5239 1596 12047 330 -8454 5819 11841 -1374 -1751 9061 3213 -6110 5683
1470 5683 13252 -1829 -7737 6525 8155 -3963 121 8724 -2321 -9055 5726 9838 -6761
$$ packed form
1373D99K393q046m72O595l342n613O690M583r813k957J0018J283p957K022O200
1388B083n894l305J0080J488j0665Q40J0391l014o258O514L985r239m88J1863
1402H381j052j1403L781R136o645m528R674J155j2411J838J2522l994j0466O184
1416B172M959q966q21J1257l418j3210M704J1455p036p368P964J031j1127L774
1430d630J2215p231j3219Q807R118r012l977J0295l222j0893Q052J1608j0317
1443b406r535J1117N097j0189J665J0820o933j0563J1672R819j2244n185J1562
1456D697L98j0334O835J0451j1717q784J4273O022j3215l77J0812n848r323J1793
1470E683P569j5081n908J4262J630j2118M084Q603j1045o734J4781M112j6599
$$ plain form
1483 -6761 -8433 4973 805 -8547 978 6338 -9193 -11789 5208 5253 -10153 -6643 4406 -4629
1497 -4629 -10777 4285 6715 -11394 -10948 7372 4152 -8996 -1481 6081 -6069 -7778 9901 8145
1511 8145 -8888 -4976 9560 3325 -3779 6848 7072 -7466 -3006 15131 7812 -7847 538 10335
1525 10335 -353 -2337 12107 6316 -12003 -2651 15848 5167 -9528 548 6669 -5139 -3369
1538 -3369 11280 2366 -14845 -4551 10927 547 -8830 208 -999 -10885 -764 10843 -4104
1551 -4104 -17137 -1830 7475 -5018 -5774 4300 -5064 -14523 3650 14285 -5966 -16049 2629
1564 2629 8403 -4461 -778 9056 -3943 -12307 7130 16743 -2783 -10243 5235 6759 -1676 6313
1578 6313 10404 -5761 -8476 11310 13702 -3776 -3628 6379 -128 -2900 11135 9453 -12238 -9001
$$ packed form
1483f761j672J3406m168r352R525N360j5531k596J6997M5j5406L510J1049r035
1497d629o148J5062K430j8109M46J8320l220j3148P515P562j2150j709J7679j756
1511H145j7033L912J4536o235p104J0627K24j4538M460J8137p319j5659Q385R797
1525A0335j0688j984J4444n791j8319R352J8499j0681j4695J0076O121j1808J770
1538c369J4649q914j7211J0294J5478j0380r377R038j207r886J0121J1607j4947
1551d104j3033J5307R305j2493p56J0074r364r459J8173J0635k0251j0083J8678
1564B629N774j2864L683R834j2999q364J9437R613j9526p460J5478J524q435P989
1578F313M091j6165k715J9786K392j7478J48J0007o507k772J4035j682k1691L237
$$ plain form
1592 -9001 13135 8845 -9083 -2584 6344 -6414 -7643 10502 7122 -15852 -11383 9727 4268
1605 4268 -10418 -2764 2208 -9220 -6748 8721 2131 -14391 -6186 6950 -900 -6331 3699
1618 3699 168 -11951 -933 13631 -752 -13421 2546 10219 -4646 -4035 11149 2761 -12082
1631 -12082 2652 17472 593 -10756 6245 11202 -3753 -1547 11831 2575 -8832 4584
1643 4584 12533 -2790 -5681 7257 3988 -7056 1993 9255 -5250 -8694 7843 5860 -11325
1656 -11325 -4800 9754 -2054 -13633 1869 8010 -9562 -10502 8170 2624 -14413 -5101 9866
1669 9866 -2925 -12552 1916 5435 -8060 -4735 8172 -597 -11323 1569 9250 -3847 -5702
1682 -5702 6572 2312 -7321 4564 12350 -4173 -9883 9405 11371 -5304 -2313 11368 922
$$ packed form
1592i001K2136m290j7928O499Q928j2758j229J8145l380k2974M469K1110n459
1605D268j4686P654M972j1428K472J5469o590j6522Q205J3136p850n431J0030
1618C699l531j2119J1018J4564j4383j2669J5967P673j4865O11J5184q388j4843
1631a2082J4734J4820j6879j1349J7001M957j4955K206J3378r256j1407J3416
1643D584P949j5323k891J2938l269j1044R049P262j4505l444J6537j983j7185
1656a1325O525J4554j1808j1579J5502O141j7572r40J8672n546j7037R312J4967
1669I866j2791r627J4468L519j3495L325J2907q769j0726J2892P681j3097j855
1682e702J2274m260r633J1885P786j6523n710J9288J966j6675K991J3681j0446
$$ plain form
1695 922 -8369 8279 14287 -6016 -9936 9991 10511 -5250 -1616 7979 -2728 -7256 8273 8839
1709 8839 -9366 -8052 6812 2304 -6442 1592 2740 -10952 -6626 10652 2740 -14778 -5575 7232
1723 7232 -3301 -8594 4816 2296 -15181 -6079 13187 2379 -14449 -3588 7966 -2775 -5279
1736 -5279 7289 2469 -11664 -740 13294 1963 -8273 2382 6042 -2778 2541 11024 -928
1749 -928 -9714 6495 13782 -2066 -5523 7764 4224 -6356 4476 12730 -3707 -11435 7016
1762 7016 11591 -6087 -6014 6639 970 -8781 2663 8038 -7067 -10574 5221 4539 -8147 -4206
1776 -4206 3863 -4792 -8334 4606 3539 -10825 -6546 7504 -304 -9968 363 5601 -7091 -6561
1790 -6561 8197 3013 -11329 -1722 10653 -371 -8366 4919 7703 -5188 -2274 10736 2643
$$ packed form
1695I22r291J6648O008k0303l920J9927N20j5761L634R595j0707m528J5529N66
1709H839j8205J314J4864m508q746Q034J148j3692M326J7278p912j7518R203J2807
1723G232j0533n293J3410k520j7477R102J9266j0808j6828J0861J1554j0741k504
1736e279J2568m820j4133J0924J4034j1331j0236J0655L660q820N319Q483j1952
1749i28q786J6209P287j5848l457J3287l540j0580J0832Q254j6437p728J8451
1762G016M575j7678P3J2653n669r751J1444N375j5105l507J5795o82j2686L941
1776d206Q069q655l542J2940j067j4364M279J4050p808r664J0331N238j2692N30
1790f561J4758n184j4342R607J2375j1024p995J3285K784j2891K914J3010q093
$$ plain form
1803 2643 -7794 3819 11008 -1183 -4591 7487 5673 -4438 2410 10019 -1678 -6413 7438
1816 7438 8706 -5496 -3430 8014 1038 -6909 3476 7133 -7356 -8000 7443 4429 -9753 -4477
1830 -4477 5305 -3142 -8161 3472 3242 -10947 -6674 6723 1236 -9252 -2428 3192 -5677 -4608
1844 -4608 6151 841 -10684 -1801 8817 -31 -7057 2654 4056 -4996 23 9894 895 -8811
1858 -8811 2809 11096 28 -3644 5857 3939 -4006 3692 10609 -1067 -6931 5680 9061 -2015
1872 -2015 -1674 6020 129 -5507 4922 7800 -5475 -7285 5277 4357 -5653 -1678 3627 -5212
1886 -5212 -7415 4679 4166 -9086 -7199 4009 214 -6852 -727 2129 -7612 -5889 5902 1776
1900 1776 -9452 -3780 5134 -1075 -4943 3023 2106 -6709 -1668 8518 1570 -7172 1034 6780 -376
$$ packed form
1803B643j0437J1613P189j2191l408J2078j814j0111O848P609j1697m735J3851
1816G438J268j4202K066J1444o976p947J0385L657j4489o44J5443l014j4182N276
1830d477R782q447n019J1633k30j4189M273J3397n487j0488O824N620q869J069
1844d608J0759n310j1525Q883J0618q848p026R711J402r052N019R871q999r706
1858h811J1620Q287j1068l672R501j918p945P698O917j1676n864J2611L381j1076
1872b015L41P694n891n636J0429K878j3275j810J2562r20j0010L975N305q839
1886e212k203J2094n13j3252J887J1208l795p066O125K856r741J723J1791m126
1900A776j1228N672Q914o209l868P966r17q815N041J0186o948q742Q206N746p156
$$ plain form
1915 -376 -1691 6128 2534 -5067 2937 9665 718 -4410 4139 6361 -1349 552 6444 161 -4672
1930 -4672 3993 7793 -2429 -4753 3645 2599 -4001 384 4168 -3963 -6426 3451 3827 -6178 -5072
1945 -5072 2169 -1166 -5598 403 1409 -7020 -5723 3730 1411 -7063 -3629 2151 -2643 -3741 2153
1960 2153 1047 -6285 -2216 5753 1050 -4910 296 3679 -1542 -264 5750 1810 -4414 1651 7749
1975 7749 1267 -2190 3513 3924 -1013 2183 6478 903 -3799 3297 6487 275 -1779 3291 1300
1990 1300 -2653 1980 4035 -2471 -4475 1943 2401 -3268 -2283 1276 -2369 -4251 651 1644 -5389 -5112
2006 -5112 1041 133 -4541 -2175 462 -3418 -3801 1179 807 -4662 -3017 1970 -98 -2454 797 1267
2022 1267 -2105 -460 3812 1715 -2122 896 3871 1065 -185 3580 2593 -700 1516 4711 1862
$$ packed form
1915c76j315P819l594p601Q004O728q947n128Q549K222p710J901N892o283m833
1930d672Q665L800j0222k324Q398j046o600M385L784q131k463R877L76j0005J106
1945e072P241l335m432O001J006q429J297R453k319q474L434N780m794j098N894
1960B153j106p332M069P969m703n960N206L383n221J278O014l940o224O065O098
1975G749o482l457N703M11m937L196M295n575m702P096L190o212k054N070j991
1990A300l953M633K055o506k004O418M58n669R85L559l645j882M902R93p033K77
2006e112O153r08m674K366K637l880l83M980l72n469J645M987k068k356L251M70
2022A267l372J645M272k097l837L018K975k806j250L765r87l293K216L195k849
$$ plain form
2037 1862 -638 2240 3345 511 844 2756 1291 -817 1311 2783 -107 -1141 1058 574 -1545
2052 -1545 -427 748 -1424 -2857 22 408 -2376 -2874 -693 -1129 -2900 -1472 -1129 -2880 -2894 -535
2068 -535 -986 -2919 -1859 -504 -1101 -1719 -560 -22 -1632 -784 1413 681 -450 541 1202 904 993 2097
2086 2097 1433 1031 1805 2204 2065 1200 1821 2019 1712 1603 1740 1641 924 1273 1601 1178 927 523 429 675
2106 675 338 -205 -40 -519 -1198 -893 -368 -1266 -1877 -1872 -1255 -1845 -2150 -1555 -1574 -2350 -2404 -1234 -1306 -1875 -1439
2127 -1439 -958 -1657 -1176 36 -710 -1484 -566 645 -185 -464 1359 1066 -573 924 2899 1265 2
2144 2 1525 2891 1018 1295 3297 1830 -47 1917 3517 1368 -95 1934 2300 242 1059 2655
2160 2655 161 -1819 1100 1912 -1002 -1647 546 -456 -2479 -148 1327 -2528 -4002 -480 -114 -3002
$$ packed form
2037A862k500K878J105k834L33J912j465k108K128J472k890j034K199m84k119
2052a545J118J175k172j433K879L86k784m98K181m36j771J428L43j751j4K359
2068e35m51j933J060J355n97o18J159N38j610Q48K197p32j131R91O61k98Q9J104
2086B097o64m02P74L99j39q65O21J98l07j09J37r9p17L49L28m23k51m04r4K46
2106F75l37n43J65m79o79L05N25q98o11NO17n90l05N95j9p76n4J170p2n69M36
2127a439M81o99M81J212p46p74R18J211q30k79J823k93j639J497J975j634j263
2144BJ523J366j873K77K002j467j877J964J600k149j463K029L66k058Q17J596
2160B655k494j980K919Q12k914o45K193j002k023K331J475l855j474L522L66k888
$$ plain form
2176 -3002 -2170 -265 -2711 -4100 -145 378 -3808 -3401 575 -211 -2755 -459 1288 -2346 -2618 2539
2192 2539 2139 -2144 -929 2965 698 -913 2808 3012 -1360 -493 4850 2933 -1211 1603 3843 434
2208 434 109 4711 3114 -2402 -35 4868 1148 -1800 2219 2834 -2310 -1220 4010 569 -4443 -764
2224 -764 2469 -2010 -3376 1235 -523 -5417 -2021 3034 -1876 -6031 -774 602 -4275 -2622 2071
2239 2071 -1417 -6281 -421 3587 -2167 -4033 1289 854 -3821 272 5057 -1116 -4410 2275 4836
2254 4836 -764 -557 4196 1057 -2890 3448 6333 -1262 -2692 4530 4340 -1289 1547 5285 -922
2269 -922 -2949 4467 5260 -2809 -2256 4250 1246 -3544 1747 3541 -4604 -4535 4228 2386 -5748 -2385
2285 -2385 2569 -2697 -4737 2302 1599 -7057 -4492 3946 16 -5884 -820 1901 -4648 -4037 4248
$$ packed form
2176c002Q32J905k446j389L955N23m186M07L976p86k544K296J747l634k72N157
2192B539m00m283J215L894k267j611L721K04m372Q67N343j917m144K814K240l409
2208D34l25M602j597n516K367M903l720k948M019O15n144J090N230l441n012L679
2224g64L233m479j366M611j758m894L396N055m910m155N257J376m877J653M693
2239B071l488m864N860M008n754j866N322m35m675M093M785o173l294O685K561
2254D836n600K07M753l139l947O338K885p595j430P222j90n629K836L738o207
2269i22k027P416P93q069N53O506l004m790N291J794q145O9Q763j842q134L363
2285b385M954n266k040P039p03q656K565Q438l930n900N064K721o549O11Q285
$$ plain form
2300 4248 1282 -6753 -1646 4833 -559 -3970 2905 3039 -4893 -829 7191 1740 -4840 1937 5810
2315 5810 -1398 -1230 6516 2814 -4707 1338 8070 1015 -3679 3753 4403 -3103 70 7243 294
2330 294 -5887 1920 5912 -2029 -3652 4077 589 -6292 5 6066 -2898 -7633 1350 3067 -4908
2345 -4908 -2896 3554 -3054 -7752 1255 4498 -4913 -6173 2439 229 -5850 564 4817 -4469 -6614
2360 -6614 4200 5165 -4904 -2648 5019 -276 -4474 4540 6615 -4226 -4244 6924 5100 -3399 1168
2375 1168 5688 -1612 -2524 7523 5699 -4819 -1955 6995 2328 -3080 3745 3855 -5344 -2269 8371
2390 8371 2707 -7673 -1861 5235 -1603 -3829 3646 1052 -8872 -2924 7092 -22 -8685 -1160
2404 -1160 2871 -4647 -3477 4518 -1092 -9600 -1208 6685 -1879 -6389 1332 1177 -5212 398 7040
$$ packed form
2300D248k966q035N107O479n392l411O875J34p932M064Q020n451o580O777L873
2315E810p208J68P746l702p521O045O732p055m694P432O50p506L173P173o949
2330B94o181P807L992p941j623P729l488o881O297O061q964m735Q983J717p975
2345d908K012O450o608m698R007L243r411j260Q612k210o079O414M253r286k145
2360f614J0814R65j0069K256P667n295m198R014K075j0841j8J1168j824q499M567
2375A168M520p300r12J0047j824j0518K864Q950m667n408O825J10r199L075J0640
2390H371n664j0380N812P096o838k226P475k594r924N948J0016p114q663P525
2404a160M031p518J170P995n610q508Q392P893q564m510P721j55o389N610O642
$$ plain form
2419 7040 -2470 -8032 2977 7129 -2284 -3007 5048 1203 -5057 4149 8962 -2223 -6170 5291
2433 5291 6828 -2597 -75 6435 -408 -4942 5936 7682 -3695 -4777 5473 3422 -3797 1164
2447 1164 4673 -4182 -5167 5603 3676 -7200 -2987 4529 -1780 -5799 2545 2900 -8126 -5145 6000
2462 6000 906 -8269 -1808 4430 -3886 -5884 3680 2254 -7469 -2868 6269 -288 -6381 1745 4374
2477 4374 -4317 -2543 6420 1306 -5432 1681 6857 -1533 -3010 5960 3753 -4854 690 8212 444
2492 444 -4982 4592 6572 -3869 -2290 7290 2667 -6036 1366 6672 -2319 -4643 4194 2872 -5874
2507 -5874 -1505 5858 -1525 -7025 1326 3238 -5236 -3853 4330 -864 -7854 -131 4755 -4164 -6431
2522 -6431 2863 1090 -7106 -1389 5637 -2588 -7423 2497 5415 -4385 -3646 5069 1126 -5497 2149
$$ packed form
2419G040r510n562J1009M152r413p23Q055l845o260R206M813j1185l947J1461
2433E291J537r425K522O510o843m534J0878J746j1377j082J0250k051p219M961
2447A164L509q855r85J0770j927j0876M213P516o309m019Q344L55j1026K981J1145
2462F000n094r175O461O238q316j998R564j426r723M601R137o557o093Q126K629
2477D374q691J774Q963n114o738P113N176q390j477Q970k207q607N544P522p768
2492D44n426R574J980j0441J579R580m623q703P402N306q991k324Q837j322q746
2507e874M369P363p383n500Q351J912q474J383Q183n194o990P723M886q919k267
2522f431R294j773q196N717P026q225m835R920K918r800P39Q715l943o623P646
$$ plain form
2537 2149 6768 -2861 -4751 5260 5003 -3427 -107 6284 -371 -3565 5360 6380 -3890 -2410 6751
2552 6751 3253 -3777 2328 5748 -2888 -3367 6261 3877 -6440 -1990 5770 -186 -5087 2000 3074
2567 3074 -5791 -3734 5197 75 -7548 -1943 3644 -3085 -4721 2280 331 -7028 -1583 5158 -1779
2582 -1779 -7127 982 3288 -3983 -2648 4559 -354 -6234 1582 6350 -2077 -4548 3920 3883 -3385
2597 -3385 698 6181 -604 -4310 4388 6395 -2375 -2197 5543 3144 -2581 2746 5464 -2504 -3280
2612 -3280 5888 4392 -4366 -1629 5038 -38 -3696 2936 2810 -5418 -3185 5017 1144 -6167 -1346
2627 -1346 2517 -3310 -3778 3038 101 -7259 -2463 4648 -1151 -6313 -88 2037 -3826 -2269 4128
2642 4128 -774 -6769 222 5581 -1101 -4225 1823 2134 -2957 962 5721 -722 -4795 3488 6219
$$ packed form
2537B149M619r629j890J0011k57q430L320O391o655l194Q925J020j0270J480R161
2552F751l498p030O105L420q636m79R628k384j0317M450P760n956m901P087J074
2567C074q865K057Q931n122p623N605N587o729j636P001j949p359N445O741o937
2582a779n348Q109K306p271J335P207m913n880P816M768q427k471Q468l7p268
2597c385M083N483o785l706Q698K007q770J78P740k399n725N327K718p968p76
2612c280R168j496q758K737O667n076l658O632j26q228K233Q202l873p311M821
2627a346L863n827m68O816k937p360M796P111n799n162O225K125n863J557O397
2642D128m902n995O991N359o682l124O048L11n091L919M759o443m073Q283K731
$$ plain form
2657 6219 -1198 -1530 3968 1096 -2401 3714 6006 -2263 -3763 4519 4781 -2812 -456 3715 -869
2672 -869 -2752 4068 4039 -4666 -3737 3781 1840 -3914 -478 2114 -3752 -3634 3304 1377 -6447 -3462
2688 -3462 3019 -790 -4267 218 473 -4738 -2404 3613 -129 -5947 -836 3427 -1477 -2692 2278
2703 2278 571 -4459 400 5687 15 -4044 1854 4266 -1243 -427 4079 1269 -2456 2344 6041
2718 6041 -122 -2588 3061 3769 -991 512 3893 -328 -2568 3042 3873 -2560 -1905 2993 576 -2941
2734 -2941 485 2118 -3312 -3603 2722 1226 -4590 -2927 1996 -934 -3884 300 729 -4073 -2832
2749 -2832 2445 -256 -4832 -1550 1722 -1572 -2376 1251 34 -3240 -199 3545 -545 -3140 1137
2764 1137 2947 -557 -55 3289 306 -2528 1968 5129 -89 -2123 2786 3127 -370 1322 3664
$$ packed form
2657F219p417l32N498k872l497O115K292q269j500Q282K62p593K356M171m584
2672h69j883O820k9q705R29P518j941n754L436K592n866J18O938j927p824K985
2688c462O481l809l477M485K55n211K334O017l742n818N111M263m904j215M970
2703B278j707n030M859N287n672m059N898K412n509Q16M506k810l725M800L697
2718F041o163k466N649P08m760J503L381m221k240N610Q31o433O55M898k417l517
2734b941L426J633n430k91O325j496n816J663M923k930k950M184M29m802J241
2749b832N277k701m576L282L272l294q04L627j217l274L041L744m090k595M277
2764A137J810l504N02L344k983k834M496L161n218k034M909L41l497J692K342
$$ plain form
2779 3664 100 -1802 2802 4107 -811 -1568 1973 1068 -1188 1170 2160 -2136 -2846 1938 1738 -3062
2795 -3062 -2333 603 -1076 -2400 476 -12 -4017 -2846 1555 -4 -3542 -1734 242 -2153 -2010 1304
2811 1304 98 -3548 -1594 2167 697 -2230 -75 695 -1127 24 2820 537 -2002 908 3456
2826 3456 1044 -247 1773 1255 -348 2005 3271 279 -1123 1501 2966 551 -252 1774 695
2841 695 -958 1244 2431 -682 -2042 743 1198 -792 -696 319 -1370 -1875 415 190 -2466 -2436 -109
2858 -109 -847 -2410 -1178 -277 -2481 -1932 95 171 -2380 -1710 356 -485 -1128 -76 205 -1193 -313 1662
2876 1662 693 -932 166 1594 954 256 1314 786 599 1131 2349 1373 205 1265 1626 1038 867
2893 867 1430 1181 180 917 1548 547 -367 387 472 49 319 -63 -461 -1009 -387 -290 -845 -1722 -1250 -851
$$ packed form
2779C664l564j902M604J305m918p57L541r05k256K358R90m296p10M784k00m800
2795c062P29K936j679j324K876m88m005J171M401j559l538J808J976k395J43L314
2811A304j206l646J954L761j470k927K155P70j822J151K796k283k539K910K548
2826C456k412j291K020n18j603K353J266k992j402K624J465k415q03K026j079
2841F95j653K202J187l113j360K785M55j990R6J015j689n05K290k25k656L0K327
2858a09p38j563J232R01k204N49K027P6k551O70K066q41o43J052K81j398Q80J975
2876A662r69j625J098J428o40o98J058n28j87N32J218r76j168J060L61n88j71
2893H67N63k49j001P37O31j001r14P54Q5m23K70l82l98n48O22R7n55q77M72L99
$$ plain form
2913 -851 -876 -1092 -1079 -1440 -1863 -1068 -694 -978 -1217 -1744 -814 -667 -529 -840 -657 -758 -177 292 31 -46 -136
2934 -136 739 731 211 850 1277 631 611 1568 1401 878 654 1539 1647 819 1114 1595 620 58 1594 1790 205
2955 205 27 1059 406 -640 639 411 -818 -1096 512 -115 -1318 -651 -53 -1462 -1828 -130 29
2972 29 -2353 -1897 -169 -1184 -2429 -768 -255 -1956 -1990 662 257 -1809 -954 702 -547 -876 1354
2989 1354 868 -1292 -416 2613 1287 -822 931 1820 185 666 2704 1809 -1087 789 3193 950
3005 950 -142 1661 2128 -939 535 2789 476 -2087 327 2302 -305 -1093 1287 111 -2983 -58
3021 -58 2301 -1313 -3472 -257 418 -2195 -1647 601 -1403 -3708 -476 1254 -2179 -2761 328 -343
3037 -343 -2823 -295 1723 -1813 -2842 1276 1967 -2154 -983 2138 -53 -2071 2034 3006 -1311 -1669
$$ packed form
2913h51k5k16J3l61m23P95L74k84k39n27R30J47J38l11J83j01N81M69k61p7r0
2934a36Q75qn20O39M27o46k0R57j67n23k24Q85J08q28K95M81r75n62J536J96j585
2955B05j78J032o53j046J279k28j229k78J608o27j203O67N98j409l66J698J59
2972B9k382M56J728j015j245J661N13j701l4K652m05k066Q55J656j249l29K230
2989A354m86k160Q76L029j326k109J753Q89j635M81K038q95k896J876K404k243
3005I50j092J803M67l067J474K254k313k563K414J975k607p88K380j176l094K925
3021e8K359l614k159L215O75k613N48K248k004k305L232J730l433n82L089o71
3037c43k480K528K018l536j029M118O91m121J171L121k191k018M105R72m317l58
$$ plain form
3053 -1669 3350 2660 -985 966 3199 -73 -1301 3397 3398 -1194 -613 3195 1262 -1316 1949 2582
3069 2582 -2196 -1884 3221 1460 -3262 -554 2232 -1563 -2723 2002 1225 -4120 -2185 2645 67
3084 67 -4062 -412 1565 -3145 -3005 2439 57 -5122 -2090 2749 -1106 -3343 1381 1158 -3619 -1252
3100 -1252 3763 28 -3741 677 3156 -1374 -1189 3743 1575 -3101 851 5302 413 -2415 2825
3115 2825 3236 -1584 492 5096 506 -3360 2105 4863 -1439 -2159 3237 1242 -3128 998 4618
3130 4618 -1901 -4397 1909 2740 -3119 -1894 2619 -1250 -4609 1345 3120 -4223 -4332 2376 577
3145 577 -4742 -840 2795 -3142 -4714 2266 2498 -4629 -2807 3348 -178 -3840 1804 3279 -3576
3160 -3576 -2934 4390 2708 -3478 75 4520 -1173 -2436 4178 3611 -3353 -602 5588 1030 -2943
$$ packed form
3053a669N019o90l645J951K233l272j228M698Jm592N81L808j933k578L265O33
3069B582m778L12N105j761m722K708K786l795j160M725p77n345J935M830k578
3084F7m129L650J977m710J40N444k382n179L032M839l855k237M724k23m777K367
3100a252N015l735l769M418K479m530J85M932k168m676L952M451m889k828N240
3115B825M11m820K076M604m590l866N465K758o302p20N396j995m370M126L620
3130D618o519k496O306Q31n859J225M513l869l359N954J775p343j09O708j799
3145E77n319L902L635n937j572O980K32p127J822O155l526l662N644J475o855
3160c576O42P324j682o186L553M445n693j263O614n67o964K751O190m558l973
$$ plain form
3175 -2943 2812 4521 -2352 -1827 5550 2501 -4151 321 5003 -1130 -3013 3352 2397 -4987 -1786
3190 -1786 4799 -513 -5497 605 3093 -3946 -3222 3841 177 -6406 -1219 3641 -2376 -5101 2245
3205 2245 1440 -5149 -2079 4505 -1117 -5763 1231 3634 -3140 -2645 4347 726 -5056 843 5956
3220 5956 -1625 -3807 3441 3565 -3313 145 5919 -227 -4247 3349 5759 -2256 -2328 5009 1874 -3826
3236 -3826 2282 5843 -2299 -4269 3997 3974 -3994 -1485 4642 -1013 -4813 2658 4290 -4987 -4355 3437
3252 3437 1023 -5151 -349 2981 -4045 -4808 3396 2180 -6052 -3059 3963 -858 -5072 1735 3002
3267 3002 -4998 -3519 5205 1182 -5836 -154 4783 -2114 -3314 4384 2936 -4749 -435 6397 476
3282 476 -3857 2884 4746 -2509 -1108 6038 1667 -4792 1650 6555 -1194 -3404 4192 2867 -4295
$$ packed form
3175b943N755J709o873N25P377l049o652M472M682o133j883O365r55p384L201
3190a786O585n312m984O102K488p039P24P063l664o583N187M860o017k725P346
3205B245q05o589L070O584n622m646O994K403o774M95O992l621n782N899N113
3220E956p581k182P248J24o878L458N774o146m020P596K410q015p2P337l135n700
3236c826O108L561q142j970Q266k3p968K509O127n655l800P471J632r277O32P792
3252C437k414o174M802L330p026p63Q204j216q232K993P022m821m214O807J267
3267C002q000J479Q724m023p018N682M937o897j200P698j448p685M314O832n921
3282D76m333O741J862p255J401P146m371o459O442M905p749k210P596j325p162
$$ plain form
3297 -4295 -185 6056 -640 -5622 2090 4159 -3854 -3005 3568 -39 -6038 385 4433 -3566 -5211
3312 -5211 3110 1696 -5710 -1583 4119 -2213 -6164 1693 3463 -4582 -3454 4223 364 -5400 678
3327 678 4503 -3135 -4325 3920 2707 -4042 -569 5285 -496 -4089 3723 4733 -3062 -2034 5586
3342 5586 1957 -3745 1942 5417 -2180 -3230 5013 4039 -4022 -873 5248 -280 -3974 2809 4080
3357 4080 -4258 -2511 4854 874 -5059 230 3762 -3160 -4175 3415 1412 -6103 -1905 4288 -1200
3372 -1200 -5297 1166 2278 -4765 -2662 4224 54 -6161 289 4306 -2524 -3697 2996 2119 -4461
3387 -4461 -47 5515 -637 -4613 2695 4126 -2407 -1294 4756 987 -3542 2739 5857 -1774 -3161
3402 -3161 4298 3354 -2834 413 4982 -1282 -3694 3906 4320 -3659 -2604 4221 1358 -4025 922
$$ packed form
3297d295M110O241o696m982P712K069q013Q49O573l607n999O423M048p999j645
3312e211Q321j414p406M127N702o332l951P857J770q045J128P677l859n764O078
3327F78L825p638j190Q245j213o749L473N854n781l593P812J010p795J028P620
3342E586l629n702N687L475p597j050Q243r74q061L149O121n528l694O783J271
3357D080q338J747P365l980n933N289L532o922j015P590k003p515M198O193n488
3372a200m097O463J112p043K103O886m170o215O450M017o830j173O693q77o580
3387d461M414N562o152l976P308J431o533J113O050l769m529O281L118p631j387
3402c161P459r44o188L247M569o264k412P600M14p979J055O825k863n383M947
$$ plain form
3417 922 3027 -3062 -3608 3357 1711 -5248 -2080 3243 -1037 -4001 1608 1312 -4758 -2470 3664 -208
3433 -208 -5442 -503 2833 -2651 -3093 2977 475 -5127 -123 5092 -373 -4308 1684 3185 -2573
3448 -2573 -552 4570 226 -4221 1882 5554 -976 -2432 2801 2454 -2188 1540 4674 -1006 -3105
3463 -3105 3126 4335 -2006 -1545 3155 162 -2811 1931 3288 -3391 -3791 3500 2592 -3814 -1681 2024
3479 2024 -1752 -3112 2299 2010 -4803 -3231 2398 595 -3930 -772 1144 -3074 -2279 3173 550
3494 550 -4670 -1401 2966 -296 -2642 1741 977 -3277 -156 4498 770 -3863 554 3967 62
3509 62 -1135 3138 1491 -2379 1179 5240 287 -3083 1793 3338 -823 124 3138 368 -2710 1572
3525 1572 3734 -1274 -2602 1803 931 -2331 64 2105 -2414 -3120 1771 1967 -3096 -2310 1335 -628
$$ packed form
3417I22K105o089n46O965j646o959L168N323m280k964N609k96o070K288O134l872
3433b08n234M939L336n484m42O070k502n602N004N215n465l935N992J501n758
3448b573K021N122m344m447O103L672o530j456N233l47m642L728L134n680k099
3463c105O231J209o341M61M700k993k973M742J357o679m00P291r08o406K133L705
3479B024l776j360N411k89o813J572N629j803m525L158J916m218P95N452k623
3494E50n220L269M367l262k346M383p64m254L121M654l728m633M417L413l905
3509F2j197M273j647l870L558M061m953l370M876J545m161R47L014k770l078M282
3525A572K162n008j328M405q72l262K395K041m519p06M891J96n063P86L645j963
$$ plain form
3541 -628 -3276 -151 1467 -3168 -3182 1528 908 -3123 -1398 1756 -801 -2635 1138 1325 -2492 -1171
3557 -1171 2619 647 -1927 773 2143 -892 -582 2971 1227 -1951 787 3565 316 -1609 2219
3572 2219 2629 -760 126 2800 510 -1591 1323 3000 -485 -1699 1821 941 -1350 217 1683 -1087
3588 -1087 -1990 1203 1283 -2260 -1547 904 -594 -2365 -110 573 -2739 -2169 1078 164 -2914 -1689 761
3605 761 -1107 -1735 606 845 -2323 -1261 2045 319 -1787 -329 1252 -341 -622 1730 691 -1391
3621 -1391 664 2635 504 -768 1240 1423 -32 893 2407 463 -1291 1028 2430 -68 -377 1032
3637 1032 936 -681 737 1691 -621 -1811 403 1125 -992 -1253 14 -583 -1438 291 179 -1887 -1820
3654 -1820 127 -232 -1808 -1081 -161 -1461 -1492 465 -21 -2112 -1515 825 -243 -1054 -248 132 -816 -521
$$ packed form
3541f28k648L125J618m635j4M710o20m031J725L154k557j834L773J87l817J321
3557a171L790j972k574K700J370l035L10L553j744l178K738K778l249j925L828
3572B219M10l389Q86K674k290k101K914J677l485j214L520q80k291J567J466k770
3588a087r03L193Q0l543P13K451j498j771K255O83l312N70L247r14l078J225K450
3605G61j868o28K341K39l168J062L306j726k106J458J581j593k81K352j039k082
3621a391K055J971k131j272K008J83j455R25J514j944j754K319J402k498l09J409
3637A032r6j617J418R54k312j190K214P22k117k61J267n97q55J729j12k066O7
3654a820J947l59j576P27R20j300l1J957m86k091N97K340j068q11Q06L80r48K95
$$ plain form
3672 -521 1317 921 -495 -94 1024 496 38 923 876 250 839 1794 586 -309 873 1686 839 595 1110
3691 1110 592 -76 1150 1429 -58 -718 -2 418 126 -309 79 -383 -1260 -384 -16 -950 -1173 -908 -357
3710 -357 -980 -857 -882 -1414 -1111 -244 -343 -1000 -1139 -628 -398 -550 -280 -485 -550 -468 348 406 31 -281 350 450
3732 450 451 763 376 231 546 1061 1101 605 91 515 1003 1390 817 924 711 356 808 1049 480 0 -32
3753 -32 458 748 -43 -388 -3 -495 -533 -184 -264 -605 -775 -397 -679 -1042 -615 -808 -1343 -848 -202 -568 -1224
3774 -1224 -693 -367 -914 -656 -20 -245 -1076 -575 272 43 -559 161 820 300 -257 1066 660 50 604
3793 604 1446 813 465 906 965 459 701 1726 678 -257 575 1020 170 171 905 117 -539 320 881 86
3813 86 -862 -10 82 -764 -738 736 -658 -1659 -194 133 -884 -1318 -233 -363 -1429 -569 385 -1089
$$ packed form
3672e21J838l96j416M01J118n28m58Q85m7o26N89R55j208q95J182Q13q47k44N15
3691A110n18o68J226K79j487o60P16M20k92m35L88m62q77Q76L68r34k23K65N51
3710c57o23J23k5n32L03Q67r9o57j39N11K30j52K70k05o5Q2Q16N8l75l12O31J00
3732D50JL12l87j45L15N15M0m96n14M24M88L87n73J07k13l55M52K41n69m80l2
3753c2M90K90p91l45L85m92l8L49q0l41j70L78k82l63M27j93n35M95O46l66o56
3774a224N31L26n47K58O36k25q31N01Q47k29o02P20O59n20n57J323m06o10N54
3793F04Q42o33l48M41N9n06K42J025j048r35Q32M45q50JP34p88o56Q59N61p95
3813H6r48Q52R2q46K6J474j394j001J465L27j017m34J085j30j066Q60R54j474
$$ plain form
3831 -1089 -1933 -128 292 -950 -644 213 -327 -811 254 1096 -1129 -716 1076 714 -741 226 1518
3848 1518 -293 -431 1500 1589 -322 66 1802 999 -127 1339 1582 -416 -3 1945 1309 -309 259
3865 259 1346 -511 -943 842 750 -1420 -666 925 14 -1649 -262 294 -1646 -1119 795 -202 -2240
3882 -2240 -975 925 -742 -1800 119 104 -1870 -1000 952 -367 -1658 -401 974 -791 -861 896
3898 896 388 -1513 193 1812 95 -946 980 1393 -568 436 2075 663 -1010 1308 2376 84
3914 84 -89 1904 925 -1003 756 2511 -16 -1375 1289 1309 -762 -297 1509 -391 -1771 385 1510
3931 1510 -1230 -1870 301 121 -2038 -414 452 -1652 -2147 547 861 -2235 -1340 617 -792 -2046
3947 -2046 528 690 -1983 -1664 1492 904 -1716 -283 1693 -497 -1384 1678 1605 -1644 -447 2419
$$ packed form
3831a089q44J805M20j242L06Q57n40m84J065Q42k225M13J792l62j455R67J292
3848A518j811j38J931Q9j911L88J736q03j126J466K43j998M13J948o36j618N68
3865B59J087j857m32J785r2k170P54J591r11j663J387N56j940N27J914r97k038
3882b240J265J900j667j058J919j5j974Q70J952j319j291J257J375j765p0J757
3898H96n08j901J706J619j717j041J926M13j961J004J639j412j673K318J068k292
3914H4j73J993r79j928J759J755k527j359K664K0k071M65J806j900j380K156J125
3931A510k740o40K171j80k159J624Q66k104m95K694L14l096Q95J957j409j254
3947b046K574J62k673L19L156n88k620J433J976k190q87L062p3l249J197K866
$$ plain form
3963 2419 1216 -1005 1166 2037 -500 146 2920 1239 -1386 601 2646 209 -792 1805 1137 -1587
3979 -1587 96 2336 -181 -1984 485 1590 -1137 -1479 1361 72 -2417 -474 1640 -1357 -2506
3994 -2506 409 727 -2346 -976 1034 -1182 -2822 252 1030 -2236 -1755 1153 -172 -2022 -121 1892
4010 1892 -982 -1917 1462 1248 -1723 -251 2288 307 -1620 1630 2020 -1177 -410 2615 1274 -1030
4026 -1030 1020 2442 49 -868 2136 1621 -1192 180 2615 -51 -1746 1072 1743 -1187 -1058 1971
4042 1971 278 -2461 -30 1897 -1590 -1987 1079 394 -2423 -936 1504 -1252 -2571 397 911 -2395
4058 -2395 -1674 1285 -248 -2615 138 1687 -1740 -1691 1573 941 -1932 -307 2249 -318 -1601 1531
4074 1531 1824 -1414 -300 2594 607 -1223 1145 2514 -479 -593 2592 1761 -1646 256 2795 37
$$ packed form
3963B419j203k221K171Q71k537O46K774j681k625J987K045k437j001K597o68k724
3979a587J683K240k517j803K469J105k727l42K840j289k489J943K114k997j149
3994b506K915L18l073J370K010k216j640L074P78l266M81K908j325j850J901K013
4010A892k874r35L379k14k971J472K539j981j927L250L90l197P67L025j341k304
4026a030K050J422k393r17L004n15k813J372K435k666j695K818O71k930J29L029
4042A971j693k739K431J927l487l97L066o85k817J487K440k756j319K968N14l306
4058b395P21K959j533k367K753J549l427M9L264o32k873J625K556k567j283L132
4074A531K93l238J114K894j987j830K368J369k993j14L185q31l407J902K539k758
$$ plain form
4090 37 -1654 1476 1801 -1413 -571 2446 285 -2224 11 1775 -1308 -1531 1260 156 -2614 -327
4106 -327 1773 -1254 -2765 271 626 -2591 -1464 1660 -918 -2975 73 1332 -1568 -2132 1274 341
4122 341 -1883 -88 2014 -764 -2040 1446 2011 -1326 -385 2185 162 -1695 1582 2455 -772 -954
4138 -954 2594 1412 -1110 898 2522 -475 -1106 2411 1812 -1594 -363 2412 240 -1995 855 1902
4154 1902 -1799 -1326 2125 467 -2354 -539 1529 -1368 -2498 1154 548 -2842 -1286 1635 -858
4169 -858 -2876 20 862 -2308 -1534 1578 102 -2706 -36 2104 -991 -1792 1231 1261 -1657 127
4185 127 2538 -56 -1826 1494 2543 -762 -596 2155 816 -1250 1168 2834 -352 -968 2263 1800
4201 1800 -1191 261 2426 -354 -1329 1651 2115 -1818 -1281 2090 374 -2365 288 1393 -1234 -1778
$$ packed form
4090C7j691L130L25l214Q42L017k161k509K235J764l083k23K791j104k770K287
4106c27K100l027j511L036L55l217J127L124k578k057L048J259k900n64L406r33
4122C41k224J795K102k778j276L486N65l337R41K570k023j857L277Q73l227j82
4138i54L548j182k522K008J624k997o31L517n99l406J231K775k172k235K850J047
4154A902l701M73L451j658k821J815K068k897j130L652o06l390J556K921k493
4169h58k018K896Q42l170P74L112j476k808K670K140l095q01L023L0k918J784
4185A27K411k594j770L320J049l305J66K751j339k066K418J666l186o16L231m63
4201A800k991J452K165k780r75K980M64l933N37L371j716k739K653J105k627n44
$$ plain form
4217 -1778 1448 683 -2761 -1071 1296 -703 -2360 129 803 -2063 -1484 1229 -187 -2848 -307 1547
4233 1547 -1232 -1685 1208 223 -2143 221 2352 -261 -1981 1359 1794 -1303 -485 2587 421 -1425
4249 -1425 1407 2787 -445 -1299 2085 1830 -998 330 2116 -242 -1299 1877 1705 -1339 -923 2154
4265 2154 717 -1545 548 1304 -1501 -1556 1767 530 -2684 -667 1156 -803 -1856 669 184 -2600
4281 -2600 -1487 1048 -199 -2780 -179 978 -1651 -1192 1154 -73 -2400 -289 2029 -303 -1563
4296 -1563 1179 606 -1541 147 2045 54 -1963 1214 2557 -533 -465 1922 922 -1018 1277 2369
4312 2369 -356 -1377 1884 2161 -706 -189 1342 70 -991 842 1772 -1549 -1389 1426 557 -1290
4328 -1290 -164 522 -1703 -1115 1219 387 -2288 -1255 1256 -382 -1963 -218 628 -2054 -966 1222
$$ packed form
4217a778L226p65l444J690K367j999j657K489O74k866N79K713j416k661K541J854
4233A547k779m53K893r85k366K364K131k613j720L340M35l097Q18L072k166j846
4249a425K832J380l232q54L384k55k828J328J786k358j057L176j72l044M16L077
4265B154j437k262K093P56k805n5L323j237l214K017J823j959j053K525m85k784
4281b600J113K535j247k581K601J157k629M59K346j227k327K111K318k332j260
4296a563K742n73k147J688J898j991k017L177J343l090O8K387j000j940K295J092
4312B369k725j021L261K77k867N17J531j272j061J833R30l321J60K815q69j847
4328a290J126O86k225N88K334q32k675J033K511j638j581J745Q46k682J088K188
$$ plain form
4344 1222 -234 -2633 -842 1089 -847 -1171 773 516 -1293 -362 1860 124 -1400 787 1360 -529
4360 -529 204 1937 430 -1253 1051 2368 -273 -430 1746 1377 -696 342 1991 129 -892 1225
4376 1225 1849 -869 -723 1379 441 -1139 218 1049 -826 -1336 715 546 -1593 -908 893 -727 -1310
4393 -1310 402 165 -1889 -1004 899 -617 -1829 -186 785 -1217 -1305 477 169 -1555 -292 1311
$$ packed form
4344A222j456k399J791J931j936l24J944k57j809R31K222j736j524K187N73j889
4360e29P33J733j507j683K304J317k641j57K176l69k073J038J649j862j021K117
4376A225O24k718J46K102r38j580J357Q31j875n10K051j69k139O85J801j620n83
4393a310J712k37k054Q85J903j516j212J643R71k002q8J782l08j724J263J603
$$ [...]
8191d37
##END NTUPLES=NMR FID
##END=
