##TITLE=1H_Pr A2
 , 8 sc, 
 15.2.2019
##JCAMPDX= 6.0         $$ Bruker NMR JCAMP-DX V2.0
##DATA TYPE= NMR FID
##DATA CLASS= NTUPLES
##ORIGIN= UXNMR, Bruker Analytische Messtechnik GmbH
##OWNER= root
$$ XWIN-NMR		Version 3.5
$$ Fri Feb 15 15:51:12 2019 Russian Standard Time (UT+4h)  she@DPX200
##.OBSERVE FREQUENCY= 200.1313
##.OBSERVE NUCLEUS= ^1H
##.DELAY= (6, 6)
##.ACQUISITION MODE= SIMULTANEOUS
##.ACQUISITION SCHEME= undefined
##.AVERAGES= 8
##.DIGITISER RES= 18
##SPECTROMETER/DATA SYSTEM= spect
##.PULSE SEQUENCE= zg30
##.SOLVENT NAME= DMSO
##.SHIFT REFERENCE= (INTERNAL, DMSO, 0, 15.7039)
##AUDIT TRAIL= $$ (NUMBER, WHEN, WHO, WHERE, WHAT)
$$ ##TITLE= Audit trail, XWIN-NMR		Version 3.5
$$ ##JCAMPDX= 5.01
$$ ##ORIGIN= Bruker BioSpin GmbH
$$ ##OWNER= she
$$ F:/spectra/data/she/nmr/H-F/1/audita.txt
$$ ##AUDIT TRAIL=  $$ (NUMBER, WHEN, WHO, WHERE, WHAT)
(   1,<2019-02-15 15:49:59.15 +0400>,<she>,<DPX200>,
      <created by zg, POWCHK disabled, PULCHK disabled
       configuration hash MD5:
       00 E9 B6 7A A2 85 ED C7 34 08 36 98 17 FE 4E 26
       data hash MD5: 16K
       4F 12 62 83 59 3C 10 2B 1A 18 65 7C 2A 7E CA CA>)
$$ ##END=
$$ 
$$ hash MD5
$$ AC E9 04 7B 12 28 6F D2 96 82 92 BD EC 4E F4 AA
##$RELAX= 
##$RELAX= 
##$RELAX= 
##$RELAX= 
##$RELAX= 
##$RELAX= 
$$ Bruker specific parameters
$$ --------------------------
##$DU= <F:/spectra>
##$EXPNO= 1
##$NAME= <H-F>
##$PROCNO= 1
##$TYPE= <nmr>
##$USER= <she>
##$AMP= (0..31)
100 100 100 100 100 100 100 100 100 100 100 100 100 100 100 100 100 100 
100 100 100 100 100 100 100 100 100 100 100 100 100 100 
##$AQSEQ= 0
##$AQ_mod= 1
##$AUNM= <au_zg>
##$AUTOPOS= <>
##$BF1= 200.13
##$BF2= 200.13
##$BF3= 200.13
##$BF4= 200.13
##$BF5= 200.13
##$BF6= 200.13
##$BF7= 200.13
##$BF8= 200.13
##$BYTORDA= 1
##$CFDGTYP= 0
##$CFRGTYP= 5
##$CHEMSTR= <none>
##$CNST= (0..31)
1 1 145 1 1 1 1 1 1 1 1 1 1 1 1 1 1 1 1 1 1 1 1 1 1 1 1 1 1 1 1 1 
##$CPDPRG= <>
##$CPDPRG1= <>
##$CPDPRG2= <>
##$CPDPRG3= <>
##$CPDPRG4= <mlev>
##$CPDPRG5= <mlev>
##$CPDPRG6= <mlev>
##$CPDPRG7= <mlev>
##$CPDPRG8= <mlev>
##$CPDPRGB= <>
##$CPDPRGT= <>
##$D= (0..31)
0 1.2 0 0 0 0 0 0 0 0 0 0.03 0 0 0 0 0 0 0 0 0 0 0 0 0 0 0 0 0 0 0 0 
##$DATE= 1550231398
##$DBL= (0..7)
120 120 120 120 120 120 120 120 
##$DBP= (0..7)
150 150 150 150 150 150 150 150 
##$DBP07= 0
##$DBPNAM0= <>
##$DBPNAM1= <>
##$DBPNAM2= <>
##$DBPNAM3= <>
##$DBPNAM4= <>
##$DBPNAM5= <>
##$DBPNAM6= <>
##$DBPNAM7= <>
##$DBPOAL= (0..7)
0.5 0.5 0.5 0.5 0.5 0.5 0.5 0.5 
##$DBPOFFS= (0..7)
0 0 0 0 0 0 0 0 
##$DE= 6
##$DECBNUC= <off>
##$DECIM= 32
##$DECNUC= <off>
##$DECSTAT= 4
##$DIGMOD= 1
##$DIGTYP= 9
##$DL= (0..7)
0 120 120 120 120 120 120 120 
##$DP= (0..7)
150 150 150 150 150 150 150 150 
##$DP07= 0
##$DPNAME0= <>
##$DPNAME1= <>
##$DPNAME2= <>
##$DPNAME3= <>
##$DPNAME4= <>
##$DPNAME5= <>
##$DPNAME6= <>
##$DPNAME7= <>
##$DPOAL= (0..7)
0.5 0.5 0.5 0.5 0.5 0.5 0.5 0.5 
##$DPOFFS= (0..7)
0 0 0 0 0 0 0 0 
##$DQDMODE= 0
##$DR= 18
##$DS= 0
##$DSLIST= <SSSSSSSSSSSSSSS>
##$DSPFIRM= 0
##$DSPFVS= 10
$$ [...]
##$SUBNAM2= <"">
##$SUBNAM3= <"">
##$SUBNAM4= <"">
##$SUBNAM5= <"">
##$SUBNAM6= <"">
##$SUBNAM7= <"">
##$SUBNAM8= <"">
##$SUBNAM9= <"">
##$SW= 20.0189088683792
##$SWIBOX= (0..15)
0 0 2 0 0 0 0 0 0 0 0 0 0 0 0 0 
##$SW_h= 4006.41025641026
##$TD= 16384
##$TD0= 1
##$TE= 0
##$TE2= 300
##$TE3= 300
##$TEG= 300
##$TL= (0..7)
0 120 120 120 120 120 120 120 
##$TP= (0..7)
150 150 150 150 150 150 150 150 
##$TP07= 0
##$TPNAME0= <>
##$TPNAME1= <>
##$TPNAME2= <>
##$TPNAME3= <>
##$TPNAME4= <>
##$TPNAME5= <>
##$TPNAME6= <>
##$TPNAME7= <>
##$TPOAL= (0..7)
0.5 0.5 0.5 0.5 0.5 0.5 0.5 0.5 
##$TPOFFS= (0..7)
0 0 0 0 0 0 0 0 
##$TUNHIN= 0
##$TUNHOUT= 0
##$TUNXOUT= 0
##$USERA1= <user>
##$USERA2= <user>
##$USERA3= <user>
##$USERA4= <user>
##$USERA5= <user>
##$V9= 5
##$VALIST= <valist>
##$VCLIST= <CCCCCCCCCCCCCCC>
##$VD= 0
##$VDLIST= <DDDDDDDDDDDDDDD>
##$VPLIST= <PPPPPPPPPPPPPPP>
##$VTLIST= <TTTTTTTTTTTTTTT>
##$WBST= 1024
##$WBSW= 4
##$XGAIN= (0..3)
0 0 0 0 
##$XL= 0
##$YL= 0
##$YMAX_a= 231338
##$YMIN_a= -277237
##$ZGOPTNS= <>
##$ZL1= 120
##$ZL2= 120
##$ZL3= 120
##$ZL4= 120
##$ABSF1= 10
##$ABSF2= 0
##$ABSG= 5
##$ABSL= 3
##$ALPHA= 0
##$AQORDER= 0
##$ASSFAC= 0
##$ASSFACI= 0
##$ASSFACX= 0
##$ASSWID= 0
##$AUNMP= <proc_1d>
##$AZFE= 0.1
##$AZFW= 0.1
##$BCFW= 1
##$BC_mod= 2
##$BYTORDP= 1
##$COROFFS= 0
##$CY= 11.3945322036743
##$DATMOD= 1
##$DC= 2
##$DFILT= <>
##$DTYPP= 0
##$F1P= 18.9103706918063
##$F2P= -1.10871071338519
##$FCOR= 0.5
##$FTSIZE= 0
##$FT_mod= 4
##$GAMMA= 1
##$GB= 0.15
##$INTBC= 1
##$INTSCL= 1
##$ISEN= 128
##$LB= 0.24
##$LEV0= 0
##$LPBIN= 0
##$MAXI= 10000
##$MC2= 0
##$MEAN= 0
##$ME_mod= 0
##$MI= 1.114404
##$NCOEF= 0
##$NC_proc= 0
##$NLEV= 6
##$NOISF1= 3.799351
##$NOISF2= 2.8
##$NSP= 1
##$NTH_PI= 0
##$NZP= 0
##$OFFSET= 15.70392
##$PC= 1
##$PHC0= -9130.088
##$PHC1= 7.200144
##$PH_mod= 1
##$PKNL= yes
##$PPARMOD= 0
##$PSCAL= 0
##$PSIGN= 0
##$REVERSE= no
##$SF= 200.130013532006
##$SI= 16384
##$SIGF1= 3
##$SIGF2= 2
##$SINO= 400
##$SIOLD= 16384
##$SREGLST= <1H.CDCl3>
##$SSB= 0
##$STSI= 0
##$STSR= 0
##$SW_p= 3612.71676300578
##$SYMM= 0
##$S_DEV= 0
##$TDeff= 0
##$TDoff= 0
##$TI= <>
##$TILT= no
##$TM1= 0
##$TM2= 0
##$TOPLEV= 0
##$USERP1= <user>
##$USERP2= <user>
##$USERP3= <user>
##$USERP4= <user>
##$USERP5= <user>
##$WDW= 1
##$XDIM= 8192
##$YMAX_p= 0
##$YMIN_p= 0
$$ End of Bruker specific parameters
$$ ---------------------------------
##NTUPLES= NMR FID
##VAR_NAME=  TIME,          FID/REAL,        FID/IMAG
##SYMBOL=    X,             R,               I
##VAR_TYPE=  INDEPENDENT,   DEPENDENT,       DEPENDENT
##VAR_FORM=  AFFN,          ASDF,            ASDF
##VAR_DIM=   8192,          8192,            8192
##UNITS=     SECONDS,       ARBITRARY UNITS, ARBITRARY UNITS
##FACTOR=    0.0002496,     1,               1
##FIRST=     0,             0,               0
##LAST=      2.0444736,     0,               0
##MIN=       0,             -277237,         0
##MAX=       2.0444736,     231338,          0
$$ Real data points
##PAGE= N=1
##DATA TABLE= (X++(R..R)), XYDATA
$$ plain form
0 0 0 0 0 0 0 0 0 0 0 0 0 0 8 -8 8 -8 15 -16 16 -24 24 -32 39 -42 50 -60 70 -80 88 -104 120 -136 152 -173
34 -173 195 -221 245 -277 309 -341 380 -420 466 -515 570 -627 691 -762 842 -925 1019 -1122
52 -1122 1239 -1366 1514 -1678 1866 -2086 2342 -2648 3018 -3482 4075 -4866 5975 -7636 10384
67 10384 -15706 29607 -136846 -277237 125444 15435 18027 138862 -128415 -39155 230027
78 230027 -135491 -204269 111283 17583 46304 153542 -176315 -84081 215774 -89688 -168952
89 -168952 85005 -1450 105870 188010 -219728 -183670 156412 -12289 -31599 113215 -72764
100 -72764 28486 159789 -200803 -157231 164004 23844 14765 83195 -146400 819 183881
111 183881 -149405 -150070 115111 27785 84201 107734 -206606 -87347 156549 -72884 -52536
$$ packed form
0@%%%%%%%%%%%%Qj6J6j6K3l1L2m0M8n6P1q1R2j10J30j50J68j92K24k56K88l25
34a73L68m16M66n22N86o50P21q00Q86r81J085j197J318j453J604j767J944k141
52a122K361k605K880l192L544l952M428m990N666o500P557q941J0841j3611J8020
67A0384k6090M5313j66453j40391M02681j10009K592J20835k67277Q9260K69182
78B30027l65518o8778L15552r3700K8721J07238l29857R2234K99855l05462p9264
89a68952K53957q6455J07320Q2140m07738L6058L40082j68701j9310J44814j85979
100g2764J01250J31303l60592M3572L21235j40160r079O8430k29595J47219J83062
111A83881l33286o65K65181q7326N6416K3533l14340J19259K43896k29433K0348
$$ plain form
122 -52536 122013 -20988 49065 76179 -222054 -79155 184756 -4353 -17685 58713 -95187
133 -95187 41310 118514 -180540 -91897 142339 15180 44873 59089 -153327 -14836 106795
144 106795 -119038 -32788 139442 5883 28602 11652 -188130 -10683 157700 -42072
154 -42072 -19585 63298 -54527 38748 47263 -161224 -23318 130781 -12777 16380 43262
165 43262 -91539 10898 45254 -127532 4229 140799 2884 5755 -16811 -137094 25457
176 25457 105376 -59291 2042 68863 -37566 14951 6027 -116846 20921 98652 -39544
187 -39544 10948 46854 -55023 9373 684 -106284 37400 116312 -10532 -3108 -17310 -91580
199 -91580 24915 56339 -49759 28964 62634 -40859 -4375 -6658 -70016 36386 55078
$$ packed form
122e2536J74549j43001P0053K7114k98233J42899K63911j89109j3332P6398j53900
133i5187J36497P7204k99054Q8643K34236j27159K9693J4216k12416J38491J21631
144A06795k25833Q6250J72230j33559K2719j6950j99782J77447J68383j99772
154d2072K2487Q2883j17825R3275Q515k08487J37906J54099j43558K9157K6882
165D3262j34801J02437L4356j72786J31761J36570j37915K871k2566j20283J62551
176B5457P9919j64667O1333O6821j06429N2517q924j22873J37767P7731j38196
187c9544N0492L5906j01877O4396q689j06968J43684P8912j26844P424j4202p4270
199i1580J16495L1424j06098P8723L3670j03493L6484k283o3358J06402J8692
$$ plain form
210 55078 -42751 20191 42456 -35618 -3503 -18913 -67960 45091 79508 -13893 1141 -11160
222 -11160 -63977 10634 24111 -24134 43594 40943 -39494 -12348 -8706 -34614 29496 25750 -28713
235 -28713 23725 31051 -27517 -9026 -19608 -39442 37395 46903 -6321 9591 -10740 -48125
247 -48125 -3126 10933 -373 40698 22246 -33158 -12752 -6864 -18638 19909 13070 -12682
259 -12682 20741 14290 -19042 -7398 -15545 -20910 20910 27751 6419 10402 -11722 -37481 -10261
272 -10261 7646 11913 31188 10396 -21001 -12891 -10315 -7460 12091 9728 552 8538 4215 -8465
286 -8465 -6750 -10480 -11897 8534 18774 13881 7334 -12932 -25462 -13241 4134 17679 20418
299 20418 7543 -10095 -17369 -11028 -1231 8141 10873 4176 -212 -358 -1507 -5558 -8227 -5323 1091
$$ packed form
210E5078r7829O2942K2265p8074L2115j5410m9047J13051L4417r3401J5034j2301
222a1160n2817P4611J3477m8245O7728k651q0437K7146L642k5908O4110l746n4463
235b8713N2438P326n8568J8491j0582j9834P6837R508n3224J5912k0331l7385
247d8125M4999J4059j1306M1071j8452n5404K0406N888j1774L8547o839k5752
259a2682L3423o451l3332J1644q147n365M1820O841k1332L983k2124k5759K7220
272a0261J7907M267J9275k0792l1397Q110K576K855J9551k363r176P986m323j2680
286h465J715l730j417K0431J0240m893o547k0266j2530J2221J7375J3545K739
299B0418j2875j7638p274O341R797R372K732o697m388j46j149m051k669K904O414
$$ plain form
314 1091 13186 16384 1943 -9056 -15978 -15862 2801 16421 14738 8638 -5962 -18757 -11265 2654
328 2654 6677 9963 6080 -5790 -1626 1912 -6564 -3439 -1830 -3035 9828 12711 1225 -4452
342 -4452 -11093 -15083 -110 14479 12122 8233 -3300 -18637 -9503 3291 5078 10663 4697 -6301
356 -6301 -2416 -232 -3238 -706 -634 -2845 4336 9341 2619 -1874 -7847 -13097 -1468 10110 11413
371 11413 8133 -4062 -13371 -9517 318 7996 8192 3505 -3177 -5948 -1608 799 127 -245 -741 175
387 175 4056 6437 -1048 -7415 -6135 -5794 5074 14891 4043 -3516 -6460 -12462 -1134 11095 4464
402 4464 2082 2052 -9257 -4984 6903 -2065 -596 6030 -7641 29 12599 -4410 -4954 402 -11910
417 -11910 2761 18441 -1108 -3792 1845 -15671 -3383 16148 -2876 2179 11013 -16833 -6345
$$ packed form
314A091J2095L198j4441j0999o922J16J8663J3620j683o100j4600j2795P492J3919
328B654M023L286l883j1870M164L538q476L125J609j205J2863K883j1486n677
342d452o641l990J4973J4589k357l889j1533j5337R134J2794J787N585n966j0998
356f301L885K184l006K532P2k211P181N005o722m493n973n250J1629J1578J303
371A1413l280j2195r309L854R835P678J96m687o682k771M340K407o72l72m96R16
387A75L881K381p485o367J280L41J0868R817j0848p559k944o002J1328J2229o631
402D464k382l0j1309M273J1887q968J469O626j3671P670J2570j7009n44N356j2312
417a1910J4671J5680j9549k684N637j7516J2288J9531j9024N055Q834k7846J0488
$$ plain form
430 -6345 13181 -7385 2511 11557 -16708 -1214 19030 -9305 -3962 8209 -18714 2024 23993
443 23993 -11630 -1622 12717 -22999 -2788 19587 -12207 7021 18318 -26325 -6314 19935
455 19935 -13327 4902 17249 -27195 1201 26684 -20058 -791 16264 -26429 5576 25145
467 25145 -22986 4896 21465 -30613 -2543 22328 -19481 12697 23693 -37849 -2253 26966
479 26966 -22497 9004 20108 -35329 8675 28269 -31407 4858 23197 -32272 7913 24548
491 24548 -32586 13987 28201 -42314 1468 25797 -27901 20527 23889 -47994 7666 29906
503 29906 -33550 13625 23256 -40989 16320 27110 -44579 14940 30040 -42355 13128 22841
515 22841 -41015 26687 27956 -53678 10219 27535 -35437 26334 22183 -53966 19140 29123 -46330
$$ packed form
430f345J9526k0566R896R046k8265J5494K0244k8335N343J2171k6923K0738K1969
443B3993l5623J0008J4339l5716K0211K2375l1794J9228J1297m4643K0011K6249
455A9935l3262J8229J2347m4444K8396K5483m6742J9267J7055m2693L2005J9569
467B5145m8131K7882J6569n2078K8070K4871m1809L2178J0996o1542L5596K9219
479B6966m9463L1501J1104n5437M4004J9594n9676L6265J8339n5469M0185J6635
491B4548n7134M6573J4214p0515M3782K4329n3698M8428L362p1883N5660K2240
503B9906o3456M7175R631o4245N7309J0790p1689N9519J5100p2395N5483R713
515B2841o3856O7702J269q1634O3897J7316o2972O1771m151p6149P3106R983p5453
$$ plain form
528 -46330 21327 26199 -45825 24344 20476 -52513 28041 29570 -49786 18734 20233 -43683 34552
541 34552 23131 -59629 20906 26605 -43612 32024 19425 -55102 29988 20735 -54014 31773
553 31773 25193 -48245 29423 13477 -54682 38668 24887 -56450 27960 17920 -48013 42052
565 42052 15442 -61739 34517 19441 -50573 40048 15824 -54427 38009 11000 -58268 43521
577 43521 21566 -52756 37203 7043 -55943 48462 14955 -58227 39807 11336 -50111 46836
589 46836 7878 -57981 43003 9846 -52938 47664 11359 -53090 42944 1160 -55630 51544
601 51544 12106 -50678 43199 -152 -52102 50072 5720 -52035 46235 3423 -49385 49715
613 49715 1653 -52272 47216 -917 -48702 53485 2756 -48523 45746 -7075 -49459 53777
$$ packed form
528d6330O7657M872p2024P0169l868p2989Q0554J529p9356O8520J499o3916P8235
541C4552j1421q2760Q0535N699p0217P5636j2599p4527Q5090r253p4749Q5787
553C1773o580p3438P7668j5946o8159R3350j3781q1337Q4410j0040o5933R0065
565D2052k6610p7181R6256j5076p0014R0621k4224p0251R2436k7009o9268J01789
577D3521k1955p4322Q9959l0160o2986J04405l3507p3182R8034k8471o1447R6947
589D6836l8958o5859J00984l3157o2784J00602l6305o4449R6034m1784n6790J07174
601E1544l9438o2784R3877m3351n1950J02174m4352n7755R8270m2812n2808R9100
613D9715m8062n3925R9488m8133m7785J02187n0729n1279R4269n2821m2384J03236
$$ plain form
625 53777 2778 -45193 48800 -7710 -49996 52344 -2528 -45058 51860 -7617 -45187 53909
637 53909 -7184 -46075 49374 -9554 -41568 55657 -6607 -43119 49413 -14318 -44664 54402
649 54402 -5976 -36192 51878 -17853 -43862 52118 -9460 -35570 50133 -14817 -36222 52063
661 52063 -14511 -38896 48416 -14115 -33072 51710 -14357 -32400 48068 -21162 -36499 49282
673 49282 -9905 -24682 46413 -23613 -34826 48208 -13913 -27842 46299 -18040 -26238 46550
685 46550 -22274 -28911 46382 -17984 -24751 44496 -18186 -21108 43400 -26678 -29205 46024 -12636
698 -12636 -16899 41268 -28106 -24483 43858 -20692 -19334 42821 -19413 -17244 37488 -26334 -18407
711 -18407 42398 -20532 -18660 38305 -18776 -12111 35870 -30102 -19204 40338 -14653 -9463 32603
$$ packed form
625E3777n0999m7971R3993n6510m2286J02340n4872m2530R6918n9477l7570R9096
637E3909o1093l8891R5449n8928l2014R7225o2264l6512R2532o3731l0346R9066
649E4402o0378l0216Q8070o9731k6009R5980o1578k6110Q5703o4950k1405Q8285
661E2063o6574k4385Q7312o2531j8957Q4782o6067j8043Q0468o9230j5337Q5781
673D9282n9187j4777P1095p0026j1213Q3034o2121j3929P4141o4339q198P2788
685D6550o8824o637P5293o4366o767O9247o2682k922O4508p0078k527P5229n8660
698a2636m263N8167o9374L623O8341o4550J358O2155o2234K169N4732o3822P927
711a8407O0805o2930J872N6965n7081O665M7981o5972J0898N9542n4991N190M2066
$$ plain form
724 32603 -26193 -14576 33021 -22191 -11107 37040 -16865 -11931 26834 -25023 -8740 34267
736 34267 -21188 -11260 30210 -16157 -5381 24194 -27035 -10017 31330 -13860 -4989 25405
748 25405 -21343 -8772 22360 -21853 -2800 31049 -15569 -7185 17412 -21264 -1690 24286
760 24286 -18995 -4798 23613 -13733 -2924 16303 -22440 -3393 22933 -13922 288 19628
772 19628 -17367 -4921 11995 -17520 3316 22971 -12167 -4488 10584 -15954 280 15730
784 15730 -14152 356 16442 -11308 -1084 8876 -15120 -13 12672 -8980 3072 13007
796 13007 -11164 -5028 4630 -10772 4970 15535 -7640 -2155 4657 -11021 539 7928 -6656
809 -6656 2892 8690 -6708 -1371 4023 -8066 -538 6430 -4053 4039 8043 -7262 -4320 -175
$$ packed form
724C2603n8796J1617M7597n5212J1084M8147n3905M934L8765n1857J6283M3007
736C4267n5455R928M1470m6367J0776K9575n1229J7018M1347m5190Q871L0394
748B5405m6748J2571L1132m4213J9053L3849m6618Q384K4597l8676J9574K5976
760B4286m3281J4197K8411l7346J0809J9227l8743J9047K6326l6855J4210J9340
772A9628l6995J2446J6916k9515K0836J9655l5138P679J5072k6538J6234J5450
784A5730k9882J4508J6086k7750J0224R960k3996J5107J2685k1652J2052R935
796A3007k4171O136R658j5402J5742J0565k3175N485O812j5678J1560P389j4584
809f656R548N798j5398N337N394j2089P528O968j0483Q092M004j5305K942M145
$$ plain form
823 -175 -5448 4993 8897 -1895 -1124 -183 -6557 -1339 4241 -493 2377 4145 -3455 -1575 827
838 827 -3758 -841 2079 952 3280 3120 -2126 -5133 -2957 -637 2080 5883 3072 -2079 -2790 -3584
854 -3584 -2743 1898 4049 1338 613 859 -3295 -1951 1029 -2889 655 4785 184 1488 1280 -6053
870 -6053 -3827 1649 352 4033 6430 -3092 -4648 -320 -4725 748 7236 -906 382 2962 -5575
885 -5575 -2153 2778 -3404 473 5788 -1297 320 3543 -6687 -4324 3637 -1798 3813 7914 -4727
900 -4727 -3626 439 -6060 1120 7433 -1011 575 3139 -6324 -2463 4087 -3809 725 6265 -3012
915 -3012 997 3698 -7192 -2627 2980 -2251 4067 6786 -3934 -2996 112 -6005 940 7322 -1050
930 -1050 1284 2394 -6864 -1228 2940 -3188 1999 4142 -2211 1137 1948 -5284 -2155 1923 -1543
$$ packed form
823a75n273J0441L904j0792P71R41o374N218N580m734K870J768p600J880K402
838H27m585K917K920j127K328j60n246l007K176K320K717L803k811n151p11p94
854c584Q41M641K151k711p25K46m154J344K980l918L544M130m601J304k08p333
870f053K226N476j297L681K397r522j556M328m405N473O488q142J288K580q537
885e575L422M931o182L877N315p085J617L223j0230K363P961n435N611M101j2641
900d727J101M065o499P180O313q444J586K564r463L861O550p896M534N540r277
915c012M009K701j0890M565N607n231O318K719j0720R38L108o117O945O382q372
930a050K334J110r258N636M168o128N187K143o353L348Q11p232L129M078l466
$$ plain form
945 -1543 3578 5447 -2994 -1833 -1374 -5191 1732 4763 884 1961 -339 -4486 -1448 958 -445
960 -445 1596 2373 -551 673 102 -3156 -1279 -357 546 3297 2016 434 -1673 -3903 -1777 266
976 266 2481 4206 820 -2329 -1836 -1998 -1108 2434 1200 -566 2930 -307 -3280 1228 -2149 -2392
992 -2392 4444 350 -335 4539 -2765 -5452 1281 -1272 272 7959 -781 -5265 3002 -3522 -3705 6977
1008 6977 -1723 -1990 7807 -3987 -5173 5718 -3796 -3326 7783 -3059 -2383 9965 -5131 -7920
1022 -7920 6449 -4486 -1080 12867 -5787 -5909 8866 -7290 -4972 10552 -4869 -1865 12082
1035 12082 -8635 -7031 11725 -6454 -4676 11875 -8171 -2061 15438 -10468 -8173 11211 -7800
1048 -7800 -1020 15122 -10170 -4867 14160 -11500 -6763 14893 -7981 -1029 15563 -15062 -5711
$$ packed form
945a543N121J869q441J161M59l817O923L031l879J077k300m147L038K406j403
960d45K041P77k924J224n71l258J877R22R03K751j281j582k107k230K126K043
976B66K215J725l386l149M93j62Q90L542j234j766L496l237k973M508l377k43
992b392O836m094o85M874p304k687O733k553J544P687q740m484Q267o524j83J0682
1008F977q700k67R797j1794j186J0891r514M70J1109j0842O76J2348j5096k789
1022g920J4369j0935L406J3947j8654j22J4775j6156K318J5524j5421L004J3947
1035A2082k0717J604J8756j8179J778J6551k0046O110J7499k5906K295J9384j9011
1048g800O780J6142k5292N303J9027k5660M737K1656k2874O952J6592l0625R351
$$ plain form
1061 -5711 17328 -10989 -4427 14251 -12035 154 18149 -16081 -7129 16757 -11776 -1598
1073 -1598 17533 -15368 -1175 18754 -19225 -5390 19269 -12222 1345 16347 -20992 -1509
1085 -1509 21580 -17334 -3892 18039 -16101 2902 19589 -23684 -2042 21863 -18581 -260
1097 -260 18483 -18997 4324 19238 -26102 -1966 23181 -16376 2275 16741 -24871 4057
1109 4057 23035 -24791 -453 20919 -19317 5476 17218 -27080 4440 23002 -24084 739
1121 739 19807 -20345 7617 17606 -31127 4029 25032 -22017 4339 16154 -26027 9809
1133 9809 19762 -30115 5072 22764 -22754 6577 15281 -28819 11707 21618 -31407 5719 20993
1146 20993 -23238 11555 13413 -33476 12480 22921 -27996 7752 16434 -26508 13751 15132
$$ packed form
1061e711K3039k8317O562J8678k6286J2189J7995l4230Q952K3886k8533J0178
1073a598J9131l2901J4193J9929l7979J3835K4659l1491J3567J5002l7339J9483
1085a509K3089l8914J3442K1931l4140J9003J6687m3273K1642K3905m0444J8321
1097b60J8743l7480K3321J4914m5340K4136K5147l9557J8651J4466m1612K8928
1109D057J8978m7826K4338K1372m0236K4793J1742m4298L1520J8562m7086K4823
1121G39J9068m0152K7962R989m8733L5156K1003m7049K6356J1815m2181L5836
1133I809R953m9877L5187J7692m5518K9331Q704m4100M0526R911n3025L7126J5274
1146B0993m4231L4793J858m6889M5956J0441n0917L5748Q682m2942M0259J381
$$ plain form
1158 15132 -33875 13262 22377 -28151 9555 13071 -28237 17861 15679 -34427 12018 19854 -25001
1171 -25001 12635 10266 -31535 17915 18034 -31780 12493 16013 -26376 15378 9194 -31825 19605
1184 19605 17616 -30069 11565 11629 -25308 19056 9797 -33440 17837 16927 -27370 14401 7759
1197 7759 -27903 21562 10127 -31763 18282 13472 -26096 15701 4956 -27929 23941 11286
1209 11286 -31555 16513 9665 -24605 20624 3525 -29764 23626 9986 -27957 17365 5447
1221 5447 -24121 21922 3404 -28792 22962 9248 -26331 17059 1961 -23410 25130 3770
1233 3770 -28117 19997 5824 -22211 18952 345 -23268 23546 4063 -25636 18829 3930
1245 3930 -20830 19826 -1209 -22617 23943 3605 -23148 16714 204 -17980 21744 -827
$$ packed form
1158A5132m9007M7137R115n0528L7706L516m1308M6098k182n0106M6445P836m4855
1171b5001L7636k369m1801M9450J19m9814M4273L520m2389M1754o184m1019N1430
1184A9605j989m7685M1634O4l6937M4364r259m3237N1277r10m4297M1771o642
1197G759l5662M9465j1435m1890N0045m810l9568M1797j0745l2885N1870j2655
1209A1286m2841M8068o848l4270M5229j7099l3289N3390j3640l7943M5322j1918
1221E447k9568M6043j8518l2196N1754j3714l5579M3390j5098k5371M8540k1360
1233C770l1887M8114j4173k8035M1163j8607k3613M6814j9483k9699M4465j4899
1245C930k4760M0656k1035k1408M6560k0338k6753L9862j6510j8184L9724k2571
$$ plain form
1257 -827 -22243 20683 2237 -20277 17799 -1373 -17652 22109 -2103 -20792 20118 377
1269 377 -17145 17468 -4049 -16207 22229 -1387 -19217 17299 -1925 -14883 19487 -4388
1281 -4388 -16046 20462 -3099 -16302 17025 -3364 -12335 18318 -5336 -14775 18506 -2275
1293 -2275 -13835 15264 -4825 -11362 18690 -4632 -13497 15735 -4011 -10761 15047 -4791 -9755
1306 -9755 15754 -4779 -11814 13934 -3067 -8855 13795 -5658 -9519 14930 -4163 -9433 12011
1319 12011 -4770 -6835 13079 -4937 -8026 11884 -4376 -7710 11330 -4004 -5917 11733 -5777
1332 -5777 -7351 11115 -4052 -5076 9877 -5390 -4897 10149 -4437 -5399 8759 -4147 -4326 9176
1346 9176 -4324 -4293 8563 -4909 -4289 7989 -3546 -2444 7084 -4681 -3637 6620 -2861 -2694
$$ packed form
1257h27k1416M2926j8446k2514L8076j9172j6279L9761k4212j8689M0910j9741
1269C77j7522L4613k1517j2158L8436k3616j7830L6516j9224j2958L4370k3875
1281d388j1658L6508k3561j3203L3327k0389q971L0653k3654r439L3281k0781
1293b275j1560K9099k0089o537L0052k3322q865K9232j9746o750K5808j9838m964
1306i755K5509k0533p035K5748j7001n788K2650j9453l861K4449j9093n270K1444
1319A2011j6781k065J9914j8016l089J9910j6260l334J9040j5334j913J7650j7510
1332e777j574J8466j5167j024J4953j5267M93J5046j4586r62J4158j2906j79J3502
1346I176j3500L1J2856j3472O20J2278j1535J102R528j1765J044J0257r481J67
$$ plain form
1360 -2694 6071 -3299 -2919 5991 -3172 -2687 5386 -3081 -2052 4912 -2390 -1581 3871 -2705 -2209 3821
1376 3821 -1040 -1366 3428 -2103 -2324 3150 -1300 -1023 3011 -1518 -1279 2035 -993 -888 1611 -641
1392 -641 -1142 1643 82 -1079 1158 -670 -1382 1276 308 -212 803 -327 -1111 -153 815 -134 139
1409 139 963 -1199 -428 1214 -940 -242 1147 -853 -360 1512 -529 -1108 1357 -977 -1356 2647 -405
1426 -405 -1265 2198 -1848 -1670 2800 -794 -990 2560 -1360 -1846 2649 -939 -1879 3189 -1148 -2105 3646
1443 3646 -1395 -2091 3363 -2062 -1873 3937 -1151 -1649 3181 -2060 -2456 3790 -1045 -1930 4117 -1989
1459 -1989 -2634 4044 -2043 -1883 4278 -2182 -1866 4027 -1981 -1974 3672 -2204 -2138 4428 -1591 -1986 4146
1476 4146 -2833 -2371 4392 -2158 -1181 4317 -2742 -1901 3649 -2291 -1399 4103 -2177 -1751 4088 -2376
$$ packed form
1360b694Q765r370L80Q910r163M85Q073q467J029O964p302Q09N452o576M96O030
1376C821m861l26M794n531k21N474m450K77M034m529K39L314l028J05K499k252
1392f41n01K785j561j161K237j828p12K658r68n20J015j130p84R58R68r49K73
1409A39Q24k162P71J642k154O98J389k000M93J872k041n79K465k334l79M003l052
1426d05q60L463m046J78M470l594j96L550l920m86M495l588r40N068m337r57N751
1443C646n041o96N454n425J89N810n088m98M830n241l96O246m835q85O047o106
1459a989o45O678o087J60O161o460L16N893o008PN646n876O6O566o019l95O132
1476D146o979M62O763o550R77N498p059Q41N550n940Q92N502o280M26N839o464
$$ plain form
1492 -2376 -1712 3992 -2855 -1357 4199 -2359 -781 3480 -3027 -1390 3342 -1908 -581 3618 -2486
1507 -2486 -1556 3186 -2463 -734 3629 -2474 -586 2957 -2559 -405 2538 -2311 -430 2579 -1580
1522 -1580 -253 2306 -2358 -919 2328 -1678 298 2381 -2143 -267 1307 -1818 400 1590 -1097
1537 -1097 65 965 -1200 -85 1085 -1142 0 1079 -762 598 436 -1302 149 -34 -138 961
1553 961 -18 -98 -65 -811 -31 414 -19 454 352 -946 107 609 -1189 603 640 -1504 1468 657 -1992
1572 -1992 1215 -93 -1968 1963 560 -1698 1891 -6 -2867 1888 607 -2397 3020 170 -3478
1587 -3478 3101 -118 -3318 3592 -388 -3108 4068 -397 -3624 3772 -599 -3926 4556 -198 -3865
1602 -3865 5208 -1168 -5033 5267 -979 -3911 6106 -1591 -4672 5872 -1537 -4757 6164 -1343
$$ packed form
1492b376O64N704o847J498N556o558J578M261o507J637M732n250J327M199o104
1507b486R30M742n649J729M363o103J888L543n516K154K943m849J881L009m159
1522a580J327K559m664J439L247m006J976K083m524J876J574l125K218J190k687
1537a097J162R00k165J115J170k227J142J079j841J360j62j738J451j83j04J099
1553I61r79q0L3p46P80M45m33M73j02j298J053N02j798J792L7k144K972q11k649
1572a992L207j308j875L931j403k258L589j897k861M755j281l004N417k850l648
1587c478O579l219l200O910l980k720P176m465l227P396m371l327Q482m754l667
1602c865R073o376l865J0300o246k932J0017p697l081J0544p409l220J0921p507
$$ plain form
1616 -1343 -4745 6895 -1795 -5498 7208 -2176 -5496 7607 -2171 -4708 8048 -3071 -5934 7762
1630 7762 -2283 -5023 8492 -2918 -5890 8870 -3377 -6176 9449 -3342 -5414 9675 -4401
1643 -4401 -5677 10015 -4414 -5953 9943 -4085 -5137 10674 -5492 -6542 11122 -5059 -5507
1656 -5507 11556 -6049 -5314 11662 -6956 -5648 12096 -6048 -5047 11737 -7219 -5199 12828
1669 12828 -7545 -5886 12913 -7214 -4438 12987 -9016 -5101 13394 -8257 -4656 13150 -8220
1682 -8220 -4301 13073 -9579 -4976 14354 -8544 -4623 13434 -9823 -3738 14207 -10538 -4446
1695 -4446 14171 -9293 -3409 13430 -10813 -3674 14485 -10744 -3946 14695 -10403 -2947 13807
1708 13807 -12565 -2617 15316 -11531 -2784 13813 -11853 -1574 14166 -13182 -2230 15250
$$ packed form
1616a343l402J1640q690l703J2706r384l320J3103r778k537J2756j1119k863J3696
1630G762j0045k740J3515j1410k972J4760j2247k799J5625j2791k072J5089j4076
1643d401j276J5692j4429j539J5896j4028j052J5811j6166j050J7664j6181m48
1656e507J7063j7605P35J6976j8618J308J7744j8144J001J6784j8956K020J8027
1669A2828k0373J659J8799k0127K776J7425k2003L915J8495k1651L601J7806k1370
1682h220L919J7374k2652M603J9330k2898L921J8057k3257O085J7945k4745O092
1695d446J8617k3464N884J6839k4243P139J8159k5229O798J8641k5098P456J6754
1708A3807k6372R948J7933k6847Q747J6597k5666J0279J5740k7348J0952J7480
$$ plain form
1720 15250 -12148 -1796 14046 -13514 -628 14653 -14390 -875 15015 -12970 -340 13044
1732 13044 -14627 433 14984 -14161 -583 14129 -13859 695 13507 -15514 1123 14749
1744 14749 -14562 606 13075 -14312 1815 12911 -15535 1379 14418 -14055 933 12224
1756 12224 -15206 2681 13510 -15664 1960 13124 -14481 2387 11378 -15300 3535 12863
1768 12863 -15312 2207 12184 -14461 3454 11055 -16173 4426 12653 -15325 3463 10344 -15054
1781 -15054 5247 10484 -15836 4890 11273 -15027 4226 9498 -15210 6326 10216 -16237 5446
1794 5446 10024 -14703 5795 8004 -15287 7057 9485 -15113 5372 8459 -14218 6391 7849
1807 7849 -15022 7142 8783 -14794 5757 7138 -13511 7415 6899 -14418 6652 7734 -13234
$$ packed form
1720A5250k7398J0352J5842k7560J2886J5281k9043J3515J5890k7985J2630J3384
1732A3044k7671J5060J4551k9145J3578J4712k7988J4554J2812k9021J6637J3626
1744A4749k9311J5168J2469k7387J6127J1096k8446J6914J3039k8473J4988J1291
1756A2224k7430J7887J0829k9174J7624J1164k7605J6868Q991k6678J8835R328
1768A2863k8175J7519R977k6645J7915P601k7228K0599Q227k7978J8788O881k5398
1781a5054K0301N237k6320K0726O383k6300J9253N272k4708K1536L890k6453K1683
1794E446M578k4727K0498K209k3291K2344K428k4598K0485L087k2677K0609J458
1807G849k2871K2164J641k3577K0551J381k0649K0926n16k1317K1070J082k0968
$$ plain form
1820 -13234 5815 6204 -13139 7469 6882 -13854 6551 6524 -12694 6676 5116 -12398 7869
1833 7869 5761 -12866 6125 5305 -11357 7178 4516 -12318 7615 5144 -12011 6742 3841
1846 3841 -10893 7977 3419 -11337 7464 3783 -10657 6620 2924 -9921 7978 3032 -10958
1859 -10958 6979 2968 -9526 7301 1870 -9359 7684 2160 -9381 6430 2089 -8206 6697
1872 6697 1645 -8566 6905 2030 -8609 5981 1508 -7220 6774 1001 -7751 5919 1387
1885 1387 -6803 5428 1128 -6371 5719 1016 -6941 5317 1211 -6047 5221 443 -5637 5472
1899 5472 404 -5727 4471 584 -4599 4658 255 -5080 4440 404 -4818 4320 244 -4098 4351
1914 4351 -413 -4122 4016 -14 -3500 3439 -102 -3147 3507 -97 -3556 3121 139 -2857 3209
$$ packed form
1820a3234J9049L89j9343K0608n87k0736K0405k7j9218J9370j560j7514K0267
1833G869k108j8627J8991q20j6662J8535k662j6834J9933k471j7155J8753k901
1846C841j4734J8870m558j4756J8801l681j4440J7277l696j2845J7899m946j3990
1859a0958J7937m011j2494J6827n431j1229J7043n524j1541J5811m341j0295J4903
1872F697n052j0211J5471m875j0639J4590m473q728J3994n773q752J3670m532
1885A387q190J2231m300p499J2090m703p957J2258m106p258J1268m778o080J1109
1899E472n068o131J0198l887n183R257m403n335R520m036n222R138m076m342Q449
1914D351m764l709Q138m030l486O939l541l045O654l604l459O677k982k996O066
$$ plain form
1929 3209 -246 -2760 2819 -376 -2438 2476 112 -1921 1951 -89 -2126 1876 343 -2037 1673
1944 1673 268 -1680 1609 -4 -1628 1166 213 -1087 909 438 -1097 392 449 -1174 541 870
1960 870 -973 316 447 -886 231 562 -483 -114 697 -295 -474 871 -439 -705 1086 -351 -510
1977 -510 1147 -397 -831 860 -160 -840 1176 161 -1301 1153 -5 -1544 1592 30 -1533 1661
1993 1661 -128 -1497 1632 -123 -1682 1573 196 -1735 1788 178 -2217 1907 68 -2169 2365
2008 2365 22 -2172 2174 -261 -2116 2270 33 -2168 2172 95 -2380 2376 23 -2608 2628
2023 2628 -52 -2453 2791 -286 -2439 2580 -364 -2260 2694 -80 -2415 2490 -218 -2607 2843
2038 2843 -164 -2602 2957 -468 -2478 2939 -621 -2281 2805 -527 -2178 2775 -419 -2395 2678
$$ packed form
1929C209l455k514N579l195k062M914k364k033L872k040k037M002j533k380L710
1944A673j405j948L289j613j624K794r53j300J996m71j535J489N7j623J715L29
1960H70j843J289J31j333J117L31j045L69Q11r92j79J345j310k66J791j437j59
1977e10J657j544m34J691j020o80K016j015j462K454j158j539L136j562j563L194
1993A661j789j369L129j755j559L255j377j931L523j610k395M124j839k237M534
2008B365k343k194M346k435j855M386k237k201M340k077k475M756k353k631N236
2023B628k680k401N244l077k153N019k944j896M954k774k335M905k708k389N450
2038B843l007k438N559l425k010N417l560j660N086l332j651M953l194j976N073
$$ plain form
2053 2678 -504 -2377 3062 -538 -2331 2933 -934 -2114 2944 -818 -1845 2700 -832 -1908 2620
2068 2620 -685 -1961 2687 -758 -1896 2865 -954 -1789 2661 -1170 -1440 2596 -993 -1295 2226 -1038
2084 -1038 -1404 2265 -800 -1318 2292 -1041 -1305 2289 -1158 -988 2091 -1195 -717 1831 -1035 -687
2100 -687 1522 -936 -694 1612 -762 -651 1505 -1061 -546 1464 -979 -125 1153 -1011 -51 799 -733
2117 -733 23 664 -560 -31 644 -564 21 517 -732 288 398 -586 579 -69 -566 592 -323 -183
2135 -183 674 -435 -137 509 -533 -119 754 -637 -185 973 -918 -18 1115 -1386 231 1147 -1537
2152 -1537 586 1070 -1658 609 935 -1750 741 1269 -1906 702 1263 -2340 1086 1411 -2662 1412
2168 1412 1291 -2785 1685 1065 -2872 1814 1116 -2970 1876 1311 -3210 1977 1224 -3636 2499 1395
$$ packed form
2053B678l182j873N439l600j793N264l867j180N058l762j027M545l532j076M528
2068B620l305j276M648l445j138M761l819q35M450l831k70M036l589l02L521l264
2084a038l66L669l065n18L610l333k64L594l447J70L079l286M78K548k866L48
2100f87K209k458K42K306k374J11K156k566N15K010k443Q54J278k164R60Q50j532
2117g33P56O41j224N29O75j208N85M96j249J020J10r84J165o48m97J158r15J40
2135a83Q57j109K98O46j042M14Q73j391M52J158j891R00J133k501J617R16k684
2152a537K123M84k728K267L26k685K491N28l175K608N61l603L426L25m073M074
2168A412j21m076M470o20l937M686o98m086M846n65m521N187p53m860O135j104
$$ plain form
2184 1395 -3849 2652 1025 -3893 2963 930 -3977 2994 1082 -4080 2963 1112 -4344 3323 1152
2199 1152 -4736 3683 1138 -4787 3838 703 -4830 4209 845 -4891 4061 804 -5016 4278 800
2214 800 -5323 4744 785 -5598 4942 461 -5463 5333 68 -5555 5511 169 -5521 5388
2228 5388 -80 -5637 5905 -78 -5985 6196 -323 -5979 6439 -794 -5794 6864 -973 -5908
2242 -5908 6701 -962 -5714 6857 -1177 -6017 7299 -1104 -6209 7372 -1511 -6001 7785 -1803
2256 -1803 -5971 7837 -1807 -5959 7618 -1851 -5816 7994 -1921 -6275 8149 -1963 -6117 8334
2270 8334 -2464 -5969 8654 -2611 -5950 8422 -2674 -5696 8492 -2834 -5777 8805 -2941
2283 -2941 -5995 8855 -3235 -5540 9210 -3807 -5494 9227 -3889 -5186 9031 -4089 -4944
$$ packed form
2184A395n244O501j627m918O856k033m907O971j912n162P043j851n456P667k171
2199A152n888Q419k545n925Q625l135n533R039l364n736Q952l257n820R294l478
2214H00o123J0067l959o383J0540m481n924J0796n265n623J1066n342n690J0909
2228E388n468n557J1542n983n907J2181o519n656J2418p233n000J2658p837m935
2242e908J2609p663m752J2571q034m840J3316q403n105J3581q883m490J3786r588
2256a803m168J3808r644m152J3577r469l965J3810r915m354J4424j0112m154J4451
2270H334j0798l505J4623j1265l339J4372j1096l022J4188j1326k943J4582j1746
2283b941l054J4850j2090k305J4750j3017j687J4721j3116j297J4217j3120q55
$$ plain form
2296 -4944 9211 -4222 -5121 9349 -4368 -4932 9470 -4821 -4578 9680 -5146 -4493 9408 -5107
2310 -5107 -4044 9353 -5264 -4163 9434 -5210 -4227 9467 -5393 -3961 9606 -5771 -3829
2323 -3829 9543 -5776 -3610 9247 -5744 -3368 9232 -5784 -3626 9232 -5697 -3411 9320
2336 9320 -6046 -3240 9310 -6271 -2971 9119 -6226 -2629 8848 -6302 -2548 8818 -6283
2349 -6283 -2547 8786 -6407 -2210 8825 -6794 -1974 8641 -6856 -1515 8374 -6873 -1282
2362 -1282 8080 -6867 -1238 8061 -6773 -1094 7988 -7021 -883 7927 -7170 -601 7644 -7097
2376 -7097 -304 7327 -7003 -336 7114 -6794 -306 7139 -6746 -320 7027 -6893 -144 6931
2390 6931 -6832 121 6602 -6720 193 6329 -6462 172 6195 -6306 165 6189 -6354 194
$$ packed form
2296d944J4155j3433q99J4470j3717n64J4402j4291K43J4258j4826O53J3901j4515
2310e107J063J3397j4617J101J3597j4644R83J3694j4860J432J3567j5377J942
2323c829J3372j5319K166J2857j4991K376J2600j5016K158J2858j4929K286J2731
2336I320j5366K806J2550j5581L300J2090j5345L597J1477j5150L754J1366j5101
2349f283L736J1333j5193M197J1035j5619M820J0615j5497N341R889j5247N591
2362a282R362j4947N629R299j4834N679R082j5009O138Q810j5097O569Q245j4741
2376g097O793P631j4330O667P450j3908O488P445j3885O426P347j3920O749P075
2390F931j3763O953O481j3322O913O136j2791O634O023j2501O471O024j2543O548
$$ plain form
2404 194 6041 -6386 541 5846 -6338 724 5425 -6169 810 5196 -5880 847 5044 -5878
2418 -5878 829 4980 -5863 1041 4757 -5883 1346 4452 -5769 1416 4051 -5449 1480 3895
2432 3895 -5241 1352 3791 -5210 1343 3765 -5110 1559 3519 -5107 1634 3239 -4758 1619 2981
2447 2981 -4443 1493 2943 -4294 1263 2944 -4199 1334 2896 -4130 1430 2630 -4054 1418 2422
2462 2422 -3618 1370 2235 -3442 1117 2249 -3282 1033 2224 -3226 1138 2056 -3210 1215 1780 -2929
2478 -2929 1204 1553 -2558 1073 1413 -2450 857 1483 -2260 882 1389 -2311 939 1226 -2137 990
2494 990 995 -1807 874 826 -1552 630 882 -1404 456 1002 -1337 457 893 -1381 460 803 -1093
2511 -1093 421 604 -873 173 596 -651 -67 779 -572 -232 822 -625 -203 766 -549 -194 654
$$ packed form
2404A94N847j2427O927N305j2184P062M701j1594O979M386j1076O727M197j0922
2418e878O707M151j0843O904L716j0640P229L106j0221P185K635r500O929K415
2432C895r136O593K439r001O553K422q875O669J960q626O741J605p997O377J362
2447B981p424N936J450p237N557J681p143N533J562p026N560J200o684N472J004
2462B422o040M988Q65n677M559J132n531M315J191n450M364R18n266M425N65m709
2478b929M133L49m111L631L40l863L307O26l743L142N07l700L250K87l363L127
2494I90Nk802K681m8k378K182K52k286J860N46k339J794M36k274J841L43j896
2511a093J514J83j477J046M23j247N84Q46j351L40J054j447M22R69j315L55Q48
$$ plain form
2528 654 -289 -317 503 -116 -584 614 76 -740 748 13 -832 762 9 -730 700 136 -769 533 353
2547 353 -925 522 529 -1156 688 584 -1285 776 453 -1276 813 501 -1188 706 590 -1328 580
2564 580 781 -1488 732 877 -1699 885 773 -1756 1006 677 -1660 990 709 -1634 864 799 -1775
2581 -1775 888 981 -1935 1060 923 -2102 1215 792 -2002 1302 698 -1921 1177 737 -1919 1124
2597 1124 883 -2034 1202 935 -2172 1355 786 -2213 1495 680 -2048 1478 568 -1997 1331 653
2613 653 -1987 1330 750 -2125 1393 681 -2197 1583 531 -2115 1638 384 -1946 1533 332 -1862
2629 -1862 1417 461 -1866 1449 480 -2009 1555 362 -1945 1708 192 -1802 1635 52 -1615
2644 -1615 1501 117 -1542 1420 194 -1603 1452 144 -1640 1570 8 -1486 1617 -191 -1320
$$ packed form
2528F54r43k8Q20o19m68J198n38q16J488p35q45J594p53p39J430n64r05J302j80
2547C53j278J447Pj685J844j04j869K061l23j729K089l12j689J894j16j918J908
2564E80K01k269K220J45k576K584j12k529K762l29k337K650k81k343K498o5k574
2581a775K663R3k916K995j37l025L317m23k794L304o04k619L098m40k656L043
2597A124k41k917L236k67l107L527n69k999L708q15k728L526r10k565L328o78
2613F53k640L317n80k875L518p12k878L780j052k646L753j254k330L479j201k194
2629a862L279r56k327L315r69k489L564j193k307L653j516j994L437j583j667
2644a615L116j384j659K962j226j797L055j308j784L210j562j494L103j808j129
$$ plain form
2659 -1320 1448 -235 -1117 1325 -137 -1112 1198 -116 -1155 1284 -168 -1098 1349 -354 -926 1262
2675 1262 -489 -700 1075 -434 -540 909 -327 -589 830 -295 -550 928 -380 -454 878 -566
2691 -566 -227 745 -570 17 518 -485 61 348 -382 57 326 -391 114 376 -524 262 247 -639 550
2710 550 56 -585 693 -209 -472 707 -328 -365 728 -322 -442 797 -381 -522 1012 -561 -544 1251
2728 1251 -807 -409 1280 -1062 -221 1293 -1119 -136 1273 -1133 -179 1375 -1260 -173 1620 -1486
2744 -1486 -115 1712 -1742 139 1715 -1954 311 1679 -1949 342 1631 -2028 347 1806 -2199
2759 -2199 342 2010 -2444 478 2010 -2688 766 2026 -2824 808 1951 -2788 850 1989 -2925
2774 -2925 830 2225 -3104 861 2302 -3348 1127 2293 -3576 1359 2265 -3596 1385 2121 -3595
$$ packed form
2659a320K768j683q82K442j462r75K310j314j039K439j452r30K447j703n72K188
2675A262j751k11J775j509j06J449j236k62J419j125k55J478j308p4J332j444
2691e66L39R72j315N87N01j003N46K87p30M39K69p17N05K62r00P86j5q86J189
2710E50m94o41J278r02k63J179j035l7J093j050j20J239j178j41J534j573J7J795
2728A251k058L98J689k342Q41J514k412R83J409k406R54J554k635J087J793l106
2744a486J371J827l454J881J576l669K265J368l628K291J289l659K375J459m005
2759b199K541J668m454K922J532m698L454J260m850L632J143m739L638J139m914
2774b925L755J395n329L965J441n650M475J166n869M935R06n861M981P36n716
$$ plain form
2789 -3595 1500 2238 -3780 1478 2362 -3927 1681 2306 -4154 2029 2215 -4284 2149 2043 -4208 2272
2805 2272 1897 -4266 2379 2026 -4423 2362 1979 -4528 2736 1880 -4779 2959 1760 -4738 3050 1529
2821 1529 -4649 3202 1544 -4797 3136 1664 -4842 3257 1555 -5051 3606 1532 -5197 3669 1369
2836 1369 -5032 3804 1214 -5077 3836 1351 -5161 3765 1362 -5208 4055 1233 -5446 4281 1162
2851 1162 -5365 4314 853 -5211 4493 768 -5290 4405 823 -5221 4486 653 -5316 4830 490
2866 490 -5412 4919 273 -5100 5032 -78 -5040 5111 -18 -4987 4977 -113 -4907 5215
2880 5215 -294 -5068 5399 -394 -4927 5411 -692 -4682 5514 -810 -4705 5399 -675 -4581
2894 -4581 5354 -807 -4666 5584 -841 -4763 5607 -978 -4506 5639 -1247 -4420 5632 -1175
$$ packed form
2789c595N095P38o018N258Q84o289N608O25o460O183J86o499O433j06o251O480
2805B272l75o163O645l53o449O785l83o507P264q56o659P738j199o498P788j521
2821A529o178P851j658o341P933j472o506Q099j702o606Q657k074o729Q866k300
2836A369o401Q836k590o291Q913k485o512Q926k403o570R263k822o679R727l119
2851A162o527R679l461o064R704l725o058R695l582o044R707l833n969J0146m340
2866D90n902J0331m646n373J0132n110m962J0151n129m969R964n090m794J0122
2880E215n509m774J0467n793m533J0338o103l990J0196o324l895J0104o074l906
2894d581R935o161l859J0250o425l922J0370o585l528J0145o886l173J0052o807
$$ plain form
2908 -1175 -4373 5431 -1137 -4276 5552 -1286 -4426 5682 -1322 -4267 5639 -1621 -3982 5690 -1773
2923 -1773 -3881 5526 -1707 -3676 5413 -1834 -3614 5566 -1925 -3634 5546 -2063 -3289 5509 -2383
2938 -2383 -3088 5452 -2341 -2929 5195 -2326 -2764 5170 -2418 -2818 5235 -2419 -2710 5157 -2614 -2451
2954 -2451 5132 -2730 -2358 4937 -2577 -2212 4741 -2567 -2235 4793 -2521 -2301 4787 -2552 -2118 4711
2970 4711 -2738 -1947 4627 -2663 -1824 4357 -2547 -1728 4281 -2544 -1781 4300 -2486 -1699 4211 -2643
2986 -2643 -1465 4130 -2735 -1278 3918 -2613 -1129 3651 -2572 -1064 3617 -2487 -1077 3540 -2521
3001 -2521 -901 3441 -2655 -711 3288 -2580 -557 3009 -2457 -488 2852 -2355 -540 2829 -2260
3016 -2260 -546 2767 -2303 -417 2689 -2312 -309 2513 -2163 -230 2293 -2011 -283 2235 -1844
$$ packed form
2908a175l198R804o568l139R828o838l140J0108p004k945R906p260k361R672p463
2923a773k108R407p233j969R089p247j780R180p491j709R180p609j226Q798p892
2938b383p05Q540p793n88Q124p521m38P934p588m00Q053p654k91P867p771J63
2954b451P583p862L72P295p514L65O953p308L32P028p314K20P088p339M34O829
2970D711p449P91O574p290Q39O181o904Q19O009o825P63O081o786P87N910o854
2986b643J178N595o865J457N196o531J484M780o223J508M681o104J410M617o061
3001b521J620M342o096J944L999n868K023L566n466J969L340n207J815L369n089
3016b260J714L313n070J886L106n001K003K822m676J933K523m304J728K518m079
$$ plain form
3031 -1844 -386 2234 -1809 -366 2180 -1846 -264 2068 -1775 -166 1831 -1631 -149 1684 -1459
3046 -1459 -228 1634 -1348 -279 1608 -1366 -203 1542 -1367 -85 1346 -1254 -17 1109 -1061
3061 -1061 -39 1024 -893 -146 998 -833 -165 995 -843 -88 879 -811 -18 710 -634 -21 556
3078 556 -440 -136 562 -314 -263 596 -292 -275 615 -298 -224 500 -238 -205 358 -33 -298 287 118 -456 322
3099 322 175 -552 383 160 -530 362 153 -484 217 279 -498 130 468 -614 101 564 -749 182 575 -789
3119 -789 236 545 -758 168 577 -687 53 718 -764 -12 867 -913 56 913 -1005 161 868 -1018
3137 -1018 163 819 -952 103 884 -949 25 1002 -1070 38 1094 -1195 150 1060 -1277 228
3153 228 984 -1237 228 945 -1173 181 1041 -1207 116 1121 -1333 189 1165 -1409 331 1064
$$ packed form
3031a844J458K620m043J443K546m026J582K332l843J609J997l462J482J833l143
3046a459J231J862k982J069J887k974J163J745k909J282J431k600J237J126k170
3061a061J022J063j917P47J144j831O68J160j838P55R67j690P93P28j344O13N77
3078E56r96L04O98q76N1Q59q88J7Q90r13P4P24p38L3N63l91k65N85j69n74P78
3099C22j47p27R35k23o90Q92k09o37P01O2p77O28L38j082P15M63j313R31L93j364
3119g89J025L09j303R26M09j264P40O65j482P52Q79j780R69Q57j918J166P07j886
3137a018J181O56j771J055P81j833R74R77k072J108J056k289J345R10k337J505
3153B28P56k221J465P17k118J354Q60k248J323J005k454J522R76k574J740P33
$$ plain form
3169 1064 -1421 404 981 -1339 363 981 -1306 285 1064 -1355 289 1125 -1465 393 1087 -1516
3185 -1516 497 964 -1460 529 883 -1348 457 897 -1338 410 958 -1398 454 952 -1486 561
3201 561 853 -1473 648 725 -1354 619 674 -1248 526 709 -1263 516 759 -1308 600 693 -1347
3218 -1347 704 550 -1240 761 441 -1113 670 429 -1025 595 469 -1046 603 473 -1087 689
3234 689 366 -1057 757 214 -904 726 113 -771 598 138 -707 535 192 -740 558 154 -725 633
3252 633 31 -645 629 -93 -465 535 -141 -332 407 -82 -306 364 -49 -331 400 -116 -261 453 -254
3271 -254 -120 404 -328 61 251 -331 168 149 -266 179 115 -264 178 157 -377 287 159 -515 456 31 -564
3292 -564 635 -129 -502 696 -218 -443 667 -235 -466 717 -228 -573 851 -302 -634 1020 -470
$$ packed form
3169A064k485J825N77k320J702O18k287J591P79k419J644Q36k590J858O94k603
3185a516K013M67k424J989L54k231J805M40k235J748N48k356J852M98k438K047
3201E61K92k326K121P7k079J973N5j922J774J83j972J779K43k067J908R3k040
3218a347K051j54j790K001l20j554J783k41j454J620j26j515J649j30j560J776
3234F89l23j423J814n43j118J630o13q84J369m60q45J242l43r32J298m04q79J358
3252F33o02o76J274p22l72J000o76j91P39m89k24O70m13k82P31n16j45P14p07
3271b54J34N24p32L89J90n82M99j9m15M45o4l79M42k1n34O64j28o74R71m25n95
3292e64J199p64l73J198r14k25J110r02k31J183r45l45J424j153l32J654j490
$$ plain form
3309 -470 -590 1141 -623 -486 1142 -714 -399 1135 -704 -440 1194 -736 -507 1342 -870 -500 1493
3326 1493 -1047 -400 1539 -1187 -278 1515 -1224 -255 1522 -1240 -314 1605 -1316 -356 1784 -1471
3342 -1471 -314 1893 -1659 -214 1906 -1754 -118 1871 -1774 -128 1919 -1798 -192 2043 -1897
3357 -1897 -187 2205 -2094 -105 2252 -2251 70 2218 -2303 153 2160 -2308 150 2183 -2354
3372 -2354 149 2301 -2497 233 2361 -2671 395 2303 -2775 584 2202 -2788 629 2133 -2774
3387 -2774 647 2169 -2856 694 2245 -3029 787 2236 -3152 977 2171 -3209 1090 2074 -3174
3402 -3174 1091 2063 -3174 1083 2143 -3285 1136 2227 -3433 1252 2201 -3541 1424 2113 -3559 1485
3418 1485 2066 -3505 1462 2067 -3533 1478 2155 -3665 1563 2145 -3771 1739 2019 -3812 1894 1880 -3751
$$ packed form
3309d70j20J731j764J37J628j856L15J534j839K64J634j930K29J849k212L70J993
3326A493k540O47J939k726R09J793k739R69J777k762R26J919k921R60K140l255
3342a471J157K207l552J445K120l660J636J989l645J646K047l717J606K235l940
3357a897J710K392m299J989K357m503K321K148m521K456K007m468K458K033m537
3372b354K503K152m798K730K128n032L066J908n078L359J618m990L417J504m907
3387b774L421J522n025L550J551n274L816J449n388M129J194n380M299R84n248
3402c174M265R72n237M257J060n428M421J091n660M685R49n742M965O89n672N044
3418A485N81n571M967O05n600N011O77n820N228N82n916N510K80n831N706j4n631
$$ plain form
3435 -3751 1910 1771 -3672 1923 1759 -3736 1966 1762 -3790 2102 1641 -3840 2290 1470 -3801 2368
3451 2368 1338 -3664 2362 1251 -3620 2364 1280 -3667 2412 1263 -3713 2571 1137 -3735 2681
3466 2681 990 -3648 2691 921 -3539 2653 929 -3570 2638 995 -3636 2696 938 -3678 2840
3481 2840 826 -3676 2893 711 -3531 2839 639 -3451 2795 664 -3474 2787 659 -3479 2897
3496 2897 537 -3475 2999 380 -3338 2993 229 -3151 2942 160 -3068 2865 179 -3033 2889
3511 2889 107 -3011 2995 -42 -2921 3023 -180 -2722 2947 -288 -2581 2863 -265 -2547 2790
3526 2790 -225 -2552 2822 -303 -2550 2886 -402 -2447 2864 -492 -2298 2758 -511 -2231 2664
3541 2664 -415 -2228 2618 -409 -2261 2693 -464 -2219 2711 -567 -2081 2621 -632 -1921 2502
$$ packed form
3435c751N661j39n443N595j64n495N702k04n552N892m61n481O130q20n271O169
3451B368j030n002O026j111m871N984j084m947O079j149m976O284j434m872O416
3466B681j691m638O339j770m460O192j724m499O208j643m631O332j758m616O518
3481B840k014m502O569k182m242O370k200m090O246k131m138O261k128m138O376
3496B897k360m012O474k619l718O331k764l380O093k782l228N933k686l212N922
3511B889k782l118O006l037k879N944l203k542N669l235k293N444l128k282N337
3526B790l015k327N374l125k247N436l288k045N311l356j806N056l269j720M895
3541B664l079j813M846l027j852M954l157j755M930l278j514M702l253j289M423
$$ plain form
3556 2502 -586 -1867 2391 -523 -1837 2380 -558 -1824 2433 -640 -1708 2360 -747 -1498 2233
3571 2233 -774 -1375 2083 -706 -1330 1979 -667 -1317 1990 -705 -1270 1981 -787 -1115 1884 -848
3587 -848 -971 1726 -777 -917 1597 -656 -921 1558 -630 -962 1597 -666 -918 1568 -719 -783 1454
3604 1454 -690 -707 1311 -573 -710 1211 -466 -755 1230 -449 -764 1247 -497 -670 1172 -535
3620 -535 -549 1031 -472 -485 865 -335 -511 812 -273 -558 832 -298 -528 800 -338 -403 677
3637 677 -323 -294 522 -199 -299 416 -80 -360 404 -30 -373 428 -57 -320 381 -77 -231 270 -10 -200
3657 -200 147 129 -250 105 233 -340 148 230 -373 174 204 -312 114 212 -246 -9 291 -267 -98 438 -360
3678 -360 -89 494 -438 -35 455 -439 -40 426 -353 -123 467 -334 -234 582 -378 -269 705 -474 -219 720
$$ packed form
3556B502l088j281M258k914j314M217k938j266M257l073j068M068l107p51L731
3571B233l007o01L458k789o24L309k646o50L307k695n65L251k768l28K999k732
3587h48j23K697k503j40K514k253k65K479k188l32K559k263k52K486k287o4K237
3604A454k144j7K018j884j37J921j677k89J985j679l15K011j744j73J842j707
3620e35j4J580j503j3J350j200j76J323j085k85J390j130k30J328j138o5J080
3637F77j000K9Q16p21j00P15m96k80P64m34l43Q01m85k63P01m58j54N01k80j90
3657b00L47j8l79L55J28n73M88Q2o03N47L0n16M26R8m58K37L00n58J69N36p98
3678c60K71N83r32M03M90q94L99M66p79K30N90q01J00Q16r60J09R74j179K55R39
$$ plain form
3698 720 -519 -170 659 -468 -183 642 -408 -280 717 -414 -352 845 -500 -331 900 -598 -255 865
3716 865 -620 -205 810 -556 -253 807 -520 -330 897 -582 -348 979 -684 -284 992 -748
3732 -748 -191 910 -737 -168 853 -659 -233 879 -655 -270 974 -730 -259 1021 -820 -167 991
3749 991 -838 -81 897 -784 -79 857 -720 -138 913 -730 -169 971 -811 -116 971 -890 -8
3766 -8 884 -863 24 784 -789 -13 775 -745 -67 821 -778 -63 845 -861 42 783 -879 125
3784 125 677 -810 136 603 -726 79 620 -695 48 658 -760 110 651 -801 197 552 -768 274
3802 274 432 -671 249 389 -581 186 425 -581 171 438 -635 255 384 -651 330 266 -564 346 148
3821 148 -459 265 136 -395 206 175 -409 221 184 -440 291 101 -399 344 -30 -288 318 -90 -167 223 -64
$$ packed form
3698G20j239L49Q29j127K85Q25j050J28R97j131O2J197j345J69J231j498L43J120
3716H65j485M15J015j366L03J060j327J90J227j479K34J327j663M00J276j740
3732g48N57J101j647N69J021j512M26J112j534L85J244j704M71J280j841O53J158
3749I91j829P57R78j681P05R36j577N82J051j643N61J140j782O95J087j861Q82
3766hQ92j747Q87P60j573P76P88j520O78Q88j599P15R08j706R03P41j662J004
3784A25N52j487R46M67j329Q05N41j315P43O10j418Q70N41j452R98L55j320J042
3802B74J58j103R20J40r70P67K39j006P52K67j073Q90J29j035R81o4q30R10j98
3821A48o07P24j29n31O01l1n84O30l7o24P31j90n00P43l74k58O06m08p7L90k87
$$ plain form
3842 -64 -125 180 -42 -147 227 -83 -145 292 -187 -66 304 -300 88 241 -320 173 143 -309 187 131 -293 169
3864 169 177 -397 216 213 -511 335 185 -584 474 65 -579 519 -7 -535 510 -16 -552 530 27 -620
3884 -620 604 23 -699 739 -64 -728 846 -175 -650 866 -243 -610 844 -230 -629 875 -219
3901 -219 -693 976 -253 -740 1109 -381 -712 1167 -487 -646 1178 -514 -631 1168 -496 -692 1218
3918 1218 -511 -775 1351 -593 -809 1481 -717 -754 1511 -806 -706 1492 -829 -705 1505 -786
3934 -786 -768 1596 -846 -814 1728 -950 -785 1789 -1076 -686 1780 -1141 -607 1735 -1115 -601 1744
3951 1744 -1120 -631 1827 -1203 -627 1905 -1324 -532 1890 -1421 -404 1841 -1435 -365 1790 -1412
3967 -1412 -378 1812 -1441 -403 1887 -1539 -374 1938 -1668 -262 1924 -1721 -181 1875 -1713
$$ packed form
3842f4o1L05k22j05L74l10o2M37m79J21L70o04L88J53n61M93l0m52M96n6m24M62
3864A69Qn74O13lp24Q46j50p69J058m09o44J098n26n28J045n26n36J082n03o47
3884f20J224n81p22J438q03o64J574j021m75J516j109l67J454j074l99J504j094
3901b19m74J669j229m87J849j490l31J879j654j59J824j692j17J799j664j96J910
3918A218j729k64K126j944k16K290k198l7K265k317J00K198k321J24K210k291
3934g86J8K364k442L2K542k678J65K574k865L90K466k921N34K342k850N14K345
3951A744k864M89K458l030N76K532l229P92K422l311J017K245l276J070K155l202
3967a412J034K190l253J038K290l426J165K312l606J406K186l645J540K056l588
$$ plain form
3982 -1713 -170 1883 -1703 -202 1945 -1762 -225 2037 -1868 -148 2070 -1957 -51 2026 -1982
3997 -1982 11 1972 -1951 -3 1966 -1951 -9 2034 -2015 10 2064 -2122 136 2006 -2177
4012 -2177 251 1902 -2136 301 1816 -2089 296 1817 -2103 302 1822 -2169 365 1790 -2225
4027 -2225 490 1700 -2229 579 1579 -2149 582 1533 -2117 564 1567 -2128 581 1599 -2217
4042 -2217 661 1574 -2255 771 1489 -2228 803 1414 -2165 773 1421 -2167 757 1463 -2221 767
4058 767 1476 -2286 876 1410 -2304 936 1302 -2232 953 1234 -2155 901 1233 -2138 893 1238 -2189
4075 -2189 969 1181 -2181 1055 1059 -2113 1098 942 -2001 1072 888 -1906 1025 889 -1902 1031 877
4092 877 -1906 1109 796 -1890 1167 670 -1800 1158 621 -1686 1095 622 -1662 1049 643 -1692
$$ packed form
3982a713J543K053l586J501K147l707J537K262l905J720K218m027J906K077m008
3997a982J993J961l923J948J969l917J942K043m049K025K054m186K258J870m183
4012b177K428J651m038K437J515l905K385J521l920K405J520l991K534J425m015
4027b225K715J210l929K808J000l728K731R51l650K681J003l695K709J018l816
4042b217K878R13l829L026P18l717L031O11l579K938O48l588K924P06l684K988
4058G67P09l762L162N34l714L240L66l534L185K81l389L056L32l371L031L45l427
4075b189L158K12l362L236Ml172L211j56k943L073j84k794K931j36k791K933j54
4092H77k783L015l13k686L057m97k470K958n37k307K781m73k284K711m06k335
$$ plain form
4108 -1692 1071 628 -1730 1135 543 -1690 1158 473 -1601 1103 450 -1532 1050 481 -1516 1025
4124 1025 502 -1548 1055 469 -1541 1114 368 -1458 1091 300 -1354 1021 300 -1275 955 334
4140 334 -1258 946 320 -1248 983 252 -1194 992 148 -1066 935 105 -948 841 128 -909
4156 -909 778 165 -917 772 141 -926 794 76 -847 773 16 -739 685 23 -691 607 86
4173 86 -687 577 121 -708 604 106 -704 622 60 -611 580 30 -545 488 71 -514 433 145 -536
4192 -536 415 154 -549 421 99 -500 417 64 -404 342 74 -347 232 131 -318 192 186 -361 180 178 -352
4213 -352 190 112 -282 132 87 -187 47 129 -157 -37 211 -184 -52 249 -221 -22 228 -198 -16 200 -131
4234 -131 -69 209 -80 -156 290 -87 -189 359 -150 -190 361 -175 -152 335 -142 -173 315 -97 -246 352 -66 -310
$$ packed form
4108a692K763m43k358K865n92k233K848o85k074K704o53j982K582n69j997K541
4124A025n23k050K603n86k010K655p46j826K549p91j654K375p21j575K230o21
4140C34j592K204o26j568K231p31j446K186q44j214K001q30j053J789p13j037
4156i09J687o13j082J689o31j067J720p18r23J620p57p55J424o62p14J298n21
4173H6p73J264m56q29J312m98q10J326n62o71J191n50n75J033m17n85R47k88o81
4192e36R51k61p03R70l22n99R17l53m68P46k68m21N79j01m49N10on47N41kn30
4213c52N42p8l94M14m5k74K34Q2k86J20K48l95J32L01m70J99K50m26J82K16l31
4234a31O2K78k89p6M46l77j02N48n09m0N51n36K3M87m77l1M88m12j49N98m18k44
$$ plain form
4256 -310 423 -119 -328 465 -170 -296 466 -186 -270 424 -143 -314 422 -95 -389 484 -90 -438 552 -155
4276 -155 -409 584 -197 -373 553 -190 -367 542 -128 -407 550 -103 -465 620 -136 -468 672 -204 -423
4295 -423 668 -244 -374 615 -215 -381 602 -174 -440 625 -193 -475 697 -255 -455 709 -315 -387 680
4314 680 -317 -352 631 -273 -368 624 -252 -404 674 -279 -422 723 -355 -372 718 -388 -298 661 -369
4333 -369 -271 617 -306 -310 638 -304 -335 686 -357 -304 695 -421 -239 657 -421 -191 589 -370 -199 557
4353 557 -341 -235 569 -350 -234 619 -407 -188 595 -461 -105 527 -433 -67 453 -386 -93 453 -355
4372 -355 -119 486 -383 -91 482 -440 -16 441 -429 53 363 -387 74 308 -331 44 312 -314 22 344
4392 344 -345 67 318 -383 123 237 -356 160 170 -282 143 133 -244 109 137 -243 98 163 -288 151 114 -288
$$ packed form
4256c10P33n42k09P93o35j26P62o52q4O94n67j71P36n17k94Q73n74l48R90p07
4276a55k54R93p81j76R26p43j77R09o70k79R57o53l62J085p56l32J140q76k19
4295d23J091r12j30R89q30j66R83p76k66J065q18k82J172r52k00J164j024p2J067
4314F80r97l5R83r04r5R92q76j52J078r53j43J145j078j7J090j106R0R59j030
4333c69R8Q88r23mR48r42l1J021j043N3R99j116J82Q96j078K30P80r59J71P56
4353E57q98J06Q04r19J16Q53j026K19P83j056L56O32r60L66N20q39K93N46q08
4372c55K36O05q69K92N73r22M24M57q70M82L10p50M61K34o39L75K68o26L36L22
4392C44o89M12K51p01N06J14n93N16J0m52M25j0l77L53K8l80L41O5m51M39l7m02
$$ plain form
4414 -288 212 33 -238 236 -31 -161 198 -44 -110 161 -21 -138 196 -34 -148 256 -98 -123 296 -196 -49
4435 -49 283 -255 24 244 -252 59 224 -233 31 265 -282 24 312 -375 84 326 -444 180 282 -476
4455 -476 225 218 -450 225 210 -440 203 254 -477 231 276 -559 308 241 -596 396 187 -572 421 130 -543 419
4477 419 152 -546 417 186 -614 460 192 -683 550 138 -695 620 71 -668 637 47 -658 624
4495 624 74 -695 655 91 -793 732 72 -827 813 -17 -839 868 -80 -794 857 -77 -792 861
4513 861 -53 -849 908 -45 -888 988 -112 -902 1049 -183 -845 1068 -227 -797 1046 -225 -787
4530 -787 1044 -204 -815 1076 -234 -844 1138 -319 -819 1177 -387 -745 1158 -416 -706 1121
4546 1121 -393 -720 1128 -385 -777 1189 -448 -780 1260 -522 -739 1273 -575 -692 1255 -586
$$ packed form
4414b88N00j79k71M74k67j30L59k42o6K71j82j17L34k30j14M04l54k5M19m92J47
4435d9L32n38K79K20m96L11J65m57K64K34n47L06K88o87M59K42p70O24J02p58
4455d76P01po68O75j5o50O43N1p31P08M5q35Q67o7q37R92k09p59R93k91o73R62
4477D19k67o98R63k31q00J074k68q75J233m12q33J315n49p39J305n90p05J282
4495F24n50p69J350n64q84J525o60q99J640q30q22J707r48p14J651r34p15J653
4513H61r14p96J757r53q43J876j100p90J951j232o62J913j295n70J843j271n62
4530g87J831j248o11J891j310o10J982j457n00J996j564l58J903j574k90J827
4546A121j514l27J848j513l92J966j637l32K040j782k17K012j848j17J947j841
$$ plain form
4562 -586 -685 1249 -576 -717 1303 -580 -745 1379 -650 -723 1441 -725 -668 1415 -760 -596 1379
4579 1379 -749 -601 1378 -724 -629 1411 -765 -628 1442 -843 -575 1427 -892 -482 1362 -891
4595 -891 -430 1311 -867 -455 1286 -850 -457 1321 -898 -430 1339 -959 -350 1298 -983 -275 1236
4612 1236 -949 -258 1213 -914 -292 1228 -931 -292 1278 -998 -255 1294 -1053 -183 1257 -1059
4628 -1059 -140 1216 -1035 -161 1202 -1008 -178 1232 -1035 -175 1264 -1113 -117 1228 -1137 -51
4644 -51 1146 -1109 -30 1089 -1051 -47 1094 -1043 -66 1092 -1075 -25 1076 -1097 48 1012
4660 1012 -1082 96 934 -994 102 881 -945 74 883 -932 74 898 -961 123 868 -980
4676 -980 185 789 -942 206 731 -880 179 727 -851 131 759 -887 158 770 -919 205 723
$$ packed form
4562e86r9J934j825j41K020j883j65K124k029p3K164k166N7K083k175J64J975
4579A379k128J48J979k102R5K040k176J37K070k285K68K002k319M10J844k253
4595h91M61J741k178M12J741k136L93J778k219M68J769k298O09J648k281P08J511
4612A236k185O91J471k127O22J520k159O39J570k276P43J549k347Q70J440k316
4628a059R19J356k251Q74J363k210Q30J410k267Q60J439k377R96J345k365J086
4644e1J197k255J079J119k140J004J141k137R77J158k167J050J101k173J145R64
4660A012k094J178Q38j928J096P79j826J019Q09j815J006Q24j859J084P45j848
4676i80J165O04j731J148N25j611J059N48j578R82O28j646J045O12j689J124N18
$$ plain form
4693 723 -926 237 647 -892 238 602 -841 203 616 -814 163 649 -845 195 630 -854 248
4710 248 569 -818 281 499 -730 249 464 -666 209 486 -645 182 502 -664 223 444 -643 261
4728 261 376 -581 240 320 -509 176 319 -466 133 347 -473 140 342 -494 173 300 -480 195 239 -414 162
4749 162 209 -353 89 242 -361 53 274 -388 88 273 -395 122 227 -349 121 180 -267 73 200 -233 27
4770 27 247 -241 1 262 -248 39 234 -252 58 159 -174 26 142 -108 -55 173 -101 -105 204 -121 -101 204
4792 204 -130 -83 170 -98 -78 124 -30 -125 145 4 -192 195 -6 -220 224 -31 -183 213 -35 -167 170
4813 170 7 -184 165 62 -237 188 65 -282 248 36 -264 264 -4 -248 234 6 -224 210 51 -270
4833 -270 202 86 -335 246 71 -367 291 31 -337 307 -3 -316 263 38 -316 232 86 -365 268 108
$$ packed form
4693G23j649J163M10j539J130L64j443J044M13j430R77M86j494J040M35j484J102
4710B48L21j387J099K18j229R79K15j130Q75K77j131Q27L20j166Q87K21j087R04
4728B61J15r57Q21Q0q29O85J43p85N99K14q20O13K02q36O67J27p80O75M4o53N76
4749A62M7n62M42J53o03M14K21o62M76J85o68N17J05n76M70N9m47L40J27m33K60
4770B7K20m88K42K61n10K87J95m86L10J01l33K00J16k50N3K28k74mL09l25K0L05
4792B04l34M7K53k68K0K02j54r5K70j41j96L87k01k14M44k55j52L96k48j32L37
4813A70j63j91L49j03k99M25j23l47N30k12l00N28k68k44M82k28k30M34j59l21
4833b70M72j16m21N81j75m38O58k60l68O44l10l13N79k25l54N48j46m51O33j60
$$ plain form
4853 108 -406 330 68 -407 364 29 -364 331 21 -341 300 55 -359 304 101 -418 352 73 -432 392
4873 392 33 -408 408 -3 -354 374 11 -346 335 31 -381 352 48 -435 381 7 -426 416 -56 -374
4893 -374 414 -66 -331 372 -53 -328 354 -12 -366 391 -24 -389 426 -71 -358 448 -100 -293 401 -109
4913 -109 -269 372 -66 -291 368 -57 -318 398 -81 -312 436 -123 -267 418 -165 -201 357 -134 -200 321 -118
4934 -118 -227 335 -111 -251 368 -153 -229 370 -203 -177 334 -212 -117 269 -177 -121 266 -152 -135 281 -154 -142
4956 -142 313 -198 -82 298 -227 -34 232 -206 -10 189 -163 -14 189 -142 -30 214 -187 -15 221 -225
4976 -225 30 185 -229 77 126 -195 73 88 -154 49 93 -150 36 110 -190 78 95 -224 129 43 -195 160
4998 160 -14 -158 159 -29 -120 128 -13 -125 137 -6 -146 187 -41 -151 257 -105 -113 260 -175 -67 231
$$ packed form
4853A08n14P36k62m75P71l35l93O95l10l62O41k45m14O63k03n19P70k79n05Q24
4873C92l59m41Q16m11l51P28l63l57O81l04m12P33l04m83Q16l74m33Q42m72l18
4893c74P88m80k65P03m25k75O82l66l54P57m15l65Q15m97k87Q06n48j93O94n10
4913a09j60O41m38k25O59m25k61P16m79k31P48n59j44O85n83l6N58m91o6N21m39
4934a18j09N62m46j40O19n21p6N99n73K6N11n46R5L86m46N6L87m18J7M16m35J2
4956a42M55n11J16L80n25J93K66m38J96J99l52J49K03l31J12K44m01J72K36m46
4976b25K55J55m14L06M9l21K68J5k42K03M4k43J86P4l00K68J7l19L53q6k38L55
4998A60j74j44L17j88r1K48j41j12K62j43j40L33k28j10M08l62qL73m35J08K98
$$ plain form
5019 231 -176 -38 219 -168 -64 238 -178 -82 286 -242 -73 321 -295 -11 305 -319 22 262 -308 23
5039 23 266 -290 8 280 -305 -1 315 -372 30 335 -412 80 303 -403 124 280 -381 107 284 -375
5059 -375 92 311 -422 117 345 -472 160 327 -517 231 291 -522 242 269 -512 225 282 -535 237 322 -583
5080 -583 268 337 -655 325 303 -661 373 244 -648 375 246 -627 367 262 -649 369 282 -696 413 275
5100 275 -710 467 228 -699 487 190 -661 472 187 -636 452 212 -666 466 230 -692 512 182
5118 182 -704 555 138 -678 548 105 -654 524 127 -656 530 137 -698 566 136 -736 630 80
5136 80 -730 658 46 -696 647 29 -683 654 45 -702 661 59 -742 724 34 -756 779 -26
5154 -26 -723 773 -60 -686 751 -57 -667 735 -27 -674 743 -30 -699 775 -86 -679 791 -127
$$ packed form
5019B31m07J38K57l87J04L02m16R6L68n28J69L94o16K84L16o24L41K40n70L31
5039B3K43n56K98K72n85L04L16o87M02L05p47M92K23p06N27J56o61M88J77o59
5059c75M67K19p33N39K28q17O32J67q44P48O0q13P64K7p81P37N7q17P72Q5r05
5080e83Q51O9r92R80k2r64J034j29q92J023j29q73R94j05r11J018q7r78J109j38
5100B75r85J177k39r27J186k97q51J133k85q23J088k40q78J132k36r22J204l30
5118A82q86J259m17q16J226m43p59J178l97p83J186l93q35J264m30q72J366n50
5136H0q10J388o12p42J343o18p12J337o09p47J363o02q01J466o90p90J535q05
5154b6o97J496q33o26J437q08o10J402p62o47J417p73o69J474q61n93J470r18
$$ plain form
5172 -127 -627 759 -155 -586 703 -120 -583 692 -109 -615 726 -127 -617 745 -175 -583 748 -199
5190 -199 -536 720 -202 -518 696 -166 -536 717 -170 -558 755 -207 -536 806 -260 -496 785 -284
5208 -284 -456 751 -268 -467 731 -246 -488 762 -260 -497 785 -317 -461 781 -335 -416 743
5225 743 -343 -382 700 -311 -388 684 -282 -407 683 -296 -383 688 -329 -359 670 -326 -302 614 -311
5244 -311 -277 565 -263 -295 578 -256 -299 599 -277 -277 609 -320 -241 572 -319 -216 526 -291 -223 512 -263 -251 519
5267 519 -275 -247 559 -311 -223 549 -349 -186 501 -336 -174 463 -274 -193 459 -268 -200 482 -282 -195 475 -307
5289 -307 -156 451 -288 -123 396 -255 -116 359 -202 -147 363 -185 -147 391 -197 -129 370 -211 -102 317 -180
5310 -180 -78 267 -145 -122 247 -112 -150 274 -136 -152 293 -157 -126 264 -157 -88 228 -129 -97 209 -95 -118
$$ packed form
5172a27n00J386r14m31J289q23m63J275q01n06J341q53m90J362r20m08J331r47
5190a99l37J256r22l16J214q62l70J253q87l88J313r62l29J342j066k36J281j069
5208b84j72J207j019j99J198r77k42J250j022k37J282j102j44J242j116q1J159
5225G43j086l9J082j011p7J072r66j25J090r79q7J071j017l0J029r96K4R16r25
5244c11L4Q42q28l2Q73q34m3Q98q76%Q86r29P9Q13q91J03P42q17O8P35p75J2P70
5267E19p94K8Q06q70Q8P72q98J63O87q37J62O37p37Q1O52p27O8O82p64Q7O70p82
5289c07J51O07p39J65N19o51J39M75n61N5N10n48L8N38n88O8M99n81J09M19m97
5310a80J02L45m12K3L69l59l8M24m10j6M45m50L1L90m21O9L16l57L2L06l04k3
$$ plain form
5332 -118 205 -82 -144 234 -89 -144 250 -114 -103 216 -89 -85 184 -52 -105 173 -15 -130 183 -17 -142 210
5354 210 -39 -133 192 -26 -108 153 -2 -121 119 39 -147 120 66 -179 138 34 -194 145 25 -176 127
5375 127 39 -149 105 77 -157 83 109 -208 100 105 -221 130 85 -208 138 67 -177 124 91 -170 104 127 -196
5398 -196 98 150 -239 117 136 -238 154 114 -225 132 104 -212 110 133 -214 98 151 -257 121 149 -282 143
5420 143 122 -279 155 104 -258 130 119 -251 116 150 -269 119 182 -307 141 165 -308 177 125 -283 186 110 -257
5443 -257 151 136 -260 137 161 -289 150 161 -304 195 137 -310 208 102 -269 191 97 -252 171 96 -276 160
5465 160 112 -296 189 108 -307 225 68 -289 213 41 -255 200 43 -244 173 77 -261 193 80 -273 229
5486 229 51 -275 258 22 -235 239 12 -201 222 29 -195 210 38 -232 223 28 -233 247 -8 -220
$$ packed form
5332a18L23k87o2L78l23n5L94l64J1L19l05MK69k36n3K78j88j15L13k00j25L52
5354B10k49r4L25k18q2K61j55j19K40q0j86K67n4k45L17j04k28L39j20k01L03
5375A27q8j88K54k8k34K40K6l17L08Nl26L51m5k93L46p1k44L01l3k61K74K3l23
5398a96K94N2l89L56J9l74L92m0l39L57k8l16L22K3l47L12N3m08L78K8m31M25
5420A43k1m01M34n1l62L88j1l70L67L4m19L88O3m89M48K4m73M85n2m08M69p6l67
5443b57M08j5l96L97K4m50M39J1m65M99n8m47N18j06l71M60r4l49M23p5l72M36
5465A60m8m08M85q1m15N32j57l57N02j72k96M55j57k87M17r6l38M54j13l53N02
5486B29j78l26N33k36k57M74k27k13M23j93k24M05j72k70M55j95k61M80k55k12
$$ plain form
5506 -220 257 -49 -183 237 -48 -158 202 -42 -160 201 -20 -190 214 -55 -178 234 -88 -150 218 -118
5526 -118 -108 196 -96 -81 177 -83 -111 192 -91 -96 220 -118 -76 220 -146 -32 202 -144 4 175 -137 2
5548 2 153 -125 -26 168 -135 -17 170 -177 12 159 -203 44 123 -189 59 105 -168 49 101 -167 42 111
5570 111 -187 56 125 -214 102 93 -231 135 44 -213 137 46 -188 137 49 -194 148 46 -216 179 43 -240
5592 -240 230 11 -226 263 -33 -187 255 -44 -170 247 -47 -204 257 -51 -233 286 -61 -246 325 -114
5612 -114 -219 320 -138 -193 311 -136 -173 288 -123 -206 314 -118 -221 358 -161 -224 389 -189 -181 393 -208 -150
5634 -150 361 -192 -149 351 -187 -171 395 -208 -181 423 -257 -154 442 -296 -122 442 -315 -93 425 -309 -111
5655 -111 420 -328 -122 447 -356 -117 467 -410 -73 470 -433 -39 449 -429 -25 435 -413 -48 456 -416
$$ packed form
5506b20M77l06j34M20k85j10L60k44j18L61k21j70M04k69j23M12l22o2L68l36
5526a18J0L04k92J5K58k60k8L03k83nL16l38M2K96l66J14K34l46J48J71l12J39
5548BJ51k78R9J94l03J18J87l47J89J47l62K47P9l12K48M6k73K17N2k68K09O9
5570A11k98K43O9l39L16rl24L66r1k57L50r1k34L25q8k43L42j02k62L95j36k83
5592b40M70k19k37M89k96j54M42k99j26M17k94j57M61l08j82N19l47j85N71m39
5612a14j05N39m58n5N04m47l7M61m11q3N20m32j03N79n19o3O13n78QN74o01N8
5634a50N11n53M3N00n38J6N66o03K7O04o80J03N96p38J74N64p57K22N18p34J98
5655a11N31p48K06N69q03K39N84q77L37N43r03L94M88q78M04M60q48L65N04q72
$$ plain form
5675 -416 -55 492 -445 -30 499 -473 7 486 -476 31 444 -463 26 434 -441 9 470 -462 12 489
5695 489 -497 52 476 -528 66 443 -519 89 415 -503 75 427 -514 68 440 -542 97 468 -590
5714 -590 119 430 -599 168 394 -595 177 383 -577 167 404 -594 171 421 -629 207 421 -640 252
5733 252 389 -625 274 356 -599 262 346 -582 239 363 -591 238 375 -623 257 354 -613 280 309 -589 275
5754 275 293 -564 250 302 -553 241 312 -583 261 310 -594 288 276 -599 314 245 -570 303 239 -550 296 255 -546
5777 -546 314 261 -571 333 241 -593 383 210 -572 384 179 -532 376 177 -526 357 186 -538 359 181 -546
5798 -546 386 164 -543 392 128 -508 372 97 -469 339 118 -480 327 141 -488 339 144 -490 347 102
5818 102 -468 345 84 -424 332 87 -405 294 109 -404 304 121 -424 323 105 -413 346 75 -390 346
$$ packed form
5675d16L61N47r37M15N29r72M80M79r62N07M13r07M89M08q75M50M61r32M74M77
5695D89r86N49M24j004N94L77r62O08L26r18N78L52r41N82L72r82O39L71j058
5714e90P09L11j029P67K26r89P72K06r60P44K37r98P65K50j050Q36K14j061Q92
5733B52J37j014Q99Q2r55Q61Q4r28Q21J24r54Q29J37r98Q80R7r67Q93K9q98Q64
5754B75J8q57Q14N2q55P94P1q95Q44M9r04Q82j2q75R13o9q15Q73o4p89Q46m1q01
5777e46Q60n3q32R04r2q34R76j73p82R56k05p11R08j99p03Q83j71p24Q97j78p27
5798e46R32k22p07R35k64o36Q80k75n66Q08k21n98Q07j86o29Q27j95o34Q37k45
5818A02n70Q13k61n08P56k45m92O99j85n13P08j83n45P47k18n18P59k71m65P36
$$ plain form
5838 346 43 -363 315 64 -352 297 73 -375 310 64 -372 327 36 -360 323 -2 -329 306 0 -291
5858 -291 289 26 -298 259 39 -312 282 32 -312 288 -3 -283 275 6 -243 249 23 -228 214 50
5878 50 -244 206 62 -257 214 44 -247 238 24 -214 206 36 -187 168 42 -191 139 65 -219 144 56
5899 56 -222 167 33 -207 160 19 -177 136 21 -158 112 55 -188 108 66 -201 128 49 -183 140 40
5920 40 -157 130 24 -141 99 54 -137 77 88 -151 79 94 -164 98 68 -159 94 77 -136 76 84 -111 42
5943 42 108 -140 27 123 -168 40 120 -171 57 90 -163 56 80 -139 13 103 -138 -2 135 -150 18 155
5965 155 -176 32 145 -153 48 113 -137 33 131 -121 13 143 -130 -2 168 -153 17 151 -172 53 142
5986 142 -165 46 126 -142 18 138 -136 -4 161 -163 -13 181 -184 26 150 -194 31 124 -176 25 122
$$ packed form
5838C46l03m06O78k51m16O49k24m48O85k46m36O99k91l96O83l25l27O35l06k91
5858b91N80k63l24N57k20l51N94k50l44O00k91k80N58k69k49M92k26k51M42j64
5878E0k94M50j44l19M71j70k91M85k14k38M20j70k23L55j26k33L30p4k84L63q8
5899E6k78L89j34k40L67j41j96L13j15j79K70n7k43K96m2k67L29p9k32L23j00
5920D0j97K87j06j65K40m5j91K14J1k39K30J5k58K62l0k27K53j7k13K12Qj95J53
5943D2O6k48J67R6k91K08Q0k91K28L3k53K19K4k19J52R0k41J36J37k85J68J37
5965A55l31K08J13k98K01O5k50J70R8k52J34J30k73J28J70l21J70J34l23K25Q9
5986A42l07K11Q0k68J60J20k74J32J65l24J50J94l65K10J24l44K25R3l00K01R7
$$ plain form
6007 122 -156 2 148 -161 -9 168 -188 17 181 -200 49 169 -192 60 142 -166 50 145 -159 13 152
6028 152 -164 26 164 -189 63 143 -207 74 115 -196 69 100 -177 50 107 -182 45 135 -191 51 137 -218
6050 -218 80 101 -203 101 77 -183 84 63 -167 66 79 -169 79 94 -189 99 97 -204 124 67 -180 132 42
6073 42 -151 119 60 -135 106 64 -160 118 58 -181 122 37 -170 151 4 -142 144 -8 -138 113 -15 -120
6095 -120 115 -1 -134 126 -5 -148 158 -32 -136 159 -58 -96 134 -73 -79 125 -61 -82 137 -47 -95 155
6117 155 -75 -90 169 -103 -64 164 -120 -29 154 -114 -17 145 -97 -38 158 -106 -38 161 -126 -25 176 -176
6139 -176 -6 154 -182 33 136 -170 22 132 -153 12 133 -165 22 168 -210 30 153 -227 83 136
6159 136 -217 97 121 -205 95 113 -201 101 122 -218 118 124 -255 142 117 -256 180 88 -251 191 69 -246
$$ packed form
6007A22k78J58J46l09J52J77l56K05J64l81K49J20l61K52Q2l08K16R5l04J72J39
6028A52l16J90J38l53K52Q0l50K81M1l11K65L1k77K27N7k89K27R0l26K42Q6l55
6050b18K98K1l04L04k4k60K67k1k30K33J3k48K48J5k83K88kl01L28n7k47L12r0
6073D2j93K70n9j95K41m2k24K78o0k39L03q5k07L21j47j46K86j52j30K51j28j05
6095a20K35j16j33K60j31j43L06j90j04K95k17l8K30k07oK04j86k1K19j84m8K50
6117A55k30j5K59k72L9K28k84R1J83k68R7J62k42N9J96k64O8J99k87J01K01l52
6139a76J70J60l36K15J03l06J92J10k85J65J21k98J87J46l78K40J23l80L10N3
6159A36l53L14K4l26L00J8l14L02K1l40L36Ol79L97k5l73M36r2l39M42j22l15
$$ plain form
6181 -246 164 69 -250 168 96 -276 190 91 -304 226 66 -295 232 29 -281 230 25 -274 211 44 -285
6202 -285 223 54 -297 261 37 -317 284 10 -301 297 -3 -279 293 -5 -273 295 7 -297 310 1
6222 1 -313 342 -15 -313 367 -65 -292 373 -80 -278 363 -88 -287 363 -85 -294 399 -106 -309 419 -142
6243 -142 -295 425 -173 -275 416 -162 -256 395 -144 -272 416 -148 -277 435 -161 -279 464 -181 -257 457 -193
6264 -193 -238 443 -184 -229 431 -173 -243 447 -173 -255 461 -217 -242 476 -245 -215 466 -259 -205 451 -252 -199 446
6287 446 -253 -211 460 -278 -222 487 -298 -175 483 -320 -152 467 -335 -136 442 -323 -148 454 -328 -146 482
6308 482 -337 -123 477 -358 -108 464 -363 -74 442 -356 -81 438 -332 -98 451 -332 -108 452 -362 -91
6328 -91 452 -378 -62 427 -375 -61 401 -348 -81 392 -346 -82 423 -356 -56 421 -378 -42 412 -384
$$ packed form
6181b46M10r5l19M18p2l72M66r9l95N30j60l61N27k03l10N11k05k99M85j67l29
6202b85N08j69l51N58k24l54O01k74l11N98l00k76N72k98k68N68k88l04O07l09
6222Al14O55l57k98O80m32k27O65m53j98O41m51j99O50m48k09O93n05k03P28n61
6243a42j53P20n98j02O91n78r4O51n39j28O88n64j29P12n96j18P43o45p6P14o50
6264a93m5O81o27m5O60o04p0O90o20q2P16o78k5P18p21L0O81p25N4O56p03N3O45
6287D46o99M2O71p38N6P09p85J23O58q03J68O19q02J99N78p65J75O02p82J82O28
6308D82q19K14O00q35K50N72q27K89N16p98K75N19p70K34N49p83K24N60q14K71
6328i1N43q30L16M89q02L14M62p49K67M73p38K64N05p79L00M77p99L36M54p96
$$ plain form
6348 -384 -12 393 -378 4 368 -366 -4 367 -361 -4 387 -386 16 386 -404 56 365 -399 69 341
6368 341 -375 65 327 -365 47 326 -362 48 333 -390 49 320 -396 75 289 -378 79 264 -359 56
6388 56 265 -344 41 282 -343 39 287 -359 67 274 -350 86 246 -317 73 239 -295 59 244 -293
6408 -293 60 256 -305 82 249 -320 107 224 -307 110 189 -275 105 188 -265 89 198 -284 82 190 -290
6429 -290 100 178 -281 110 139 -279 109 130 -243 87 129 -246 74 148 -241 75 144 -258 92 147 -227 92
6451 92 126 -196 88 120 -179 56 135 -179 50 157 -199 52 138 -198 69 129 -177 59 108 -151 45 109 -153
6474 -153 30 120 -164 30 120 -182 48 94 -166 48 83 -146 19 75 -131 18 91 -132 15 107 -135 21
6496 21 96 -137 28 91 -119 41 80 -101 17 96 -92 -3 102 -90 -10 120 -104 -1 112 -107 0 78 -98
$$ packed form
6348c84L72M05p71L82L64p34L62L71p28L57L91p73M02L70p90M60L09p64M68K72
6368C41p16M40K62o92M12K79o88M10K85p23M39K71p16M71K14o67M57J85o23M15
6388E6K09o09L85K41o25L82K48o46M26K07o24M36J60n63L90J66n34L54J85n37
6408b93L53J96n61L87J67n69M27J17n31M17P9m64L80Q3m53L54J09m82L66J08m80
6429b90L90P8m59L91K9m18L88K1l73L30M2l75L20P4l89L16O9m02L50N5l74L19
6451I2L4l22K84L2k99K35P9l14K29J07l56K51Q6l36K67O0l06K36M9k59J96O4k62
6474a53J83R0k84J94R0l02K30M6k60K14L5k29J65N6k06J49P3k23J47R2k42J56
6496B1P5k33J65O3k10J60L9j81J18P9j88Q9J05j92Q0J30k24J03J13k19J07P8j76
$$ plain form
6519 -98 -17 87 -74 -33 94 -72 -50 120 -95 -44 123 -90 -24 97 -101 -25 93 -73 -27 90 -70 -41 115
6542 115 -63 -56 135 -86 -34 128 -92 -26 108 -87 -34 102 -52 -38 126 -46 -51 146 -71 -38 142 -89 -32
6565 -32 132 -95 -20 104 -74 -46 114 -66 -59 116 -77 -64 134 -98 -55 136 -101 -47 121 -99 -16 107 -74
6588 -74 -47 104 -77 -70 140 -95 -56 146 -104 -26 135 -121 -18 109 -94 -16 119 -82 -29 132 -85 -33 135
6611 135 -103 -12 131 -108 -3 118 -122 1 87 -103 -9 89 -89 -29 97 -108 -15 105 -120 1 88 -129
6633 -129 32 89 -128 39 77 -94 30 84 -98 19 99 -108 33 96 -128 53 69 -116 61 55 -109 54 51
6656 51 -101 59 62 -94 47 69 -120 66 55 -123 81 26 -105 80 4 -98 85 5 -96 72 11 -92 83
6679 83 12 -114 88 -3 -118 122 -28 -86 111 -48 -60 113 -30 -67 107 -12 -74 114 -38 -86 138 -47 -72
$$ packed form
6519i8Q1J04j61M1J27j66K2J70k15N1J67k13O6J21j98P6J18j66M6J17j60K9J56
6542A15j78PJ91k21N2J62k20O6J34j95N3J36j54J4J64j72nJ97k17L3J80k31N7
6565c2J64k27P5J24j78K8J60j80PJ75j93J3J98k32M3J91k37N4J68k20Q3J23j81
6588g4K7J51j81PK10k35L9K02k50P8J61k56J03J27k03P8J35k01N3J61k17N2J68
6611A35k38R1J43k39J05J21k40J23Q6j90R4R8j78O0J26k05R3J20k25J21Q7k17
6633a29J61N7k17J67L8j71J24N4j82J17Q0k07J41O3k24J81J6j85J77oj64J63l
6656E1j52J60Lj56J41K2j89J86j1j78K04n5j31J85p6j02J83q0j01J68o1j03J75
6679H3p1j26K02r1j15K40j50n8J97j59j2J73j43l7J74j19o2J88j52m8K24j85k5
$$ plain form
6702 -72 148 -80 -52 136 -79 -38 128 -77 -46 134 -72 -64 151 -89 -66 157 -121 -48 169 -121 -31 144 -133
6725 -133 -17 129 -115 -18 147 -133 -21 166 -155 -17 168 -176 16 164 -171 36 146 -170 42 147
6745 147 -157 45 155 -177 33 176 -207 64 159 -210 86 158 -214 103 125 -216 92 147 -193 75 156 -225
6767 -225 81 152 -249 101 151 -254 116 132 -253 117 125 -253 118 125 -261 100 145 -282 120 144 -284 152 128
6790 128 -288 169 115 -275 182 111 -271 174 118 -272 186 122 -283 208 101 -302 227 78 -305 225 56
6811 56 -292 225 50 -291 221 70 -302 237 58 -307 246 42 -316 264 24 -299 268 14 -285 256
6831 256 27 -284 261 42 -300 280 39 -318 291 22 -311 298 8 -278 291 8 -276 298 17 -278
6851 -278 300 28 -293 314 -8 -306 320 -28 -299 329 -44 -268 301 -49 -264 311 -47 -272 314 -55
$$ packed form
6702g2K20k28K8J88k15M1J66k05L1J80k06QK15k40K3K23k78P3K17k90R0J75k77
6725a33J16J46k44R7J65k80J12J87l21J38J85l44J92J48l35K07J10l16K12J05
6745A47l04K02J10l32K10J43l83K71R5l69K96P2l72L17K2l41L08N5l40K68Q1l81
6767b25L06P1m01L50N0m05L70J6l85L70Ql78L71Pl86L61M5m27M02K4m28M36k4
6790A28m16M57n4l90M57p1l82M45n6l90M58o4m05M91j07m03N29j49l83N30j69
6811E6l48N17j75l41N12j51l72N39j79l65N53k04l58N80k40l23N67k54k99N41
6831B56k29l11N45k19l42N80k41l57O09k69l33O09k90k86N69k83k84N74k81k95
6851b78N78k72l21O07l22k98O26l48k71O28l73k24N69l50k15N75l58k25N86l69
$$ plain form
6871 -55 -285 334 -88 -270 348 -102 -247 346 -108 -221 333 -96 -217 329 -92 -248 337 -92 -243 349
6891 349 -114 -223 356 -120 -201 352 -111 -198 330 -98 -209 338 -104 -222 351 -120 -224 337 -126 -212 339
6912 339 -137 -193 303 -142 -196 300 -124 -199 314 -135 -192 330 -154 -167 328 -171 -152 313 -171 -150 295 -156
6934 -156 -141 294 -155 -152 308 -175 -143 313 -183 -107 303 -190 -95 287 -170 -91 269 -165 -104 274 -175 -114 291
6957 291 -184 -105 277 -188 -97 264 -178 -81 236 -171 -97 213 -157 -102 237 -159 -117 235 -167 -95 248 -166
6979 -166 -75 230 -154 -59 221 -144 -53 221 -143 -63 235 -148 -62 228 -149 -33 214 -141 -27 196 -151 -26
7001 -26 179 -134 -39 179 -136 -46 186 -151 -34 174 -154 -22 155 -148 -27 154 -120 -41 135 -109 -48 151
7023 151 -119 -49 149 -132 -34 150 -123 -24 146 -119 -23 122 -71 -22 151 -71 -43 151 -87 -22 136 -93
$$ packed form
6871e5k30O19m22j82O18m50j45N93m54j13N54m29j21N46m21j56N85m29j51N92
6891C49m63j09N79m76q1N53m63q7N28m28j11N47m42j18N73m71j04N61m63q6N51
6912C39m76n6M96m45n4M96m24p5N13m49n7N22m84j3M95m99J9M65m84K1M45m51
6934a56J5M35m49LM60m83L2M56m96P6M10m93R5L82m57P9L60m34O1L78m49O1M05
6957B91m75P9L82m65R1L61m42R7L17m07P4L10l70N5L39l96M2L52m02P2L43m14
6979a66R1L05l84R5K80l65R1K74l64Q0K98l83Q6K90l77J16K47l55J14K23l47J25
7001b6K05l13R5K18l15R0K32l37J17K08l28J32J77l03J21J81k74P9J76k44O1J99
7023A51k70P0J98k81R8J84k73R9J70k65R6J45j93M9J73k22K8J94k38O5J58k29
$$ plain form
7045 -93 -22 119 -91 -26 98 -85 -23 108 -65 -55 102 -68 -48 115 -80 -39 100 -78 -25 91 -70 -24 81
7068 81 -54 -30 85 -42 -58 96 -52 -47 99 -57 -31 92 -48 -27 80 -38 -21 74 -16 -43 88 -27 -53 94
7092 94 -34 -40 108 -41 -38 86 -34 -40 74 -23 -56 71 -11 -73 80 -21 -81 100 -41 -60 77 -39 -57 56 -36
7117 -36 -69 72 -15 -68 83 -10 -74 90 -14 -66 93 -26 -57 80 -15 -52 73 -5 -63 70 4 -72 88 -16 -80
7142 -80 94 -25 -54 96 -28 -59 78 -28 -62 76 -7 -75 76 -13 -89 89 -29 -79 91 -46 -59 88 -39
7165 -39 -44 80 -27 -60 80 -19 -76 88 -24 -78 110 -33 -53 105 -47 -45 88 -40 -31 71 -30 -48 83 -26
7189 -26 -50 99 -35 -57 106 -56 -30 85 -60 -16 80 -53 -26 71 -48 -32 77 -52 -41 81 -73 -17 87 -80
7213 -80 -18 65 -82 -5 49 -52 -9 72 -54 -19 73 -62 -6 76 -82 17 79 -86 30 62 -66 38 57 -72 21
$$ packed form
7045i3P1J41k10O5J24j83O2J31j73J0J57j70K0J63j95M1J39j78N3J16j61M6J05
7068H1j35K4J15j27j6J54j48NJ46j56K6J23j40K1J07j18J7R5r0k7J31j15k6J47
7092I4j28oJ48j49LJ24j20oJ14r7l3J27q2o2J53j01o0J81j41j9J37j16j8J13r2
7117c6l3J41q7n3J51r3o4J64j04n2J59j19l1J37r5l7J25p8n8J33o6p6J60j04o4
7142h0J74j19k9J50j24l1J37j06l4J38q3o8J51q9p6J78j18n0J70j37j3J47j27
7165c9nJ24j07l3J40r9n7J64j12n4J88j43k0J58j52KJ33j28RJ02j01j8J31j09
7189b6k4J49j34k2J63j62K6J15j45M4R6j33K7R7j19J6J09j29J1J22j54N6J04j67
7213h0O2Q3j47P7N4j01M3Q1j26L5R2j35N6Q2j58R9O2j65J16L2j28J04J9j29R3
$$ plain form
7238 21 59 -69 21 64 -80 25 63 -100 47 49 -102 56 27 -75 61 15 -80 48 27 -91 42 23 -95 57
7262 57 19 -109 75 3 -101 89 -9 -83 83 1 -77 74 1 -83 94 5 -89 111 -8 -98 135 -27 -96 117
7286 117 -37 -70 113 -32 -83 110 -31 -98 110 -49 -115 144 -62 -99 147 -77 -99 132 -88 -73 130 -77
7308 -77 -93 122 -79 -96 148 -83 -81 159 -107 -70 166 -116 -50 145 -113 -47 155 -105 -40 163 -111 -41 186
7331 186 -130 -39 191 -139 -27 177 -152 -9 172 -146 -18 159 -160 -37 176 -167 -40 177 -184 -19
7351 -19 189 -200 -13 184 -192 2 182 -189 -2 190 -185 -3 199 -208 -3 205 -215 28 197 -222
7371 -222 36 181 -217 42 176 -206 54 191 -211 49 197 -232 59 189 -242 76 180 -254 80 162
7391 162 -241 74 153 -234 70 158 -248 74 164 -271 86 160 -286 115 149 -274 113 138 -246 96 150 -264
$$ packed form
7238B1L8j28R0M3j44J05L8j63J47Kj51J58k9j02J36m6r5J28k1j18J33j9j18J52
7262E7l8j28J84p2j04J90r8p4J66q2p8J51p3q4J77q9r4K00j19r0K33j62o9K13
7286A17j54l3J83j45n1J93j41o7K08j59o6K59k06l7K46k24k2K31k20J5K03k07
7308g7j6K15k01j7K44k31KK40k66L7K36k82O6J95k58O6K02k60O5K03k74P0K27
7331A86l16R1K30l30J12K04l29J43J81l18J28J77l19J23K13l43J27K17l61J65
7351a9K08l89J87J97l76J94J80l71J87J92l75J82K02m07K05K08m20K43J69m19
7371b22K58J45l98K59J34l82K60J37m02K60J48m29K91J30m31L18J04m34L34Q2
7391A62m03L15P9l87L04Q8m06L22R0m35L57P4m46M01L4m23L87K5l84L42N4m14
$$ plain form
7413 -264 104 158 -266 117 164 -280 129 150 -275 145 136 -258 149 138 -263 135 146 -248 146 142 -281 152 137
7436 137 -280 177 117 -267 170 91 -269 156 87 -269 164 99 -276 152 96 -287 176 75 -283 189 54 -263
7458 -263 190 57 -250 181 65 -249 185 71 -250 188 72 -265 210 47 -266 211 49 -235 208 47
7478 47 -236 193 51 -250 189 41 -257 196 33 -257 205 16 -237 209 7 -227 186 11 -220 175
7498 175 12 -231 190 11 -238 209 2 -225 205 -20 -206 203 -20 -184 180 -23 -185 187 -7 -182
7518 -182 207 -7 -188 206 -12 -171 208 -30 -158 188 -39 -153 169 -28 -168 170 -22 -172 185 -33
7538 -33 -178 184 -48 -161 184 -46 -158 153 -37 -146 157 -41 -165 163 -28 -158 167 -30 -145 170
7558 170 -45 -126 159 -49 -112 148 -35 -108 147 -30 -109 156 -44 -113 159 -49 -89 149 -38 -83 124 -58
$$ packed form
7413b64L68N4m24L83M7m44M09K1m25M20rl94M07j1m01L98J1l94L94mm23M33j5
7436A37m17M57o0l84M37p9l60M25o9l56M33o5l75M28n6l83M63j01l58M72j35l17
7458b63M53j33l07M31j16l14M34j14l21M38j16l37M75j63l13M77j62k84M43j61
7478D7k83M29j42l01M39j48k98M53j63k90M62j89k53M46k02k34M13j75k31L95
7498A75j63k43M21j79k49M47k07k27M30k25j86M09k23j64L64k03j62L72j94j75
7518a82L89k14j81L94k18j59L79k38j28L46k27j14L22j97j40L38j92j50L57k18
7538c3j45L62k32j13L45k30j12L11j90j09L03j98j24L28j91j30L25j97j15L15
7558A70k15q1K85k08o3K60j83p3K55j77p9K65k00o9K72k08m0K38j87m5K07j82
$$ plain form
7580 -58 -89 119 -39 -97 120 -43 -103 128 -54 -100 118 -64 -83 110 -48 -77 88 -47 -78 86 -33 -89 104
7603 104 -34 -91 118 -41 -80 118 -42 -67 87 -28 -64 88 -27 -70 93 -6 -71 88 -23 -74 101 -17 -55
7626 -55 84 -31 -55 73 -15 -61 58 -16 -70 63 -15 -77 58 -25 -70 63 -37 -60 57 -14 -45 34 -4 -57 47
7651 47 1 -68 49 2 -56 60 -16 -65 53 -17 -52 37 -4 -51 31 19 -56 46 30 -65 53 10 -72 50 1 -53 39
7678 39 -7 -52 31 21 -63 30 17 -90 35 18 -84 42 5 -78 45 -2 -69 30 3 -70 33 38 -67 29 33 -63 47
7705 47 17 -63 55 6 -62 51 11 -45 41 23 -50 37 31 -77 46 19 -67 49 9 -62 54 2 -55 42 12 -58 39 14
7733 14 -72 45 8 -69 43 -3 -82 55 3 -80 35 -2 -55 40 -3 -59 42 7 -61 40 13 -65 54 -3 -61 66
7759 66 -6 -41 55 0 -30 58 12 -44 45 0 -49 60 -8 -64 65 -22 -50 58 -31 -45 59 -21 -39 43 -21 -46 46 -24
$$ packed form
7580e8l1K08j58n8K17j63o0K31j82m6K18j82j9J93j58k9J65j35l1J64j19n6J93
7603A04j38n7K09j59l9J98j60k5J54j15l6J52j15m3J63r9o5J59j11n1J75j18l8
7626e5J39j15k4J28q8m6J19p4n4J33p8o2J35q3m5J33j00k3J17p1l1P9l8n3J04
7651D7m6o9J17m7n8J16p6m9J18p0l5Q9m1m7Q2j2p5J02j6r5J18m3q2J22m9n4R2
7678C9m6m5Q3j0q4R3j3j07J25j7j02J26l7q3J23m7o7R9k7p3J03Nj05R6Mr6J10
7705D7l0q0J18m9o8J13m0n6Q6j8p3Q7oj08J23k7q6J16m0p1J16n2n7R7l0p0R7k5
7733A4q6J17l7p7J12m6p9J37n2q3J15l7n3R5m3n6J01l5o8J01k7p8J19n7n8J27
7759F6p2l5R6n5l0Q8m6n6Q9m5m9J09o8n6J29q7k8J08q9j4J04q0j8Q2o4k5R2p0
$$ plain form
7787 -24 -46 61 -30 -39 56 -52 -27 75 -50 -18 43 -42 -14 55 -25 -29 52 -35 -16 78 -46 -21 69 -51 6 48 -42 12
7815 12 62 -41 1 44 -57 -12 68 -53 10 63 -67 9 55 -78 21 39 -68 22 31 -67 21 37 -73 16 49 -85 20
7842 20 46 -78 45 37 -88 53 24 -87 50 33 -72 56 31 -79 56 47 -83 65 48 -84 72 30 -85 92
7866 92 7 -84 85 15 -83 73 10 -83 82 13 -106 85 -4 -106 90 -22 -108 96 -17 -87 97 -20 -101 98
7890 98 -17 -103 115 -21 -105 118 -24 -99 130 -34 -91 119 -31 -79 118 -24 -90 123 -44 -87 134 -36 -90
7913 -90 150 -66 -81 145 -74 -76 142 -66 -78 137 -59 -93 137 -71 -98 159 -80 -98 157 -90 -86 147 -107
7936 -107 -77 146 -90 -77 148 -81 -75 163 -81 -80 185 -105 -58 169 -100 -42 179 -107 -40 167 -105 -39 169
7959 169 -109 -57 173 -123 -47 172 -135 -34 176 -133 -28 163 -132 -25 160 -132 -32 161 -141 -31 167
$$ packed form
7787b4k2J07r1rR5j08K5J02j25L2O1q5K8O9q0mQ1q7J9R4j24K5R0j20N7M2r0N4
7815A2N0j03M2M3j01M5Q0j21O3N3j30P6M6j33R9J8j07R0Rr8Q8J6j10Q9L3j34J05
7842B0K6j24J23qj25J41k9j11J37j7j05J28k5j10J35rj30J48j7j32J56m2j15J77
7866I2q5r1J69p0r8J56o3r3J65o9j19J91q9j02J96j12q6K04j13p0J84j17q1J99
7890I8j15q6K18j36q4K23j42p5K29j64n7K10j50m8J97j42o6K13j67m3K21j70n4
7913i0K40k16j5K26k19kK18k08j2K15j96l4K30k08k7K57k39j8K55k47MK33k54
7936a07L0K23k36J3K25k29OK38k44JK65k90M7K27k69N8K21k86O7K07k72O6K08
7959A69k78N2K30k96P6K19l07J01K10l09J05J91k95J07J85k92J00J93l02J10J98
$$ plain form
7980 167 -147 -36 158 -169 -24 157 -150 -21 145 -161 -20 158 -156 -23 157 -160 -22 173 -161 -2
8000 -2 183 -151 7 166 -165 18 161 -163 3 156 -167 4 170 -178 3 158 -190 23 157 -186 22
8021 22 137 -180 18 130 -173 5 134 -180 16 125 -192 21 125 -201 40 124 -186 47 111 -165 42
8042 42 120 -172 49 123 -164 49 127 -173 61 132 -172 59 117 -175 67 113 -161 52 107 -165 49 114 -183
8065 -183 57 105 -190 66 105 -186 63 86 -168 66 79 -153 61 76 -157 66 82 -174 73 86 -164 67
8087 67 61 -145 81 61 -139 80 66 -146 72 68 -148 84 73 -149 94 73 -133 93 59 -117 87 51 -135 69
8111 69 50 -125 67 62 -134 76 56 -140 65 37 -145 71 37 -127 67 41 -125 63 45 -122 56 44 -124
8134 -124 67 51 -131 73 39 -105 76 17 -95 58 38 -88 59 37 -97 70 45 -91 67 29 -91 85
$$ packed form
7980A67l14J11J94l27J45J81l07J29J66l06J41J78l14J33J80l17J38J95l34J59
8000bJ85l34J58J59l31J83J43l24J66J53l23J71J66l48J81J55l48K13J34l43K08
8021B2J15l17J98J12l03J78J29l14J96J09l17K13J04l26K41Q4l10K33O4k76K07
8042D2P8k92K21P4k87K13P8l00K34P1l04K31N8k92K42M6k74K13N5k72K14O5k97
8065a83K40M8k95K56L9k91K49K3k54K34J3k32K14J5k33K23J6k56K47J3k50K31
8087F7ok06K26k0k00K19j4k12K18mk16K32j1k22K43k1k06K26l4j76K04l6j86K04
8111F9j9j75J92nj96K10k0j96K05k8j82K16l4j64J94k6j66J88j8j67J78j2j68
8134a24J91j6j82K04l4j44J81n9j12J53k0j26J47k2j34J67k5j36J58l8j20J76
$$ plain form
8156 85 16 -87 65 20 -81 56 21 -88 50 33 -85 48 19 -94 53 15 -96 57 10 -79 38 5 -74 46
8180 46 21 -78 39 23 -81 39 19 -79 44 16 -68
$$ packed form
8156H5o9j03J52m5j01J37l5j09J38j7j18J33k9j13J47l8j11J53m7q9J17l3p9J20
8180D6k5r9J17j6j04J20k0r8J23k8q4
8191f8
$$ Imaginary data points
##PAGE= N=2
##DATA TABLE= (X++(I..I)), XYDATA
$$ plain form
0 0 0 0 0 0 0 0 0 0 0 0 0 -8 8 -8 8 -16 16 -17 24 -32 37 -41 48 -57 72 -81 96 -112 129 -145 169 -193 219
33 219 -248 280 -317 356 -398 446 -498 554 -616 684 -757 839 -928 1025 -1128 1243 -1370
50 -1370 1510 -1663 1833 -2020 2231 -2468 2736 -3044 3397 -3813 4307 -4909 5657 -6615 7897
65 7897 -9706 12461 -17226 27743 -99138 129352 179984 -67455 103581 -83076 -110474
76 -110474 179757 -56437 -244016 155158 122350 -34695 86444 -119626 -151809 207987
86 207987 -11562 -204528 118573 98801 1240 107478 -186988 -217551 204499 95534 -93805
97 -93805 93279 -23197 -65674 120293 -130930 -176453 211983 101370 -78666 47710 -93287
108 -93287 -64952 174722 -85156 -176720 162672 99457 -21836 49460 -167835 -123577 198104
$$ packed form
0@%%%%%%%%%%%qJ6j6J6k4L2l3M1n6O9p8Q9j05J29j53J77k08K41k74L14l62M12
33B19m67N28n97O73p54Q44r44J052j170J300j441J596j767J953k153K371k613
50a370K880l173L496l853M251m699N204n780O441p210Q120r216J0566j2272J4512
65G897j7603K2167k9687M4969j26881K28490N0632k47439J71036j86657k7398
76a10474K90231k36194j87579L99174l2808j57045J21139k06070l2183L59796
86B07987k19549j92966L23101j9772r7561J06238k94466l0563M22050j08965j89339
97i3805J87084j16476m2477J85967k51223m5523L88436j10613j80036J26376j40997
108i3287K8335K39674k59878r1564L39392o3215j21293P1296k17295M4258L21681
$$ plain form
119 198104 11243 -102630 126502 12172 -55936 50883 -154308 -88769 231338 44714
129 44714 -104027 46673 -51840 -27301 114934 -121936 -110889 189882 59310 -53577 30023
140 30023 -120414 -55784 143460 -52210 -64700 155116 15033 -71217 2278 -125936 -17167
151 -17167 197546 -11318 -89401 65403 -30882 -26421 56388 -110602 -35600 169430 7715
162 7715 -59935 33500 -71778 -29984 77626 -70528 -13532 156635 -5602 -80310 -11979
173 -11979 -87457 19209 141229 -39791 -49569 73372 -32452 -38068 24792 -73904 9906
184 9906 126410 -29909 -45426 47666 -48355 -28735 34125 -59938 27157 129201 -29057
195 -29057 -69005 -7100 -57546 21099 89289 -34576 -10118 62768 -46816 -42355 18937 -38772
$$ packed form
119A98104j86861j13873K29132j14330o8108J06819k05191O5539L20107j86624
129D4714j48741J50700r8513K4539J42235k36870J1047L00771j30572j12887Q3600
140C0023j50437O4630J99244j95670j2490K19816j40083q6250P3495j28214J08769
151a7167K14713k08864p8083J54804r6285M461Q2809j66990P5002K05030j61715
162G715o7650R3435j05278M1794J07610j48154N6996J70167j62237p4708O8331
173a1979p5478J06666J22020j81020r778J22941j05824n616O2860r8696Q3810
184I906J16504j56319j5517R3092r6021J9620O2860r4063Q7095J02044j58258
195b9057l9948O1905n0446P8645O8190j23865K4458P2886j09584M461O1292n7709
$$ plain form
207 -38772 26120 76170 -40429 -17037 44639 -40156 -29881 11425 -32941 40611 86881 -33333
219 -33333 -46162 -2906 -43499 11706 55518 -14238 14663 35745 -51905 -33188 15274 -14119
231 -14119 24124 39320 -29165 -538 30316 -34878 -25200 5654 -15276 36254 52502 -24594
243 -24594 -23119 -7362 -37369 4936 37551 5742 19437 12234 -45064 -23123 12538 -4192
255 -4192 18104 22414 -16242 4512 12409 -26691 -13998 1930 -5768 24462 30330 -7987 -12207
268 -12207 -14245 -30134 1257 28666 15749 15752 -1108 -32544 -16066 3786 3069 15596 12657 -4678
282 -4678 -772 -257 -12464 -8110 -1104 -1043 13805 19612 2784 -8342 -18272 -20856 265 18762
296 18762 20517 11320 -6318 -19485 -16873 -2155 9678 12868 9310 -886 -6467 -4329 -3214 -4244
$$ packed form
207c8772O4892N0050j16599K3392O1676q4795J0275M1306m4366P3552M6270j20214
219c3333j2829M3256m0593N5205M3812o9756K8901K1082q7650J8717M8462k9393
231a4119L8243J5196o8485K8627L0854o5194R678L0854k0930N1530J6248p7096
243b4594J475J5757l0007M2305L2615l1809J3695p203n7298K1941L5661j6730
255d192K2296M310l8656K0754P897l9100J2693J5928p698L0230N868l8317m220
268a2207k038j5889L1391K7409j2917Lj6860l1436J6478J9852p17J2527k939j7335
282d678L906N15j2207M354P006O1J4848N807j6828j1126r930k584K1121J8497
296A8762J755r197j7638j3167K612J4718J1833L190l558j0196n581K138J115j030
$$ plain form
310 -4244 -3761 1827 7714 11740 8755 -7944 -16938 -11636 -3910 12472 20875 8126 -4714 -13724
324 -13724 -17659 -4147 12461 11978 5887 857 -9185 -6120 2781 -3944 -2812 4229 1692 7815
338 7815 8913 -6219 -11435 -8369 -5851 7665 18685 8130 -4010 -10059 -17000 -4532 12989
351 12989 9460 5813 692 -10212 -5120 2057 -1213 118 2397 91 3602 6835 -1915 -7818 -6723
366 -6723 -6368 4740 14717 7930 -1164 -9971 -13712 -3598 7903 11112 5797 -2124 -6717 -6412 -113
381 -113 3404 1237 280 288 950 2653 2686 -3649 -8750 -2823 1978 7144 12528 -675 -11454 -6853 -5667
398 -5667 3217 14330 4207 -4719 -1852 -7052 -4893 8885 2161 -4040 5378 -3397 -3789 11164
412 11164 -3317 -10652 3097 -3365 1930 17718 -2146 -13324 885 -7097 -3164 19054 1349
$$ packed form
310d244M83N588N887M026k985j6699q994N302P726J6382Q403j2749j2840r010
324a3724l935J3512J6608m83o091n030j0042L065Q901o725J132P041k537O123
338G815J098j5132n216L066K518J3516J1020j0555j2140o049o941J2468J7521
351A2989l529l647n121j0904N092P177l270J331K279k306L511L233q750n903J095
366f723L55J1108R977o787r094q807l741J0114J1501L209n315p921m593L05O299
381a13L517k167r57QO62J703L3o335n101N927M801N166N384j3203j0779M601J186
398e667Q884J1113j0123q926K867n200K159J3778o724o201R418q775l92J4953
412A1164j4481p335J3749o462N295J5788j9864j1178J4209p982L933K2218j7705
$$ plain form
425 1349 -8124 7771 -11408 -10669 17298 -544 -5964 11546 -10516 -7553 19884 -5091 -13562
438 -13562 10377 -7860 -3652 24992 -7494 -15385 13555 -12808 -8985 25494 -4845 -7404 17284
451 17284 -19361 -14479 26395 -4024 -8665 18388 -17835 -9970 30577 -12475 -15948 21431 -14841
464 -14841 -6268 30346 -16142 -12136 24820 -20781 -13546 31276 -9402 -6153 24940 -28873 -15461
477 -15461 37143 -11961 -10090 25673 -25481 -7329 36282 -23024 -13304 31457 -21561 -8837
489 -8837 33575 -22922 -7105 34510 -32436 -15103 40041 -17231 -3468 30439 -39375 -9904
501 -9904 44360 -23795 -8733 33574 -31655 -5003 39367 -34669 -7286 42942 -33357 -9448
513 -9448 38727 -31515 1201 39511 -46112 -9741 46931 -26699 -696 33956 -46261 -2822
$$ packed form
425A349r473J5895j9179P39K7967j7842n420J7510k2062K963K7437k4975q471
438a3562K3939j8237M208K8644l2486p891K8940k6363L823L4479l0339k559K4688
451A7284l6645M882M0874l0419m641K7053l6223P865M0547m3052l473L7379l6272
464a4841Q573L6614m6488M006L6956m5601P235M4822m0678L249L1093n3813J3412
477a5461N2604m9104J871L5763n1154J8152M3611n9306R720M4761n3018J2724
489h837M2412n6497J5817M1615o6946J7333N5144n7272J3763L3907o9814K9471
501i904N4264o8155J5062M2307o5229K6652M4370p4036K7383N0228p6299K3909
513i448M8175p0242L2716L8310q5623L6371N6672p3630K6003L4652q0217M3439
$$ plain form
525 -2822 47579 -37422 -3818 42494 -39491 -1624 38802 -44283 4057 46984 -44886 -5416
537 -5416 40964 -36546 7362 38662 -53875 -1314 49766 -37465 3498 37191 -50935 5172
549 5172 43755 -48052 7071 45758 -46762 2334 36072 -48630 13798 45915 -54454 2330
561 2330 43337 -44729 13387 37158 -59929 10880 46829 -49050 12577 38556 -55325 12067
573 12067 38024 -55040 18976 46214 -55886 9118 34912 -54487 23465 41241 -61235 14992
585 14992 40057 -52558 20454 33608 -60660 20100 39367 -54996 22231 37133 -59044 17899
597 17899 31658 -56885 29461 39249 -59154 18246 28884 -55643 28872 33665 -58509 23696
609 23696 32054 -55620 26543 29504 -59342 26435 30122 -55254 31824 29514 -59561 24673 23872
$$ packed form
525b822N0401q5001L3604M6312q1985L7867M0426q3085M8340M2927r1870L9470
537e416M6380p7510M3908L1300r2537N2561N1080q7231M0963L3693q8126N6107
549E172L8583r1807N5123L8687r2520M9096L3738q4702O2428L2117j00369N6784
561B330M1007q8066N8116K3771r7087P0809L5949r5879O1627K5979r3881O7392
573A2067K5957r3064P4016K7238j02100O5004K5794q9399P7952J7776j02476P6227
585A4992K5065r2615P3012J3154r4268Q0760J9267r4363P7227J4902r6177P6943
597A7899J3759q8543Q6346R788r8403P7400J0638q4527Q4515M793r2174Q2205
609B3696Q358q7674Q2163K961q8846Q5777L687q5376Q7078k310q9075Q4234q01
$$ plain form
622 23872 -54865 35552 30533 -57134 26442 21447 -57636 34647 27792 -56170 31986 21787 -56566
635 -56566 35386 21576 -57927 33064 21334 -52306 37928 20135 -57582 31946 16537 -54255
647 -54255 40434 22700 -52641 33478 10213 -55744 40503 19750 -50206 35205 11977 -50318
659 -50318 38167 12253 -52521 36674 14489 -46963 38620 10687 -49359 35708 6207 -48369
671 -48369 41515 15317 -42819 32547 338 -47374 41159 12210 -43307 35635 5596 -42718
683 -42718 37111 2126 -43634 39953 6275 -40558 36784 3402 -38728 35016 -3127 -41358
695 -41358 42490 9587 -36454 31450 -6838 -38834 41415 2367 -35600 37500 -603 -35221
707 -35221 32732 -5484 -32363 39660 -960 -34489 34538 -701 -30115 31416 -10307 -31371
$$ packed form
622B3872p8737R0417n019q7667Q3576m995p9083R2283o855q3962Q8156j0199p8353
635e6566R1952j3810p9503R0991j1730p3640R0234j7793p7717Q9528j5409p0792
647e4255R4689j7734p5341Q6119k3265o5957R6247k0753o9956Q5411k3228o2295
659e0318Q8485k5914o4774Q9195k2185o1452Q5583k7933o0046Q5067k9501n4576
671d8369Q9884k6198n8136P5366l2209m7712Q8533k8949n5517P8942l0039m8314
683d2718P9829l4985m5760Q3587l3678m6833P7342l3382m2130P3744l8143l8231
695d1358Q3848l2903m6041O7904l8288l1996Q0249l9048l7967P3100l8103l4618
707c5221O7953l8216k6879P2023m0620l3529O9027l5239k9414O1531m1723k1064
$$ plain form
719 -31371 41184 2457 -28377 27593 -10522 -27960 34012 -3937 -24474 34568 -3781 -28652
731 -28652 25241 -7941 -20947 34500 -6752 -25389 30041 -3858 -21172 23218 -12492 -19368
743 -19368 33917 -1956 -20478 22621 -10371 -20591 25418 -6980 -13862 30912 -7828 -22141
755 -22141 18955 -8915 -11266 26608 -9312 -15966 24495 -5925 -15840 17286 -11347 -11286 26740
768 26740 -5687 -12626 19180 -11395 -14598 17177 -6923 -4299 23551 -9042 -15839 12638 -7360
781 -7360 -6140 18855 -7639 -8322 17640 -7497 -10379 11481 -8500 -4731 16569 -4694 -5146 12090
795 12090 -9095 -10725 9242 -2942 680 15614 -7300 -10392 6558 -5973 -2259 11493 -3663
808 -3663 -2332 8674 -6016 -6112 5713 -4026 -2264 9045 -1522 -1320 6560 -7336 -7408 4189 -504
$$ packed form
719c1371P2555l8727l0834N5970l8115j7438O1972l7949k0537N9042l8349k4871
731b8652N3893l3182j3006N5447m1252j8637N5430l3899j7314M4390l5710o876
743a9368N3285l5873j8522M3099l2992j0220M6009l2398o882M4774l8740j4313
755b2141M1096k7870k351L7874l5920o654M0461l0420r915L3126k8633O1L8026
768B6740l2427o939L1806l0575l203L1775k4100K624K7850l2593o797K8477j9998
781g360J220K4995k6494o83K5962k5137k882K1860j9981L769K1300k1263m52J7236
795A2090k1185j630J9967j2184L622J4934k2914l092J6950j2531L714J3752j5156
808c663J331J1006j4690r6J1825r739J762J1309j0567K02P880j3896p2J1597m693
$$ plain form
823 -504 3696 8683 -3987 -5958 183 -3682 -541 6639 1096 -693 2701 -3799 -3792 2106 -1495 -430
839 -430 3992 1338 916 716 -3742 -5004 -635 3038 3552 4165 603 -5007 -3942 -1397 102 3598
855 3598 4317 233 -2064 -768 -2649 -2173 2527 -52 241 4909 -286 -2333 76 -4790 -2898 4764
871 4764 3060 1811 3434 -4368 -7066 1198 82 870 7572 -537 -4048 1864 -4047 -3247 4815 -365
887 -365 -736 5587 -934 -3561 2175 -4309 -4615 6403 2031 373 5705 -5374 -7233 2651 -1501
902 -1501 868 8311 -893 -3957 1901 -4418 -3621 6017 -340 -1535 6268 -2193 -3476 3462 -5172
917 -5172 -3549 6249 633 1094 5120 -4964 -6132 1941 -1639 820 8248 -811 -3601 1715 -5272
932 -5272 -2377 5753 -892 68 4510 -2553 -2021 1826 -3971 -2285 4477 847 1241 4067 -4202 -4680
$$ packed form
823e04M200M987j2670j971O141l865L141P180n543j789L394o500PN898l601J065
839d30M422k654m22k00m458j262M369L673N14O13l562n610J065K545J499L496
855C598P19m084k297J296j881M76M700k579K93M668n195k047K409m866J892P662
871D764j704j249J623p802k698Q264j116P88O702q109l511N912n911Q00Q062n180
887c65l71O323o521k627N736o484l06J1018m372j658N332j1079j859R884m152
902a501K369P443r204l064N858o319P97R638o357j195P803q461j283O938q634
917e172J623R798n616M61M026j0084j168Q073l580K459P428r059k790N316o987
932e272K895Q130o645R60M442p063N32L847n797J686O762l630L94K826q269m78
$$ plain form
948 -4680 704 -2061 2254 6211 -374 -1559 -1138 -4195 -826 3107 991 854 1910 -1319 -1362 15
964 15 -2565 -675 1997 1320 2552 773 -2093 -2419 -2906 32 2850 2791 2572 -999 -4066 -1971 -71
981 -71 516 2765 1888 -1498 749 -11 -4043 650 843 -1975 4210 1936 -2860 2075 -1821 -5956 2386
998 2386 2798 -238 5361 -462 -7960 1698 921 -3976 6461 1698 -5163 5388 -1378 -7802 5426
1013 5426 790 -5012 7020 598 -5981 6982 -1764 -10554 6803 2382 -4326 10294 -2527 -11203
1027 -11203 8070 -1083 -7872 10729 430 -7176 9562 -3875 -11296 11430 406 -9382 11097
1040 11097 -1630 -8446 13307 -5038 -13685 12647 245 -6919 13536 -5063 -11917 13436 -3861
1053 -3861 -11903 15642 -443 -9485 13698 -7978 -12681 18430 -3152 -12218 15163 -4280 -8545
$$ packed form
948d680N384k765M315L957o585j185M21l057L369L933k116j37J056l229m3J377
964A5k580J890K672o77J232j779k866l26m87K938K818n9k19l571l067K095J900
981g1N87K249q77l386K247p60m032M693J93k818O185k274m796M935l896m135Q342
998B386M12l036N599n823p498R658p77m897J0437m763o861J0551o766o424J3228
1013E426m636n802J2032o422o579J2963q746q790J7357m421o708J4620j2821q676
1027a1203J9273r153o789J8601j0299p606J6738j3437p421K2726j1024r788K0479
1040A1097j2727o816K1753j8345q647K6332j2402p164K0455j8599o854K5353j7297
1053c861q042K7545j6085r042K3183k1676m703L1111k1582r066K7381j9443m265
$$ plain form
1066 -8545 17091 -9239 -14632 18821 -2571 -10490 17468 -7764 -11543 19357 -10328 -13694 22539
1079 22539 -4072 -10423 16784 -12798 -10802 24108 -8943 -14276 20866 -7121 -9345 20724 -15137
1092 -15137 -12777 26123 -9598 -12313 21987 -11077 -8838 21853 -17226 -12019 28335 -8393 -11956
1105 -11956 19601 -15724 -8139 27458 -16305 -13066 26632 -11359 -9094 21426 -18703 -7769
1117 -7769 28537 -16167 -12237 25642 -12590 -7715 22142 -21972 -8005 32289 -15116 -11518 22519
1130 22519 -18059 -4360 26460 -22485 -8154 30317 -16370 -9301 22450 -20553 -2857 29118
1142 29118 -24387 -8717 30318 -17458 -5657 21663 -25906 -871 32294 -23058 -8167 25718
1154 25718 -20432 -2110 24495 -26997 -1195 32261 -24083 -6961 24167 -22457 2273 25572
$$ packed form
1066h545K5636k6330n393L3453k1392p919K7958k5232l779L0900k9685l366L6233
1079B2539k6611o351K7207k9582J996L4910l3051n333L5142k7987k224L0069l5861
1092a5137K360L8900l5721k715L4300l3064K239L0691l9079N207M0354l6728l563
1105a1956L1557l5325P585L5597m3763L239L9698l7991K265L0520m0129J0934
1117g769L6306m4704L930L7879l8232M875K9857m4114J3967M0294m7405L598L4037
1130B2519m0578J3699L0820m8945J4331L8471m6687P069L1751m3003J7696L1975
1142B9118n3505J5670L9035m7776J1801K7320m7569K5035L3165n5352J4891L3885
1154B5718m6150J8322K6605n1492K5802L3456n6344J7122L1128m6624K4730K3299
$$ plain form
1166 25572 -29615 -1754 30940 -21810 -3991 20789 -25644 3853 28687 -28190 -2786 27426
1178 27426 -23255 -408 21119 -27154 5800 28268 -28467 -2950 23961 -21927 3969 20793
1190 20793 -29844 4491 28774 -26331 -1064 20586 -25051 7671 22320 -30324 4909 25600
1202 25600 -26068 1556 18368 -25330 10526 22768 -31669 3261 23549 -24446 6488 16877
1214 16877 -29083 11412 22711 -29665 4717 19079 -24472 9462 16387 -28915 11100 21594
1226 21594 -28634 4909 16538 -23854 13299 15952 -30471 9511 19028 -24680 7981 13298
1238 13298 -24460 13129 15777 -28135 8674 16777 -23381 9450 11780 -24549 14397 14848 -27121
1251 -27121 7974 13248 -20365 12550 10230 -25197 12222 13811 -23731 9347 11084 -20843 13594
$$ packed form
1166B5572n5187K7861L2694n2750J7819K4780m6433K9497K4834n6877K5404L0212
1178B7426n0681K2847K1527m8273L2954K2468n6735K5517K6911m5888K5896J6824
1190B0793n0637L4335K4283n5105K5267K1650m5637L2722J4649n2644L5233K0691
1202B5600n1668K7624J6812m3698L5856J2242n4437L4930K0288m7995L0934J0389
1214A6877m5960M0495J1299n2376L4382J4362m3551L3934O925m5302M0015J0494
1226B1594n0228L3543J1629m0392L7153K653m6423L9982R517m3708L2661N317
1238A3298l7758L7589K648m3912L6809Q103m0158L2831K330l6329L8946M51m1969
1251b7121L5095N274l3613L2915k320l5427L7419J589l7542L3078J737l1927L4437
$$ plain form
1264 13594 9202 -24683 12913 11794 -21675 10278 7721 -19523 15018 8528 -23777 10874 9786
1277 9786 -18838 12656 6358 -20652 14267 7228 -21192 11965 7277 -17089 12670 4128 -18997
1290 -18997 13620 6953 -18644 10413 5252 -15568 13639 3910 -18569 11850 5129 -15296 11371
1303 11371 3419 -14332 11759 2738 -15776 10875 4928 -13218 9942 1968 -13578 11866 2912
1316 2912 -14002 9619 2507 -10913 10449 1046 -12136 9610 1958 -11217 9249 2178 -10076
1329 -10076 9130 59 -11078 9861 1721 -9302 8285 -310 -8533 8923 142 -8849 7659
1342 7659 680 -7524 7780 1 -7881 7462 -468 -7365 7655 287 -5986 6221 -1466 -6103
1356 -6103 6492 379 -5207 5218 -370 -5230 5352 -211 -5012 5067 -312 -4214 4726 -377
$$ packed form
1264A3594m392l3885L7596j119l3469L1953k557k7244L4541o490l2305L4651j088
1277I786k8624L1494o298k7010L4919p039k8420L3157m688k4366K9759q542k3125
1290a8997L2617o667k5597K9057n161k0820K9207r729k2479L0419o721k0425K6667
1303A1371p952j7751K6091r021j8514K6651n947j8146K3160p974j5546K5444q954
1316B912j6914K3621p112j3420K1362r403j3182K1746p652j3175K0466p071j2254
1329a0076J9206r071j1137K0939q140j1023J7587q595q223J7456q781q991J6508
1342G659o979q204J5304p779p882J5343p930o897J5020p368o273J2207p687m637
1356f103J2595o113n586J0425n588m860J0582n563m801J0079n379l902Q940n103
$$ plain form
1370 -377 -3709 3600 -758 -3342 3785 673 -2916 2536 -489 -3372 3080 574 -2384 2614 -403
1385 -403 -2445 2059 -26 -1561 1518 124 -1446 1276 685 -1580 580 215 -1453 1249 945 -839
1401 -839 328 -250 -1038 109 1046 184 -407 625 -721 -910 1370 -302 -811 1237 -343 -791 1259
1418 1259 -99 -1521 978 224 -1540 2089 654 -2367 1479 -350 -2288 2737 534 -2107 1908
1433 1908 -265 -2545 2191 596 -2585 2356 558 -3117 2748 430 -3423 2797 44 -2982 3524
1448 3524 381 -3202 2426 -259 -3224 3347 937 -3281 2975 7 -4027 3502 359 -3442 3776
1463 3776 -205 -3525 3582 -149 -3444 3225 -71 -3292 3817 396 -3788 3276 -491 -3835 4270
1478 4270 152 -3218 3812 -1006 -3585 3660 -252 -2821 3691 -377 -3375 3568 -348 -3436 3737
$$ packed form
1370c77l332P309m358k584P127l112l589N452l025k883O452k506k958M998l017
1385d03k042M504k085j535L079j394j570K722n91k265K160l65j668K702l04j784
1401h39J167n78p88J147R37q62n91J032j346j89K280j672n09K048j580m48K050
1418A259j358j422K499p54j764L629j435l021L846j829j938N025k203k641M015
1433A908k173k280M736j595l181M941j798l675N865k318l853O220k753l026O506
1448C524l143l583N628k685k965O571k410m218O256k968m034P529l143l801P218
1463C776l981l320P107l731l295O669l296l221P109l421m184P064l767l344Q105
1478D270m118l370P030m818k579P245l912k569O512m068k998O943l916l088P173
$$ plain form
1493 3737 -633 -3093 4202 -638 -2900 3376 -1397 -2748 3710 -250 -2171 3174 -1081 -3049 3256
1508 3256 -491 -2272 3662 -1022 -2440 3185 -1283 -1906 2966 -1124 -1578 2826 -664 -1639 2172 -1219
$$ packed form
1493C737m370k460P295m840k262O276m773j351O458l960j921N345m255j968O305
1508C256l747j781N934m684j418N625m468o23M872m090m54M404l490r75L811l391
$$ [...]
8191A1
##END NTUPLES=NMR FID
##END=
