##TITLE=C13_SL53-DAU(A)
 CDCl3, 27000 sc

 7.12.2022
##JCAMPDX= 6.0         $$ Bruker NMR JCAMP-DX V2.0
##DATA TYPE= NMR SPECTRUM
##DATA CLASS= NTUPLES
##ORIGIN= UXNMR, Bruker Analytische Messtechnik GmbH
##OWNER= root
$$ XWIN-NMR		Version 3.5
$$ Thu Dec  8 10:41:12 2022 Russian Standard Time (UT+4h)  she@DPX200
##.OBSERVE FREQUENCY= 50.327896
##.OBSERVE NUCLEUS= ^13C
##.ACQUISITION MODE= SIMULTANEOUS
##.ACQUISITION SCHEME= undefined
##.AVERAGES= 18400
##.DIGITISER RES= 17
##SPECTROMETER/DATA SYSTEM= spect
##.PULSE SEQUENCE= zgpg30
##.SOLVENT NAME= CDCl3
##.SHIFT REFERENCE= (INTERNAL, CDCl3, 0, 222.653)
##AUDIT TRAIL= $$ (NUMBER, WHEN, WHO, WHERE, WHAT)
$$ ##TITLE= Audit trail, XWIN-NMR		Version 3.5
$$ ##JCAMPDX= 5.01
$$ ##ORIGIN= Bruker BioSpin GmbH
$$ ##OWNER= she
$$ F:/spectra/data/she/nmr/c13/1/pdata/1/auditp.txt
$$ ##AUDIT TRAIL=  $$ (NUMBER, WHEN, WHO, WHERE, WHAT)
(   1,<2022-12-08 10:40:02.48 +0400>,<she>,<DPX200>,
      <created by zg, POWCHK disabled, PULCHK disabled
       terminated by command 'halt'
       configuration hash MD5:
       00 E9 B6 7A A2 85 ED C7 34 08 36 98 17 FE 4E 26
       data hash MD5: 32K
       32 B1 AD 91 0C F1 9D 04 FE 62 37 EC 10 7D C8 A7>)
(   2,<2022-12-08 10:40:35.56 +0400>,<she>,<DPX200>,
      <Start of raw data processing
       efp BC_mod = 2 LB = 2 FT_mod = 6 PKNL = 1 PHC0 = -314.9538 PHC1 = 48.7945 SI = 32K 
       data hash MD5: 32K
       F7 5A 44 A4 AC E9 1E EB C5 17 FF AD 4E 33 AE B8>)
(   3,<2022-12-08 10:40:38.18 +0400>,<she>,<DPX200>,
      <apk 
       data hash MD5: 32K
       3C 56 28 BF D6 FA 7D 23 6D 04 BA 99 79 39 10 20>)
(   4,<2022-12-08 10:40:40.21 +0400>,<she>,<DPX200>,
      <abs n ABSG = 5 
       data hash MD5: 32K
       27 E9 BC 82 A4 47 C6 39 60 86 75 34 BB 40 0D 29>)
$$ ##END=
$$ 
$$ hash MD5
$$ BD 55 C5 86 FE 0E D6 CD 00 D5 40 9D 50 FE 0F 60
##$RELAX= 
##$RELAX= 
##$RELAX= 
##$RELAX= 
##$RELAX= 
##$RELAX= 
##$RELAX= 
##$RELAX= 
$$ Bruker specific parameters
$$ --------------------------
##$DU= <F:/spectra>
##$EXPNO= 1
##$NAME= <c13>
##$PROCNO= 1
##$TYPE= <nmr>
##$USER= <she>
##$AMP= (0..31)
100 100 100 100 100 100 100 100 100 100 100 100 100 100 100 100 100 100 
100 100 100 100 100 100 100 100 100 100 100 100 100 100 
##$AQSEQ= 0
##$AQ_mod= 1
##$AUNM= <au_zg>
##$AUTOPOS= <>
##$BF1= 50.322709
##$BF2= 200.13
##$BF3= 50.322709
##$BF4= 500.13
##$BF5= 500.13
##$BF6= 500.13
##$BF7= 500.13
##$BF8= 500.13
##$BYTORDA= 1
##$CFDGTYP= 0
##$CFRGTYP= 5
##$CHEMSTR= <none>
##$CNST= (0..31)
1 1 145 1 1 1 1 1 1 1 1 1 1 1 1 1 1 1 1 1 1 1 1 1 1 1 1 1 1 1 1 1 
##$CPDPRG= <waltz16>
##$CPDPRG1= <>
##$CPDPRG2= <waltz16>
##$CPDPRG3= <>
##$CPDPRG4= <mlev>
##$CPDPRG5= <mlev>
##$CPDPRG6= <mlev>
##$CPDPRG7= <mlev>
##$CPDPRG8= <mlev>
##$CPDPRGB= <>
##$CPDPRGT= <>
##$D= (0..31)
0 2 0.00345 0 0 0 0 0 0 0 0 0.03 2e-05 3e-06 0 0 0 0 0 0 0 0 0 0 0 0 0 
0 0 0 0 0 
##$DATE= 1670418884
##$DBL= (0..7)
120 120 120 120 120 120 120 120 
##$DBP= (0..7)
150 150 150 150 150 150 150 150 
##$DBP07= 0
##$DBPNAM0= <>
$$ [...]
##$SUBNAM4= <"">
##$SUBNAM5= <"">
##$SUBNAM6= <"">
##$SUBNAM7= <"">
##$SUBNAM8= <"">
##$SUBNAM9= <"">
##$SW= 239.972175391363
##$SWIBOX= (0..15)
0 1 3 0 0 0 0 0 0 0 0 0 0 0 0 0 
##$SW_h= 12077.2946859903
##$TD= 32768
##$TD0= 1
##$TE= 0
##$TE2= 300
##$TE3= 300
##$TEG= 300
##$TL= (0..7)
120 120 120 120 120 120 120 120 
##$TP= (0..7)
150 150 150 150 150 150 150 150 
##$TP07= 0
##$TPNAME0= <>
##$TPNAME1= <>
##$TPNAME2= <>
##$TPNAME3= <>
##$TPNAME4= <>
##$TPNAME5= <>
##$TPNAME6= <>
##$TPNAME7= <>
##$TPOAL= (0..7)
0.5 0.5 0.5 0.5 0.5 0.5 0.5 0.5 
##$TPOFFS= (0..7)
0 0 0 0 0 0 0 0 
##$TUNHIN= 0
##$TUNHOUT= 0
##$TUNXOUT= 0
##$USERA1= <user>
##$USERA2= <user>
##$USERA3= <user>
##$USERA4= <user>
##$USERA5= <user>
##$V9= 5
##$VALIST= <valist>
##$VCLIST= <CCCCCCCCCCCCCCC>
##$VD= 0
##$VDLIST= <DDDDDDDDDDDDDDD>
##$VPLIST= <PPPPPPPPPPPPPPP>
##$VTLIST= <TTTTTTTTTTTTTTT>
##$WBST= 1024
##$WBSW= 4
##$XGAIN= (0..3)
0 0 0 0 
##$XL= 0
##$YL= 0
##$YMAX_a= 126862097
##$YMIN_a= -32469696
##$ZGOPTNS= <>
##$ZL1= 120
##$ZL2= 120
##$ZL3= 120
##$ZL4= 120
##$ABSF1= 222.6533
##$ABSF2= -17.34351
##$ABSG= 5
##$ABSL= 3
##$ALPHA= 0
##$AQORDER= 0
##$ASSFAC= 0
##$ASSFACI= 0
##$ASSFACX= 0
##$ASSWID= 0
##$AUNMP= <proc_1d>
##$AZFE= 0.1
##$AZFW= 0.5
##$BCFW= 0
##$BC_mod= 2
##$BYTORDP= 0
##$COROFFS= 0
##$CY= -3
##$DATMOD= 1
##$DC= 0
##$DFILT= <>
##$DTYPP= 0
##$F1P= 0
##$F2P= 0
##$FCOR= 0.5
##$FTSIZE= 32768
##$FT_mod= 6
##$GAMMA= 0
##$GB= 0
##$INTBC= 1
##$INTSCL= 4.134877e-10
##$ISEN= 128
##$LB= 2
##$LEV0= 0
##$LPBIN= 0
##$MAXI= 10000
##$MC2= 0
##$MEAN= 0
##$ME_mod= 0
##$MI= 0.1934396
##$NCOEF= 0
##$NC_proc= 2
##$NLEV= 6
##$NOISF1= 120.0001
##$NOISF2= 80.00006
##$NSP= 0
##$NTH_PI= 0
##$NZP= 0
##$OFFSET= 222.6533
##$PC= 1.4
##$PHC0= -293.4056
##$PHC1= 12.64132
##$PH_mod= 1
##$PKNL= yes
##$PPARMOD= 0
##$PSCAL= 0
##$PSIGN= 0
##$REVERSE= no
##$SF= 50.322730123286
##$SI= 32768
##$SIGF1= 140
##$SIGF2= 120
##$SINO= 11.81781
##$SIOLD= 32768
##$SREGLST= <13C.CDCl3>
##$SSB= 0
##$STSI= 32768
##$STSR= 0
##$SW_p= 12077.2946859903
##$SYMM= 0
##$S_DEV= 0
##$TDeff= 32768
##$TDoff= 0
##$TI= <>
##$TILT= no
##$TM1= 0
##$TM2= 0
##$TOPLEV= 0
##$USERP1= <user>
##$USERP2= <user>
##$USERP3= <user>
##$USERP4= <user>
##$USERP5= <user>
##$WDW= 1
##$XDIM= 32768
##$YMAX_p= 374684111
##$YMIN_p= -1569426
$$ End of Bruker specific parameters
$$ ---------------------------------
##NTUPLES= NMR SPECTRUM
##VAR_NAME=  FREQUENCY,     SPECTRUM/REAL,   SPECTRUM/IMAG
##SYMBOL=    X,             R,               I
##VAR_TYPE=  INDEPENDENT,   DEPENDENT,       DEPENDENT
##VAR_FORM=  AFFN,          ASDF,            ASDF
##VAR_DIM=   32768,         32768,           32768
##UNITS=     HZ,            ARBITRARY UNITS, ARBITRARY UNITS
##FACTOR=    0.368581032318806, 1,           1
##FIRST=     11204.5221812756, 0,            0
##LAST=      -872.772504714734, 0,           0
##MIN=       -872.772504714734, -1569426,    0
##MAX=       11204.5221812756, 374684111,    0
$$ Real data points
##PAGE= N=1
##DATA TABLE= (X++(R..R)), XYDATA
$$ [...]
18340 212890 223786 308635 361083 353904 349410 394689 443157 408643 290035 161521 121055
18329 121055 176020 211918 183526 139916 103347 94192 121890 152644 94052 -109540 -400015
18318 -400015 -678988 -822247 -770058 -608833 -455330 -343931 -257258 -192611 -169421 -220991
18308 -220991 -311204 -346372 -330796 -343677 -399187 -472421 -542913 -569830 -530755 -462688 -403767
18297 -403767 -393600 -443879 -515319 -552383 -577924 -663415 -763199 -783767 -759051 -724183 -664362
18286 -664362 -616812 -616689 -618515 -540803 -351826 -84892 148192 280083 361213 479795 634292
18275 634292 742623 771113 686836 536721 421009 366481 348197 295181 189377 110151 105783
18264 105783 161030 217068 218174 169160 120565 96671 83352 91233 129454 154243 103005 -27391
18252 -27391 -181376 -303323 -337313 -247706 -82991 60196 124584 144603 157797 139278 106519
18241 106519 109637 122156 98506 34170 -60802 -131055 -146734 -98424 -6637 45285 40992 36168
18229 36168 66926 117675 179828 242372 272160 276413 308740 375654 414063 340678 178168 49601
18217 49601 25467 81686 148331 161985 141819 147220 178000 190276 182629 165026 97677 -78325
18205 -78325 -323431 -506746 -567186 -505857 -377858 -266206 -210645 -231903 -268447 -284576 -359148
18194 -359148 -497450 -588225 -591200 -547551 -477547 -407812 -378294 -386811 -411461 -422978 -386852 -313260
18182 -313260 -247517 -214350 -163465 -65078 25403 44380 53292 150849 274379 296653 220242
18171 220242 128297 84064 79904 63366 62445 127244 234487 332800 382739 361125 301708 264019
18159 264019 291389 415445 580750 665032 645006 555693 382900 145875 -68282 -203213
18149 -203213 -251105 -238365 -208703 -152366 -62646 55397 195949 304065 348443 325990 235535
18138 235535 121994 64954 68594 87863 95579 59428 99 -15923 34537 97960 120726 93965
18126 93965 43129 -21776 -107033 -173859 -183469 -152309 -148590 -199542 -281708 -325606 -273837 -161301
18114 -161301 -88749 -99758 -140623 -146009 -82511 3072 35586 -7359 -51750 -9791 93845
18103 93845 188171 263576 288945 231129 139664 83309 100225 167018 224267 293760 403816
18092 403816 509765 563851 540942 461824 407551 451451 555945 619987 611175 533322 399876
18081 399876 260383 139561 76332 107732 192619 240472 219093 203252 260553 344046 401559
18070 401559 451612 503180 568109 646643 690502 643962 500876 311206 140631 15232 -55803
18059 -55803 -28282 89323 226772 331130 357886 303804 202858 116538 75623 6942 -133786
18048 -133786 -285935 -327211 -229897 -111377 -59463 -97506 -225661 -396908 -520035 -510001
18038 -510001 -346438 -81960 186099 374000 443546 394920 265823 111673 -17355 -95659
18028 -95659 -116098 -117863 -140705 -144890 -75687 4021 9869 -42992 -106625 -156561 -227084 -318515
18016 -318515 -398688 -451995 -464866 -404391 -268497 -119337 -20683 34774 98247 165596 205007
18005 205007 218065 204913 127916 -35358 -235655 -382369 -472562 -594356 -763507 -881731
17995 -881731 -881054 -794973 -688760 -630436 -604837 -525467 -377416 -174506 54792 245729 362033
17984 362033 404243 397899 369219 321531 233546 113573 45169 81294 188064 281887 266914
17973 266914 166958 98596 90817 98933 116463 148601 185128 221614 210359 153031 104305 70122
17961 70122 6452 -116095 -263081 -404767 -522481 -582710 -597290 -632788 -693476 -722010 -716288
17950 -716288 -680323 -603928 -520809 -483750 -496156 -506684 -461464 -364760 -296427 -315264 -360171
17939 -360171 -361193 -341633 -306092 -213086 -78741 10320 37080 58891 101017 114726 8305
17928 8305 -199645 -411467 -566283 -663316 -726867 -751227 -721265 -636437 -514768 -414046 -389210
17917 -389210 -355697 -267492 -182598 -113487 -72362 -29540 77329 236020 371328 428838 449446
17906 449446 461668 389986 201850 -11378 -176207 -312069 -459337 -585407 -608445 -495032
17896 -495032 -283909 -81354 28070 51414 42428 16353 -53930 -147996 -225366 -299767 -385323
17885 -385323 -441741 -485480 -601593 -760811 -853060 -806794 -689016 -627558 -617909 -598445 -587125
17874 -587125 -640801 -761192 -844377 -827282 -716636 -526520 -300199 -123229 -47116 -55646 -111839
17863 -111839 -158215 -188399 -303301 -539472 -751338 -813253 -711173 -500784 -275622 -87805
17853 -87805 19471 56221 106490 171358 174647 107507 59609 92086 178227 246414 279223 305461
17841 305461 337776 342830 287079 178126 57293 -35896 -98285 -146572 -231301 -406052 -627726
17830 -627726 -770457 -780497 -691266 -523887 -288071 -21105 263783 519701 638073 663584
17820 663584 742627 851366 911619 897127 768222 581931 457702 400340 364332 350134 350091
17809 350091 296487 170760 27448 -104641 -213130 -286708 -347142 -444772 -598619 -741485
17799 -741485 -813096 -831864 -810096 -744285 -653002 -529469 -378380 -208835 -16136 112938
17789 112938 78656 -61608 -175016 -214061 -229903 -263929 -286000 -245361 -130773 12296 120929
17778 120929 179006 216308 259838 311610 307790 258775 242258 285611 360819 414853 395171 312420
17766 312420 229890 201572 254063 364322 467225 507737 483765 420529 314686 179093 59882
17755 59882 -20846 -27048 74846 200935 253300 274397 295565 245422 116376 -43051 -222389
17744 -222389 -409560 -563194 -660072 -691511 -655657 -578517 -490134 -429265 -435606 -514616 -599936
17733 -599936 -624106 -590102 -547005 -503923 -402392 -228769 -43444 68033 65962 1682 -61502
17722 -61502 -108694 -118682 -70054 13638 126896 275530 426535 488661 416200 281883 132900
17711 132900 -80400 -368600 -585829 -610644 -543912 -538119 -585779 -606303 -588162 -562963 -554515
17700 -554515 -538734 -470344 -333633 -167621 -13067 113787 194755 259114 337623 419544 467136
17689 467136 439641 308553 51462 -256009 -471323 -548528 -533423 -486827 -447777 -416747 -391002
17678 -391002 -374894 -356110 -292708 -179484 -75677 -32386 -64793 -105416 -99989 -101410 -102474 -9621
17666 -9621 172022 318296 361527 311105 171012 -13355 -173461 -276434 -308582 -284359 -259261
17655 -259261 -230715 -174624 -118936 -94914 -89831 -68629 4296 87710 101772 58489 38260 91107
17643 91107 166940 196167 153908 67858 17694 80193 231291 343947 337522 206594 24824
17632 24824 -83805 -105339 -110127 -125225 -120224 -66902 13478 67974 68296 27130 -35134 -94684
17620 -94684 -98831 -43382 21423 47136 68971 133523 200521 237008 266925 334566 451859 555202
17608 555202 605267 627555 647843 726942 878416 1045083 1215790 1417707 1617036 1783471
17598 1783471 1924493 2046974 2130621 2211898 2375192 2543683 2543942 2306428 1947789 1621047
17588 1621047 1392237 1249832 1153780 1049436 926703 826301 771906 775726 865390 1030052
17578 1030052 1191876 1313687 1381850 1402094 1493354 1735046 2061334 2392830 2620147 2655919
17568 2655919 2513151 2248110 1951991 1708083 1534959 1402167 1309283 1286380 1306267 1317407
17558 1317407 1317902 1311002 1264986 1142233 970107 822465 725481 636062 552053 523227 512738
17547 512738 414638 211842 -13972 -200047 -370803 -504243 -547124 -512123 -442374 -393974
17537 -393974 -382732 -373538 -312625 -207099 -121103 -93661 -93300 -103652 -80290 3583 88813 155373
17525 155373 225585 308241 416176 507905 521590 442112 295230 104207 -108919 -305403
17515 -305403 -493433 -686420 -864213 -974437 -982654 -933169 -890268 -863224 -805230 -661384 -489434
17504 -489434 -374698 -296377 -238254 -215653 -244295 -289821 -266481 -203639 -193553 -232521 -286028
17493 -286028 -359555 -446407 -550496 -652826 -704834 -706646 -703103 -774785 -917197 -1058927 -1150102
17482 -1150102 -1150756 -1053680 -901024 -760487 -680183 -635655 -588714 -547220 -540872 -560238 -575724
17471 -575724 -577529 -537955 -454663 -345770 -227536 -144833 -132294 -173930 -217113 -230027 -222206
17460 -222206 -169206 -53762 71401 143180 123121 54594 15748 4197 -61652 -178666 -244690
17449 -244690 -211451 -131678 -64679 -28882 -5257 37106 98236 159361 181391 159027 138257
17438 138257 162471 262961 464514 711470 912106 1071020 1168506 1119129 943832 758958
17428 758958 593881 411588 221601 58626 -46133 -77989 -43916 570 -2518 -28783 -49637
17417 -49637 -72320 -87681 -43665 84727 269623 470593 622057 723787 787017 814713 818199
17406 818199 765780 667595 582139 528367 508395 490008 424631 338698 258729 203341 194761 190673
17394 190673 119094 -15711 -136871 -198258 -227057 -261900 -265974 -169987 37408 303031 554035
17383 554035 703841 694463 570585 408553 290591 270214 298693 294797 210637 55942 -106071
17372 -106071 -248963 -379324 -459164 -460993 -410259 -347909 -303694 -299682 -331055 -325069 -214423
17361 -214423 -42549 83360 109223 90514 114879 198744 302058 436498 593078 685234
17351 685234 670080 549129 347576 112142 -111312 -252816 -302223 -332031 -378149 -415390
17341 -415390 -425941 -400664 -365703 -364778 -419844 -500357 -557631 -554765 -452700 -284436 -99316
17330 -99316 87637 231436 282320 280977 277458 262343 215362 170489 179566 226603 230450 136105
17318 136105 7772 -72221 -80765 -21016 81910 157145 145078 57833 -25972 -55845 -45806
17307 -45806 -62523 -118814 -180169 -255507 -338344 -372749 -308420 -211819 -178655 -191223 -225537 -272975
17295 -272975 -291759 -307232 -349521 -378557 -370215 -357424 -330471 -256001 -137539 -6120 125845
17284 125845 263013 405413 584071 772033 910997 975665 981270 976477 969570 880782 653957
17273 653957 343194 31471 -215912 -351585 -377907 -334344 -290635 -278902 -264679 -237169 -188162
17262 -188162 -112918 -44954 -3547 -7817 -41030 -70058 -117675 -221916 -380957 -541495 -676831
17251 -676831 -799871 -922415 -1009663 -1028734 -1034413 -1070249 -1095382 -1036727 -897394 -763551 -720347
17240 -720347 -766888 -859108 -932807 -924714 -880613 -839923 -816751 -811963 -780537 -720688 -672332 -653193
17228 -653193 -677889 -742290 -811768 -881313 -954504 -992190 -1006487 -1015825 -961122 -813966 -637579
17217 -637579 -491206 -337000 -143197 81339 256387 280028 192779 85798 -33265 -146134
17207 -146134 -195775 -190145 -170560 -151240 -120455 -36899 132784 338561 472174 496957 480908
17196 480908 484401 487191 437600 350494 276396 239525 223208 169658 24400 -187221 -385911
17185 -385911 -514433 -536514 -443353 -297297 -211086 -225287 -298605 -369655 -379681 -325518 -271436
17174 -271436 -292889 -344722 -337976 -280165 -229603 -193379 -161863 -138121 -163239 -281274 -452017
17163 -452017 -561841 -563624 -517936 -462545 -440377 -462810 -457792 -340814 -107088 156973 384792
17152 384792 526375 533520 443420 345448 293028 268239 241648 245633 308184 438783 586005
17141 586005 597185 437742 273396 210042 186799 123385 49534 39607 62617 84488 132226
17130 132226 208324 241098 173704 56253 -14074 -35071 -19642 52130 153049 253615 343280
17119 343280 410993 466491 504922 478436 330605 53470 -243540 -399244 -365985 -252126
17109 -252126 -203075 -233173 -231146 -168656 -73330 42008 131430 116712 2767 -137889 -272074
17098 -272074 -406089 -547466 -693114 -831071 -936552 -963767 -877328 -754063 -679194 -607201
17088 -607201 -470438 -285778 -115080 -5567 45018 61629 38851 -40461 -122382 -187330 -230326
17077 -230326 -236840 -258779 -321275 -371333 -396366 -433231 -462035 -411376 -272333 -169166 -205997
17066 -205997 -357085 -546855 -722546 -830604 -821816 -696372 -527081 -376869 -298652 -306365
17056 -306365 -330815 -316143 -293242 -267580 -220484 -210304 -281797 -404177 -571369 -754708 -796641
17045 -796641 -591755 -250995 62349 235725 250508 177563 130499 145995 168334 165598 107939
17034 107939 18866 -28124 -35031 -28074 -5754 43071 98962 126034 137519 152313 153186 107061
17022 107061 9579 -67961 -68587 -64584 -92555 -90033 -38728 43706 173617 335007 428733 399591
17010 399591 301203 171746 42443 -18913 -19789 -26612 -59687 -91959 -79870 -37646 -36690 -87471
16998 -87471 -129389 -119774 -94425 -94650 -103330 -105997 -119890 -144315 -147295 -121435 -85556 -46730 18534
16985 18534 99040 162478 189592 160872 91709 1780 -90473 -196602 -355876 -542133 -692045
16974 -692045 -761515 -741456 -673611 -607468 -547767 -476320 -355193 -188644 -53647 8464 11196
16963 11196 4463 7373 -44498 -165566 -279011 -292746 -208200 -68958 116784 315874 492553
16952 492553 628290 655129 558409 411227 266830 147875 83630 86519 131738 171142 185419
16941 185419 191837 180049 125120 25420 -79881 -151726 -168749 -152326 -139128 -70029 106000
16930 106000 281210 342080 302682 203941 100484 40199 7167 -36701 -89396 -161760 -291365
16919 -291365 -493938 -730373 -901433 -934626 -822678 -623433 -445723 -344137 -286369 -209915
16909 -209915 -26125 252758 498293 648809 734524 755682 698010 542874 331125 136857
16899 136857 11280 10831 79105 108727 101897 64662 -31249 -154564 -264683 -297715 -203057
16888 -203057 -55540 50786 83373 30266 -70666 -131144 -99761 -98300 -225282 -396646 -486646
16877 -486646 -484265 -473921 -488689 -526039 -618214 -759000 -845142 -811801 -713707 -597916 -439558
16866 -439558 -257067 -97264 9468 52009 75851 100736 88996 36769 18322 86404 186896
16855 186896 196304 90705 -26589 -103331 -152036 -132947 -17944 138962 280872 321976 165923
16844 165923 -163985 -549960 -870139 -1074480 -1167763 -1128360 -969575 -780719 -621002 -523538
16834 -523538 -488483 -471045 -429055 -404322 -459586 -534438 -524807 -448080 -413800 -440275 -493833 -549240
16822 -549240 -592858 -587025 -503673 -441219 -477215 -530251 -529470 -467975 -356748 -258671 -229845 -233391
16810 -233391 -205017 -134541 -50726 26667 93743 135780 144685 155903 209459 294487 343994 313067
16798 313067 237417 178217 178477 225426 260089 242377 198333 172813 157395 133433 124591 148257
16786 148257 209028 279886 264599 136892 -54030 -267363 -452901 -557886 -522282 -382000
16776 -382000 -306148 -336112 -359752 -321315 -266181 -260827 -305123 -333315 -302882 -217645 -160723 -198170
16764 -198170 -274005 -308034 -293567 -277027 -250238 -185974 -92978 -35660 -29887 -17264 -32151 -81245
16752 -81245 -81252 -56523 -110196 -261576 -443544 -592422 -677025 -658836 -541088 -414264 -329119
16741 -329119 -258949 -207525 -248450 -411686 -621392 -763715 -797092 -750963 -695295 -670093 -676033
16730 -676033 -724297 -792535 -804387 -723704 -606325 -496619 -421387 -378258 -347375 -326496 -314907
16719 -314907 -321435 -376306 -463143 -554563 -652333 -719905 -728230 -702057 -638330 -498693 -308395
16708 -308395 -102953 85913 208126 246893 217206 133673 33445 -46796 -129705 -263500
16698 -263500 -393711 -407869 -315030 -210830 -135636 -92268 -59847 22325 152580 247191 253303
16687 253303 190012 136132 178162 261632 286560 247292 194944 191969 240375 268857 204232 32853
16675 32853 -155731 -296537 -387831 -471417 -595270 -770831 -928812 -982814 -936830 -852650 -756878
16664 -756878 -640302 -484026 -315499 -185300 -78807 1089 29570 22838 -2153 -3306 37061
16653 37061 65737 78116 116124 202608 307915 324902 185114 -35917 -216202 -299432 -316915
16642 -316915 -322915 -323703 -338729 -392901 -456935 -450770 -326690 -187529 -127951 -112290 -139278 -198118
16630 -198118 -258508 -367165 -533424 -655224 -673316 -635023 -581484 -535051 -494024 -437751 -332189
16619 -332189 -154081 56193 236800 322299 239285 -5892 -336993 -620680 -744134 -700487
16609 -700487 -577176 -446492 -295307 -123450 13666 97004 153012 204701 255048 277135
16599 277135 272439 276822 278032 268904 269833 259668 244199 267343 277113 228696 184187 142574 53627
16586 53627 -65234 -187023 -244440 -181444 69 208111 302407 236864 91939 -35027
16576 -35027 -75548 4285 163417 344011 523353 677547 740285 699228 614886 515535 384021
16565 384021 228022 74674 -29060 -46518 -2528 65974 150854 220386 237471 191684 82961
16554 82961 -28255 -116136 -218009 -332156 -422887 -472440 -489789 -473510 -428344 -401565 -434540
16543 -434540 -479447 -460033 -389204 -325156 -282320 -258553 -260578 -257445 -223711 -174110 -92010 28720
16531 28720 80824 11552 -89897 -140112 -136585 -161465 -216597 -227104 -153648 -24412 122880
16520 122880 278592 404910 414346 282472 79124 -110548 -213004 -202648 -115643 -16823
16510 -16823 38987 48828 67263 82729 40856 -71932 -222414 -348328 -439506 -502309 -541693
16499 -541693 -611862 -679570 -704444 -736627 -796704 -852271 -879542 -852592 -758645 -616210 -482843
16488 -482843 -416883 -404923 -409888 -422037 -418695 -399554 -409715 -411417 -321884 -120264 163520 438300
16476 438300 582260 600612 581579 565002 517475 402847 273163 169117 89894 84845 161573
16465 161573 292320 416246 418317 272984 82937 -57015 -125791 -149141 -159761 -175428 -188912
16454 -188912 -165095 -88372 -22985 -10822 -35290 -75630 -114191 -139263 -165624 -243216 -396217
16443 -396217 -590877 -756061 -810926 -723259 -483986 -174088 62513 169784 171113 145863
16433 145863 137528 117907 65927 22745 15028 2423 -52306 -127242 -189615 -175794 -41161 183646
16421 183646 411932 589551 702578 742452 685546 554357 402284 261442 119051 -30027
16411 -30027 -154479 -253824 -312298 -305153 -304357 -399692 -514730 -512492 -380610 -186342 -11387
16400 -11387 59366 -15231 -151173 -247797 -328590 -408439 -440065 -407126 -345564 -293780 -234721
16389 -234721 -141362 -66197 -62976 -129116 -161578 -74852 26186 31007 -241 -27950 -97559 -219277
16377 -219277 -363994 -479163 -507570 -457076 -396985 -378058 -376974 -352022 -342771 -413201 -526660
16366 -526660 -583222 -541810 -467486 -420014 -400147 -411502 -457118 -528215 -596812 -608111 -564011
16355 -564011 -520810 -485015 -430344 -379646 -325354 -250334 -172596 -86311 30148 133604 182196
16344 182196 187137 190888 185369 160025 171562 230643 280913 268518 190204 100331 74637 81318
16332 81318 54754 -15679 -105568 -171648 -164026 -118924 -99872 -86333 -44732 6176 24328 -1269
16320 -1269 -51967 -97651 -131349 -150104 -90676 57513 234528 392952 472805 493634 510221
16309 510221 497546 405409 242368 100962 36321 6710 -15161 33033 150093 257786 324657
16298 324657 342558 348197 363323 377785 396609 430609 485001 539855 573815 571345 567986 582811
16286 582811 574380 553037 547054 544781 511752 442563 366790 308160 249304 200560 200884 233962
16274 233962 275060 333873 378456 359716 327058 351529 426150 501859 516823 470027 436295
16263 436295 431768 434106 445157 427345 364100 288216 236178 183411 121739 103400 136456 174020
16251 174020 184609 175819 175237 202983 219723 185871 147658 176059 276999 363003 376790 340317
16239 340317 291531 295670 380294 506408 580502 564185 471915 352733 231535 125061 29910
16228 29910 -64407 -121936 -99356 -19683 84679 184875 286320 398620 476729 503910 503463
16217 503463 518166 553805 582264 585391 555994 499009 461506 447067 420623 381189 333612 267012
16205 267012 190379 148055 150280 134858 55309 -56108 -149349 -192864 -168377 -59185 88600
16194 88600 183169 218023 276527 365104 391190 307609 155409 1054 -93703 -64422 113656
16183 113656 358885 568592 684962 712576 708606 707475 659503 536070 395927 264634 126274
16172 126274 49952 96130 196036 277638 294016 261609 249850 260110 287006 320989 337085
16161 337085 356188 418975 566536 753687 917693 1052071 1186953 1345095 1556400 1818051
16151 1818051 2061136 2187673 2156959 2015360 1839409 1675183 1520387 1331881 1112255 938977
16141 938977 847722 789666 748663 757582 799690 829648 803095 689906 500634 325960 266564
16130 266564 330463 437955 507735 558234 609623 620369 591092 558490 518189 485965 506408
16119 506408 582148 714005 888517 1048966 1125457 1113299 1058239 974294 843309 653955
16109 653955 408469 166472 -1640 -92914 -128989 -132788 -111769 -79752 -55869 -29988 -1459
16098 -1459 33620 60195 66083 102140 184113 276661 316390 260921 146605 57991 44205 115815
16086 115815 232194 328598 371259 375153 338882 256753 167143 51743 -112142 -252377 -281984
16075 -281984 -217362 -131353 -48705 8982 25941 26241 38502 93886 155032 169109 139216 76403
16063 76403 -2442 -76375 -152764 -247034 -364949 -492874 -525482 -370347 -126798 41206 113129
16052 113129 127502 89133 -23999 -199552 -327655 -341068 -280355 -187313 -111202 -54028 26465
16041 26465 104411 178648 256599 310371 349709 406068 488668 516101 417385 248480 109903
16030 109903 16352 -59353 -116072 -222468 -379086 -473067 -494041 -518953 -580371 -648905 -646524
16019 -646524 -545821 -423986 -338897 -317902 -328178 -283374 -198350 -152091 -102293 -12021 79065
16008 79065 167630 229453 181886 47245 -80868 -165295 -187611 -160819 -127967 -121181 -123529 -93840
15996 -93840 -18297 96161 232261 364249 473057 543023 597726 649955 644774 574997 486952
15985 486952 428654 399457 355312 263087 114299 -55861 -209141 -347675 -500503 -637851
15975 -637851 -690995 -633462 -537849 -484935 -455665 -392452 -313289 -298424 -414330 -611649 -775493
15964 -775493 -857377 -841275 -751447 -693598 -714076 -787761 -880649 -934396 -928673 -867398 -756503
15953 -756503 -635661 -570642 -571142 -523484 -350316 -144988 -6313 62558 61465 -24558 -218255
15942 -218255 -478807 -688944 -796452 -816059 -736062 -595292 -432858 -238091 -66575 41193
15932 41193 94335 70993 10040 -40684 -124837 -252483 -378098 -493620 -565452 -529350 -412665
15921 -412665 -298527 -236133 -206856 -144412 -80138 -100833 -167152 -228995 -281558 -289504 -256812
15910 -256812 -238805 -237511 -224407 -216021 -236874 -215206 -102364 49839 214656 421629 647411
15899 647411 781913 788230 781559 837005 903313 942003 914565 806009 669501 528678 397900
15888 397900 338100 348490 348162 291697 189822 87670 21067 20552 90844 177054 223538 268016
15876 268016 361131 475146 581058 650223 635707 541163 459673 429083 444911 537267 624386
15865 624386 601183 528987 498146 494251 496091 481365 415502 286814 172779 152190 168074
15854 168074 165772 165746 185872 201447 192500 190140 234603 299513 378023 476616 546709 557096 522957
15841 522957 460053 350293 198737 79921 44700 50902 52157 70992 137576 232978 301062
15830 301062 333082 331036 236380 29160 -227320 -419990 -479128 -441859 -389327 -400799 -474081
15819 -474081 -543179 -536895 -467681 -412875 -394571 -396159 -400285 -391084 -358578 -321471 -301591 -297773
15807 -297773 -277198 -201030 -117144 -91089 -128632 -231643 -401026 -561145 -592738 -480031 -294561
15796 -294561 -138052 -61121 -57198 -103661 -132721 -140695 -171869 -241419 -312717 -328748 -278358 -220853
15784 -220853 -171616 -128136 -137014 -204901 -290144 -332437 -297199 -210774 -123093 -84783 -118861 -191307
15772 -191307 -229284 -242617 -288202 -322534 -279869 -180382 -125037 -174932 -295222 -375539 -367524
15761 -367524 -337209 -348301 -388945 -443021 -530104 -630883 -713403 -709516 -573701 -370941 -180661
15750 -180661 -26269 122543 246729 300478 289209 267524 242672 159475 10694 -133963
15740 -133963 -197109 -204607 -226915 -219000 -119107 24242 135542 208907 268171 315590 341315
15729 341315 331253 285903 235811 187924 116252 21662 -56256 -87004 -73415 -52168 -30699
15718 -30699 14524 114792 306824 534760 706935 808950 802412 703106 600468 531474 502285
15707 502285 507098 520220 478849 369374 260777 173058 87802 32651 21066 22198 28664 55042
15695 55042 65847 59600 72931 103239 66151 -52071 -169500 -248788 -292800 -297456 -261652 -210446
15683 -210446 -179370 -211969 -272892 -289655 -254801 -197010 -99095 -3849 20439 -18387 -65365
15672 -65365 -109354 -135996 -116917 -109927 -140728 -161245 -117363 19910 216984 383788 428028
15661 428028 333061 197609 151989 224607 315024 322508 234913 129840 45168 -29614 -68439
15650 -68439 -45549 -9900 -42630 -136629 -230434 -286066 -295011 -241452 -138008 -74994 -148203 -336572
15638 -336572 -489110 -477149 -330631 -187754 -122830 -131254 -186803 -220952 -164206 -86693 -93342
15627 -93342 -155388 -216614 -282268 -347193 -346427 -261672 -126366 9138 68143 51153 30969 44720
15615 44720 87759 116206 107929 92190 105404 137310 178813 234868 259715 254727 278129 349995
15603 349995 473298 586343 548139 344415 110936 -56418 -145598 -157824 -127167 -152842
15593 -152842 -292723 -469090 -547755 -450928 -263202 -159462 -188923 -282032 -347028 -313318 -175018
15582 -175018 6390 185583 354462 487206 534647 511679 478696 445138 406691 368745 334632
15571 334632 300605 254447 189611 79957 -84338 -246975 -312455 -239616 -101914 -24396 -24423
15560 -24423 -30063 -3904 29248 14843 -46809 -75577 -49845 -5123 14831 -12705 12486 138421
15548 138421 274815 319618 255359 171174 127566 132361 200244 304336 358446 331855 269683
15537 269683 226898 212346 146314 5746 -102068 -127219 -136791 -154841 -162928 -181048 -224154
15526 -224154 -227587 -147461 -31509 39041 10642 -70064 -125682 -140809 -150275 -219763 -296561 -274364
15514 -274364 -154366 7317 175411 311546 380410 398947 423091 465139 471978 399009 261598
15503 261598 88317 -130412 -326710 -365068 -259915 -153980 -143919 -212887 -256126 -171588
15493 -171588 50481 327185 550642 667097 731434 815272 935721 1005617 862700 535694
15483 535694 268438 184219 231526 343508 465333 523906 479970 378894 243625 76693
15473 76693 -56923 -122277 -189056 -319001 -496097 -644141 -685441 -611022 -452117 -242884
15463 -242884 -16752 206823 387453 513605 603528 638212 566645 341709 18014 -217201
15453 -217201 -220620 -63675 102962 206777 234189 191035 66787 -97790 -202852 -206359 -150375
15442 -150375 -97802 -98917 -152762 -230296 -356875 -509166 -604626 -619429 -576558 -509351 -458394
15431 -458394 -493821 -591741 -625693 -545228 -401359 -256923 -149613 -82879 -49232 -80582 -172040
15420 -172040 -239239 -218843 -122297 -13223 32582 -2888 -66606 -97657 -44965 89825 224695
15409 224695 326426 428236 537415 618337 612911 547042 492254 470307 478122 493940 496063
15398 496063 497642 522065 611960 751486 819707 758639 611736 445761 316832 227283 167155
15387 167155 113591 27670 -39958 -92467 -211143 -399660 -569740 -655544 -643807 -556167 -443924
15376 -443924 -320784 -201330 -131425 -107378 -65417 17686 88395 89752 -26378 -211942 -342306
15365 -342306 -319765 -129528 133890 361898 565256 769739 928223 1010713 1027993 989909
15355 989909 865948 673147 523072 490945 586887 732658 780841 664232 473799 371791
15345 371791 402334 461679 475930 500875 592286 672271 659856 594243 547907 543385 530197 491326
15333 491326 416276 296442 182516 137052 160922 207603 249881 298741 318561 267126 199592
15322 199592 196760 228097 170199 11621 -141014 -232850 -274824 -280450 -314144 -408544 -465808
15311 -465808 -382503 -180820 32167 180180 256471 272915 207373 70408 -71175 -169053
15301 -169053 -201602 -145923 -33828 64251 64949 -54635 -216099 -317196 -309973 -240014 -169211
15290 -169211 -114479 -71861 -43262 -34732 -24769 17150 95216 202420 334404 462325 514286
15279 514286 422551 199868 -54494 -259200 -354202 -311823 -159556 39445 190654 227831
15269 227831 159473 57306 -48020 -142371 -183264 -190643 -209861 -224279 -227597 -212977 -154053
15258 -154053 -21190 203862 456858 648316 759061 787641 720878 592713 476320 394136
15248 394136 338769 350807 405274 411757 372475 327091 287105 294017 340911 367320 363411 329220
15236 329220 245445 144141 85419 48304 7829 2200 36171 112917 229548 337304 425741
15225 425741 483156 458728 387055 346117 361888 406188 453342 491394 482609 430643 353898 246053
15213 246053 142237 71508 13936 -65916 -148484 -197399 -179582 -116059 -93249 -138543 -190315
15202 -190315 -222493 -244942 -280662 -343622 -407616 -466585 -515384 -523697 -445738 -297119 -145365
15191 -145365 -27205 54545 102530 107431 67265 22182 -31521 -133051 -257887 -345754 -386408
15180 -386408 -414408 -450150 -488074 -510969 -481196 -398245 -303769 -237293 -257784 -408242 -604573
15169 -604573 -739403 -775422 -689267 -504711 -292587 -120343 -23574 5321 -5869 -19355 -21446
15158 -21446 -55486 -159154 -326702 -534555 -715035 -807879 -792173 -699653 -643351 -643000 -636799
15147 -636799 -660341 -780852 -950538 -1115163 -1230983 -1256082 -1154861 -908187 -602494 -357945
15137 -357945 -194159 -113048 -126007 -214951 -333471 -399183 -413009 -462436 -554198 -660241 -741284
15126 -741284 -808173 -905536 -984981 -993087 -955747 -960847 -1042532 -1158861 -1243765 -1256458 -1191504 -1049289
15114 -1049289 -856300 -663535 -555789 -548836 -537535 -458088 -312635 -112855 133211 352778
15104 352778 442838 422039 355813 294378 261636 197833 84210 -8249 -42803 -51263 -37099
15093 -37099 -23390 -2579 50473 81117 42877 -78602 -288011 -516775 -685901 -767382 -759163
15082 -759163 -690214 -579383 -444929 -309809 -204277 -194151 -269590 -299656 -236908 -173232 -173816
15071 -173816 -180802 -123330 -20779 43073 4908 -66434 -92364 -82489 -95760 -152275 -181754 -156819
15059 -156819 -171527 -284225 -442299 -571175 -615638 -555169 -442290 -358739 -323280 -316489 -332309
15048 -332309 -358740 -374416 -350890 -258149 -122515 -8465 45087 39037 -20037 -106534 -152738
15037 -152738 -133787 -93316 -94030 -133882 -173171 -214805 -230869 -198368 -141097 -86324 -41776 18335
15025 18335 157615 362033 510835 539177 480775 379816 257543 115813 -36019 -150140
15015 -150140 -165036 -96093 -39292 -44893 -85455 -120625 -135684 -112543 -38409 48587 125531 197637
15003 197637 260585 279634 187536 17673 -90180 -72849 29700 164591 296195 405964
14993 405964 525721 673468 772873 787347 756403 678261 543612 395134 286891 234842
14983 234842 184449 90850 17729 31404 91794 121451 63658 -106189 -289131 -325318 -229866
14972 -229866 -184917 -293318 -474175 -612862 -702405 -741504 -680697 -521576 -337502 -232172
14962 -232172 -191891 -120981 -3546 92910 100286 51668 6458 -43295 -88626 -59600 65477
14951 65477 218273 356246 423410 372769 270532 236008 315800 430644 481585 452526 371636
14940 371636 264585 145951 34167 -47249 -94666 -125945 -179486 -313409 -494076 -599970
14930 -599970 -552901 -396005 -225559 -83226 1392 14327 -28996 -64265 -19912 84139 158169
14919 158169 183463 190205 167670 69158 -116875 -334860 -533341 -731534 -905791 -975538 -916300
14908 -916300 -722340 -433177 -200080 -122958 -173378 -268929 -279325 -215501 -195677 -209816 -180844
14897 -180844 -85619 44518 129616 129366 121138 159749 197081 211719 232450 268359 279331 246703
14885 246703 190290 125745 54321 14582 31249 59626 39758 -65023 -215604 -318210 -317783
14874 -317783 -282665 -331257 -461983 -580620 -634257 -626173 -574297 -495156 -387288 -244076 -130321
14863 -130321 -99980 -130105 -171390 -207594 -260709 -284055 -165661 75227 308200 496412 642065
14852 642065 726462 729010 658775 562808 470503 406355 393933 411232 395697 352579 350689 372981
14840 372981 357449 307879 243845 209515 209970 198756 167875 129681 104484 105726 155936 237603
14828 237603 306804 355990 369338 350982 340379 321780 250488 169573 165003 258660 392687
14817 392687 527788 656791 742042 803960 875433 904857 828384 692982 568237 478603 451516
14806 451516 480707 513643 477410 385762 301007 258774 250766 231848 177243 98037 28374 44403
14794 44403 152763 262362 292414 222191 93880 -6138 -57529 -111715 -172807 -212514 -242833
14783 -242833 -295359 -377296 -486159 -592006 -631521 -581963 -426847 -186173 30178 167914
14773 167914 240220 282696 315459 341065 334806 243644 54914 -178296 -348933 -390954 -327310
14762 -327310 -208560 -44025 120976 188243 141431 87227 111884 229660 395780 514734
14752 514734 559506 620659 723367 790865 807133 789143 740881 691262 634873 543484 408531
14741 408531 261188 123940 -9807 -133227 -249669 -303074 -256984 -174169 -159013 -244105
14731 -244105 -405357 -529348 -512640 -418000 -366547 -378280 -435328 -544833 -693398 -793604
14721 -793604 -763551 -624439 -459602 -347250 -317427 -352094 -417075 -500321 -584240 -597978 -522702
14710 -522702 -459334 -443039 -424670 -404505 -365286 -277862 -123719 58852 187779 242938 239905
14699 239905 196790 156457 143191 159056 177163 157685 92427 25747 -15571 -51497 -106334
14688 -106334 -211211 -316085 -306355 -160606 41168 216261 304928 310132 288926 265594 246600
14677 246600 266963 303843 345736 395927 445016 511328 560027 523542 403449 198828 -90189
14666 -90189 -387337 -602461 -704440 -721951 -696381 -635592 -544594 -469988 -467727 -489462 -461758
14655 -461758 -381781 -279879 -196246 -144771 -121568 -144483 -166644 -143907 -106472 -76081 -77775
14644 -77775 -106293 -88743 4174 89034 101423 68994 -8308 -153563 -326271 -446526 -497395
14633 -497395 -490787 -425340 -330942 -265636 -253171 -265183 -289904 -330058 -379343 -444886 -504764 -524830
14621 -524830 -511440 -426173 -262589 -98391 -57544 -187561 -391895 -555633 -596808 -529264
14611 -529264 -460962 -458081 -490903 -505927 -471253 -405278 -346769 -314662 -319851 -361404 -410012 -409740
14599 -409740 -353218 -278948 -191549 -96983 -23052 -18558 -70390 -115051 -123315 -99224 -32602 64609
14587 64609 126336 83573 -47094 -181057 -275816 -317225 -356185 -397184 -371884 -307394 -257974
14576 -257974 -246426 -263221 -255525 -216594 -135128 -16070 66734 44003 -59803 -190019 -304740
14565 -304740 -361440 -379617 -422494 -505925 -603451 -675786 -694697 -696586 -732339 -778376 -772740 -698765
14553 -698765 -547827 -327779 -128528 -54970 -86560 -118860 -79856 1890 18419 -55963 -138062
14542 -138062 -219206 -350469 -538019 -712847 -808915 -830524 -798550 -734352 -626834 -446909
14532 -446909 -243292 -104166 2581 121521 233056 320266 352797 305325 198735 58406
14522 58406 -111474 -309215 -484205 -578500 -578769 -518289 -399688 -196479 11588 108012 53969
14511 53969 -108547 -266716 -347996 -347313 -254590 -86074 49348 51727 2616 23944 86161
14500 86161 133616 153407 95961 -3687 -44605 -25035 -2806 31976 119978 233452 311262
14489 311262 342177 326824 226334 26806 -212987 -405929 -524690 -582388 -602331 -591872
14479 -591872 -548623 -488551 -418490 -319821 -171325 2654 141232 199503 186535 134293 78752
14468 78752 38722 -6565 -91046 -210543 -245466 -124263 56320 169732 154367 49044 -68843
14457 -68843 -149106 -174109 -168639 -200507 -232974 -180621 -33368 175109 369946 524665 662398
14446 662398 742932 730627 670060 618876 583643 524023 432196 345394 298335 255268 191191
14435 191191 120728 31567 -88446 -179889 -173336 -85694 42573 182235 293032 343721 353310
14424 353310 347797 321945 241198 80422 -104253 -198446 -201591 -204477 -206178 -157378 -63156 2163
14412 2163 10623 36419 114953 167963 134950 44293 -22984 -28556 7949 63900 114455 115013 61090
14399 61090 1293 -12097 34763 150103 319214 453741 487564 463261 440670 405098 283184
14388 283184 57287 -178173 -349219 -405910 -385424 -370073 -367141 -377660 -410252 -466460 -540077
14377 -540077 -612175 -664651 -677765 -649587 -586763 -475747 -380214 -387500 -453964 -464149 -392324
14366 -392324 -295140 -218114 -163665 -85636 23226 126648 179549 160307 119373 113327 143184
14355 143184 172301 182954 139288 -18533 -311544 -674368 -939346 -983607 -858236 -692058
14345 -692058 -553817 -438732 -324998 -233970 -184263 -189820 -234792 -272235 -263968 -168564 21605
14334 21605 213870 316135 338342 344077 373685 422861 486704 541344 534598 473022 403010 326988
14322 326988 249281 207867 222138 313402 450365 575593 697718 845361 965272 946301
14312 946301 763897 519189 334710 271758 289142 297648 299738 274142 152153 -58530 -267818
14301 -267818 -405286 -477711 -473221 -371109 -216234 -97158 -32909 67326 273127 512997
14291 512997 629540 585110 455398 286176 120506 29892 45291 132591 229965 304339 380024
14280 380024 441216 425186 324594 206585 120718 56567 -10698 -82484 -174604 -289181 -385369
14269 -385369 -423715 -397893 -318639 -222776 -139506 -52379 49589 134841 163721 137917 108309
14258 108309 92292 48287 -48902 -166885 -258575 -307577 -334707 -367808 -397015 -408034 -438185
14247 -438185 -522088 -644032 -791078 -875002 -816623 -666077 -521528 -396077 -271543 -182366
14237 -182366 -165824 -225928 -310285 -371393 -412006 -442469 -424509 -357387 -310836 -304185 -304730 -282748
14225 -282748 -269918 -314809 -410024 -477942 -437226 -306730 -175188 -116302 -116611 -110284 -50494 52199
14213 52199 166755 264605 290730 236290 175800 166237 213684 297179 363520 359119 306753 220711
14201 220711 98728 15121 6735 80016 246304 464596 624061 637901 528423 362474
14191 362474 171406 -26728 -179004 -281039 -349358 -335020 -276594 -252554 -239098 -184503 -74935
14180 -74935 64734 165795 209599 244792 274615 274234 235500 146462 -11780 -186841 -271185
14169 -271185 -237601 -139417 -5210 152536 273517 328540 357851 379318 346645 250327 132728
14158 132728 39626 26978 84108 119480 92751 16511 -68719 -177124 -371656 -567567 -657420
14147 -657420 -631348 -482790 -269293 -103003 -30839 -44354 -109999 -167047 -116432 23561 90593
14136 90593 17690 -102422 -148607 -72913 80822 219435 276392 248962 207067 222791 297839
14125 297839 372133 408981 414148 393103 329559 154750 -161739 -505090 -730946 -742802 -537148
14114 -537148 -227727 62612 254002 309289 270014 212993 220814 295866 395040 494443 591750
14103 591750 676350 718336 687740 589882 510709 474605 405732 273089 152305 108921 131686
14092 131686 166351 139658 15372 -117534 -207584 -276893 -279391 -189969 -75584 -15109 -33431
14081 -33431 -110321 -172285 -135470 -12854 172516 372535 505975 549295 533201 478365 395371
14070 395371 297656 150415 -14044 -98183 -48607 84865 214690 319921 390351 412347
14060 412347 405400 403697 421261 469922 536197 577102 550103 453005 362263 324836 315003 331068
14048 331068 373218 434377 467055 402967 267968 156106 132426 194373 290088 371878 377403
14037 377403 299600 204196 110174 18816 -55361 -109346 -143684 -139920 -94937 -39925 -10436 -31852
14025 -31852 -98605 -177259 -228995 -239852 -257116 -309040 -367531 -406885 -394998 -347374 -321000 -312144
14013 -312144 -269965 -141332 61684 223886 250749 123823 -108064 -335216 -441770 -388111
14003 -388111 -245835 -67819 136281 293228 323420 222777 18324 -236674 -423759 -485847
13993 -485847 -509487 -544552 -539066 -481509 -459626 -488835 -528303 -524594 -467802 -412346 -365488 -296332
13981 -296332 -189532 -70130 27170 65940 56166 37255 20783 -5159 -78537 -200478 -251079
13970 -251079 -154461 -11068 52122 53977 44840 22065 -7466 -70952 -198996 -331847 -394063
13959 -394063 -410225 -480835 -592152 -603414 -462488 -257751 -71509 50423 108386 151069
13949 151069 169052 127290 104063 165085 220548 171086 36795 -91658 -129400 -75574 -15173
13938 -15173 11480 47640 102553 113195 91877 123500 201347 267659 302453 305264 256312 177722
13926 177722 122787 104898 87262 53947 53786 78218 88463 132241 237453 333140 377533 424506
13914 424506 511155 592752 608373 535849 412253 249514 51374 -100742 -136012 -95155 -36996
13903 -36996 41961 112356 108139 29781 -86569 -192080 -229904 -194568 -125556 -61556 -35448
13892 -35448 -81416 -160467 -199608 -153426 -11135 194009 413928 567624 561563 403616 206515
13881 206515 62883 83499 289472 502612 557811 484216 430499 443943 418646 300104 162054
13870 162054 105698 151010 217485 205168 99781 -30700 -126952 -148963 -104849 -82327 -143144
13859 -143144 -226386 -230440 -185289 -173546 -168495 -114240 -23044 43390 21652 -54711 -103942 -107712
13847 -107712 -119677 -178816 -246116 -264655 -234741 -198819 -205339 -218571 -201699 -184894 -172744 -150032
13835 -150032 -129410 -87961 -3316 65008 42253 -69593 -183246 -222357 -148883 17146 238352
13824 238352 449696 573963 544267 350512 90688 -127402 -274515 -328768 -286325 -226559
13814 -226559 -224674 -250462 -272583 -276922 -229962 -158432 -136307 -220099 -384239 -516056 -563112
13803 -563112 -538563 -468148 -403380 -363921 -314761 -207056 -36254 113841 194341 276206 392400
13792 392400 502262 544476 495708 425539 409063 438098 514226 680706 919556 1106477 1128573
13781 1128573 1004950 829561 690962 626662 577546 496922 347569 100571 -168932 -327715
13771 -327715 -330046 -222698 -66838 62840 166216 286273 373899 364557 278608 147164 -39659
13760 -39659 -236955 -398107 -506191 -565625 -581479 -541252 -474358 -440671 -466504 -487473 -469867
13749 -469867 -461180 -484571 -517436 -558180 -545057 -414471 -243145 -116760 -78526 -125573 -203547
13738 -203547 -258997 -223358 -57542 150240 280490 282912 199251 143069 128221 59084 -58789
13727 -58789 -151119 -209404 -270765 -358329 -462657 -517144 -470367 -353716 -222886 -93053 56549
13716 56549 223787 349193 404646 417290 410913 396867 372140 326017 245709 150723 48741
13705 48741 -54724 -157218 -271154 -369131 -411875 -379859 -281822 -215342 -249561 -298327 -264820
13694 -264820 -160740 -59087 -40944 -109032 -188949 -216769 -202547 -199379 -231941 -292876 -384007
13683 -384007 -476368 -508369 -470394 -416652 -391603 -384646 -346209 -251584 -112025 28721 157673
13672 157673 293643 359057 280955 128529 17389 4593 91347 234628 322452 279595 145831
13661 145831 30783 9333 28006 -20036 -153585 -350424 -593364 -818818 -968509 -1030686
13651 -1030686 -1039559 -1041504 -1009593 -949259 -861174 -688829 -483287 -367368 -351551 -331192 -270190
13640 -270190 -212155 -174390 -108893 57056 293464 496350 660882 793927 845829 787097
13630 787097 648543 487223 336414 202334 96066 -1512 -80485 -106698 -84791 -15131
13620 -15131 115565 253257 335797 357969 398508 506224 601348 604626 535315 475948 480399
13609 480399 550306 663871 767565 782588 703305 582754 427373 248239 91145 -9205
13599 -9205 -52731 -67264 -85666 -127877 -224058 -387794 -570619 -719366 -827367 -893095 -885609
13588 -885609 -803750 -664031 -509659 -377631 -278036 -197310 -113820 -29090 53799 93759 84006
13577 84006 76860 87612 126955 199397 274742 301273 250682 140738 43348 52699 193119 379046
13565 379046 538135 659797 717542 686106 620975 577328 554478 481431 316863 162191 109424
13554 109424 112104 72454 -29625 -78891 6188 161256 298494 393849 458059 506824 528855
13543 528855 560582 659970 766046 768104 662740 494501 312169 196542 164039 137030 101012
13532 101012 100698 118575 137484 183435 289717 460875 655242 787022 796262 714222 637080
13521 637080 608131 571090 490768 408056 374461 398425 423585 403700 371578 376777 385179 341636
13509 341636 246568 148386 88412 101771 207379 345615 444662 485834 512447 573465 636063
13498 636063 639394 565730 429844 246452 27463 -158014 -257541 -283891 -292024 -322706 -366511
13487 -366511 -407131 -436664 -464242 -496703 -539664 -569822 -562399 -495974 -369960 -226424 -93363
13476 -93363 46463 211003 345455 406680 433899 490672 572806 630654 673087 685485 550799
13465 550799 257936 -58795 -296678 -413804 -449350 -429224 -326564 -164117 -25585 19285
13455 19285 23482 58041 119473 176434 187930 151020 128664 146667 180221 231420 292019 353493
13443 353493 388223 380083 337344 286275 306395 417799 550684 661382 719370 652230 480635
13432 480635 384511 461575 629283 793781 935067 1035085 1078130 1070188 983797 804123 590142
13421 590142 388921 226417 129062 107413 130295 156297 179525 198431 253544 355946 431626
13410 431626 433839 395196 368260 346407 313864 259824 188779 134718 94952 45652 -1626 -11403
13398 -11403 32327 103247 157124 191246 229576 235350 183905 94260 2373 6233 158238 376220
13386 376220 542891 662822 791866 919638 1021054 1120050 1219373 1266239 1241408 1207638
13376 1207638 1231002 1283288 1338324 1360581 1296396 1174466 1053164 957414 876498 805305 714932
13365 714932 562668 419091 360342 362776 357850 293881 178288 73583 70793 210544 447187
13354 447187 664118 787225 831645 793178 673694 570445 519662 437425 278737 113005
13344 113005 17615 -20355 -7088 46845 109273 177997 292963 427159 493329 481899 459580
13333 459580 443586 429137 446691 464559 396079 302811 301233 351104 364296 339663 353705 423896
13321 423896 474599 469981 440846 435276 476046 529491 547778 521505 446084 311298 164821
13310 164821 92202 99566 176785 320530 488378 611463 677682 747534 810928 832284 819949
13299 819949 805476 851151 979903 1102415 1118693 1032134 943969 912873 864403 711581 510493
13288 510493 344684 263554 315675 443495 550522 651315 748077 801299 788040 708321 617676
13277 617676 581313 600855 595804 526303 440049 350190 269927 226681 218976 274291 394076 525373
13265 525373 638837 742632 815585 852680 852642 797832 744632 758623 804989 826846 808152 738314
13253 738314 656631 638587 696719 770570 796833 766410 728039 736715 806686 914274 1037507
13242 1037507 1140556 1188013 1200688 1188739 1147639 1077142 965159 832462 710350 638072
13232 638072 635671 716981 874052 1063974 1258904 1386909 1373148 1233898 1064196 938984
13222 938984 848858 786995 768919 781071 828554 921455 1008332 1013467 958705 900089 811712 679237
13210 679237 592945 619647 714151 790678 825814 856399 912924 1044020 1220232 1331682 1356834
13199 1356834 1364356 1382572 1385634 1380612 1384187 1426943 1519474 1580975 1576807 1541998 1501643 1464004
13187 1464004 1455360 1472059 1477229 1429366 1337425 1219674 1112921 1055872 1047723 1075163 1136426
13176 1136426 1220518 1267705 1240825 1180184 1142326 1132754 1134204 1156250 1222296 1353178 1506665
13165 1506665 1547822 1461606 1389860 1380175 1347200 1263465 1198388 1225798 1349433 1504745 1612495
13154 1612495 1626836 1615824 1642967 1647547 1598995 1553431 1563052 1624800 1686595 1707793 1666005 1568497
13142 1568497 1496858 1530267 1634948 1750929 1868533 1954965 1994178 2011504 1992039 1948377 1927273
13131 1927273 1906063 1848968 1807359 1830433 1899989 1971726 2000541 1965736 1868770 1772186 1767762
13120 1767762 1828518 1880542 1885499 1865706 1853180 1838892 1851792 1908066 1955380 1965861 1952560
13109 1952560 1913312 1818741 1642421 1463764 1442535 1601713 1832703 2035634 2166764 2240509
13099 2240509 2255920 2205726 2121111 2021659 1951500 1951742 1975461 1988319 2017242 2077177 2128692 2177038
13087 2177038 2285004 2486394 2738298 2981835 3185169 3325111 3372839 3351924 3329232 3357726
13077 3357726 3451042 3588265 3737787 3848738 3858570 3748995 3579736 3475118 3472740 3509441
13067 3509441 3566196 3679765 3806885 3817867 3646938 3375860 3173815 3168574 3325605 3527816
13057 3527816 3701255 3826222 3920926 3995604 4026932 3969364 3848395 3745940 3746287 3896512 4160960
13046 4160960 4459982 4726625 4974394 5206226 5382617 5494630 5556917 5569898 5542806 5507518
13036 5507518 5479877 5487001 5575073 5701521 5809618 5904827 5944277 5899341 5872159 5960303 6128143
13025 6128143 6290602 6385819 6425193 6540389 6815402 7178993 7533763 7793951 7945060 8081209
13015 8081209 8256282 8458836 8702724 8981120 9279654 9609811 9969763 10352223 10737395
13006 10737395 11134939 11623749 12231914 12928728 13682196 14462999 15282321 16154771 17068662
12997 17068662 18011117 19045765 20283624 21773635 23476093 25372383 27530598 30047257
12989 30047257 32956599 36296287 40216720 44868591 50340665 56783676 64526364 73918919
12981 73918919 85240157 98886103 115448156 135643502 160198710 189788662 224936165
12974 224936165 265194404 307591334 345038142 367001129 365042342 339643045 299850639
12967 299850639 256249408 215728637 181016900 152346828 128988378 109990965 94489357
12960 94489357 81788965 71353588 62762282 55603910 49568198 44480778 40194102 36604941
12952 36604941 33628383 31126762 28937513 26921624 25057609 23405332 21941744 20610664
12944 20610664 19419629 18404828 17601864 16995683 16505420 16001795 15421308 14824962 14318342
12935 14318342 13959812 13772196 13724581 13694259 13614805 13549453 13549589 13548431 13465442 13383496 13454352
12924 13454352 13666230 13901547 14156789 14513630 14994760 15583528 16279517 17126372 18198558
12915 18198558 19427225 20676778 21896902 23002115 23861410 24483326 25068665 25798879 26746120
12906 26746120 27961729 29527265 31477179 33806927 36553785 39832710 43791945 48607174
12898 48607174 54421761 61367216 69642168 79520368 91349515 105652243 123129689 144532788
12890 144532788 170667189 202330621 239810513 281980285 324676290 359269716 374684111
12883 374684111 364365773 332065577 288689097 244391844 204716766 171418347 144292361
12876 144292361 122381954 104622013 90117530 78227835 68489141 60516892 54011284
12869 54011284 48729233 44393339 40739011 37605019 34911631 32588157 30547646 28666013
12861 28666013 26802127 24962151 23298136 21867105 20604098 19475486 18480546 17647173
12853 17647173 16956060 16395249 15967882 15630324 15308237 14929666 14516986 14170767 13934213
12844 13934213 13783448 13645205 13465365 13287646 13157693 13060185 12986405 12970330 13076408 13307711
12834 13307711 13588558 13884481 14183832 14501601 14869979 15279806 15715625 16173195 16731487
12825 16731487 17455368 18287708 19136579 20050277 21198996 22681189 24480171 26537313 28862212
12816 28862212 31522064 34646415 38351884 42714775 47882720 54051617 61431165 70254495
12808 70254495 80798673 93467109 108833347 127538069 150315915 177980933 211124055
12801 211124055 249631277 291610869 331653777 360208315 367224535 349449261 313369520
12794 313369520 269813208 227294942 189918421 158677766 133175611 112559880 95902977
12787 95902977 82324667 71139519 61887315 54212182 47803553 42381199 37733551 33739981
12779 33739981 30331386 27421626 24923000 22749448 20834478 19097199 17484395 16017294
12771 16017294 14704526 13563497 12613816 11834991 11159205 10528821 9939034 9367604 8805618
12762 8805618 8287269 7826308 7386328 6951359 6604044 6376168 6157702 5824804 5368586
12753 5368586 4910709 4557063 4285488 4011817 3739133 3563531 3503378 3506276 3508795 3461493
12743 3461493 3402433 3382829 3399932 3411274 3337545 3124901 2816365 2511595 2270078 2137528
12733 2137528 2133171 2154758 2108781 2023057 1952497 1887277 1826539 1833142 1921408 2021706 2059242
12722 2059242 2025291 1912314 1684336 1395928 1123263 918768 840692 888915 1011927 1162479
12712 1162479 1307417 1409817 1451028 1435049 1424766 1494504 1626323 1759634 1850906 1869219
12702 1869219 1815447 1730741 1659067 1620344 1602278 1614678 1701222 1863378 2061151 2289608 2574972
12691 2574972 2888142 3129872 3256473 3253835 3049856 2677800 2321410 2068760 1875112 1674653
12681 1674653 1417304 1146205 964751 881983 814834 696789 582574 559217 585880 610092
12671 610092 628137 584093 449430 284944 153755 103759 130406 169169 179671 170034 177898
12660 177898 218884 281267 324843 278901 144710 35931 55371 134486 132911 57991 12954
12649 12954 23936 45177 78599 144007 222337 271740 262943 263620 321173 370467 357116 294717
12637 294717 215804 181008 252836 405554 536638 571463 493189 368426 260216 222247 293555
12626 293555 444014 583527 648750 640188 597137 604518 673851 721859 703710 641172 553462
12615 553462 452052 306542 99875 -61465 -108113 -97733 -96414 -116854 -142382 -158142 -174833
12604 -174833 -215976 -287839 -353890 -381945 -391277 -409439 -437950 -464168 -461915 -407951 -306294 -192866
12592 -192866 -130721 -143986 -163575 -126008 -72365 -39358 -21274 -1328 21388 27529 44131 85209
12580 85209 85583 -23812 -221095 -408319 -517566 -555272 -546714 -504135 -437552 -368895 -308382
12569 -308382 -190907 20283 251131 415301 493528 486442 393556 269073 188153 165371 150944
12558 150944 134520 143064 138138 110323 76187 -7648 -156081 -331797 -479886 -557855 -575457
12547 -575457 -565220 -573843 -621603 -657099 -622808 -504405 -300834 -43792 212737 439324 628142
12536 628142 776548 846313 798533 664102 515160 359813 210068 120456 84351 16234
12526 16234 -97776 -154604 -81561 118368 312626 379503 361730 343465 328185 224918 26388
12515 26388 -130622 -185715 -213803 -261086 -317729 -387698 -482939 -595928 -742128 -918011 -1042297
12504 -1042297 -1006082 -818136 -599546 -423704 -327707 -350032 -443400 -486225 -422185 -289906
12494 -289906 -133962 -864 45577 205 -68444 -66442 16203 91443 107687 59042 -65243
12483 -65243 -226795 -330116 -388526 -479863 -569904 -587344 -508842 -371448 -276976 -268116 -259941
12472 -259941 -201284 -116992 -32219 66635 198598 366664 577483 779524 876936 848137 722984
12461 722984 540475 376688 296854 286622 267081 170370 11635 -141358 -253194 -317155
12451 -317155 -380648 -468005 -559510 -628677 -622509 -559445 -498350 -433946 -354891 -279621 -205297 -128730
12439 -128730 -71030 -37073 2956 25378 19844 26358 87475 209014 362994 506519 610348
12428 610348 671162 693452 714169 738124 709526 632904 569620 513264 417624 282190 154536
12417 154536 95851 103242 134526 181782 229392 242270 214899 185654 180204 196140 205033 164311
12405 164311 118094 162481 286359 372818 366210 318952 333222 426865 545316 657666 741124
12394 741124 778485 755013 607174 355248 116580 -38593 -103801 -79093 -42562 -121843 -295912
12383 -295912 -460112 -558616 -598155 -596830 -570584 -522251 -442452 -366454 -319828 -273870 -212972
12372 -212972 -171688 -150626 -83052 45176 168170 246989 285768 297188 311006 321419 272797
12361 272797 175400 123317 133800 146310 173020 240963 311375 365960 452114 547156 553244 465939
12349 465939 346929 264309 232665 228097 191752 108012 37153 -4067 -15519 -5676 37987 147287
12337 147287 281645 411989 546376 650304 684829 659029 647662 666383 656531 591840 445869
12326 445869 210248 -59328 -327645 -589702 -789251 -885547 -906071 -887980 -857434 -831685
12316 -831685 -828509 -851201 -843210 -767163 -681891 -611303 -551972 -541480 -643580 -856761 -1063052
12305 -1063052 -1179562 -1209417 -1199598 -1172306 -1137822 -1112633 -1072135 -978849 -826290 -651413 -465614
12294 -465614 -285285 -164239 -141564 -200293 -295992 -383190 -364160 -236595 -150159 -153686 -156499
12283 -156499 -147032 -161813 -213395 -301181 -400001 -475203 -504876 -446011 -275287 -48437 177857
12272 177857 384748 556665 663515 663902 546682 349608 123736 -101992 -295672 -451131
12262 -451131 -584588 -652767 -610282 -484199 -308800 -135674 -53405 -113635 -272997 -453314
12252 -453314 -585583 -652561 -645208 -594440 -562421 -541696 -505274 -442366 -380574 -363180 -388525
12241 -388525 -425356 -462170 -498414 -522700 -513086 -461979 -378192 -284900 -251091 -335009 -515671
12230 -515671 -708280 -854768 -931650 -936707 -929957 -916893 -845477 -694004 -475304 -256792 -114219
12219 -114219 -57546 -33503 -10261 -26077 -120973 -236719 -279478 -223975 -143718 -162813 -300222
12208 -300222 -446705 -490557 -387888 -194624 24597 247778 423834 473792 414695 320296
12198 320296 217329 141032 124566 104966 16784 -113182 -227924 -308132 -370910 -442937 -523308
12187 -523308 -621792 -727172 -779413 -756814 -635185 -388490 -113752 88734 230824 318330
12177 318330 309021 215531 96264 -33484 -156671 -181814 -69207 124384 300110 402973
12167 402973 451054 443948 341340 151729 -65956 -298389 -515348 -639329 -630675 -563740 -519327
12156 -519327 -468609 -399935 -345840 -243281 -54608 156287 331547 411374 358487 210094
12146 210094 63162 -28249 -130904 -305846 -450052 -408428 -222230 -40131 68888 120526
12136 120526 141087 137615 135895 146082 165279 217232 309020 393524 398292 305253 191309 186406
12124 186406 320799 484413 576716 575916 517957 444849 363385 286780 254286 267837 284727
12113 284727 291705 291712 269723 269546 388443 597723 736741 708553 531355 320551 233229 315462
12101 315462 455225 483209 385412 301096 279751 239269 111153 -104869 -370084 -622323
12091 -622323 -802101 -889117 -915235 -926901 -941024 -944400 -911541 -840472 -722641 -570816 -433879
12080 -433879 -347629 -332462 -364650 -386735 -402649 -414425 -338531 -143277 60506 188643 278189
12069 278189 365290 420992 415145 327825 169532 -7820 -167786 -279177 -313244 -298646 -252734
12058 -252734 -186386 -134389 -146939 -220351 -245468 -206050 -176601 -174652 -231162 -369103 -553558
12047 -553558 -669216 -622657 -461663 -304717 -255880 -326021 -386494 -337901 -223802 -135057 -137338
12036 -137338 -262447 -452022 -591998 -561825 -349886 -67669 164503 352864 531182 670333
12026 670333 755763 792511 763351 638384 476773 367049 296663 226918 148896 75155 25064
12015 25064 -33457 -113399 -158963 -148404 -99433 -25296 52958 89910 43447 -58966 -174757
12004 -174757 -273596 -284676 -189886 -87221 -39708 -50842 -125790 -212483 -239870 -196532 -138534
11993 -138534 -147046 -245609 -376658 -464902 -467146 -397366 -299934 -190974 -53083 63756 138504
11982 138504 236327 306878 290789 278892 322000 351834 350711 321481 277118 272360 277697 243010
11970 243010 224850 277165 374132 526422 727248 828780 731148 501209 290760 176692
11960 176692 135271 126183 121187 117979 100740 86098 102173 147940 206118 249521 248122 207581
11948 207581 195330 209355 223953 288114 428407 607682 780845 905797 958690 1010149 1111131
11937 1111131 1216392 1292544 1390071 1607112 1982191 2422238 2732369 2811056 2663276 2340970
11927 2340970 1969215 1671169 1463652 1336657 1263127 1186894 1060002 903064 784915 725028
11917 725028 707653 721621 755407 807876 889555 956000 976937 950103 849035 719744 663370
11906 663370 673322 635497 502961 336947 210245 105865 -33692 -213093 -395326 -567625
11896 -567625 -710236 -792805 -776404 -658539 -504758 -421631 -468999 -625149 -797995 -911678
11886 -911678 -948532 -909855 -820102 -697019 -534980 -372121 -287327 -318960 -428781 -582053
11876 -582053 -726942 -763290 -632581 -394170 -145637 36734 110847 118795 124457 123555 76141
11865 76141 30009 135621 446181 852522 1194648 1378902 1390933 1251839 1032242 807758
11855 807758 584156 383724 221319 79275 -24115 -86161 -118987 -109369 -40483 67468
11845 67468 180821 270633 289372 203889 79088 19124 70148 182964 275140 286073 210203
11834 210203 131086 144334 224527 319525 394789 440184 454824 419818 318819 163531 -22654
11823 -22654 -215987 -413084 -597455 -716184 -714925 -585450 -358685 -109107 82188 182620
11813 182620 208376 192745 146170 41341 -119660 -254676 -307046 -255507 -126058 3807
11803 3807 76616 78221 24599 -70022 -147693 -169559 -177409 -186264 -139829 -26686 52506 40467
11791 40467 -96641 -238026 -155840 48958 135121 39907 -162604 -317848 -341991 -289174 -220856
11780 -220856 -149752 -79079 -19438 86258 228011 298714 267566 197088 163423 134382 62766
11769 62766 -7314 -46057 -67519 -88045 -122270 -153724 -162878 -152884 -140204 -127570 -132543 -133525 -113039
11756 -113039 -92481 -108264 -185229 -257592 -230341 -148972 -108671 -168899 -283537 -379706 -509184
11745 -509184 -656502 -694064 -603579 -482422 -377642 -310491 -319202 -378072 -437782 -494140 -551482
11734 -551482 -578531 -515315 -368790 -210000 -116794 -104469 -132033 -119664 -28636 64811 106658
11723 106658 73876 -24657 -115075 -176771 -252511 -343814 -344976 -245926 -177626 -229490 -380505
11712 -380505 -506603 -518866 -421364 -258853 -126723 -61483 -25712 -2681 8597 -5549 -89075
11701 -89075 -224735 -343084 -395970 -361489 -271207 -182917 -130504 -142974 -172722 -155477 -127704
11690 -127704 -107017 -31539 136935 322017 473557 611342 675939 607751 497991 471715
11680 471715 502957 511912 458976 327031 143495 -41239 -192756 -297884 -370251 -477324
11670 -477324 -625958 -755801 -800861 -729072 -559033 -358514 -213792 -130831 -98731 -138034
11660 -138034 -234317 -316595 -358014 -421814 -525812 -615862 -674235 -705587 -692549 -595486 -425567
11649 -425567 -276092 -220840 -249005 -302788 -333641 -315859 -306046 -344917 -377800 -365574 -321081
11638 -321081 -226761 -57636 158806 352763 469478 506746 494051 495361 532642 558423 529565
11627 529565 466734 368150 200266 -13176 -238757 -432965 -508749 -443186 -354123 -360873 -429935
11616 -429935 -467549 -439678 -380295 -364214 -434078 -525019 -521154 -373235 -166918 -18950 24503
11605 24503 14060 7097 -44723 -143862 -177123 -77605 103344 277208 369792 356976 304568
11594 304568 264201 222789 214270 260580 298118 292218 259202 187737 80218 -322 2793 57693
11582 57693 108845 129052 130844 156565 217368 304246 479366 771924 1104783 1361717 1477444
11571 1477444 1483685 1403066 1259715 1106229 982094 908056 875794 846342 801129 747213 644410
11560 644410 478300 322581 226367 149633 54479 -40544 -111806 -152208 -111082 62919 324322
11549 324322 576557 761761 871844 854958 707190 529402 435044 417550 423364 470567 567515
11538 567515 673228 740767 739249 643484 494142 375656 289271 189788 52084 -102294 -281895
11527 -281895 -456575 -551259 -496508 -243401 136266 467270 667864 762106 835603 938558
11517 938558 1098866 1367925 1646894 1826432 2014770 2312672 2582608 2701707 2662277 2471456
11507 2471456 2156339 1769929 1427463 1224017 1094362 950640 825128 746969 660726 538590
11497 538590 422391 357253 320135 284644 266420 256683 228374 188684 145316 113802 124986
11486 124986 192086 283927 338369 308752 226220 149731 140155 169853 161724 112299 40646 -20635
11474 -20635 -23539 42415 149765 201305 147059 4616 -215314 -458107 -654351 -763601 -809222
11463 -809222 -843001 -896564 -1011788 -1147579 -1190136 -1128966 -1031588 -906940 -717473 -526780
11453 -526780 -412926 -366058 -385627 -462881 -544791 -546756 -453502 -359018 -306267 -273240 -262540
11442 -262540 -310443 -351936 -261846 -62464 147810 309722 403590 443815 491029 587997 661415
11431 661415 615196 436349 210478 66421 36282 71482 146516 189410 150847 55456 -69838
11420 -69838 -164735 -177540 -136619 -125555 -183876 -263762 -299579 -274775 -235472 -229212 -241849 -235561
11408 -235561 -250460 -343162 -470843 -554296 -576458 -554532 -518610 -517548 -555137 -580789 -511497
11397 -511497 -346681 -193072 -166714 -282502 -402472 -408483 -324807 -232274 -102553 100909
11387 100909 283147 360662 337894 214404 12593 -183898 -286796 -260489 -210144 -285890
11377 -285890 -459596 -613393 -693560 -700120 -604057 -399338 -182967 -74431 -107788 -245803
11367 -245803 -430052 -597187 -683657 -696955 -701840 -652446 -529349 -381392 -193570 3235
11357 3235 125443 166123 196524 254648 310567 319889 255968 102875 -126531 -335683 -426767
11346 -426767 -357774 -168966 70331 340750 600578 753210 795389 791314 780350 771378 741523
11335 741523 679631 617223 543107 426545 319754 241854 133078 -31465 -209243 -313570
11325 -313570 -294521 -194039 -108750 -102994 -112065 -74421 -7096 81199 159548 145180 18368
11314 18368 -139181 -236591 -248130 -210272 -196321 -283603 -452226 -622019 -741638 -797407 -830922
11303 -830922 -835450 -769131 -663237 -542345 -383925 -175341 938 42572 -21063 -84270 -90553
11292 -90553 -61919 -47995 -69336 -84390 -63593 -30836 -1551 14796 -22730 -134756 -301672
11281 -301672 -467158 -576733 -599259 -529921 -403722 -248365 -103635 -11282 -4052 -122366
11271 -122366 -359940 -577504 -613113 -465001 -226951 26424 210720 257626 190709 82256
11261 82256 -16984 -67992 -87832 -147073 -269400 -388036 -435308 -450311 -454001 -380443 -264831
11250 -264831 -232717 -281640 -293878 -270076 -296781 -348668 -347640 -292013 -242801 -213570 -179947 -165723
11238 -165723 -182097 -229818 -312437 -399702 -471573 -519947 -499656 -402410 -272643 -182655 -164278
11227 -164278 -144445 -41324 140234 381079 658638 884487 986719 1005309 995398 943842
11217 943842 845894 770336 739747 691930 607400 511417 439966 435343 484156 492581 394595 222861
11205 222861 59700 -71515 -221582 -425502 -550610 -463406 -265953 -113697 -22710 42011
11195 42011 141302 274377 361254 415678 551366 836834 1188893 1424823 1426296 1274203 1111981
11184 1111981 987424 893414 867588 978495 1172848 1331136 1440984 1524007 1522225 1350383
11174 1350383 1074751 846422 690858 605674 580149 554801 499643 399823 263986 146053
11164 146053 92119 95924 156700 245755 250493 98611 -139358 -328415 -414769 -409574 -330626
11153 -330626 -237615 -204565 -218996 -229204 -201531 -170359 -172558 -142061 -5760 219297 428261
11142 428261 484527 374161 208820 99603 65057 110199 262774 437228 526821 526654 481425
11131 481425 444231 428714 423070 412802 377338 327183 320272 372725 402549 351048 244058 134758
11119 134758 21826 -111163 -229087 -252889 -190621 -120041 -48499 70426 210585 240811
11109 240811 129038 -7517 -73658 -94981 -116682 -150041 -222737 -285463 -265038 -224472 -269378
11098 -269378 -384161 -479921 -509929 -500141 -495249 -471425 -418588 -369262 -322894 -287846 -305187 -368091
11086 -368091 -414998 -390751 -287861 -140869 3702 81303 52968 -27224 -64954 -32540 28908
11075 28908 107570 162469 124694 7008 -93519 -99855 -65579 -83658 -97058 -45793 2968
11064 2968 -25373 -126179 -208974 -184400 -59502 102462 255125 403080 554203 646776 641013
11053 641013 563298 445979 317916 236956 227542 234950 216415 186940 135044 11615 -186833
11042 -186833 -375739 -458035 -421886 -334058 -280609 -268792 -249994 -220580 -224903 -304688 -458113
11031 -458113 -611979 -692332 -670815 -541979 -385789 -313411 -339884 -381996 -386288 -365553 -349838
11020 -349838 -346063 -367802 -414233 -466197 -531525 -590490 -596976 -507940 -315418 -88266 109815
11009 109815 261679 380792 455694 461170 433511 425991 449094 486073 515268 550378 624603
10998 624603 727150 772518 652697 405836 196098 42979 -179297 -481192 -765684 -933377
10988 -933377 -907219 -723295 -528162 -425518 -396202 -380029 -359982 -332638 -296368 -255124 -217894
10977 -217894 -191173 -180042 -153893 -89403 -55452 -113347 -248185 -368230 -384069 -287771 -175450
10966 -175450 -143930 -161233 -135349 -65058 -47363 -73705 -78328 -58244 -63885 -151488 -286844 -362020
10954 -362020 -338226 -253580 -131870 -8965 63491 71449 58539 68069 90904 77807 31314
10943 31314 10646 36388 83917 137757 189546 239425 298201 374429 454461 481049 414739 283951
10931 283951 127999 -4182 -34997 61343 178136 173264 29483 -144522 -238222 -247432 -269940
10920 -269940 -305541 -265721 -150388 -19306 116270 250854 339284 349469 323560 261562 89542
10909 89542 -109568 -195848 -206995 -251543 -314917 -313618 -216038 -87530 -14924 -37413 -96673
10898 -96673 -105855 -41199 63554 139682 144497 103337 35498 -37219 -52214 24840 141099 200961
10886 200961 185434 142791 126486 133466 83582 -13608 -63753 -12843 110871 220977 276487
10875 276487 289405 292267 309295 333646 330015 308917 312087 266884 99595 -123022 -305968
10864 -305968 -413022 -438179 -394343 -341805 -332881 -335451 -329226 -345625 -393959 -461933 -550240 -661192
10852 -661192 -787175 -892453 -904943 -760187 -476802 -178921 18436 82349 59434 1590
10842 1590 -87320 -174945 -208167 -150374 -22991 100727 189834 289906 428681 552634 654752
10831 654752 732657 770400 775038 730201 646311 565966 514028 471964 382385 238189 82084
10820 82084 -41003 -96538 -98830 -93338 -74540 1943 127563 212034 210174 151047 102434 101366
10808 101366 60979 -67194 -208975 -277458 -251603 -164706 -103127 -111652 -110498 -51354 28112
10797 28112 74123 119536 180838 189798 85732 -111767 -284683 -362199 -387116 -428343 -477718
10786 -477718 -484323 -448906 -422674 -433252 -450417 -418984 -354608 -325868 -330431 -343784 -352599 -352324
10774 -352324 -364879 -436164 -580584 -718377 -735250 -622778 -483115 -392256 -348282 -318867 -256664
10763 -256664 -120972 57494 162720 155903 131640 124768 112352 137103 216901 310253 366804
10752 366804 372919 369161 367984 339303 267130 191150 207014 332800 471381 580454 665251
10741 665251 690038 622476 488776 351081 242784 197682 260356 366781 437812 462993 465596
10730 465596 473080 500099 515625 456041 264720 -18243 -270181 -427391 -513295 -534167 -504799
10719 -504799 -479462 -452944 -344523 -81822 247537 477792 570405 549932 416904 202379
10709 202379 -48586 -294166 -469508 -526179 -506354 -461768 -416048 -409721 -463024 -555495 -621884
10698 -621884 -612350 -550918 -457980 -318618 -159695 7837 173749 245329 171822 53953 20246
10687 20246 77371 136223 151289 98235 -13824 -143445 -218376 -185332 -87787 7508 62688
10676 62688 80478 69769 73062 108336 159320 178348 127540 72572 110563 263932 477812
10665 477812 682363 805664 825774 818338 807376 745276 654201 656903 833132 1181011 1629402
10654 1629402 2032242 2320041 2501403 2537667 2422135 2253496 2106690 1973510 1839693 1718313
10644 1718313 1601967 1479068 1376244 1281165 1173389 1061958 982486 994028 1084871 1168402
10634 1168402 1179430 1129953 1059934 987464 874562 695118 489634 294156 102754 -75912
10624 -75912 -189502 -225430 -221207 -167366 -13625 179322 311884 317131 154752 -118170 -399946
10613 -399946 -607113 -687414 -649966 -568260 -516354 -514076 -518004 -453787 -305648 -183405 -198499
10602 -198499 -334044 -446915 -447809 -351357 -201842 -71550 -11161 15216 31734 -19479 -121069
10591 -121069 -205537 -273842 -335663 -333023 -272535 -276811 -379913 -499184 -587170 -637221 -636133 -584303
10579 -584303 -498415 -408909 -338005 -296025 -259523 -195696 -114091 -84695 -178324 -363519 -483140
10568 -483140 -448359 -368900 -377765 -477480 -596576 -655628 -609114 -481595 -340588 -223915 -124715
10557 -124715 -42993 30906 94183 118682 121936 140692 122519 53358 17607 81596 231362
10546 231362 404033 518540 512615 426355 321150 194265 48756 -40071 -22302 -5585 -102581
10535 -102581 -227857 -246348 -177395 -110327 -46791 12493 80575 218575 367467 416676 336542
10524 336542 118638 -168898 -380795 -468710 -501658 -539350 -605855 -658229 -665562 -679779 -725794
10513 -725794 -794029 -884003 -958560 -925370 -728115 -459893 -265799 -194939 -235711 -396811 -657789
10502 -657789 -884320 -987937 -980930 -875717 -694280 -520761 -424584 -418452 -483735 -527997 -497895
10491 -497895 -446784 -426714 -461571 -513939 -554824 -581040 -572990 -535409 -496512 -428015 -296792
10480 -296792 -190845 -200976 -282543 -341539 -323175 -217628 -104993 -43407 -12776 -22288 -76797
10469 -76797 -124051 -127204 -100403 -41922 56558 180927 292055 348699 295866 120898 -84833
10458 -84833 -232314 -261860 -155684 8264 122678 157985 147865 123489 79435 22140 9508
10447 9508 75933 159633 215550 288620 402611 532450 663468 759446 750675 628260 437029
10436 437029 246711 136205 133880 249884 445187 599208 683703 786717 944173 1101366
10426 1101366 1226473 1356205 1452255 1437860 1426773 1556398 1787546 1949049 1942822 1804336
10416 1804336 1579301 1304986 1044172 858882 739693 661998 628131 637090 658224 669212
10406 669212 691538 740434 721835 559693 382420 332492 378012 465705 593542 741589 885405
10395 885405 996169 997783 866145 677911 485168 330688 255273 207699 127393 22155
10385 22155 -86249 -175486 -247767 -290979 -289027 -259950 -193206 -101165 -63755 -131115 -246766
10374 -246766 -301263 -237013 -108107 29951 165872 262714 324564 353363 316700 248981 212167
10363 212167 209424 218855 273610 402523 588520 794065 952906 1022413 1023567 966232 843250
10352 843250 690424 600476 605456 641879 627441 546963 421812 289478 202018 143553 44729
10341 44729 -127068 -317817 -453482 -515568 -528814 -528508 -514638 -426351 -232109 16046 252042
10330 252042 448251 583581 630823 597835 525218 437083 358082 295288 228223 150887 121469
10319 121469 166674 233752 306562 414673 521342 532743 462433 383018 303926 238977 207787
10308 207787 197782 184326 197510 255731 293730 194537 -24639 -214382 -286691 -290790 -276983
10297 -276983 -240039 -202064 -187300 -158044 -77373 23655 107726 145504 98556 -32526 -173347
10286 -173347 -265257 -287163 -198338 -18141 194826 366936 453776 497629 521605 499632 439061
10275 439061 397357 397661 404571 397032 406981 523861 751135 951047 1025820 994012 912158 827816
10263 827816 808212 856404 913008 937081 893486 763587 570262 368864 183190 -34008
10253 -34008 -256803 -357680 -267019 -67279 125336 236147 242357 239952 382957 666385 908153
10242 908153 965379 848622 667713 543824 505544 513452 526642 518256 492775 451439 393948
10231 393948 342602 291713 191572 8925 -211097 -393776 -468051 -450075 -428531 -411756 -382749
10220 -382749 -373503 -378556 -387660 -399080 -406880 -438163 -528403 -625286 -620379 -490499 -358296 -294173
10208 -294173 -192043 3029 152814 132310 -55590 -370944 -688875 -897185 -999640 -1011725
10198 -1011725 -932277 -747972 -503039 -324153 -253354 -214495 -178233 -157640 -123401 -40444 61872
10187 61872 128305 133950 96694 66150 88035 185729 299964 330662 306898 328497 392880 444915
10175 444915 482992 540758 614284 666526 661784 622238 579770 486774 305660 95234 -90899
10164 -90899 -245264 -311787 -270984 -215677 -205614 -256814 -341333 -389905 -368820 -286939 -207545
10153 -207545 -155089 -49753 111069 169191 82188 -10623 -38166 -47219 -129882 -297165 -466662
10142 -466662 -563987 -584076 -557579 -478157 -365373 -271440 -190257 -72818 59480 189790 308319
10131 308319 380618 412230 425136 412932 391197 412181 498547 620431 763491 917154 1055819
10120 1055819 1194404 1325618 1469866 1698326 2030632 2430327 2890148 3421087 3974167
10111 3974167 4474447 4844779 4963037 4791123 4465824 4123540 3810970 3566069 3392248
10102 3392248 3220956 3006351 2780658 2536977 2263540 2019451 1887084 1854191 1825115 1723595
10092 1723595 1553382 1300955 950933 559983 216141 10681 -33478 6625 34285 -11457
10082 -11457 -113686 -191090 -180004 -66154 85167 196437 307381 476514 602909 551775
10072 551775 418043 383575 440773 470858 408116 255931 55028 -124788 -259471 -377388
10062 -377388 -459660 -468640 -378630 -211257 -103919 -144649 -244057 -292775 -284751 -265033 -214160
10051 -214160 -49873 223018 437929 506259 468602 338524 132146 -110501 -317651 -380214
10041 -380214 -301089 -193958 -165511 -273143 -467737 -645010 -744073 -786005 -802909 -803928 -796998
10030 -796998 -802064 -794871 -728573 -630132 -542825 -440576 -332149 -272331 -243730 -216540 -220315 -222497
10018 -222497 -195540 -157851 -79248 19084 75236 71966 43492 60497 152594 273731 374400
10007 374400 437384 456240 434318 395981 332349 237417 161783 130637 98600 -6767 -179403
9996 -179403 -297098 -279108 -179419 -83190 6895 107663 192611 274751 356116 410907 465001
9985 465001 498155 431989 272922 108834 1695 -95691 -231611 -394590 -558077 -688429
9975 -688429 -736685 -692824 -609825 -525148 -407239 -191050 83560 327231 518214 694590
9965 694590 898025 1145517 1401472 1622440 1826752 2028548 2211831 2356459 2466113 2526323
9955 2526323 2502724 2454533 2458549 2450908 2281421 1940557 1565195 1254666 1030581 875480 761872
9944 761872 684604 654427 637092 555047 400298 236504 75452 -59101 -124805 -133983 -108113
9933 -108113 -54326 -68585 -206488 -350805 -400051 -394105 -377802 -377646 -378047 -324834 -227771 -133634
9921 -133634 -94697 -125337 -192071 -242501 -252079 -226979 -170509 -105432 -59940 -43693 -83538 -193866
9909 -193866 -331407 -445622 -491939 -469470 -467662 -548058 -661125 -722663 -709611 -647463 -592985
9898 -592985 -572781 -559098 -550400 -557629 -536068 -440858 -299426 -195016 -174015 -226773 -352925
9887 -352925 -543589 -727888 -787423 -727107 -625570 -507085 -398774 -322114 -258280 -211694 -191701
9876 -191701 -188199 -234385 -364529 -525159 -604930 -556106 -417404 -248147 -98156 -8296 -19818
9865 -19818 -141709 -282229 -346164 -342161 -317440 -264491 -212859 -228293 -308332 -412274 -477094
9854 -477094 -475457 -433894 -359860 -257946 -165648 -87137 -19949 17477 32442 85019 173868 227626
9842 227626 207638 98436 -59844 -168380 -192997 -168285 -130349 -74127 40 19620 -59390
9831 -59390 -164252 -238822 -294488 -347738 -428920 -506511 -530147 -518255 -495652 -460365 -418184 -399092
9819 -399092 -394168 -367237 -321788 -279414 -244288 -218486 -236759 -314961 -382971 -368633 -274523 -153008
9807 -153008 -57393 7763 21069 -26962 -96406 -93995 1633 70057 10631 -119587 -219818
9796 -219818 -277137 -327812 -381296 -415217 -451205 -508426 -498255 -353341 -158075 -43376 -39224
9785 -39224 -88798 -147911 -203209 -248797 -297330 -385222 -510314 -599152 -629086 -653410 -672145 -614864
9773 -614864 -478645 -343603 -265062 -245718 -227089 -165502 -76458 31448 171167 292802 321786
9762 321786 283697 256102 291122 383947 448272 429507 372235 339435 336804 338500 319565 268154
9750 268154 198801 157886 187390 299347 440450 519592 492870 400037 261173 85248 -55933
9739 -55933 -108803 -78514 -13880 35719 71163 170680 368866 569167 666432 661735 587885 488558
9727 488558 417446 371976 345037 340299 340226 316439 278023 207670 56063 -164862 -397157 -546224
9715 -546224 -572357 -509693 -379585 -207938 -51975 -35 -82669 -209449 -280532 -261323 -156812
9704 -156812 10844 176374 291476 343127 320740 261840 231127 216753 187601 197676 293383
9693 293383 380965 292702 10229 -325013 -592709 -780468 -876714 -846083 -725542 -620823
9683 -620823 -606828 -659968 -744534 -835359 -886555 -888369 -843627 -733413 -559737 -358157 -133324
9672 -133324 67382 157930 120335 14300 -72843 -102091 -115488 -172061 -301522 -442618 -506836
9661 -506836 -507480 -475107 -398610 -308108 -242184 -124328 86953 291716 396096 400316 402091 458532
9649 458532 527555 579857 593737 551930 472353 402821 350554 300655 254041 245494 283286 355774
9637 355774 458815 589199 767007 1002713 1272852 1520242 1673853 1714583 1666049 1529852
9627 1529852 1301480 1038353 814700 646800 543064 491996 449348 407105 394089 407170
9617 407170 406029 367144 260936 113911 -13437 -165385 -375951 -601520 -794092 -899614
9607 -899614 -897380 -853031 -832536 -836448 -845927 -839462 -750514 -606168 -483180 -408145 -358722 -311734
9595 -311734 -298687 -323633 -390723 -501597 -616183 -694872 -747415 -756743 -681848 -525603 -333888
9584 -333888 -200913 -171816 -163773 -67943 125679 325219 434430 428701 324961 167613 39736
9573 39736 -33792 -70227 -100764 -185109 -318199 -415666 -471230 -563406 -712453 -844594 -881951
9562 -881951 -812800 -660665 -483305 -358969 -279881 -160099 -13495 62702 77600 122743 220707
9551 220707 313241 391997 484368 558809 547463 443199 258805 24168 -174487 -287296 -315403
9540 -315403 -252314 -105326 100000 315818 502305 644719 741940 827577 882106 824764 687073
9529 687073 573022 464969 351717 265790 194547 147592 161501 216928 226548 124451 -75828
9518 -75828 -265379 -362509 -393341 -391441 -316488 -143667 39082 144184 147861 71407 -58897
9507 -58897 -249693 -474067 -652518 -731901 -737204 -688243 -622889 -568642 -510593 -483270 -475916 -410640
9495 -410640 -251178 -46050 121097 213355 250528 272385 289986 259651 181733 90978 -5532
9484 -5532 -129967 -265492 -316009 -253084 -158740 -118287 -154083 -186429 -167178 -134728 -130654 -202686
9472 -202686 -376755 -548791 -632962 -652530 -626013 -548994 -387650 -142796 91142 267434
9462 267434 436266 564234 596642 605221 637817 642495 594950 517956 438852 376879 318920 220793
9450 220793 76028 -52085 -119262 -140410 -148144 -182412 -226010 -223089 -160344 -74513 -5021 6759
9438 6759 -50402 -100555 -70285 24095 147620 295041 439955 550219 598441 599791 568342
9427 568342 503703 415793 342124 362231 487267 614664 704759 761903 780122 774731 765306 787252
9415 787252 800364 727550 611546 547176 521487 470823 395430 334847 295000 261814 201163
9404 201163 119750 44908 -33449 -125997 -260095 -436429 -600993 -690697 -728162 -767755 -801418
9393 -801418 -777426 -686205 -579598 -457793 -290030 -118321 3548 100122 170700 158543 85114
9382 85114 46833 70278 93741 43345 -72895 -194714 -295210 -351388 -339073 -282726 -210740
9371 -210740 -136780 -102372 -111788 -108563 -79869 -47359 5731 56826 51088 26355 31033 23004 -20753
9358 -20753 -95225 -185586 -251413 -259728 -196012 -84641 35886 122615 159332 193387 274166 345852
9346 345852 327695 256543 206579 183877 218555 326311 422993 422300 322824 197548 145239 195484
9334 195484 326553 440852 415213 297378 215282 223580 280325 294481 244464 136692 -37772
9323 -37772 -218004 -339202 -413965 -426263 -296075 -41978 251457 514477 677858 671532 478245
9312 478245 218407 31138 -26961 28236 102559 183649 312598 449154 526005 564929 589583
9301 589583 614521 615873 530068 378111 228537 144377 177729 295396 383486 399004 401719
9290 401719 469582 556770 542923 433875 339390 282626 231461 225900 309902 443250 576739
9279 576739 686058 720762 702269 674140 643151 625150 606357 550532 433645 284524 156610
9268 156610 34715 -86738 -164747 -172878 -137910 -106704 -91658 -87909 -90161 -95911 -116809 -127029
9256 -127029 -74922 -28930 -95822 -287456 -504956 -645630 -703704 -707327 -652159 -549839 -480588
9245 -480588 -499507 -528356 -466528 -304610 -122364 -356 50967 86052 156430 296321 463363
9234 463363 535772 494279 391949 250189 82754 -56635 -124590 -144580 -169896 -200242 -228548
9223 -228548 -258979 -247232 -149376 5393 95996 53035 -85303 -311901 -596376 -817509 -892177
9212 -892177 -871501 -852671 -838810 -754484 -575456 -369888 -222965 -155182 -155660 -213254 -294554
9201 -294554 -346989 -299705 -190690 -158069 -244833 -365535 -436064 -470863 -497232 -503194 -484922
9190 -484922 -470235 -447478 -393595 -341700 -311242 -301995 -317357 -336490 -359956 -425023 -539977 -699196
9178 -699196 -862860 -978992 -1081501 -1169552 -1170791 -1119604 -1081950 -1020608 -891327 -741639 -648327
9167 -648327 -594270 -540926 -473376 -366799 -239293 -179860 -229639 -256969 -158114 28816 230769
9156 230769 418182 586098 675831 636872 520328 392444 278726 182369 91157 -1069 -58791
9145 -58791 -80806 -96846 -106073 -133884 -221292 -369401 -482949 -486525 -459237 -538262 -703381 -825000
9133 -825000 -860659 -860479 -874947 -877041 -852445 -805876 -692767 -496654 -286344 -102275 50542
9122 50542 160860 221923 213717 174328 187306 238810 304767 412796 568058 699718 749255
9111 749255 728806 672235 595735 494857 366031 229683 173796 221436 256596 226573 187900
9100 187900 144945 74813 5535 -62289 -173524 -313716 -421751 -456789 -360001 -156537 28546
9089 28546 163016 275335 351814 350412 280564 183989 98422 72051 114949 197926 289532 334110
9077 334110 280653 151119 27397 -29297 -61215 -104000 -97130 -14825 41066 -5925 -135846
9066 -135846 -289257 -453151 -628264 -802830 -977033 -1126869 -1208204 -1169031 -965392 -634229
9056 -634229 -267223 -154 72043 10045 -40385 -3603 66633 73873 -9580 -153247 -303389
9045 -303389 -395307 -444569 -508792 -553780 -520231 -456310 -395702 -335564 -273428 -195578 -122536 -85951
9033 -85951 -82963 -84850 -140357 -272374 -391202 -432781 -426083 -428154 -417638 -356705 -272300 -215913
9021 -215913 -191740 -137553 20318 250488 461100 611557 671744 602702 408610 160678
9011 160678 -47964 -170465 -206955 -182987 -136948 -127908 -208640 -340216 -436736 -444442 -394604
9000 -394604 -354612 -360016 -415071 -496312 -544512 -535277 -469624 -324691 -168984 -89321 -48221 32160
8988 32160 128280 175543 190249 205275 196029 153655 91319 45868 46055 87872 145393 162642
8976 162642 120528 72631 53166 34405 15083 39631 101917 129001 77455 -29966 -158077
8965 -158077 -277952 -390116 -497870 -578093 -631565 -665131 -671750 -643490 -558946 -444857 -350409
8954 -350409 -296277 -269000 -247549 -228190 -189195 -163946 -163942 -98084 46570 186425 256869 281035
8942 281035 297598 316944 358110 398830 351743 174593 -47436 -208330 -249267 -174212 -15635
8931 -15635 168305 268081 267278 240643 188319 76574 -34709 -29640 84595 174574 135639 1505
8919 1505 -145063 -280855 -356469 -324808 -163495 81724 317454 479067 572293 641320 711152
8908 711152 731300 651038 514879 415113 357472 265354 138689 76760 129207 254713 343238
8897 343238 330077 261700 218157 228522 286984 415041 613617 785690 831937 734897 542699
8886 542699 333873 197982 188893 264382 345121 409150 485380 582584 663966 686156 652000
8875 652000 575490 475979 371679 262558 144315 75940 134188 242404 269971 183431 40280
8864 40280 -77001 -114272 -113416 -126858 -116497 -77803 -24940 34470 62365 57429 49293 -11363
8852 -11363 -176214 -360312 -487317 -539633 -498041 -370191 -230374 -178008 -201139 -172363 -3540
8841 -3540 264019 476037 550534 559090 527634 451889 389152 390341 449670 506758 517646 474752
8829 474752 386922 283030 155788 25405 -18111 79658 289556 552151 794211 980225
8819 980225 1109014 1143350 1080546 934482 708149 429546 167484 -17999 -103949 -97007 -42266
8808 -42266 26188 33361 -77078 -265744 -434042 -522283 -549857 -537961 -467875 -344927 -216278
8797 -216278 -130779 -93316 -66644 -57707 -98535 -126212 -79843 16127 147198 311499 472661
8786 472661 613447 745853 875281 955161 930062 816063 694630 579389 444276 322225
8776 322225 240991 200722 190963 174564 173683 232239 337911 422299 370966 190344 53508 52386
8764 52386 100304 124940 122699 91536 42767 8375 12712 47001 90587 106733 66063 66791 169579
8751 169579 291571 364428 357947 266529 98753 -74571 -193481 -304612 -421591 -470860 -483951
8740 -483951 -579015 -761294 -934884 -970094 -813923 -575304 -396208 -305299 -240314 -158622 -79230
8729 -79230 -45559 -68865 -117087 -164661 -200543 -234586 -260786 -289189 -364579 -487395 -601954
8718 -601954 -648862 -616622 -544601 -455710 -374906 -360483 -406110 -431400 -452073 -517015 -592656 -601072
8706 -601072 -526971 -420577 -315105 -239464 -181195 -97297 17410 160546 323493 468169
8696 468169 535541 498019 383499 244457 148430 155443 237802 309949 353593 396465 437186
8685 437186 448352 419029 378258 377177 396722 401859 383584 314752 196280 99048 43426 -38163
8673 -38163 -165222 -273113 -324732 -337979 -368350 -412191 -378188 -297958 -276281 -317843 -417487
8662 -417487 -519569 -542292 -498098 -430338 -351730 -261188 -173705 -139004 -161618 -211451 -284984
8651 -284984 -377397 -474463 -509863 -409258 -216314 -72027 -41644 -77183 -99073 -54939 27033
8640 27033 85314 58321 -76729 -293895 -523302 -644775 -612063 -529642 -488133 -510932 -552765
8629 -552765 -520662 -385165 -191307 5825 182853 270082 207297 62007 -56025 -149284
8619 -149284 -245330 -312126 -348958 -349867 -312073 -238490 -97577 98054 227513 193205 34471
8608 34471 -154516 -311184 -379572 -337412 -216428 -71570 18445 26907 -9016 -71028 -159583
8597 -159583 -261923 -398756 -568680 -686741 -685579 -619027 -521279 -325998 -41952 229160
8587 229160 403244 452002 373133 201441 24518 -83185 -150970 -217425 -271696 -294422 -258564
8576 -258564 -199279 -197436 -243329 -281268 -311202 -309356 -265528 -237275 -258054 -306183 -317950 -277093
8564 -277093 -191209 -70847 48208 136237 199086 214956 169962 78360 -47529 -162669 -247674
8553 -247674 -310514 -327075 -259111 -128835 10683 66096 -14959 -146111 -199888 -125251 15569
8542 15569 150132 240937 265904 261025 252105 254827 318950 424149 497679 531902 555470 568289
8530 568289 590530 660262 783085 941131 1072693 1138785 1155025 1159915 1205211 1313898 1468252
8519 1468252 1624044 1728327 1768451 1706451 1560004 1443941 1408092 1393193 1314899 1147976
8509 1147976 900456 605009 343657 216411 232938 270260 253911 217016 199840 170564 124458
8498 124458 99453 103439 115724 95117 48948 47476 98361 154627 175630 197152 223997 205606
8486 205606 145190 60427 -48344 -195687 -342635 -396341 -361729 -340599 -388838 -423352 -329336
8475 -329336 -149977 -58864 -119779 -279729 -477133 -626328 -693966 -746251 -797632 -799827 -745033
8464 -745033 -667160 -607309 -544624 -435769 -332952 -296863 -275198 -223340 -193262 -188224 -168060
8453 -168060 -136089 -75365 13803 80239 118320 145796 123393 56515 7100 2938 42320 89555
8441 89555 130939 142695 74941 -2435 -16724 31617 127668 223684 272968 272280 263395 278128
8429 278128 297890 310652 333039 406344 492795 474454 345228 198299 81901 -42628 -211751
8418 -211751 -360683 -391775 -335098 -246177 -123223 5007 78778 67101 19757 28564 104416
8407 104416 175564 203105 183837 149301 150081 165979 153161 100718 41328 -4982 -72506 -173302
8395 -173302 -252747 -284030 -272353 -220128 -119339 45561 235895 387614 487154 565326 620434
8384 620434 606547 499916 323916 104198 -145596 -382401 -606786 -837884 -994219 -998675
8374 -998675 -900882 -782539 -674984 -596604 -576977 -599985 -597857 -554252 -514707 -478239 -396512
8363 -396512 -326652 -339362 -375453 -369431 -347367 -310273 -221260 -63984 170537 422543 563305
8352 563305 552566 469494 386744 350669 340092 262488 95226 -101913 -287520 -434818 -476162
8341 -476162 -373200 -182134 -3934 134320 237015 282724 276014 232551 120943 -65085
8331 -65085 -247363 -346336 -375851 -399280 -429161 -419787 -342950 -180740 23261 191642 335877
8320 335877 492330 618971 632777 500271 303227 143329 58020 25357 13901 -2710 -70991
8309 -70991 -165336 -249782 -364493 -524284 -672005 -769539 -828234 -827187 -721532 -545918 -356061
8298 -356061 -163380 -32482 -9799 -42280 -62404 -68680 -66999 -70220 -85971 -81762 -95928 -207238
8286 -207238 -376096 -503541 -554627 -565006 -540960 -521478 -624329 -829194 -970018 -1003738 -994767
8275 -994767 -944891 -816684 -588020 -319142 -118971 24115 143245 199095 186787 164078
8265 164078 163634 164697 146052 86504 14647 -40530 -100031 -178714 -282743 -407536 -535425 -627984
8253 -627984 -642117 -536568 -357932 -221771 -139039 -16069 174617 338938 412386 450096
8243 450096 490317 482332 430113 333784 159759 -88811 -388551 -676617 -872275 -939216 -889224
8232 -889224 -764632 -599121 -402480 -216660 -84986 -14207 37893 87892 122267 185986 280093
8221 280093 349238 372310 338065 242470 124252 38315 -16563 -86552 -169571 -223568 -228388 -146037
8209 -146037 -4300 117762 187942 171487 101736 33832 -21454 -52299 -64971 -89905 -90290 -17701
8197 -17701 108663 228651 259339 165598 18473 -72180 -79462 -83547 -147801 -218999 -234763 -176645
8185 -176645 -63731 51278 93581 34263 -67848 -134893 -180937 -214221 -199973 -141461 -50751
8174 -50751 82560 254777 403490 443011 343271 194499 109713 111604 163533 209169 218011
8163 218011 200073 183855 221695 322726 470216 637825 767172 810770 788485 723178 594552
8152 594552 432293 295130 189597 128615 89652 26459 -12677 -27602 -97435 -219274 -313252
8141 -313252 -347141 -377508 -423973 -413747 -317577 -203616 -159315 -204815 -250471 -192921 -17692
8130 -17692 209683 445439 606185 636779 585374 501842 413127 377223 430916 514935 557741
8119 557741 565284 569021 520836 416490 318168 238832 173913 150372 235035 411714 566523
8108 566523 622219 607018 540472 403785 257657 182769 181684 273407 436943 534992 499882
8097 499882 406131 328847 247252 138995 62485 54737 76685 112179 145618 105454 -13056
8086 -13056 -155927 -278212 -302008 -215132 -89048 7323 43657 57179 90757 121216 89549
8075 89549 -11995 -161545 -341202 -514974 -600313 -571164 -515235 -490118 -480221 -483911 -515759
8064 -515759 -563845 -594020 -615532 -630326 -561732 -414810 -266425 -182742 -254094 -495652 -770023
8053 -770023 -906939 -887828 -779102 -650351 -512321 -320203 -138009 -61915 -77693 -138263
8043 -138263 -218384 -279376 -202855 60134 371797 567994 629180 629304 608669 586453 512915
8032 512915 322847 70553 -96673 -105106 -19832 55174 91554 125163 174729 254120 360033
8021 360033 419939 369726 223849 51871 -58114 -54210 13900 80665 133351 171495 207735
8010 207735 302665 465701 600806 630893 551442 391019 219155 111063 83196 97659 118185
7999 118185 144665 167511 121956 -39510 -243619 -408162 -545953 -677137 -732143 -657238 -484379
7988 -484379 -279044 -111267 -29920 -54798 -150198 -268817 -360946 -366306 -279459 -136567 16092
7977 16092 116489 114447 46507 -26259 -88148 -133805 -156387 -117219 -7871 116711 188613
7966 188613 204178 204628 178274 76491 -140575 -399336 -548141 -517945 -370031 -240123 -201197
7955 -201197 -224363 -247228 -218854 -146783 -120032 -194185 -318094 -389945 -372209 -322233 -302585
7944 -302585 -306979 -310113 -300701 -279512 -225577 -103133 60740 230295 375940 493565 572610
7933 572610 612000 633173 638532 632783 629338 630814 595124 482215 330970 152596 -70242 -248613
7921 -248613 -285206 -213034 -132248 -87068 -126662 -242218 -328124 -330668 -303102 -332652 -413757 -458454
7909 -458454 -446741 -434547 -445831 -420290 -317898 -197360 -112167 -75219 -58677 -30216 384
7898 384 -9219 -41913 -25334 29278 55361 12643 -89503 -195610 -260139 -273904 -259404 -225708
7886 -225708 -145997 -33433 46872 52915 4645 -33070 -24314 20588 93424 173215 248596 255543
7874 255543 158360 18882 -93649 -124820 -82189 -55514 -100183 -177178 -240450 -278501 -284070
7863 -284070 -262122 -253353 -260145 -244466 -230581 -240754 -265368 -278627 -256547 -222287 -203364 -162445
7851 -162445 -91381 -34565 -2511 23195 -283 -124844 -289824 -407901 -443868 -421657 -378780
7840 -378780 -324403 -281106 -271263 -266772 -240470 -219875 -226175 -272394 -393870 -531008 -594753 -645511
7828 -645511 -742889 -840260 -870347 -820992 -719589 -540992 -295041 -39839 216719 449793
7818 449793 587983 577705 438940 278402 195992 211795 284612 351402 355344 281201 159938
7807 159938 49140 33678 149281 315782 407367 362031 269776 254125 285265 295696 294567
7796 294567 319224 350503 371887 378571 368301 350437 328325 349420 437327 507441 485232 383676
7784 383676 251450 145069 107278 83660 -12495 -161128 -324569 -466074 -524079 -461572 -340021
7773 -340021 -283141 -350276 -476989 -568992 -607371 -648814 -703137 -743050 -766197 -801979 -891640
7762 -891640 -1028739 -1159386 -1258549 -1312392 -1285116 -1183750 -1054790 -900686 -691888 -490266
7752 -490266 -381084 -365804 -394764 -444033 -505339 -560821 -593697 -585981 -574657 -548191 -429788
7741 -429788 -266446 -166426 -108912 -47897 -3022 57115 189388 355282 484664 601582
7731 601582 743147 854144 856148 741497 578793 449110 418416 467183 522080 539327 495563
7720 495563 390879 280416 230397 234516 197403 42677 -154011 -258049 -238269 -94540 129185
7709 129185 324475 422935 425338 379375 344245 314458 278130 251511 209353 146287 75562 62304
7697 62304 107921 123139 91453 84926 144327 206522 177250 64968 -81498 -243943 -384933
7686 -384933 -477428 -543630 -570130 -537286 -498938 -462874 -343209 -147964 5469 71900 67499
7675 67499 1297 -72646 -53549 87524 278655 420874 440920 324232 150198 -14850 -149650
7664 -149650 -198481 -146794 -71707 -54414 -69745 -40260 18082 71045 124630 190265 265709 311429
7652 311429 310959 286191 243170 166745 65976 -40538 -143771 -226056 -267193 -274977 -253999 -213515
7640 -213515 -198428 -262239 -409853 -564099 -663663 -715637 -729576 -719725 -655748 -467669 -208862
7629 -208862 15896 162080 221898 194909 111935 9869 -103372 -231305 -324958 -303421 -163901
7618 -163901 -2333 77527 28580 -101848 -167875 -88833 60209 171917 222711 225981 195723
7607 195723 146971 60866 -35185 -45881 40955 128828 191590 253535 278735 243281 202719 207052
7595 207052 223027 189510 93069 -45043 -183200 -280770 -340570 -352730 -284830 -182480 -126705
7584 -126705 -127207 -139394 -118543 -25594 134310 255915 260510 176103 62442 -16590 -57873 -123558
7572 -123558 -216979 -276543 -292160 -300422 -296131 -268175 -236057 -196334 -156414 -139507 -97358 -18815
7560 -18815 24925 -3049 -66165 -104259 -62178 49586 124423 122649 103279 61030 -16530 -59744
7548 -59744 5068 189465 388569 498129 524932 515406 484716 417056 311875 199294 100660
7537 100660 36389 46216 128329 209644 234913 199761 151459 147733 199900 293491 409796 509428
7525 509428 561758 563126 549732 528874 442154 291211 149576 90631 153387 329954 507964
7514 507964 585715 592387 547468 395812 173854 -24685 -175085 -272089 -316118 -335774 -359418
7503 -359418 -375608 -324979 -190788 -78727 -39595 -20892 -4211 -24568 -108638 -217329 -301489
7492 -301489 -346815 -345841 -298652 -203749 -79060 4667 10344 -30168 -89051 -185849 -342832 -488822
7480 -488822 -579044 -668616 -756240 -795589 -777507 -726982 -715350 -748662 -743334 -669802 -545382 -312855
7468 -312855 44279 430550 705740 765977 613122 343121 76066 -121381 -218646 -264164
7458 -264164 -295456 -303976 -277852 -190475 -24636 202408 436439 632228 758902 789327 730028
7447 730028 592082 398219 223175 150333 161473 170314 128562 84916 80111 72238 42884 6763
7435 6763 -45896 -118247 -192697 -234643 -191364 -83748 5932 39364 19331 -27082 -34454 4460
7423 4460 72415 238333 522334 824040 1053926 1192725 1266680 1379224 1613563 1903559
$$ [...]
##END NTUPLES=NMR SPECTRUM
##END=
