##TITLE=C13_lac-Jalaric-1
 Py-d5,22500 sc

 3.7.2019
##JCAMPDX= 6.0         $$ Bruker NMR JCAMP-DX V2.0
##DATA TYPE= NMR SPECTRUM
##DATA CLASS= NTUPLES
##ORIGIN= UXNMR, Bruker Analytische Messtechnik GmbH
##OWNER= root
$$ XWIN-NMR		Version 3.5
$$ Thu Jul  4 13:40:06 2019 Russian Standard Time (UT+4h)  she@DPX200
##.OBSERVE FREQUENCY= 50.327896
##.OBSERVE NUCLEUS= ^13C
##.ACQUISITION MODE= SIMULTANEOUS
##.ACQUISITION SCHEME= undefined
##.AVERAGES= 17569
##.DIGITISER RES= 17
##SPECTROMETER/DATA SYSTEM= spect
##.PULSE SEQUENCE= zgpg30
##.SOLVENT NAME= CDCl3
##.SHIFT REFERENCE= (INTERNAL, CDCl3, 0, 225.252)
##AUDIT TRAIL= $$ (NUMBER, WHEN, WHO, WHERE, WHAT)
$$ ##TITLE= Audit trail, XWIN-NMR		Version 3.5
$$ ##JCAMPDX= 5.01
$$ ##ORIGIN= Bruker BioSpin GmbH
$$ ##OWNER= she
$$ F:/spectra/data/she/nmr/c13/1/pdata/1/auditp.txt
$$ ##AUDIT TRAIL=  $$ (NUMBER, WHEN, WHO, WHERE, WHAT)
(   1,<2019-07-04 09:17:17.90 +0400>,<she>,<DPX200>,
      <created by zg, POWCHK disabled, PULCHK disabled
       terminated by command 'halt'
       configuration hash MD5:
       00 E9 B6 7A A2 85 ED C7 34 08 36 98 17 FE 4E 26
       data hash MD5: 32K
       F1 24 7F 68 52 E0 84 B6 52 68 D6 FB FB A5 06 E4>)
(   2,<2019-07-04 09:17:30.20 +0400>,<she>,<DPX200>,
      <Start of raw data processing
       efp BC_mod = 2 LB = 1 FT_mod = 6 PKNL = 1 PHC0 = -380.4057 PHC1 = 31.20641 SI = 32K 
       data hash MD5: 32K
       E0 4B 12 D4 48 C7 48 99 6A 63 22 53 12 83 77 C6>)
(   3,<2019-07-04 13:37:58.93 +0400>,<she>,<DPX200>,
      <pk PHC0 = 1.050753 PHC1 = -5.2 
       data hash MD5: 32K
       12 D3 E0 68 60 A8 2B EA E4 D9 1E AD 10 1D 9D 36>)
(   4,<2019-07-04 13:38:02.28 +0400>,<she>,<DPX200>,
      <abs ABSG = 5 
       data hash MD5: 32K
       4C 17 3C 09 05 73 85 B9 DC EA 35 C1 6C A2 7E 2B>)
$$ ##END=
$$ 
$$ hash MD5
$$ 08 61 CF 9E 67 41 F9 B9 66 43 2D A1 D4 B1 F2 88
##$RELAX= 
##$RELAX= 
##$RELAX= 
##$RELAX= 
##$RELAX= 
##$RELAX= 
##$RELAX= 
##$RELAX= 
$$ Bruker specific parameters
$$ --------------------------
##$DU= <F:/spectra>
##$EXPNO= 1
##$NAME= <c13>
##$PROCNO= 1
##$TYPE= <nmr>
##$USER= <she>
##$AMP= (0..31)
100 100 100 100 100 100 100 100 100 100 100 100 100 100 100 100 100 100 
100 100 100 100 100 100 100 100 100 100 100 100 100 100 
##$AQSEQ= 0
##$AQ_mod= 1
##$AUNM= <au_zg>
##$AUTOPOS= <>
##$BF1= 50.322709
##$BF2= 200.13
##$BF3= 50.322709
##$BF4= 500.13
##$BF5= 500.13
##$BF6= 500.13
##$BF7= 500.13
##$BF8= 500.13
##$BYTORDA= 1
##$CFDGTYP= 0
##$CFRGTYP= 5
##$CHEMSTR= <none>
##$CNST= (0..31)
1 1 145 1 1 1 1 1 1 1 1 1 1 1 1 1 1 1 1 1 1 1 1 1 1 1 1 1 1 1 1 1 
##$CPDPRG= <waltz16>
##$CPDPRG1= <>
##$CPDPRG2= <waltz16>
##$CPDPRG3= <>
##$CPDPRG4= <mlev>
##$CPDPRG5= <mlev>
##$CPDPRG6= <mlev>
##$CPDPRG7= <mlev>
##$CPDPRG8= <mlev>
##$CPDPRGB= <>
##$CPDPRGT= <>
##$D= (0..31)
0 2 0.00345 0 0 0 0 0 0 0 0 0.03 2e-05 3e-06 0 0 0 0 0 0 0 0 0 0 0 0 0 
0 0 0 0 0 
##$DATE= 1562217437
##$DBL= (0..7)
120 120 120 120 120 120 120 120 
##$DBP= (0..7)
150 150 150 150 150 150 150 150 
$$ [...]
##$SUBNAM4= <"">
##$SUBNAM5= <"">
##$SUBNAM6= <"">
##$SUBNAM7= <"">
##$SUBNAM8= <"">
##$SUBNAM9= <"">
##$SW= 239.972175391363
##$SWIBOX= (0..15)
0 1 3 0 0 0 0 0 0 0 0 0 0 0 0 0 
##$SW_h= 12077.2946859903
##$TD= 32768
##$TD0= 1
##$TE= 0
##$TE2= 300
##$TE3= 300
##$TEG= 300
##$TL= (0..7)
120 120 120 120 120 120 120 120 
##$TP= (0..7)
150 150 150 150 150 150 150 150 
##$TP07= 0
##$TPNAME0= <>
##$TPNAME1= <>
##$TPNAME2= <>
##$TPNAME3= <>
##$TPNAME4= <>
##$TPNAME5= <>
##$TPNAME6= <>
##$TPNAME7= <>
##$TPOAL= (0..7)
0.5 0.5 0.5 0.5 0.5 0.5 0.5 0.5 
##$TPOFFS= (0..7)
0 0 0 0 0 0 0 0 
##$TUNHIN= 0
##$TUNHOUT= 0
##$TUNXOUT= 0
##$USERA1= <user>
##$USERA2= <user>
##$USERA3= <user>
##$USERA4= <user>
##$USERA5= <user>
##$V9= 5
##$VALIST= <valist>
##$VCLIST= <CCCCCCCCCCCCCCC>
##$VD= 0
##$VDLIST= <DDDDDDDDDDDDDDD>
##$VPLIST= <PPPPPPPPPPPPPPP>
##$VTLIST= <TTTTTTTTTTTTTTT>
##$WBST= 1024
##$WBSW= 4
##$XGAIN= (0..3)
0 0 0 0 
##$XL= 0
##$YL= 0
##$YMAX_a= 83710784
##$YMIN_a= -80420836
##$ZGOPTNS= <>
##$ZL1= 120
##$ZL2= 120
##$ZL3= 120
##$ZL4= 120
##$ABSF1= 225.2522
##$ABSF2= -14.74524
##$ABSG= 5
##$ABSL= 3
##$ALPHA= 0
##$AQORDER= 0
##$ASSFAC= 0
##$ASSFACI= 0
##$ASSFACX= 0
##$ASSWID= 0
##$AUNMP= <proc_1d>
##$AZFE= 0.1
##$AZFW= 0.5
##$BCFW= 0
##$BC_mod= 2
##$BYTORDP= 0
##$COROFFS= 0
##$CY= -3
##$DATMOD= 1
##$DC= 0
##$DFILT= <>
##$DTYPP= 0
##$F1P= 0
##$F2P= 0
##$FCOR= 0.5
##$FTSIZE= 32768
##$FT_mod= 6
##$GAMMA= 0
##$GB= 0
##$INTBC= 1
##$INTSCL= 4.134877e-10
##$ISEN= 128
##$LB= 1
##$LEV0= 0
##$LPBIN= 0
##$MAXI= 10000
##$MC2= 0
##$MEAN= 0
##$ME_mod= 0
##$MI= 0.1934396
##$NCOEF= 0
##$NC_proc= 3
##$NLEV= 6
##$NOISF1= 120.0001
##$NOISF2= 80.00006
##$NSP= 0
##$NTH_PI= 0
##$NZP= 0
##$OFFSET= 225.2522
##$PC= 1.4
##$PHC0= -379.3549
##$PHC1= 26.00641
##$PH_mod= 1
##$PKNL= yes
##$PPARMOD= 0
##$PSCAL= 0
##$PSIGN= 0
##$REVERSE= no
##$SF= 50.3225993700027
##$SI= 32768
##$SIGF1= 140
##$SIGF2= 120
##$SINO= 11.81781
##$SIOLD= 32768
##$SREGLST= <13C.CDCl3>
##$SSB= 0
##$STSI= 32768
##$STSR= 0
##$SW_p= 12077.2946859903
##$SYMM= 0
##$S_DEV= 0
##$TDeff= 32768
##$TDoff= 0
##$TI= <>
##$TILT= no
##$TM1= 0
##$TM2= 0
##$TOPLEV= 0
##$USERP1= <user>
##$USERP2= <user>
##$USERP3= <user>
##$USERP4= <user>
##$USERP5= <user>
##$WDW= 1
##$XDIM= 32768
##$YMAX_p= 293498927
##$YMIN_p= -1324598
$$ End of Bruker specific parameters
$$ ---------------------------------
##NTUPLES= NMR SPECTRUM
##VAR_NAME=  FREQUENCY,     SPECTRUM/REAL,   SPECTRUM/IMAG
##SYMBOL=    X,             R,               I
##VAR_TYPE=  INDEPENDENT,   DEPENDENT,       DEPENDENT
##VAR_FORM=  AFFN,          ASDF,            ASDF
##VAR_DIM=   32768,         32768,           32768
##UNITS=     HZ,            ARBITRARY UNITS, ARBITRARY UNITS
##FACTOR=    0.368581032318806, 1,           1
##FIRST=     11335.2760802109, 0,            0
##LAST=      -742.018605779436, 0,           0
##MIN=       -742.018605779436, -1324598,    0
##MAX=       11335.2760802109, 293498927,    0
$$ Real data points
##PAGE= N=1
##DATA TABLE= (X++(R..R)), XYDATA
$$ [...]
$$ plain form
22129 -323153 -285931 50654 203315 213267 242768 265601 409064 478665 354277 262205 195456
22118 195456 34621 -76190 -107401 -189432 -289135 -212334 44577 161868 156217 -143636 -470756
22107 -470756 -497219 -567015 -507026 -252330 70865 168252 85044 -127701 -137699 -10560 203698
22096 203698 521928 458061 212586 164119 70274 79005 203334 290942 292074 74114 37975
22085 37975 10860 -105752 -144784 -31218 130239 90555 40036 125269 160078 67509 149626
22074 149626 366169 359656 215611 68721 127747 146956 50751 32853 -161527 -254779 -50307
22063 -50307 189978 404413 587604 634231 566726 558599 307920 240 -102798 -205012
22053 -205012 -385419 -468849 -392291 -326668 -223014 -130724 -162135 -411261 -517072 -367903
$$ packed form
22129c23153L7222L36585J52661R952K9501K2833J43463O9601j24388r2072o6749
22118A95456j60835j10811l1211q2031r9703P6801K56911J17291n651k99853l27120
22107d70756k6463o9796N9989K54696L23195R7387q3208k12745r998J27139K14258
22096B03698L18230o3867k45475m8467r3845Q731J24329Q7608J132k17960l6139
22085C7975k7115j16612l9032J13566J61457l9684n0519Q5233L4809r2569Q2117
22074A49626K16543o513j44045j46890N9026J9209r6205j7898j94380r3252K04472
22063e0307K40285K14435J83191M6627o7505q127k50679l07680j03038j02214
22053b05012j80407q3430P6558O5623J03654R2290l1411k49126j05811J49169
$$ plain form
22043 -367903 -140846 -254264 -303958 -192959 -250705 -267972 -203498 -160005 44140 255607
22033 255607 383881 367698 296759 70943 -118867 -240629 -188971 -199591 -164124 -145994 -406548
22022 -406548 -427367 -216848 -137006 -181214 -209662 -156389 -34981 113575 -37879 -142549
22012 -142549 -133200 -224007 -295317 -190519 -98437 -35034 25140 -41825 -140532 -296930 -380944
22001 -380944 -428401 -345619 -309130 -302973 -294197 -233079 -110936 -50117 -173122 -164869 -153372 -82228
21989 -82228 -66622 -52952 59358 279064 409995 340800 204021 353818 426127 266221
21979 266221 145414 243555 262420 244628 206768 108854 -95280 -343878 -444505 -450085 -327961
21968 -327961 -151621 103749 185654 -5920 -189302 -188983 -51147 9000 -167453 -334995
$$ packed form
22043c67903K27057j13418m9694J10999n7746j7267O4474M3493K04145K11467
22033B55607J28274j6183p0939k25816j89810j21762N1658j0620L5467J8130k60554
22022d06548k0819K10519P9842m4208k8448N3273J21408J48556j51454j04670
22012a42549R349r0807p1310J04798R2082O3403O0174o6965r8707j56398q4014
22001c80944m7457Q2782L6489O157Q776O1118J22143O0819j23005Q253J1497P1144
21989h2228J5606J3670J12310K19706J30931o9195j36779J49797P2309j59906
21979B66221j20807R8141J8865j7792l7860r7914k04134k48598j00627n580J22124
21968c27961J76340K55370Q1905j91574j83382L19J37836O0147j76453j67542
$$ plain form
21958 -334995 -237223 -315322 -442396 -440710 -496623 -356453 -176680 -138008 -74241 -36023 96599
21947 96599 266040 178245 79212 166327 270414 158806 145947 206436 30424 -201657 -331260
21936 -331260 -458836 -573679 -732158 -701694 -437892 -400083 -586719 -641590 -443523 -178102
21926 -178102 -244809 -373220 -308203 -143491 -104121 -87340 -180783 -195973 -72261 31472 214859
21915 214859 436055 456023 114489 -27484 58143 93966 -186622 -501297 -552504 -211167
21905 -211167 80178 74114 6465 17500 230001 170279 29539 -24666 -47895 -96857 -223224
21894 -223224 -371419 -437930 -486904 -208725 33199 -41001 -118399 -214422 -322752 -389263 -459500
21883 -459500 -445282 -287697 -138629 -20931 -30241 -117168 -245895 -287835 -242695 -104167 188057
$$ packed form
21958c34995R7772p8099j27074J686n5913J40170J79773L8672O3767L8218J32622
21947I6599J69441q7795r9033Q7115J04087j11608j2859O0489j76012k32081j29603
21936c31260j27576j14843j58479L0464K63802L7809j86636n4871J98067K65421
21926a78102o6707j28411O5017J64712L9370J6781r3443j5190J23712J03733J83387
21915B14859K21196J9968l41534j41973Q5627L5823k80588l14675n1207L41337
21905b11167K91345o064o7649J1035K12501n9722j40740n4205k3229m8962j26367
21894b23224j48195o6511m8974K78179K41924p4200p7398r6023j08330o6511p0237
21883d59500J4218J57585J49068J17698r310q6927j28727m1940M5140J38528K92224
$$ plain form
21872 188057 313134 106184 -56911 -204093 -252511 -313194 -339443 -239117 -175868 -101850
21862 -101850 -12593 123684 238573 168427 50072 46708 -59922 -39368 120363 -10611
21852 -10611 -183031 -161480 146515 390698 337165 193254 52209 -50835 -146158 -126487
21842 -126487 -131554 6887 132405 172758 132991 -7348 -69312 -29391 -33889 -9193 19297
21831 19297 -168953 -125766 98479 217773 294488 343413 344347 362800 391454 224308 158792
21820 158792 39712 -443919 -627420 -543515 -579632 -587302 -314066 -13936 71331 44159 142000
21809 142000 261461 395584 567788 606413 565984 579006 710114 964951 1330826 1879739
21799 1879739 2326235 2397104 2155029 1611555 1243642 1105865 999259 785926 640360 730978
$$ packed form
21872A88057J25077k06950j63095j47182m8418o0683k6249J00326O3249P4018
21862a01850Q9257J36277J14889p0146j18355l364j06630K0554J59731j30974
21852a0611j72420K1551L07995K44183n3533j43911j41045j03044r5323J9671
21842a26487n067J38441J25518M0353l9767j40339o1964L9921m498K4696K8490
21831A9297j88250M3187K24245J19294P6715M8925R34J8453K8654j67146o5516
21820A58792j19080m83631j83501Q3905l6117p670K73236L00130Q5267k7172R7841
21809A42000J19461J34123J72204L8625m0429J3022J31108K54837L65875N48913
21799A879739M46496P0869k42075n43474l67913j37777j06606k13333j45566R0618
$$ plain form
21789 730978 839480 697382 661759 818852 702948 506276 529024 585483 594355 559255 327414
21778 327414 232203 325189 468042 493214 557400 469370 152417 83431 397818 816259 1291950
21767 1291950 1564251 1638559 1822364 2099087 2186772 2247448 2360664 2518014 2689818 3025282
21757 3025282 3612813 4507311 5680784 7481011 9886948 13102931 17325406 22909247
21749 22909247 30599212 40787967 52941347 63210413 64000784 54690706 42526325 32197570
21741 32197570 24404992 18632375 14468967 11388792 9168912 7722575 6494084 5150215
21733 5150215 4121054 3580848 3176333 2841789 2664517 2434557 2345450 2258125 2021144 1646109
21723 1646109 1379842 1360472 1344988 1057616 859743 1004405 950130 721858 722764 736385 486270
$$ packed form
21789G30978J08502j42098l5623J57093j15904j96672K2748N6459Q872l5100k31841
21778C27414r5211R2986J42853K5172O4186q8030l16953o8986L14387M18441M75691
21767A291950K72301P4308J83805K76723Q7685O0676J13216J57350J71804L35464
21757C025282N87531Q94498J173473J800227K405937L215983M222475N583841
21749B2909247P689965J0188755J2153380J0269066P90371r310078j2164381j0328755
21741C2197570p792578n772617m163408l080175k219880j446337j228491j343869
21733E150215j029161n40206m04515l34544j77272k29960q9107q7325k36981l75035
21723A646109k66267j9370j5484k87372j97873J44662n4275k28272R06J3621k50115
$$ plain form
21712 486270 397054 669859 718628 512219 510423 604755 549122 473696 507679 459269 260645
21701 260645 97775 -24944 -55736 -179804 -281385 -144563 178817 274699 386708 511825
21691 511825 330326 64197 -177201 -301119 -220799 -30554 42744 119576 172655 99719
21681 99719 80676 268053 379404 379251 378733 378869 422022 371255 122259 -118966 -263229 -40928
21669 -40928 140880 166908 77080 57062 376271 672478 740854 779302 701868 561274 518712
21658 518712 437296 465232 531989 546824 465851 281800 258064 169044 68469 113531 193328
21647 193328 308996 440993 212481 -36347 -198671 -275378 -93744 82417 91522 -95582
21637 -95582 74351 389164 532722 805051 1127467 1488618 1588676 1394666 925295 427001
$$ packed form
21712D86270q9216K72805M8769k06409j796R4332n5633p5426L3983m8410j98624
21701B60645j62870j22719l0792j24068j01581J36822L23380R5882J12009J25117
21691E11825j81499k66129k41398j23918Q0320J90245P3298P6832N3079p2936
21681I9719j9043J87377J11351j53n18J36M3153n0767k48996k41225j44263K22301
21669d0928J81808K6028q9828k0018L19209K96207O8376L8448p7434j40594m2562
21658E18712q1416K7936O6757J4835q0973j84051k3736q9020j00575M5062P9797
21647A93328J15668J31997k28512k48828j62324p6707J81634J76161R105j87104
21637i5582J69933L14813J43558K72329L22416L61151J00058j94010m69371m98294
$$ plain form
21627 427001 340752 330879 251322 158152 74773 -2723 22010 36394 93035 225112 577869
21616 577869 1215748 1959752 2502974 3053113 3713698 3952821 3481994 2701516 2011747 1474648
21606 1474648 1133251 970991 906095 837824 594686 269514 244023 570797 842392 1260012
21596 1260012 1976819 2546578 2745985 2523218 1997864 1484950 1150299 907719 650094
21587 650094 616260 770093 792868 517301 377064 311932 291564 441092 537272 506050 613046
21576 613046 718515 733255 646605 584958 614166 894962 1280610 1699764 1861328 1503662
21566 1503662 1155885 991955 831461 710250 391463 41062 -126861 12171 342225
21557 342225 537176 461338 353586 319854 303552 339898 249163 125536 128493 131910 108260
$$ packed form
21627D27001q6249r873p9557r3170q3379p7496K4733J4384N6641J32077L52757
21616E77869O37879P44004N43222N50139O60585K39123m70827p80478o89769n37099
21606A474648l41397j62260o4896o8271k43138l25172k5491L26774K71595M17620
21596A260012P16807N69759J99407k22767n25354n12914l34651k42580k57625
21587F50094l3834J53833K2775k75567j40237o5132k0368J49528R6180l1222J06996
21576F13046J05469J4740q6650o1647K9208K80796L85648M19154J61564l57666
21566A503662l47777j63930j60494j21211l18787l50401j67923J39032L30054
21557C42225J94951p5838j07752l3732j6302L6346r0735j23627K957L417k3650
$$ plain form
21546 108260 -3694 -2159 -51555 -67033 35787 159447 299174 382786 381161 437496 505566
21535 505566 463703 308657 127544 98268 177068 264439 292292 99891 -51810 118755
21525 118755 241238 242045 258174 271971 445487 500453 427371 330669 207094 55807 49631
21514 49631 42682 82312 248671 380764 391769 185356 -47024 -170841 -226384 -316220 -345167
21503 -345167 -242117 -109025 47669 112332 -74560 -396926 -497976 -275482 -112414 144690
21493 144690 307161 360294 378406 342099 284666 140622 111717 142636 226859 309150 84361
21482 84361 -171993 -150472 -61056 51712 -76546 -236980 -217377 -245474 -79167 129055
21472 129055 -26332 -214612 -221022 -56986 107905 259285 245710 295960 351919 271100 343365
$$ packed form
21546A08260j11954J535m9396j5478J02820J23660J39727Q3612j625N6335O8070
21535E05566m1863j55046j81113k9276P8800Q7371K7853j92401j51701J70565
21525A18755J22483Q07J6129J3797J73516N4966p3082r6702j23575j51287o176
21514D9631o949L9630J66359J32093J1005k06413k32380j23817n5543q9836k8947
21503c45167J03050J33092J56694O4663j86892l22366j01050K22494J63068K57104
21493A44690J62471N3133J8112l6307n7433j44044k8905L0919Q4223Q2291k24789
21482H4361k56354K1521Q9416J12768j28258j60434J9603k8097J66307K08222
21472A29055j55387j88280o410J64036J64891J51380j3575N0250N5959q0819P2265
$$ plain form
21461 343365 393779 333471 294371 122979 -62094 -272350 -423575 -445573 -334710 -103318
21451 -103318 104417 178974 138202 211479 258210 250373 338549 372188 261139 334672 284795
21440 284795 223893 338243 365816 373027 306909 180563 167670 162080 2304 -98638 -2921
21429 -2921 159593 216584 269279 157003 49529 141903 171850 66217 80159 121798 92743
21418 92743 45518 -65507 -185253 -277956 -177300 33140 158793 116418 14499 45534
21408 45534 190631 340930 231871 176512 153713 145028 210140 252823 197068 140713 -41932
21397 -41932 -212806 -139017 63730 75343 -144789 -307332 -300421 -151273 33603 145778
21387 145778 74136 -5351 7916 131168 93616 -111938 -177776 -169658 -204778 -203367 -324854
$$ packed form
21461C43365N0414o0308l9100j71392j85073k10256j51225k1998J10863K31392
21451a03318K07735P4557m0772P3277M6731p837Q8176L3639j11049P3533m9877
21440B84795o0902J14350K7573P211o6118j26346j2893n590j59776j00942R5717
21429b921J62514N6991N2695j12276j07474R2374K9947j05633J3942M1639k9055
21418I2743m7225j11025j19746r2703J00656K10440J25653m2375j01919L1035
21408D5534J45097J50299j09059n5359k2799q685O5112M2683n5755n6355j82645
21397d1932j70874P3789K02747J1613k20132j62543O911J49148J84876J12175
21387A45778p1642p9487J3267J23252l7552k05554o5838Q118l5120J411j21487
$$ plain form
21376 -324854 -513858 -562635 -596049 -542475 -351952 -287307 -308278 -406165 -346744 -367019 -413840
21365 -413840 -378274 -101126 85479 -131482 -276181 28726 166397 137754 158156 78346
21355 78346 -3844 170457 347160 198810 -135326 -90389 89953 52064 -25592 67285 249219
21344 249219 324635 176094 78604 113502 50968 -89913 -140063 -132129 -35714 -99727 -287361
21333 -287361 -260318 -114219 -80562 43750 194702 285704 270950 137723 43492 85596 89490
21322 89490 54400 158002 203733 221187 372344 698941 805011 623288 543627 648355
21312 648355 786891 730182 561635 443601 570706 548130 286163 106148 -24280 -197252
21302 -197252 -134404 -30607 42928 43682 5942 90645 176969 162211 117927 215588 349784
$$ packed form
21376c24854j89004m8777l3414N3574J90523O4645k0971r7887N9421k0275m6821
21365d13840L5566K77148J86605k16961j44699L04907J37671k8643K0402p9810
21355G8346q2190J74301J76703j48350l34136M4937J80342l7889p7656R2877J81934
21344B49219P5416j48541r7490L4898o2534j40881n0150P934R6415o4013j87634
21333b87361K7043J46099L3657J24312J50952R1002j4754j33227r4231M2104L894
21322H9490l5090J03602M5731J7454J51157L26597J06070j81723p9661J04728
21312F48355J38536n6709j68547j18034J27105k2576k61967j80015j30428j72972
21302a97252O2848J03797P3535P54l7740Q4703Q6324j4758m4284R7661J34196
$$ plain form
21291 349784 459468 535383 472285 269836 145246 306756 540991 565713 271478 5583
21281 5583 -50599 -36304 -118938 -145562 -25871 88873 144164 103608 92764 63285 -25265
21270 -25265 -154086 -206543 -106539 70066 266255 247108 162064 9493 -85800 -104269 -39934
21259 -39934 26925 61020 -114128 -310444 -330354 -87579 125287 336987 377473 185473
21249 185473 -12981 -54908 64608 243650 213878 11711 -98990 11042 208208 320959
21239 320959 370382 346883 292859 193885 123229 266081 604021 604110 256118 266960 541936
21228 541936 793426 1258458 1535014 1361969 1113527 781350 604284 706767 697323 543942
21218 543942 503413 392882 312468 62553 124432 271599 148074 19392 -129641 -169065
$$ packed form
21291C49784J09684P5915o3098k02449j24590J61510K34235K4722k94235k65895
21281E583n6182J4295q2634k6624J19691J14744N5291m0556j0844k9479q8550
21270b5265j28821n2457J00004J76605J96189j9147q5044j52571r5293j8469O4335
21259c9934O6859L4095j75148j96316j9910K42775K12866K11700M0486j92000
21249A85473j98454m1927J19516J79042k9772k02167j10701J10032J97166J12751
21239C20959M9423k3499n4024r8974p0656J42852L37940Q9l47992J0842K74976
21228E41936K51490M65032K76556j73045k48442l32177j77066J02483r444j53381
21218E43942m0529j10531q0414k49915O1879J47167j23525j28682j49033l9424
$$ plain form
21208 -169065 25661 138985 111330 352719 731359 1033962 991562 626590 358265 386801
21198 386801 332436 151189 259779 610648 820934 837322 836941 767670 734394 522708 439092
21187 439092 597534 647862 530369 552264 654564 576312 577610 633535 573194 592737 772541
21176 772541 909676 830186 557953 415413 459301 598153 904384 1002586 982088 878003
21166 878003 732225 547637 524444 546818 425943 185853 67541 107745 171205 297970
21156 297970 441532 465099 384659 293985 284151 208131 166058 240912 647734 816251 731508
21145 731508 612477 521654 279547 407117 702877 877649 1099644 1321643 1601271 1831305
21135 1831305 1958303 2376944 3263831 4418999 4970192 4432724 3807878 3426746 3098932
$$ packed form
21208a69065J94726J13324k7655K41389L78640L02603m2400l64972k68325K8536
21198C86801n4365j81247J08590L50869K10286J6388l81o9271l3276k11686q3616
21187D39092J58442N0328j17493K1895J02300p8252J298N5925o0341J9543J79804
21176G72541J37135p9490k72233j42540M3888J38852L06231R8202k0498j04085
21166H78003j45778j84588k3193K2374j20875k40090j18312M0204O3460J26765
21156B97970J43562K3567q0440r0674r834p6020m2073P4854M06822J68517q4743
21145G31508j19031r0823k42107J27570K95760J74772K21995K21999K79628K30034
21135A831305J26998M18641Q86887J155168N51193n37468o24846l81132l27814
$$ plain form
21126 3098932 2902339 2855139 3138302 3831060 5102885 6469061 7756457 9622052 12908747
21117 12908747 17930773 26070261 39662206 61198366 76159776 62533829 41649121
21110 41649121 28265623 19660332 14220882 10434719 7839643 6028134 5020298 4354221
21102 4354221 3868269 3390713 3030580 2659392 2408299 2367511 2561867 3023136 3687942 4035480
21092 4035480 3576378 2716729 2113014 1699331 1457346 1387914 1514081 1848851 2198439 2504070
21082 2504070 3150960 4408436 5093400 4166240 2942365 2267535 1963466 1742691 1489448
21073 1489448 1230807 1107105 1005054 1018245 1124990 1181710 1032216 880969 730692 590187
21063 590187 573757 533114 544829 630388 649299 717886 947096 1009165 914646 704393 653719
$$ packed form
21126C098932j96593m7200K83163O92758J271825J366176J287396J865595L286695
21117A2908747N022026Q139488J3591945K1536160J4961410j3625947k0884708
21110D1649121j3383498q605291n439450l786163k595076j811509j007836o66077
21102D354221m85952m77556l60133l71188k51093m0788J94356M61269O64806L47538
21092D035480m59102q59649o03715m13683k41985o9432J26167L34770L49588L05631
21082B504070O46890J257476O84964r27160j223875o74830l04069k20775k53243
21073A489448k58641j23702j02051J3191J06745N6720j49494j51247j50277j40505
21063E90187j6430m0643J1715Q5559J8911O8587K29210O2069r4519k10253n0674
$$ plain form
21052 653719 701112 568720 535730 596498 713898 683239 712039 754772 669781 509046 308007
21041 308007 205635 231752 232048 207389 191522 216204 44930 74253 252597 273256 188813
21030 188813 181674 307878 533274 750676 923358 1034580 1056584 1151991 1292491 1266261
21020 1266261 1169248 1106982 1320965 1401960 1286140 1093224 1065153 1132127 1166402 1092545 1198125
21009 1198125 1345848 1569603 1835409 1932425 1991399 2077178 2117459 2250239 2350273 2455661
20999 2455661 2282903 2140415 2076866 1747452 1306570 1176379 1244858 1247512 1289340 1352129
20989 1352129 1384758 1330649 1263920 1271447 1300326 1300189 1360675 1447672 1374842 1301535 1247109 1210527
20977 1210527 1210471 1330120 1487443 1738521 1967430 2085059 2207222 2441632 2673528 2580269
$$ packed form
21052F53719M7393j32392l2990O0768J17400l0659K8800M2733q4991j60735k01039
21041C08007j02372K6117K96k4659j5867K4682j71274K9323J78344K0659q4443
21030A88813p139J26204K25396K17402J72682J11222K2004R5407J40500k6230
21020A266261r7013o2266K13983Q0995j15820j92916k8071O6974L4275p3857J05580
21009A198125J47723K23755K65806R7016N8974Q5779M0281J32780J00034J05388
20999B455661j72758j42488o3549l29414m40882j30191O8479K654M1828O2789
20989A352129L2629n4109o6729P527K8879j37O0486Q6997p2830p3307n4426l6582
20977A210527n6J19649J57323K51078K28909J17629J22163K34410K31896r3259
$$ plain form
20967 2580269 2195160 2037945 2116781 2253728 2329144 2307977 2396851 2797815 3067429 3189744
20957 3189744 3244644 3199504 3298680 3699950 4030083 4229287 4671035 5313073 6061231 6890366
20947 6890366 7786819 8818236 10034270 11471320 13157247 14916638 16660679 18651318
20939 18651318 21134774 24521071 29343639 35951765 44673027 56289105 71370851 89249547
20931 89249547 108917768 128928007 146737560 160269397 167709752 167036945 158793413 145108760
20923 145108760 127380333 107924972 88722877 71254646 56755409 45611005 37053792
20916 37053792 30615246 25893770 22394551 19725493 17664279 16226902 15162881 14342351
20908 14342351 14022980 14289548 15396469 17410436 20153137 23196652 26224227 28654130
$$ packed form
20967B580269l85109j57215P8836J36947P5416k1167Q8874M00964K69614J22315
20957C189744N4900m5140R9176M01270L30133J99204M41748O42038P48158Q29135
20947F890366Q96453J031417J216034J437050J685927J759391J744041J990639
20939A8651318K483456L386297M822568O608126Q721262J1616078J5081746J7878696
20931H9249547J9668221K0010239J7809553J3531837P440355o72807q243532j3684653
20923A45108760j7728427j9455361j9202095j7468231j4499237j1144404q557213
20916C7053792o438546m721476l499219k669058k061214j437377j064021q20530
20908A4342351l19371K66568J106921K013967K742701L043515L027575K429903
$$ plain form
20900 28654130 30668285 31985132 31373175 29442300 26735714 23244930 19819678 16536418
20892 16536418 13603137 11380004 9862625 8768199 8228343 8151352 8187715 8152039 8092038
20883 8092038 8215839 8498532 8974814 9760920 10756255 11871215 12990288 14177104 15735134
20874 15735134 17717222 19770545 22030671 24886118 28894931 34497463 42159810 52608846
20866 52608846 66523332 84161401 104361083 125550157 146152959 163077407 174534016
20859 174534016 178208797 172865456 160503350 142572773 121487102 100040327 79921252
20852 79921252 62691260 49278151 39073802 31264059 25544856 21449716 18233363 15774386
20844 15774386 13816419 12190696 10929229 9949803 8976481 8180643 7784447 7442395 7079725
$$ packed form
20900B8654130K014155J316847o11957j930875k706586l490784l425252l283260
20892A6536418k933281k223133j517379j094426n39856p6991L6363l5676o0001
20883H092038J23801K82693M76282P86106R95335J114960J119073J186816J558030
20874A5735134J982088K053323K260126K855447M008813N602532P662347J0449036
20866E2608846J3914486J7638069K0199682K1189074K0602802J6924448J1456609
20859A74534016L674781n343341j2362106j7930577k1085671k1446775k0119075
20852G9921252j7229992j3413109j0204349p809743n719203m095140l216353k458977
20844A5774386j957967j625723j261467r79426r73322p95838l96196l42052l62670
$$ plain form
20835 7079725 6781880 6553193 6255220 5827712 5667680 5912270 6003065 5913545 5588949 5165309
20825 5165309 4929826 5099124 5305101 5440663 5574948 5757631 5929531 6105325 6396484
20816 6396484 6781369 7254837 7897972 8765022 9857591 10934411 11990495 12939418 14201320
20807 14201320 15907807 17827322 20286886 23397217 27285225 32359846 39102319 48020321
20799 48020321 59813596 74978305 92835067 112214174 131807105 149072473 161562535
20792 161562535 167975259 166741158 157742653 143098435 124621156 104746771 85284955
20785 85284955 67676123 53088524 41682590 33047823 26696402 21860970 18300101 15579907
20777 15579907 13381134 11621183 10138258 8734518 7610298 6865926 6392092 6147954
$$ packed form
20835G079725k97845k28687k97973m27508j60032K44590R0795q9520l24596m23640
20825E165309k35483J69298K05977J35562J34285J82683J71900J75794K91159
20816F396484L84885M73468O43135Q67050J092569J076820J056084R48923J261902
20807A4201320J706487J919515K459564L110331L888008N074621O742473Q918002
20799D8020321J1793275J5164709J7856762J9379107J9592931J7265368J2490062
20792A61562535O412724j234101q998505j4644218j8477279j9874385j9461816
20785H5284955j7608832j4587599j1405934q634767o351421m835432l560869k720194
20777A5579907k198773j759951j482925j403740j124220p44372m73834k44138
$$ plain form
20769 6147954 5971981 5631100 5184760 4870977 4481566 3989025 3523068 3268390 3143902
20760 3143902 2967633 2799054 2769020 2710477 2277832 2019707 1838100 1737370 1641123 1543441
20750 1543441 1593829 1569839 1389213 1186148 970154 1001379 1087461 1207699 1183024 960885
20740 960885 839585 838939 894978 1019083 1067449 1089858 1114399 1035656 1108282 1494742 1714292
20729 1714292 1581890 1559381 1544416 1641605 1956578 2347790 2727317 3113172 3380350 3585141
20719 3585141 3438695 3064629 2770359 2499173 2111069 1728198 1350332 1063857 1032751 1133034
20709 1133034 1103842 999808 1189538 1186203 976741 949985 1130873 1339484 1437970 1269388
20699 1269388 1060516 925119 769767 676934 621375 608162 453561 297467 220135 236417
$$ packed form
20769F147954j75973l40881m46340l13783l89411m92541m65957k54678j24488
20760C143902j76269j68579l0034n8543m32645k58125j81607j00730r6247r7682
20750A543441N0388k3990j80626k03065k15994L1225Q6082J20238k4675k22139
20740I60885j21300o46N6039J24105M8366K2409K4541p8743P2626L86460K19550
20729A714292j32402k2509j4965R7189L14973L91212L79527L85855K67178K04791
20719C585141j46446l74066k94270k71186l88104l82871l77866k86475l1106J00283
20709A133034k9192j04034J89730l335k09462k6756J80888K08611R8486j68582
20699A269388k08872j35397j55352r2833n5559j3213j54601j56094p7332J6282
$$ plain form
20689 236417 307212 278679 325412 459030 542643 575850 708034 684903 579667 502557 423948
20678 423948 321436 223597 191526 266170 191828 192046 306474 386226 254151 300663 476113
20667 476113 522856 462903 296162 235162 202522 12689 35577 220064 223578 112922 -51126
20656 -51126 -58042 35655 217408 392956 255331 213936 310784 507687 683189 508814 412472
20645 412472 557814 689112 623428 596338 606844 551876 471643 362727 314212 491864 554673
20634 554673 410914 318046 379525 506515 480640 325555 49601 146743 431463 535042
20624 535042 380253 146434 318916 520796 454491 563938 591583 518916 539522 534949 595580
20613 595580 621180 657229 824046 854081 724242 576787 237869 99758 258894 213955
$$ packed form
20689B36417P0795k8533M6733J33618Q3613L3207J32184k3131j05236p7110p8609
20678D23948j02512r7839l2071P4644p4342K18J14428P9752j32075M6512J75450
20667D76113M6743n9953j66741o1000l2640j89833K2888J84487L514j10656j64048
20656e1126o916R3697J81753J75548j37625m1395R6848J96903J75502j74375r6342
20645D12472J45342J31298o5684k7090J0506n4968q0233j08916m8515J77652O2809
20634E54673j43759r2868O1479J26990k5875j55085k75954R7142K84720J03579
20624E35042j54789k33819J72482K01880o6305J09447K7645p2667K0606m573O0631
20613E95580K5600L6049J66817L0035j29839j47455l38918j38111J59136m4939
$$ plain form
20603 213955 102762 93398 -178337 -474891 -556043 -604426 -514584 -406982 -333053 -427041 -431872
20592 -431872 -242968 7883 138869 152386 86411 24536 154876 208948 192452 251242 124120
20581 124120 -54347 -196526 -168657 71648 261420 150727 5787 -61376 -192926 -136051
20571 -136051 113384 234075 156883 158830 173428 107682 -12987 -66321 -49937 11597 171984
20560 171984 317994 367361 294229 188883 260395 266716 191317 96685 80765 -32041 -69361
20549 -69361 29515 9886 91732 210517 371713 321203 82958 -205599 -423898 -263491
20539 -263491 -2351 -88785 -141146 -85177 -36074 90451 157340 36254 -155960 -81829 1213
20528 1213 -38196 -169665 -128560 -26351 79380 124839 24747 -142607 -144457 -145489 -230825
$$ packed form
20603B13955j11193r364k71735k96554q1152m8383Q9842J07602P3929r3988m831
20592d31872J88904K50851J30986J3517o5975o1875J30340N4072j6496N8790j27122
20581A24120j78467j42179K7869K40305J89772j10693j44940o7163j31550N6875
20571a36051K49435J20691p7192J947J4598o5746j20669n3334J6384O1534J60387
20560A71984J46010M9367p3132j05346P1512O321p5399r4632j5920j12806l7320
20549f9361R8876j9629Q1846J18785J61196n0510k38245k88557k18299J60407
20539b63491K61140q6434n2361N5969M9103J26525O6889j21086j92214P4131Q3042
20528A213l9409j31469M1105J02209J05731M5459j00092j67354j850j032q5336
$$ plain form
20517 -230825 -199090 -241827 -303897 -340167 -342580 -186556 67817 149891 212531 274215 153408
20506 153408 54160 142532 208716 190634 145697 151897 201045 159373 -44850 -125925 -124074 -105180
20494 -105180 -116798 -218858 -288198 -381832 -313541 -368909 -494512 -343990 -203655 -237455 -247161
20483 -247161 -156558 -40320 -118031 -97747 -5098 -116533 -281350 -377311 -373865 -240443 -23789
20472 -23789 57875 138871 158381 79750 21040 42254 -51945 -165900 -161968 -244755 -202629 -130218
20460 -130218 12855 158693 248371 198213 90078 47432 32713 -2580 -114444 -154251 -190818
20449 -190818 -167714 -275583 -368884 -371867 -452973 -395318 -211478 -254389 -412970 -416975 -378195
20438 -378195 -200900 -36147 -45175 -113209 -250578 -147791 24626 43740 -30587 -233511
$$ packed form
20517b30825L1735m2737o2070l6270k413J56024K54373Q2074O2640O1684j20807
20506A53408r9248Q8372O6184j8082m4937O200M9148m1672k04223q1075J851J8894
20494a05180j1618j02060o9340r3634O8291n5368j25603J50522J40335l3800r706
20483b47161R0603J16238p7711K0284R2649j11435j64817r5961L446J33422K16654
20472b3789Q1664Q0996J9510p8631n8710K1214r4199j13955L932q2787M2126P2411
20460a30218J43073J45838Q9678n0158j08135m2646j4719l5293j11864l9807l6567
20449a90818K3104j07869r3301k983q1106N7655J83840m2911j58581m005L8780
20438c78195J77295J64753r028o8034j37369J02787J72417J9114p4327k02924
$$ plain form
20428 -233511 -267706 -62305 126335 215785 180192 31431 -27031 144694 231139 237854 171340
20417 171340 -45982 -227562 -262958 -297223 -456901 -245098 14565 46946 -85801 -206970
20407 -206970 -285478 -383609 -355871 -163134 103697 229002 131024 -174497 -319475 -149280
20397 -149280 -64539 -179676 -349079 -333906 -263345 -151797 -21532 56739 18581 -76970 -106683
20386 -106683 -82314 -223615 -246595 -256528 -179748 -152219 -157004 -66609 36378 92120 159736
20375 159736 192211 187822 174407 250618 218241 310530 303373 202119 118343 32079 -196202
20364 -196202 -302724 -120683 172400 197778 60812 -129090 -146312 105449 216587 136133
20354 136133 -72491 -243913 -366390 -345503 -244739 -258669 -233328 -124745 34928 145129
$$ packed form
20428b33511l4195K05401J88640Q9450l5593j48761n8462J71725Q6445O715o6514
20417A71340k17322j81580l5396l4265j59678K11803K59663L2381j32747j21169
20407b06970p8508r8131K7738J92737K66831J25305r7978l05521j44978J70195
20397a49280Q4741j15137j69403J5173P0561J11548J30265P8271l8158r5551k9713
20386a06683K4369j41301k2980r933P6780K7529m785R0395J02987N5742O7616
20375A59736L2475m389j3415P6211l2377R2289p157j01254q3776q6264k28281
20364a96202j06522J82041K93083K5378j36966j89902j7222K51761J11138q0454
20354A36133k08624j71422j22477K0887J00764j3930K5341J08583J59673J10201
$$ plain form
20344 145129 175758 82658 -109639 -86936 -87866 -83987 -103245 35041 211045 350702 348142
20333 348142 357854 408029 362785 218063 -4505 -109883 -217085 -276548 -280106 -377747 -526660
20322 -526660 -554977 -344690 -247911 -315932 -214134 -137754 -64469 -108260 -277979 -483902 -557854
20311 -557854 -309976 -120569 53415 301478 372319 233885 84270 -25090 -21971 -156877
20301 -156877 -394442 -487611 -554614 -631160 -544763 -388378 -371348 -421482 -338063 -79097 17843
20290 17843 105948 311729 327513 230296 101117 -60415 -127663 -131160 -99264 52669 192410
20279 192410 235351 270765 190204 176399 323012 185875 -96676 -259400 -380575 -573632
20269 -573632 -696520 -522917 -339160 -192153 -131745 -290538 -469582 -488940 -328943 -237469
$$ packed form
20344A45129L0629r3100j92297K2703r30L879j9258J38286J76004J39657k560
20333C48142R712N0175m5244j44722k22568j05378j07202n9463l558r7641j48913
20322e26660k8317K10287R6779o8021J01798P6380P3285m3791j69719k05923p3952
20311e57854K47878J89407J73984K48063P0841j38434j49615j09360L119j34906
20301a56877k37565r3169o7003p6546Q6397J56385J7030n0134Q3419K58966R6940
20290A7843Q8105K05781J5784r7217j29179j61532o7248l497L1896J51933J39741
20279A92410M2941L5414q0561j3805J46613j37137k82551j62724j21175j93057
20269e73632j22888J73603J83757J47007O0408j58793j79044j9358J59997R1474
$$ plain form
20259 -237469 -126754 111455 390153 653364 483399 175855 150728 154795 320345 205342
20249 205342 -41976 65738 139101 109783 158581 293139 302698 32174 -233448 -297612 -196781
20238 -196781 61066 422241 504353 378886 269568 265137 216298 296388 304435 193691 132763
20227 132763 134598 79992 55510 -26236 -175914 -140406 18824 95835 39931 -103757 -212172
20216 -212172 -217473 -222124 -181939 -208305 -287090 -146898 49470 52251 41693 87148 173011 241960
20204 241960 112097 -34497 -177208 -330368 -240442 -292959 -299488 -80170 -89003 -40610 -94964
20193 -94964 -187539 -92555 46727 59104 66466 76806 -195551 -504166 -436230 -134498 -161314
20182 -161314 -285310 -299220 -296034 -344465 -235810 4691 -62913 -294568 -372711 -372001 -377357
$$ packed form
20259b37469J10715K38209K78698K63211j69965l07544k5127M067J65550j15003
20249B05342k47318J07714P3363k9318M8798J34558R559k70524k65622o4164J00831
20238a96781K57847L61175Q2112j25467j09318m431m8839Q0090Q047j10744o0928
20227A32763J835n4606k4482q1746j49678L5508J59230P7011n5904j43688j08415
20216b12172n301m651M0185k6366p8785J40192J96368K781j0558M5455Q5863O8949
20204B41960j29863j46594j42711j53160Q9926n2517o529K19318q833M8393n4354
20193i4964r2575R4984J39282J2377P362J0340k72357l08615O7936L01732k6816
20182a61314j23996j3910L186m8431J08655K40501o7604k31655p8143P10n356
$$ plain form
20171 -377357 -285250 -110734 -24310 -50320 -34820 -46988 -109349 -82393 -32510 -149351 -129150
20160 -129150 28487 76803 -64442 -166288 -196480 -269289 -98577 219068 479358 759356
20150 759356 782461 603325 393085 176764 33780 67825 -136450 -395141 -387114 -226991
20140 -226991 -332367 -413639 -300605 -293018 -390633 -561478 -495323 -312296 -144992 -64220 -29709
20129 -29709 -140198 -418758 -655168 -879305 -926098 -683716 -474447 -249088 -188798 -410274
20119 -410274 -578875 -528446 -548355 -693601 -612964 -435245 -306222 -195573 125164 264339
20109 264339 69378 -348424 -531878 -643211 -767585 -682770 -538197 -396182 -152837 -101007
20099 -101007 -273618 -354947 -207361 -114295 -295914 -370378 -320317 -249023 -218112 -137564 -172555
$$ packed form
20171c77357R2107J74516Q6424k6010J5500j2168o2361K6956M9883j16841K0201
20160a29150J57637M8316j41245j01846l0192p2809J70712L17645K60290K79998
20150G59356K3105j79136k10240k16321j42984L4045k04275k58691Q027J60123
20140b26991j05376q1272J13034P587r7615j70845O6155J83027J67304Q0772L4511
20129b9709j10489k78560k36410k24137m6793K42382K09269K25359O0290k21476
20119d10274j68601N0429j9909j45246Q0637J77719J29023J10649L20737J39175
20109B64339j94961m17802j83454j11333j24374Q4815J44573J42015K43345N1830
20099a01007j72611q1329J47586R3066j81619p4464N0061P1294L0911Q0548l4991
$$ plain form
20088 -172555 -121189 -33183 -103430 -184035 -126762 -20470 177558 302162 163420 5320
20078 5320 -118664 -70102 149176 79754 -221474 -254496 -225867 -389661 -393343 -495547 -511612
20067 -511612 -313947 -180267 -148270 -118017 -2544 153777 122945 73951 96039 67213 -119470
20056 -119470 -153930 -171639 -200649 -290938 -374964 -179109 9694 -76118 -135120 -213906 -287326
20045 -287326 -242821 -123469 7439 28208 75559 99169 -29354 -247026 -233451 62890
20035 62890 376153 414175 324207 153236 23800 -63451 -89338 -96182 -318082 -490111 -311679
20024 -311679 -261909 -259627 -98546 79261 246437 210323 117348 1310 -55710 -189331 -441829
20013 -441829 -518091 -247123 103748 183073 193733 427772 585978 767918 1012528 767643
$$ packed form
20088a72555N1366Q8006p0247q0605N7273J06292J98028J24604j38742j58100
20078E320j23984M8562K19278o9422l01228l3022K8629j63794l682j02204j6065
20067e11612J97665J33680L1997L0253J15473J56321l0832m8994K2088k8826j86683
20056a19470l4460j7709k9010r0289q4026J95855J88803q5812n9002p8786p3420
20045b87326M4505J19352J30908K0769M7351K3610j28523k17672J3575K96341
20035F2890L13263L8022q9968j70971j29436q7251k5887o844k21900j72029J78432
20024c11679M9770K282J61081J77807J67176l6114r2975j16038n7020j33621k52498
20013d41829p6262K70968L50871P9325J0660K34039J58206J81940K44610k44885
$$ plain form
20003 767643 318531 -13523 -187420 -58876 -62293 -191959 -246071 -346255 -491653 -410261
19993 -410261 -181811 -222495 -413634 -265229 -268321 -416399 -389743 -354126 -376110 -283982 -62972
19982 -62972 49272 -52700 -330640 -413985 -377097 -159631 130577 216296 65548 87021
19972 87021 55391 -31651 -17034 -4306 253569 405807 557816 737086 669842 585721 614617
19961 614617 569651 360802 54010 -97993 -154549 -217887 -254809 -311226 -218232 -76969 -145572
19950 -145572 -374544 -352318 -139536 -47130 -73730 -147513 -280809 -220928 -73591 -79077 -300085
19939 -300085 -267670 -136784 -132749 -54152 2548 37845 139615 88836 -54485 -168203 -214013
19928 -214013 -243168 -253890 -146715 -59640 -15986 -64854 -134272 -95448 -20421 -36342 -89953
$$ packed form
20003G67643m49112l32054j73897J28544l417j29666n4112j00184j45398Q1392
19993d10261K28450m0684j91139J48405l092j48078K6656L5617k1984R2128K21010
19982f2972J12244j01972k77940q3345L6888K17466K90208Q5719j50748K1473
19972H7021l1630q7042J4617J2728K57875J52238J52009J79270o7244q4121K8896
19961F14617m4966k08849l06792j52003n6556o3338l6922n6417R2994J41263o8603
19950a45572k28972K2226K12782R2406k6600p3783j33296N9881J47337n486k21008
19939c00085L2415J30886M035P8597N6700L5297J01770n0779j43321j13718m5810
19928b14013k9155j0722J07175Q7075M3654m8868o9418L8824P5027j5921n3611
$$ plain form
19917 -89953 -142113 -46937 143042 40307 -113695 -136867 -117432 -86564 -136340 -254872 -399536
19906 -399536 -316452 25272 388693 564765 338385 177118 56534 88775 205285 291376
19896 291376 436583 305309 106219 -56925 -112604 -58322 5182 -131538 -214121 -51647
19886 -51647 142073 286565 373714 291242 153750 -29535 -303691 -480156 -292348 -106681
19876 -106681 -28967 33849 -18970 -42484 -121255 -142352 41099 64734 -130415 -166490 -185227
19865 -185227 -239662 -351991 -326877 -227392 -139323 -58658 -30883 -109147 -285818 -401428 -430793
19854 -430793 -381166 -234685 -181363 -103175 1080 -51489 -110429 40304 296173 467907
19844 467907 334606 72054 -128851 -223860 -392570 -615680 -528010 -270330 128546 378141
$$ packed form
19917h9953n2160R5176J89979j02735j54002k3172J9435L0868m9776j18532j44664
19906c99536Q3084L41724L63421J76072k26380j61267j20584L2241J16510Q6091
19896B91376J45207j31274j99090j63144n5679N4282O3504j36720q2583J62474
19886e1647J93720J44492Q7149q2472j37492j83285k74156j76465J87808J85667
19876a06681P7714O2816n2819k3514p8771k1097J83451K3635j95149l6075j8737
19865a85227n4435j12329K5114R9485Q8069Q0665K7775p8264j76671j15610k9365
19854d30793M9627J46481N3322P8188J04255n2569n8940J50733K55869J71734
19844D67907j33301k62552k00905r5009j68710k23110Q7670K57680L98876K49595
$$ plain form
19834 378141 412612 164442 103581 96730 83567 103735 242469 291923 284521 263525 132069
19823 132069 -24401 -145359 -162374 -222439 -230974 -162833 -88286 -3836 107672 261043 186232
19812 186232 -2104 -36857 40332 -94796 -113048 -48075 50639 193934 301059 298411 294271
19801 294271 367254 439072 491616 582022 547558 408936 370257 489308 503526 464569 399734
19790 399734 282473 246062 99453 -13471 -93600 -12347 128553 176581 267513 101665
19780 101665 -91567 -175629 -286917 -307918 -453376 -598337 -454601 -341868 -274696 -59682
19770 -59682 27069 -47402 141 156689 146524 131662 199152 131737 -4875 -154437 -211175
19759 -211175 22590 272418 429922 364693 398231 537523 489791 243752 186430 177850 16716
$$ packed form
19834C78141L4471k48170o0861o851j3163K0168J38734M9454p402k0996j31456
19823A32069j56470j20958j7015o0065q535O8141P4547Q4450J11508J53371p4811
19812A86232j88336l4753P7189j35128j8252O4973R8714J43295J07125k648m140
19801B94271P2983P1818N2544R0406l4464j38622l8679J19051J4218l8957o4835
19790C99734j17261l6411j46609j12924q0129Q1253J40900M8028R0932j65848
19780A01665j93232q4062j11288k1001j45458j44961J43736J12733O7172K15014
19770e9682Q6751p4471M7543J56548j0165j4862O7490o7415j36612j49562n6738
19759b11175K33765K49828J57504o5229L3538J39292m7732k46039n7322q580j61134
$$ plain form
19748 16716 -185103 -216922 56166 359004 392585 271019 253935 364701 409934 387883 446696
19737 446696 359111 204431 142999 183600 344078 384207 301869 149104 10277 40523 109452
19726 109452 136536 219528 351160 411439 342044 362794 448705 555727 447414 256604 251271
19715 251271 195118 60730 -117430 -183407 -134667 -158772 -217261 -338048 -239710 66923 318626
19704 318626 332361 187411 -14003 -214127 -122123 235181 425714 497424 385621 163315
19694 163315 -53610 -171275 -28763 126740 185170 304490 271764 219804 328953 441648
19684 441648 451868 481224 403681 205447 96412 66739 181943 134699 72978 91972 200832
19673 200832 316975 301940 182710 212935 189653 64264 -125506 -67774 208328 272138
$$ packed form
19748A6716k01819l1819K73088L02838L3581j21566j7084J10766M5233k2051N8813
19737D46696q7585j54680o1432M0601J60478M0129q2338j52765j38827L0246O8929
19726A09452K7084Q2992J31632O0279o9395K0750Q5911J07022j08313j90810n333
19715B51271n6153j34388j78160o5977M8740k4105n8489j20787R8338L06633K51703
19704C18626J3735j44950k01414k00124R2004L57304J90533P1710j11803k22306
19694A63315k16925j17665J42512J55503N8430J19320l2726n1960J09149J12695
19684D41648J0220K9356p7543j98234j09035k9673J15204m7244o1721J8994J08860
19673B00832J16143j5035j19230L0225k3282j25389j89770N7732K76102O3810
$$ plain form
19663 272138 248139 416916 697418 760637 723453 622331 403668 256437 125616 193165
19653 193165 237843 178969 213711 258406 416788 492858 451803 424934 293518 283414 421107
19642 421107 546260 621592 758493 805582 615820 367009 285436 300758 324206 320154 360799
19631 360799 385006 355731 477219 568325 554054 529182 591019 563340 483111 381924 254648
19620 254648 187544 378632 555195 595177 564579 470079 402303 341945 195027 132478 297169
19609 297169 483209 592371 744952 784062 632700 623535 704535 826997 767960 681630 617308
19598 617308 591236 525048 395504 231791 179445 341159 286269 252016 272762 165500 176916
19587 176916 361979 434019 281918 112568 8868 -125923 -266993 -223338 9518 164669
$$ packed form
19663B72138k3999J68777K80502O3219l7184j01122k18663j47231j30821O7549
19653A93165M4678n8874L4742M4695J58382P6070m1055k6869j31416j0104J37693
19642D21107J25153P5332J36901M7089j89762k48811q1573J5322K3448m052M0645
19631C60799K4207k9275J21488R1106j4271k4872O1837k7679q0229j01187j27276
19620B54648o7104J91088J76563L9982l0598r4500o7776o0358j46918o2549J64691
19609B97169J86040J09162J52581L9110j51362r165Q1000J22462n9037q6330o4322
19598F17308k6072o6188j29544j63713n2346J61714n4890l4253K0746j07262J1416
19587A76916J85063P2040j52101j69350j03700j34791j41070M3655K32856J55151
$$ plain form
19577 164669 154865 253159 332024 449510 566304 397846 229699 210142 385886 573526
19567 573526 686357 609375 487014 340132 418314 605469 588721 577070 632656 538085 534773
19556 534773 544069 431957 303291 246177 304338 221074 75540 156030 394404 485456 360529
19545 360529 318196 261744 252064 302105 228117 323183 489911 298693 132690 227700 257605
19534 257605 291165 236820 109965 205384 459217 700516 868024 878770 812018 793206 810337
19523 810337 819979 858308 864456 709993 501473 333127 354133 415399 396953 426763 444587
19512 444587 485214 629928 646491 633217 936856 1289087 1256258 1096914 1063641 1057717 935121
19501 935121 826104 686782 486131 204471 134813 283109 430955 636490 627102 523472
$$ packed form
19577A64669r804R8294P8865J17486J16794j68458j68147j9557J75744J87640
19567E73526J12831p6982j22361j46882P8182J87155j6748j1651N5586r4571l312
19556E34773R296j12112j28666n7114N8161q3264j45534Q0490K38374R1052j24927
19545C60529m2333n6452r680N0041p3988R5066J66728j91218j66003R5010K9905
19534B57605L3560n4345j26855R5419K53833K41299J67508J0746o6752j8812J7131
19523H10337R642L8329O148j54463k08520j68346K1006O1266j8446K9810J7824
19512D44587M0627J44714J6563j3274L03639L52231l2829j59344l3273n924j22596
19501I35121j09017j39322k00651k81660o9658J48296J47846K05535r388j03630
$$ plain form
19491 523472 533476 656719 666861 598344 526144 432445 500386 646676 565740 309067 320714
19480 320714 403710 284778 46541 -224781 -308622 -230139 -755 239778 317791 373689
19470 373689 286995 244561 588380 835145 668172 569307 558482 637314 641793 610487 727758
19459 727758 725902 573904 517164 764326 1110267 1153788 918723 729129 772112 772435 719774
19448 719774 703646 686806 664551 612785 558493 565758 527649 401871 374843 403039 507701
19437 507701 604058 927797 1159941 1244150 1167437 1061835 1010854 1017427 963052 774695 510058
19426 510058 677168 992093 1175469 1113985 880865 782566 608683 569289 732989 854364
19416 854364 886033 798790 637289 608773 578982 507373 413576 467104 635219 861827 907909
$$ packed form
19491E23472J0004J23243J0142o8517p2200r3699O7941J46290q0936k56673J1647
19480C20714Q2996j18932k38237k71322q3841P8483K29384K40533P8013N5898
19470C73689q6694m2434L43819K46765j66973r8865j0825P8832M479l1306J17271
19459G27758j856j51998n6740K47162L45941M3521k35065j89594M2983L23n2661
19448G19774j6128j6840k2255n1766n4292P265l8109j25778k7028K8196J04662
19437E07701R6357L23739K32144Q4209p6713j05602n0981O573n4375j88357k64637
19426E10058J67110L14925J83376o1484k33120r8299j73883l9394J63700J21375
19416H54364L1669q7243j61501k8516k9791p1609r3797N3528J68115K26608M6082
$$ plain form
19405 907909 677089 444964 463495 718267 847930 912916 892550 788084 701291 675764
19395 675764 589135 446106 406934 441962 393117 479475 753214 784906 521411 437788 649183
19384 649183 728360 933474 1188459 1118601 922729 662940 671046 906339 1116390 1230366
19374 1230366 1260573 1193465 1050411 1096413 1112941 1121806 1283619 1366713 1386005 1593866 1708144
19363 1708144 1662372 1676067 1784739 1711351 1553558 1481873 1596583 1828495 1979376 1992066
19353 1992066 2057574 2402025 2968756 3553757 3898936 4098657 4293684 4404831 4553084 4845676
19343 4845676 5048934 5170734 5188438 5164300 4914696 4495821 3948656 3549100 3239839 2890241
19333 2890241 2684802 2668707 2664231 2741600 2983282 3197233 3230979 3119196 3011716 3011722 3238021
$$ packed form
19405I07909k30820k32125J8531K54772J29663O4986k0366j04466q6793k5527
19395F75764q6629j43029l9172L5028m8845Q6358K73739L1692k63495q3623K11395
19384F49183P9177K05114K54985o9858j95872k59789Q106K35293K10051J13976
19374A230366L0207o7108j43054M6002J6528Q865J61813Q3094J9292K07861J14278
19363A708144m5772J3695J08672p3388j57793p1685J14710K31912J50881J2690
19353A992066O5508L44451N66731N85001L45179J99721J95027J11147J48253K92592
19343D845676K03258J21800J7704k4138k49604m18875n47165l99556l09261l49598
19333B890241k05439j6095m476P7369K41682K13951L3746j11783j07480OK26299
$$ plain form
19322 3238021 3419935 3496896 3642630 3763711 3827087 3879762 4027390 4219019 4429717 4808455
19312 4808455 5112697 5406818 5621331 5768864 5957188 6068981 6091211 6087225 6296358 6786778
19302 6786778 7469664 8359073 9508982 10729830 12076286 13558488 15246739 17146724
19294 17146724 18793068 20238470 21730305 23459940 25599079 28484779 32427914 38054164
19286 38054164 46244963 57843545 73983779 96064022 123660447 154282515 186429059
19279 186429059 219028418 247656332 269026291 283101237 287265129 280056258 263989175
19272 263989175 240364102 210408371 178457718 147237328 117767974 92485929 72761980
19265 72761980 58150213 47599943 39830559 34021191 29893392 27201399 25541424 24612512
$$ packed form
19322C238021J81914P6961J45734J21081O3376N2675J47628J91629K10698L78738
19312D808455L04242K94121K14513J47533J88324J11793K2230l986K09133M90420
19302F786778O82886Q89409J149909J220848J346456J482202J688251J899985
19294A7146724J646344J445402J491835J729635K139139K885700L943135N626250
19286C8054164Q190799J1598582J6140234K2080243K7596425L0622068L2146544
19279A86429059L2599359K8627914K1369959J4074946M163892p208871j6067083
19272B63989175k3625073k9955731l1950653l1220390k9469354k5282045j9723949
19265G2761980j4611767j0550270p769384n809368m127799k691993j659975r28912
$$ plain form
19257 24612512 24450189 25319563 27304423 30348349 34073558 37988909 42407522 46555579
19249 46555579 49380775 51235245 51815405 50425680 47645973 43642022 38394435 33240043
19241 33240043 28594050 24137105 20312095 17727939 15986439 14829925 14091483 13761630
19233 13761630 14016678 14591501 15388118 16560103 18030444 19459172 20764307 21896432
19225 21896432 23021927 24404320 25932338 27747948 30391607 34624418 40885572 49663994
19217 49663994 62136263 79910165 103833731 132916011 164608670 197823836 231162691
19210 231162691 259422094 279836496 292277704 293498927 283189185 264669022 238140947
19203 238140947 205728758 172927934 141299602 111685852 86870711 68097599 54621995
$$ packed form
19257B4612512j62323Q69374J984860L043926L725209L915351M418613M148057
19249D6555579K825196J854470N80160j389725k779707m003951n247587n154392
19241C3240043m645993m456945l825010k584156j741500j156514p38442l29853
19233A3761630K55048N74823P96617J171985J470341J428728J305135J132125
19225B1896432J125495J382393J528018J815610K643659M232811O261154Q778422
19217D9663994J2472269J7773902K3923566K9082280L1692659L3215166L3338855
19210B31162691K8259403K0414402J2441208J221223j0309742j8520163k6528075
19203B38140947l2412189l2800824l1628332k9613750k4815141j8773112j3475604
$$ plain form
19196 54621995 45032498 37892198 32586273 28541272 25155968 22416921 20336023 18503097
19188 18503097 16846820 15480134 14270723 13143997 12025062 11084431 10365310 9883105
19180 9883105 9447820 9026379 8833762 8703485 8384591 8334967 8522791 8724203 8995352 9329105
19170 9329105 9641609 10126152 10655681 11085593 11546934 12108314 12852849 13847962 15210854
19161 15210854 16696296 18167339 19757945 21259538 22650135 24302545 26138241 28468320
19153 28468320 31798470 36702277 43722861 53418450 66565972 84873236 109399205 138330552
19145 138330552 169067551 200684875 231199054 256034106 273886439 283763208 282241830
19138 282241830 270094307 250410908 223330178 191697073 160097940 129656088 101802066
$$ packed form
19196E4621995r589497p140300n305925m045001l385304k739047k080898j832926
19188A8503097j656277j366686j209411j126726j118935r40631p19121m82205
19180I883105m35285m21441j92617j30277l18894m9624J87824K01412K71149L33753
19170I329105L12504M84543N29529M29912M61341N61380P44535R95113J362892
19161A5210854J485442J471043J590606J501593J390597J652410J835696K330079
19153B8468320L330150M903807P020584R695589J3147522J8307264K4525969K8931347
19145A38330552L0736999L1617324L0514179K4835052J7852333R876769j521378
19138B82241830j2147523j9683399k7080730l1633105l1599133l0441852k7854022
$$ plain form
19131 101802066 79015447 61846960 49286311 40124240 33542657 28619258 24538329
19124 24538329 21256044 18749792 16606156 14819540 13296043 11957727 10741967 9727676
19116 9727676 8903515 8153018 7620239 7122902 6539445 5973628 5341168 5000078 4883936
19107 4883936 4737158 4426011 4168421 4019937 3918221 3898196 3711791 3354718 3172717 3080613
19097 3080613 2862157 2631765 2635745 2692500 2653523 2457717 2104632 1817546 1685726 1813176
19087 1813176 1968645 2000647 2157582 2382395 2366594 2373333 2473531 2487408 2281946 2030476
19077 2030476 1770817 1491678 1382962 1481235 1518502 1762065 1986102 2107625 2333624 2559929
19067 2559929 2779442 3236108 3554413 3740955 3954733 4232086 4258919 4088754 3954228 3757986
$$ packed form
19131A01802066k2786619j7168487j2560649r162071o581583m923399m080929
19124B4538329l282285k506252k143636j786616j523497j338316j215760j014291
19116I727676q24161p50497n32779m97337n83457n65817o32460l41090j16142
19107D883936j46778l11147k57590j48484j01716k0025j86405l57073j82001r2104
19097C080613k18456k30392L980N6755l8977j95806l53085k87086j31820J27450
19087A813176J55469L2002J56935K24813j5801O739J00198J3877k05462k51470
19077B030476k59659k79139j08716R8273L7267K43563K24037J21523K25999K26305
19067B559929K19513M56666L18305J86542K13778K77353K6833j70165j34526j96242
$$ plain form
19057 3757986 3445039 2974490 2608209 2322751 2150877 2126760 2002556 1688464 1636002 1552407
19047 1552407 1283871 1241551 1472241 1534491 1309735 1089836 922615 901701 962145 796549
19037 796549 600903 689882 837861 859053 800918 648273 523257 346961 344832 425067 505773
19026 505773 542173 553202 684176 821862 813399 684168 733256 695667 695186 676023 681083 809475
19014 809475 962750 1000585 758190 629741 632497 628065 639383 545861 394682 315765 303995
19003 303995 283361 265009 311462 333920 361170 440271 490142 429056 320999 378171 447967
18992 447967 448362 411276 299236 429330 535281 647869 733118 712224 592645 548551 371698
18981 371698 177266 88808 54121 -50042 -21821 195160 374686 421043 399341 306041 268615
$$ packed form
19057C757986l12947m70549l66281k85458j71874k4117j24204l14092n2462q3595
19047A552407k68536m2320K30690O2250k24756k19899j67221k0914O0444j65596
19037G96549j95646Q8979J47979K1192n8135j52645j25016j76296k129Q0235Q0706
19026E05773L6400J1029J30974J37686q463j29231M9088l7589m81j9163N060J28392
19014H09475J53275L7835k42395j28449K756m432J1318r3522j51179p8917j1770
19003C03995k0634j8352M6453K2458K7250P9101M9871o1086j08057N7172O9796
18992D47967L95l7086j12040J30094J05951J12588Q5249k0894j19579m4094j76853
18981C71698j94432q8458l4687j04163K8221K16981J79526M6357k1702r3300l7426
$$ plain form
18970 268615 215372 204881 255594 176797 69384 40668 44260 89694 159887 223442 243940
18959 243940 154361 48127 -94763 -169894 13760 217115 388882 585199 498010 495332
18949 495332 623376 746464 807633 641582 585645 677417 502156 383916 181291 -53516
18939 -53516 -84310 139137 295189 287079 366874 399561 284074 315226 447586 469243 427352
18928 427352 543265 742645 538644 354259 230615 158009 141285 138529 167955 190872 265541
18917 265541 413770 383095 104051 -10146 17960 9586 162412 326937 306145 177653
18907 177653 -8088 -58085 -174214 -361904 -352775 -166950 -51241 -131457 -186625 -112641 -57263
18896 -57263 -150994 -293609 -293267 -135543 122115 410423 498708 489119 400627 268610 170088
$$ packed form
18970B68615n3243j0491N0713p8797j07413k8716L592M5434P0193O3555K0498
18959B43940q9579j06234j42890p5131J83654K03355J71767J96317q7189k678
18949D95332J28044J23088O1169j66051n5937R1772j75261j18240k02625k34807
18939e3516l0794K23447J56052q110P9795L2687j15487L1152J32360K1657m1891
18928D27352J15913J99380k04001j84385j23644p2606j6724k756K9426K2917P4669
18917B65541J48229l0675k79044j14197K8106q374J52826J64525k0792j28492
18907A77653j85741m9997j16129j87690R129J85825J15709q0216n5168P3984N5378
18896e7263r3731j42615L42J57724K57658K88308Q8285r589q8492j32017r8522
$$ plain form
18885 170088 160415 114767 -92828 -238545 -288823 -245493 -227157 -165141 -37229 187503 244703
18874 244703 255109 208674 83173 16723 54009 204285 346218 552468 588054 445079
18864 445079 210340 35672 94601 244968 307163 261363 309665 508879 595643 476814
18854 476814 244220 152860 85238 -173719 -87745 121558 295437 367262 309281 271214 227491
18843 227491 263235 353437 167996 78609 107590 184338 174160 -27171 -142097 -202314 -128134
18832 -128134 78094 228441 399187 372764 50824 -95394 -77423 67928 300604 352270
18822 352270 135408 -15524 25573 -35730 -166548 -87393 142039 268780 328196 201479
18812 201479 107156 211884 380047 508957 544019 498729 393453 292447 130164 65422
$$ packed form
18885A70088r673m5648k07595j45717n0278M3330J8336O2016J27912K24732N7200
18874B44703J0406m6435j25501o6450L7286J50276J41933K06250L5586j42975
18864D45079k34739j74668N8929J50367O2195m5800M8302J99214Q6764j18829
18854D76814k32594r1360o7622k58957Q5974K09303J73879P1825n7981l8067m3723
18843B27491L5744R0202j85441q9387K8981P6748j0178k01331j14926o0217P4180
18832a28134K06228J50347J70746k6423l21940j46218J7971J45351K32676N1666
18822C52270k16862j50932M1097o1303j30818P9155K29432J26741N9416j26717
18812B01479r4323J04728J68163J28910L5062m5290j05276j01006j62283o4742
$$ plain form
18802 65422 -122542 -214299 -123748 14111 168680 247021 145506 12025 5407 211154 321281
18791 321281 289522 156619 131844 124759 -138868 -402447 -522778 -393941 -110213 82675
18781 82675 14705 187551 328384 361271 387279 404007 429400 665917 898045 1011576 948927
18770 948927 818626 601856 324919 91194 -72818 -103408 -79051 26437 3569 -42947
18760 -42947 -127878 -185085 62714 322577 522974 419701 87246 -122082 45631 253121
18750 253121 254758 168028 25981 24329 75802 -40049 -159955 -193287 -277014 -307319 -280559
18739 -280559 -352270 -261816 -110162 -128717 -141246 -132995 -31128 -57590 -165870 -265360 -164585
18728 -164585 -44046 -123416 -364667 -463422 -304385 -258687 -295910 -254210 -142339 -104806 -122758
$$ packed form
18802F5422j87964r1757R0551J37859J54569P8341j01515j33481o618K05747J10127
18791C21281l1759j32903k4775p085k63627k63579j20331J28837K83728J92888
18781H2675o7970J72846J40833L2887K6008J6728K5393K36517K32128J13531o2649
18770I48927j30301k16770k76937k33725j64012l0590K4357J05488k2868m6516
18760d2947q4931n7207K47799K59863K00397j03273l32455k09328J67713K07490
18750B53121J637q6730j42047j652N1473j15851j19906l3332q3727l0305K6760
18739b80559p1711R0454J51654j8555j2529Q251J01867k6462j08280r9490J00775
18728a64585J20539p9370k41251r8755J59037M5698l7223M1700J11871L7533j7952
$$ plain form
18717 -122758 -74677 -60599 8844 -53101 -244641 -247648 18764 228564 63849 -91397 -51980
18706 -51980 64102 25971 -188147 -207321 -35677 163898 230535 85374 77212 244837 359017
18695 359017 255810 164137 282280 168259 -11080 -69065 -35105 -86700 185989 450911
18685 450911 264699 -24144 -36698 10917 -194848 -544676 -656086 -519966 -414502 -279922
18675 -279922 -85479 -60796 -219547 -153981 -79318 -33886 215900 467530 510717 399680
18665 399680 327707 383909 310899 104311 -182973 -236751 -97201 -20385 -126615 -148025 -76432
18654 -76432 -72109 -72557 8632 181813 396717 426752 161841 119593 147360 198536 205432 -94657
18642 -94657 -305814 -236375 -107978 -44083 -64917 -24938 -148096 -269933 -214996 -66456 38936
$$ packed form
18717a22758M8081J4078O9443o1945j91540l007K66412K09800j64715j55246L9417
18706e1980J16082l8131k14118j9174J71644J99575O6637j45161q162J67625J14180
18695C59017j03207r1673J18143j14021j79339n7985L3960n1595K72689K64922
18685D50911j86212k88843j2554M7615k05765l49828j11410J36120J05464J34580
18675b79922J94443K4683j58751O5566P4663M5432K49786K51630M3187j11037
18665C99680p1973N6202p3010k06588k87284n3778J39550P6816j06230k1410P1593
18654g6432M323m48Q1189J73181K14904L0035k64911m2248K7767N1176O896l00089
18642i4657k11157O9439J28397O3895k0834L9979j23158j21837N4937J48540J05392
$$ plain form
18631 38936 168144 396010 459726 423101 321646 171327 287079 458894 283040 273147
18621 273147 258444 57517 -158114 -349366 -465486 -492694 -409022 -255422 -150513 -39064
18611 -39064 -1824 -177823 -444303 -665181 -595252 -321083 -11411 220235 329400 363120
18601 363120 429239 293280 167134 285058 254554 270711 408292 502188 472890 367213
18591 367213 423222 549896 682150 601121 568131 548915 400851 267080 214793 184408 119384
18580 119384 130866 256035 250850 151766 45944 14627 149661 220132 124118 33872 105790
18569 105790 -12201 -138361 -214899 -68333 41388 -13731 -60976 -71612 19967 115032 152585
18558 152585 -8339 -23332 178915 263480 253474 315859 501109 458986 294600 332847 513654
$$ packed form
18631C8936J29208K27866O3716l6625j01455j50319J15752J71815j75854r893
18621B73147j4703k00927k15631j91252j16120k7208Q3672J53600J04909J11449
18611c9064L7240j75999k66480k20878O9929K74169L09672K31646J09165L3720
18601C63120O6119j35959j26146J17924l0504J6157J37581R3896k9298j05677
18591C67213N6009J26674J32254q1029l2990j9216j48064j33771n2287l0385o5024
18580A19384J1482J25169n185r9084j05822l1317J35034P0471r6014r0246P1918
18569A05790j17991j26160p6538J46566J09721n5119m7245j0636R1579R5065L7553
18558A52585j60924j4993K02247Q4565j0006O2385J85250m2123j64386L8247J80807
$$ plain form
18547 513654 688561 855881 819550 670516 508009 326079 89659 -196789 -278618 -179709
18537 -179709 -100881 -102038 -131683 -69309 119786 62008 -167614 -284209 -178610 -37147 -7175
18526 -7175 533 -31810 -58751 -251213 -417744 -416701 -422644 -410060 -363909 -137500 -52480 -166673
18514 -166673 -234309 -246472 -202381 -46729 122061 200268 114667 175585 316633 490668 529863
18503 529863 479752 554141 558778 499491 262345 -88174 -101217 121778 265333 404182 321098
18492 321098 -9199 -322516 -480104 -452904 -309616 -178779 -191444 -137646 -159608 -42541
18482 -42541 98655 149081 153008 61362 51654 61214 -106728 -138622 -95122 -130580 -107678 58724
18470 58724 236289 156545 -47929 -179122 -142935 -114176 -33070 186384 191226 78236 78440
$$ packed form
18547E13654J74907J67320l6331j49034j62507j81930k36420k86448q1829R8909
18537a79709P8828j157k9645O2374J89095n7778k29622j16595J05599J41463K9972
18526g175P708l2343k6941j92462j66531J043n943J2584M6151K26409Q5020j14193
18514a66673o7636j2163M4091J55652J68790P8207q5601O0918J41048J74035L9195
18503E29863n0111P4389M637n9287k37146l50519j3043K22995J43555J38849q3084
18492C21098l30297l13317j57588K7200J43288J30837j2665N3798k1962J17067
18482d2541J41196N0426L927r1646r708R560j67942l1894M3500l5458K2902J66402
18470E8724J77565p9744k04474j31193L6187K8759Q1106K19454M842j12990K04
$$ plain form
18459 78440 5495 -211265 -400128 -440745 -453219 -475322 -395091 -354859 -388152 -327270 -111219
18448 -111219 191841 454125 420255 203613 32301 972 108974 221871 343869 317991
18438 317991 243340 155799 188798 222070 230868 247190 204046 192566 254417 123338 -135213
18427 -135213 -121834 6910 117731 183811 52567 -54632 -115907 -98708 -110893 -193506 -138962
18416 -138962 139006 380393 368483 389134 343854 130363 -83297 -53245 192438 374430
18406 374430 320878 51270 -188472 -283269 -299669 -395636 -625291 -732460 -755798 -601667
18396 -601667 -488324 -571964 -691966 -528790 -392980 -369548 -174109 119704 155669 45656
18386 45656 -38648 -181124 -334275 -371420 -296688 -212830 -201813 -371655 -482796 -277042 -4531
$$ packed form
18459G8440p2945k16760j88863m0617j2474k2103Q0231M0232l3293O0882K16051
18448a11219L03060K62284l3870k16642j71312l1329J08002J12897J21998k5878
18438C17991p4651q7541L2999L3272Q798J6322m3144j1480O1851j31079k58551
18427a35213J3379J28744J10821O6080j31244j07199o1275J7199j2185q2613N4544
18416a38962K77968K41387j1910K0651m5280k13491k13660L0052K45683J81992
18406C74430n3552k69608k39742r4797j6400r5967k29655j07169k3338J54131
18396f01667J13343q3640j20002J63176J35810K3432J95439K93813L5965j10013
18386D5656q4304j42476j53151l7145P4732Q3858J1017j69842j11141K05754K72511
$$ plain form
18375 -4531 115791 105630 88639 62756 2862 57395 167817 259873 386703 377174 284731
18364 284731 363791 415286 270945 63766 30510 -5828 -41849 -5891 -8991 -130298 -139877
18353 -139877 -186823 -193419 40075 286910 371349 607133 835523 735830 572463 511773 610395
18342 610395 527084 317976 167477 156501 223243 181976 -15687 -44715 120708 247149
18332 247149 184584 87960 46769 7232 40456 87013 76072 -86613 -42805 -16076 -169483
18321 -169483 -422081 -399453 -144321 208667 181769 -25252 -16954 133709 149737 127658 61003
18310 61003 -65894 -303985 -432491 -439859 -366487 -154563 -143400 -203862 -173254 -152313 -57384
18299 -57384 120106 278171 310523 228041 67023 -246103 -276952 -113899 -198439 -323922
$$ packed form
18375d531J20322j0161j6991k5883n9894N4533J10422R2056J26830r529r2443
18364B84731P9060N1495j44341k07179l3256l6338l6021L5958l100j21307r579
18353a39877m6946o596K33494K46835Q4439K35784K28390r9693j63367o0690R8622
18342F10395q3311k09108j50499j0976O6742m1267j97663k9028J65423J26441
18332B47149o2565r6624m1191l9537L3224M6557j0941j62685M3808K6729j53407
18321a69483k52598K2628K55132L52988k6898k07021Q298J50663J6028k2079o6655
18310F1003j26897k38091j28506p368P3372K11924J1163o0462L0608K0941R4929
18299e7384J77490J58065L2352q2482j61018l13126l0849J63053q4540j25483
$$ plain form
18289 -323922 -340125 -319189 -385700 -349621 -147628 -177813 -152780 -51870 -39077 -46504 -99904
18278 -99904 26464 247243 385414 377453 217465 28742 42937 222751 426439 591747
18268 591747 748234 705032 737034 588863 292459 10763 -98774 -175550 -215318 -186666
18258 -186666 -124665 -95390 -139243 -65804 -113029 -315654 -348372 -206967 -177852 -165284 -157688
18247 -157688 -144323 378 124465 58762 32603 117421 232203 219099 194617 154086 184198
18236 184198 247521 276743 219606 72672 -20041 25272 101199 282410 380926 428626 641778
18225 641778 620122 426144 363891 162391 -35574 -131171 -166463 -164680 -271725 -273891 -232894
18214 -232894 -186743 -158328 -134593 -206095 -268419 -249008 -398776 -538496 -569939 -543851 -249990
$$ packed form
18289c23922j6203K0936o6511L6079K01993l0185K5033J00910J2793p427n3400
18278i9904J26368K20779J38171p961j59988j88723J4195J79814K03688J65308
18268E91747J56487m3202L2002j48171k96404k81696j09537p6776l9768K8652
18258a86666O2001K9275m3853P3439m7225k02625l2718J41405K9115J2568P596
18247a57688J3365J44701J24087o5703k6159Q4818J14782j3104k4482m0531L0112
18236A84198O3323K9222n7137j46934r2713M5313P5927J81211R8516M7700K13152
18225F41778k1656j93978o2253k01500j97965r5597l5292J783j07045k166M0997
18214b32894M6151K8415K3735p1502o2324J9411j49768j39720l1443K6088K93861
$$ plain form
18203 -249990 -6458 -31099 3941 -30473 -95846 74952 245025 87712 -115042 -203563
18193 -203563 -67010 115034 200099 66671 30925 243069 245035 70086 82547 20250 -85316
18182 -85316 32840 255298 399291 498184 527718 300457 59006 -98471 -126255 -52733
18172 -52733 -9731 52092 10378 -61138 -1197 -27809 95736 357039 433560 490935 525561
18161 525561 572107 441622 275658 120713 -64289 -291888 -268497 -191260 -273752 -242924
18151 -242924 -243614 -321737 -359467 -262561 -76753 -145806 -223420 -254244 -272641 -295792 -279542 -211729
18139 -211729 -203246 -77419 -261224 -338276 -2517 390204 456738 487815 480663 258402 9276
18128 9276 -271224 -388553 -141623 56873 140938 215461 135742 12159 -101775 -251344
$$ packed form
18203b49990K43532k4641L5040l4414o5373J70798J70073j57313k02754q8521
18193b03563J36553J82044Q5065j33428l5746K12144J966j74949J2461o2297j05566
18182h5316J18156K22458J43993R8893K9534k27261k41451j57477k7784P3522
18172e2733M3002O1823m1714p1516N9941k6612J23545K61303P6521N7375L4626
18161E25561M6546j30485j65964j54945j85002k27599K3391P7237q2492L0828
18151b42924o90p8123l7730R6906J85808o9053p7614l0824j8397k3151J6250O7813
18139b11729Q483J25827j83805p7052L35759L92721O6534L1077p152k22261k49126
18128I276k80500j17329K46930J98496Q4065P4523p9719j23583j13934j49569
$$ plain form
18118 -251344 -438900 -437739 -326916 -329840 -202421 -91490 -4755 -238612 -698805 -928725
18108 -928725 -741666 -510864 -179573 98211 226982 411197 449706 496009 557088 475231
18098 475231 378151 284170 59279 -105208 -126290 27314 110241 68279 167571 372275 387592
18087 387592 379612 453009 541636 411204 303976 204354 153112 213060 478848 502250 377374
18076 377374 243513 341797 399017 347699 347406 406234 422545 235615 85093 115574 162373
18065 162373 255683 470968 439132 418471 292956 245425 379689 456746 401178 244396 374231
18054 374231 569116 402172 117564 -7581 46019 59020 64552 8573 -7571 41652 19611
18043 19611 31109 -63170 5904 201813 313043 234371 223473 254133 12023 -118666 -156587
$$ packed form
18118b51344j87556J161J10823k924J27419J10931Q6735k33857m60193k29920
18108i28725J87059K30802L31291K77784J28771J84215L8509M6303O1079q1857
18098D75231r7080r3981k24891j64487k1082J53604Q2927m1962R9292K04704J5317
18087C87592p980P3397Q8627j30432j07228r9622n1242N9948K65788K3402j24876
18076C77374j33861R8284N7220n1318k93N8828J6311j86930j50522L0481M6799
18065A62373R3310K15285l1836k0661j25515m7531J34264P7057n5568j56782J29835
18054C74231J94885j66944k84608j25145N3600J3001N532n5979j6144M9223k2041
18043A9611J1498r4279O9074J95909J11230p8672j0898L0660k42110j30689l7921
$$ plain form
18032 -156587 -118256 -16802 -149460 -204657 -118936 -56615 94033 89565 -85555 -171654 -175279
18021 -175279 -182197 -166053 -103905 28638 84697 129990 159699 116849 -140542 -469291 -564076
18010 -564076 -279351 -216298 -202285 -193014 -236143 -153866 -256713 -241460 -47712 75925 202147
17999 202147 446377 465011 228306 -7925 -127112 -31148 78997 -55236 -445461 -632650
17989 -632650 -335805 -181633 -231608 -360594 -338184 -178810 -185401 -230016 -140508 -95328 -105833
17978 -105833 -137636 -94120 13398 71447 -26803 -53834 -160347 -41522 17873 -222505 -437703
17967 -437703 -529110 -459424 -349682 -148377 163944 392430 321643 222396 66555 7664
17957 7664 130880 271965 332297 254247 75449 69354 -7285 -352430 -613983 -542177 -210310
$$ packed form
18032a56587L8331J01454j32658n5197Q5721O2321J50648m468j75120q6099l625
18021a75279o918J6144O2148J32543N6059M5293K9709m2850k57391l28749r4785
18010e64076K84725O3053J4013R271m3129Q2277j02847J5253J93748J23637J26222
17999B02147K44230J8634k36705k36231j19187R5964J10145j34233l90225j87189
17989f32650K96845J54172m9975j28986K2410J59374o591m4615Q9508M5180j0505
17978a05833l1803M3516J07518N8049r8250k7031j06513J18825N9395k40378k15198
17967d37703r1407O9686J09742K01305L12321K28486p0787r9247j55841n8891
17957G664J23216J41085O0332p8050j78798o095p6639l45145k61553P1806L31867
$$ plain form
17946 -210310 43733 38199 -114152 -235870 -221499 27351 196070 183740 -12650 -214474
17936 -214474 -234505 -199851 -33643 -60360 -145540 -152488 -211062 -368672 -577671 -545015 -333565
17925 -333565 -316978 -61210 274980 377141 461513 414756 133688 101189 -62573 -183079
17915 -183079 -86352 -81280 -123033 -200572 -39293 169356 -1569 -250559 -66306 236525
17905 236525 381291 530320 665181 523466 291616 65792 1388 -9943 35205 168405
17895 168405 337902 436186 247433 135826 51388 37801 253365 327299 272106 217378 184659
17884 184659 285038 248018 235144 481938 605820 414355 181104 -30658 28973 38119
17874 38119 -21864 102429 47423 -79958 -142755 -37413 44512 57663 -83750 -176624 -79908
$$ packed form
17946b10310K54043n534j52351j21718J4371K48850J68719j2330j96390k01824
17936b14474k0031L4654J66208k6717q5180o948n8574j57610k08999L2656K11450
17925c33565J6587K55768L36190J02161Q4372m6757k81068l2499j63762j20506
17915a83079R6727N072m1753p7539J61279K08649j70925k48990J84253L02831
17905B36525J44766J49029J34861j41715k31850k25824o4404j1331M5148J33200
17895A68405J69497R8284j88753j11607q4438j3587K15564P3934n5193n4728l2719
17884A84659J00379l7020j2874K46794J23882j91465k33251k11762N9631R146
17874C8119n9983J24293n5006j27381o2797J05342Q1925J3151j41413r2874R6716
$$ plain form
17863 -79908 -74893 -232428 -315545 -114386 21996 -67657 -192469 -200922 -131802 -223154 -390196
17852 -390196 -459531 -500642 -482862 -359032 -416729 -543499 -621862 -494416 -197341 112369
17842 112369 72517 -2736 28491 -30452 -240826 -379435 -235799 -4452 80235 -74240
17832 -74240 -181123 -225579 -316453 -329816 -245658 -106613 -37674 -42299 -30052 42822 -14188
17821 -14188 -82271 -16957 90536 163500 112873 14886 -189342 -217096 -108877 -123509 -340950
17810 -340950 -465754 -388961 -273823 -149084 -88279 -261804 -431037 -323627 -212523 -207734
17800 -207734 12564 149204 -76264 -294008 -309108 -304867 -281066 -47525 23705 -108320
17790 -108320 1821 -72683 -234386 -311751 -161209 -28091 5294 -949 -54078 -104384 -220658
$$ packed form
17863g9908N015j57535q3117K01159J36382q9653j24812q453O9120r1352j67042
17852c90196o9335m1111J7780J23830n7697j26770p8363J27446K97075L09710
17842A12369l9852p5253L1227n8943k10374j38609J43636K31347Q4687j54475
17832g4240j06883m4456r0874j3363Q4158J39045O8939m625J2247P2874n7010
17821a4188o8083O5314J07493P2964n0627r7987k04228k7754J08219j4632k17441
17810c40950j24804P6793J15138J24739O0805j73525j69233J07410J11104M789
17800b07734K20298J36640k25468k17744j5100M241K3801K33541P1230j32025
17790a08320J10141p4504j61703p7365J50542J33118L3385o243n3129n0306j16274
$$ plain form
17779 -220658 -418048 -409069 -287476 -177973 -133448 -106972 -129432 -69102 -69280 -132246 -32331
17768 -32331 21741 -127626 -199358 -154401 -169541 -219874 -151588 89759 377018 445060 234717
17757 234717 143143 37738 -265642 -476928 -473091 -430043 -405122 -368337 -172420 125351 350074
17746 350074 496830 475925 431591 445687 385459 218233 -9609 -271468 -297654 -213509 -154783
17735 -154783 -110351 -91447 -198980 -264892 -33229 51858 214631 400021 505449 470035
17725 470035 555265 764615 786840 645781 444731 194024 -37130 -203070 -447573 -496664
17715 -496664 -431632 -306532 23379 95114 57436 -141915 -349491 -332966 -102335 101506
17705 101506 172450 124970 25934 26666 -40947 -188961 -218328 -7946 79058 -41463 -81077
$$ packed form
17779b20658j97390Q979J21593J09503M4525K6476k2460O0330j78o2966R9915
17768c2331N4072j49367p1732M4957j5140n0333O8286K41347K87259O8042k10343
17757B34717r1574j05405l03380k11286L837M3048K4921L6785J95917K97771K24723
17746C50074J46756k0905m4334J4096o0228j67226k27842k61859k6186Q4145N8726
17735a54783M4432J8904j07533o5912K31663Q5087J62773J85390J05428l5414
17725D70035Q5230K09350K2225j41059k01050k50707k31154j65940k44503m9091
17715d96664O5032J25100L29911P1735l7678j99351k07576J6525K30631K03841
17705A01506P0944m7480r9036P32o7613j48014k9367K10382Q7004j20521l9614
$$ plain form
17694 -81077 114779 247588 167162 93921 127312 95176 79203 132245 109482 25720 -138742
17683 -138742 -181405 -100946 -54084 33415 90996 187652 284721 344808 395407 269880 194840
17672 194840 286155 293121 228312 104505 74587 94435 156679 187916 127987 67091 10563
17661 10563 55870 46740 83290 30458 -17104 191541 443045 392886 347247 320899 250054
17650 250054 227900 272810 223978 270624 205110 56323 136199 217426 69543 -94569 -77973
17639 -77973 7808 -102386 -137449 -13339 59036 -13910 11484 -15640 -94868 -284334 -511665
17628 -511665 -364730 -167659 6400 37868 -300130 -467904 -381885 -408331 -450544 -447413 -488580
17617 -488580 -630774 -602328 -401016 -134278 68443 296105 232432 111342 52507 -152976
$$ packed form
17694h1077J95856J32809q0426p3241L3391l2136j5973N3042k2763q3762j64462
17683a38742m2663Q0459M6862Q7499N7581R6656R7069O0087N0599j25527p5040
17672A94840R1315O966o4809j23807k9918J9848O2244L1237n9929o0896n6528
17661A0563M5307r130L6550n2832m7562K08645K51504n0159m5639k6348p0845
17650B50054k2154M4910m8832M6646o5514j48787P9876Q1227j47883j64112J6596
17639g7973Q5781j10194l5063J24110P2375p2946K5394k7124p9228j89466k27331
17628e11665J46935J97071J74059L1468l37998j67774Q6019k6446m2213L131m1167
17617d88580j42194K8446K01312K66738K02721K27662o3673j21090n8835k05483
$$ plain form
17607 -152976 -347190 -353006 -337063 -319659 -217098 -243905 -371799 -267919 -90709 -42923 16885
17596 16885 205819 302788 366185 429509 512352 431056 333021 252470 271961 305898 161412
17585 161412 93304 64863 54907 -84145 -160613 -149251 -71930 -100379 -184363 -340717 -510675
17574 -510675 -445442 -268988 -170746 -39506 209004 279545 202449 149029 223395 370370 399818
17563 399818 215274 174492 282642 405385 491234 351563 205669 34433 114556 414727
17553 414727 532188 519063 416146 129601 27734 134806 193744 177507 -6491 -201811
17543 -201811 -346418 -159433 4775 -111665 -206966 -200012 -53800 53581 209193 193467
17533 193467 24896 -31522 74011 196750 179381 139073 151595 345564 364902 113773
$$ packed form
17607a52976j94214n816J5943J7404J02561k6807j27894J03880J77210M7786N9808
17596A6885J88934R6969O3397O3324Q2843q1296r8035q0551J9491L3937j44486
17585A61412o8108k8441r956j39052p6468J1362P7321k8449q3984j56354j69958
17574e10675O5233J76454R8242J31240K48510P0541p7096n3420P4366J46975K9448
17563C99818j84544m0782J08150J22743Q5849j39671j45894j71236Q0123L00171
17553D14727J17461j3125j02917k86545j01867J07072N8938j6237j83998j95320
17543b01811j44607J86985J64208j16440r5301O954J46212J07381J55612j5726
17533A93467j68571n6418J05533J22739j7369m0308J2522J93969J9338k51129
$$ plain form
17523 113773 -61434 60338 49542 -116086 -231330 -234772 -191311 -164488 -51595 140413
17513 140413 268146 71063 -277817 -371586 -104747 259970 279763 23152 -58172 35187
17503 35187 16138 -3705 114035 195853 298142 262609 68800 -138807 -265489 -471720
17493 -471720 -609372 -570589 -442783 -422187 -331346 -249257 -259882 -269378 -317669 -183201 -191954
17482 -191954 -184760 -139687 -256678 -235081 -124776 -51819 -9805 -39567 -188996 -301667 -340219
17471 -340219 -285078 -214731 -76971 -63859 -289088 -486274 -418281 -274156 -270842 -431772 -561218
17460 -561218 -731290 -880370 -890536 -1010816 -1054481 -996767 -863877 -689890 -470085 -336570
17450 -336570 -236096 -47106 83111 60385 85930 132042 70283 -81023 -160277 -84686 3728
$$ packed form
17523A13773j75207J21772j0796j65628j15244l442M3461K6823J12893J92008
17513A40413J27733j97083l48880r3769K66839L64717J9793k56611q1324R3359
17503C5187j9049j9843J17740Q1818J02289l5533j93809k07607j26682k06231
17493d71720j37652L8783J27806K0596R0841Q2089j0625r496m8291J34468q753
17482a91954P194M5073j16991K1597J10305P2957M2014k9762j49429j12671l8552
17471c40219N5141P0347J37760J3112k25229j97186O7993J44125L314j60930j29446
17460e61218j70072j49080j0166j20280m3665N7714J32890J73987K19805J33515
17450c36570J00474J88990J30217k2726K5545M6112o1759j51306p9254P5591Q8414
$$ plain form
17439 3728 -142328 -217350 -201652 -360664 -474593 -284352 171459 541422 413777 55259
17429 55259 -216381 -389767 -341590 -40956 40793 -161955 -230308 -259924 -277635 -212952 -234426
17418 -234426 -378316 -448671 -316042 -157015 -78483 -22174 13775 105820 271217 444343
17408 444343 469629 443503 402438 277457 57842 -187332 -273554 -98259 84773 87118 104689
17397 104689 103289 112644 92342 16554 -74285 -302500 -593095 -695246 -552354 -303166 -157524
17386 -157524 -16629 9935 15864 8035 77346 139459 -14263 -163996 -319239 -208861 -15481
17375 -15481 97928 89112 23485 106071 144470 115564 97689 -1963 -121279 -254647 -179572
17364 -179572 -9268 192771 430051 350542 172480 122021 -35322 -160781 -33798 105480
$$ packed form
17439C728j46056p5022J5698j59012j13929J90241M55811L69963j27645l58518
17429E5259k71640j73386M8177L00634Q1749k02748o8353k9616j7711O4683k1474
17418b34426j43890p0355J32629J59027P8532N6309L5949R2045J65397J73126
17408D44343K5286k6126m1065j24981k19615k45174q6222J75295J83032K345J7571
17397A04689j400R355k0302p5788r0839k28215k90595j02151J42892K49188J45642
17386a57524J40895K6564N929p829O9311O2113j53722j49733j55243J10378J93380
17375a5481J13409q816o5627Q2586L8399k8906j7875r9652j19316j33368P5075
17364a79572J70304K02039K37280p9509j78062n0459j57343j25459J26983J39278
$$ plain form
17354 105480 128300 68768 -54120 25322 234630 230381 161325 99097 134084 159006 167640
17343 167640 210580 230073 92582 -106947 -46990 10559 -152513 -259749 -104926 87312
17333 87312 60462 -56234 27319 -52666 -29469 296441 481656 378942 363857 223582 70975
17322 70975 21789 -44683 74491 270498 344665 293298 165346 -69939 -93395 -41089 -74965
17311 -74965 -82254 -122126 -177834 -202222 -133968 -135890 -339113 -338428 -217609 -132928 -210393 -313703
17299 -313703 -274273 -241547 -150546 -25659 133146 289547 353033 445724 418086 202415 300037
17288 300037 458019 355270 261755 259022 419367 492709 408471 258847 -27924 -134926
17278 -134926 46530 113006 -37351 -219459 -404644 -593043 -523780 -438480 -498547 -448212
$$ packed form
17354A05480K2820n9532j22888P9442K09308m249o9056o2228L4987K4922Q634
17343A67640M2940J9493j37491j99529N9957N7549j63072j07236J54823J92238
17333H7312k6850j16696Q3553p9985K3197L25910J85215j02714j5085j40275j52607
17322G0975m9186o6472J19174J96007P4167n1367j27952k35285k3456N2306l3876
17311g4965p289l9872n5708k4388O8254j922k03223O85J20819Q4681p7465j03310
17299c13703L9430L2726R1001J24887J58805J56401O3486R2691k7638k15671R7622
17288C00037J57982j02749r3515k733J60345P3342q4238j49624k86771j07002
17278a34926J81456O6476j50357j82108j85185j88399O9263Q5300o0067N0335
$$ plain form
17268 -448212 -337126 -373540 -425268 -457206 -397748 -190085 61476 297339 297712 335696 442223
17257 442223 202513 -72904 -110476 74312 91654 5185 -96839 18480 248742 232074
17247 232074 77029 -213171 -341001 -482416 -588020 -520861 -286476 13887 165344 31234
17237 31234 -22966 65716 19833 -65811 20448 111476 122074 41018 128811 239466 190313
17226 190313 154552 35156 -65293 -36648 -42702 28051 -11580 7146 172773 260364 383129
17215 383129 406211 293587 226782 120272 201353 333245 134136 -98378 73184 318022
17205 318022 189873 -78752 -247124 -115182 71051 117499 27202 8670 -36120 -123698
17195 -123698 40886 122030 -18954 -102546 -221675 -380028 -403659 -269126 1123 144791
$$ packed form
17268d48212J11086l6414n1728l1938N9458K07663K51561K35863L73L7984J06527
17257D42223k39710k75417l7572J84788J7342q6469j02024J15319K30262j6668
17247B32074j55045k90200j27830j41415j05604O7159K34385L00363J51457j34110
17237C1234n4200Q8682m5883q5644Q6259R1028J0598q1056Q7793J10655m9153
17226A90313l5761j19396j00449K8645o054P0753l9631J8726J65627Q7591J22765
17215C83129K3082j12624o6805j06510Q1081J31892j99109k32514J71562K44838
17205C18022j28149k68625j68372J31942J86233M6448r0297j8532m4790q7578
17195a23698J64584Q1144j40984q3592j19129j58353k3631J34533K70249J43668
$$ plain form
17185 144791 67905 -10620 -37431 -71683 -101066 -215525 -291497 -292537 -440779 -445072 -274300
17174 -274300 -121731 -133985 -311794 -409548 -344861 -191572 -129430 -71393 -260495 -536490
17164 -536490 -650652 -519060 -285991 -200656 -199558 -225399 16934 211477 248693 206614 181242
17153 181242 102834 -97112 -324247 -447457 -432283 -329448 -245850 -301219 -487840 -421561
17143 -421561 -213861 -188789 -204310 -123997 -204367 -219050 -133895 -104387 -44080 -472 115361
17132 115361 472029 669091 461305 319582 288890 255879 94842 -97606 -133996 -69130
17122 -69130 -158035 -471974 -773285 -866748 -604653 -359902 -141737 -6615 52658 38786
17112 38786 -50190 1190 -15970 -10589 183731 407885 405865 143874 -62679 -121736 -124363
$$ packed form
17185A44791p6886p8525k6811l4252k9383j14459p5972j040j48242m293J70772
17174b74300J52569j2254j77809r7754O4687J53289O2142N8037j89102k75995
17164e36490j14162J31592K33069Q5335J098k5841K42333J94543L7216m2079k5372
17153A81242p8408j99946k27135j23210J5174J02835Q3598n5369j86621O6279
17143d21561K07700K5072j5521Q0313q0370j4683Q5155K9508O0307M3608J15833
17132A15361L56668J97062k07786j41723l0692l3011j61037j92448l6390O4866
17122f9130q8905l13939l01311r3463K62095K44751K18165J35122N9273j3872
17112C8786q8976N1380j7160N381J94320K24154k020k61991k06553n9057k627
$$ plain form
17101 -124363 -36815 -3943 81013 42147 -163660 -184905 -210690 -212096 -232961 -311387 -334751
17090 -334751 -296275 -327637 -186820 -110949 -283576 -239870 -294999 -340426 -354598 -212672 -6838
17079 -6838 -82034 -375982 -610032 -747241 -482194 -174270 -61863 168134 291363 311518
17069 311518 382180 405610 253644 -49609 -185389 -134353 -86882 42947 49110 -28908 52392
17058 52392 -7260 -181258 -273276 -308987 -201883 -187566 -415143 -462955 -200175 -8449 84809
17047 84809 109484 289145 511599 621718 546461 609183 639438 544188 290507 -26211 -257455
17036 -257455 -369597 -259959 -297100 -353890 -298639 -206427 -222455 -274414 -414038 -380344 -261067
17025 -261067 -200613 -148558 -151756 -214059 -422053 -617192 -672818 -448661 -159723 49244 -24480
$$ packed form
17101a24363Q7548L2872Q4956l8866k05807k1245k5785j406k0865p8426k3364
17090c34751L8476l1362J40817P5871j72627M3706n5129m5427j4172J41926K05834
17079f838p5196k93948k34050j37209K65047L07924J12407K29997J23229K0155
17069C11518P0662K3430j51966l03253j35780N1036M7471J29829O163p8018Q1300
17058E2392n9652j73998r2018l5711J07104J4317k27577m7812K62780J91726R3258
17047H4809K4675J79661K22454J10119p5257O2722L0255r5250k53681l16718k31244
17036b57455j12142J09638l7141n6790N5251R2212j6028n1959j39624L3694J19277
17025b61067O0454N2055l198o2303k07994j95139n5626K24157K88938K08967p3724
$$ plain form
17014 -24480 -200079 -338527 -484485 -467017 -157592 34981 -56101 -16029 58833 177696
17004 177696 326551 445687 391486 104305 -35442 -65966 -101634 -103462 53859 78146 71676
16993 71676 79004 -72248 -127415 -41091 160591 373773 331182 95268 -2743 77904 103048
16982 103048 152597 78309 -193565 -250473 -270535 -325441 -273790 -301745 -358133 -405642 -281871
16971 -281871 -339258 -464663 -434745 -426805 -354650 -343568 -346944 -219607 -79722 -36320 -68446
16960 -68446 -156818 101504 425098 526675 477469 425290 360259 395056 344686 199843 -46517
16949 -46517 -119958 59098 168375 87301 -82684 48396 299496 316256 167913 -70631
16939 -70631 -217825 -305525 -256056 -147976 -223622 -391633 -349319 -281571 -89265 151827 210928
$$ packed form
17014b4480j75599j38448j45958J7468L09425J92573r1082M0072P4862J18863
17004A77696J48855J19136n4201k87181j39747l0524l5668j828J57321K4287o470
16993G1676P328j51252n5167Q6324K01682K13182m2591k35914r8011Q0647K5144
16982A03048M9549p4288k71874n6908k0062n4906N1651k7955n6388m7509J23771
16971b81871n7387j25405K9918P940P2155J1082l376J27337J39885M3402l2126
16960f8446q8372K58322L23594J01577m9206n2179o5031L4797n0370j44843k46360
16949d6517p3441J79056J09277q1074j69985J31080K51100J6760j48343k38544
16939g0631j47194q7700M9469J08080p5646j68011M2314O7748J92306K41092N9101
$$ plain form
16928 210928 126563 20607 53142 108959 143156 37956 -8800 41046 63192 31253 18675
16917 18675 -27496 -47874 90157 232500 213779 173524 65333 -16273 35681 -62284 -294660
16906 -294660 -351073 -313676 -235760 -167226 -197685 -297172 -369962 -185572 100202 221524 212227
16895 212227 344933 422935 361383 75756 -340720 -667666 -817425 -585601 -290130 -219351
16885 -219351 -141709 -66580 -156116 -336415 -460138 -478311 -360527 -266799 -196388 -214612 -433535
16874 -433535 -450558 -186549 27658 -6414 -50145 71058 165036 81853 -50615 -6908 166337
16863 166337 339546 366147 216737 -7004 -179254 -245388 -323935 -375527 -330428 -102367
16853 -102367 215842 373606 438289 364964 136743 -109118 -293725 -315687 -333236 -332185 -312939
$$ packed form
16928B10928q4365j05956L2535N5817L4197j05200m6756M9846K2146l1939j2578
16917A8675m6171k0378J38031J42343j8721m0255j08191q1606N1954r7965k32376
16906b94660n6413L7397P7916O8534l0459r9487p2790J84390K85774J21322r297
16895B12227J32706P8002o1552k85627m16476l26946j49759K31824K95471P0779
16885b19351P7642P5129q9536j80299j23723j8173J17784R3728P0411j8224k18923
16874d33535j7023K64009K14207l4072m3731J21203R3978q3183j32468M3707J73245
16863A66337J73209K6601j49410k23741j72250o6134p8547n1592M5099K28061
16853a02367L18209J57764O4683p3325k28221k45861j84607k1962j7549J051J9246
$$ plain form
16842 -312939 -294939 -175312 -87279 -50846 -24391 -130686 -344401 -424104 -487160 -489169 -332219
16831 -332219 -156858 -131789 -37350 -118335 -341616 -338431 -220308 -100758 -97200 -168705 -42699
16820 -42699 -4662 63837 54923 -81529 -148950 -121174 -79322 -104568 -219015 -226159 -89446
16809 -89446 -24612 -8194 55721 154624 294045 301481 85240 -51717 -160791 -261010 -388833
16798 -388833 -296686 -117848 -111199 -158735 -308624 -494720 -472082 -185654 121949 155339 35667
16787 35667 -136336 -55077 164366 347121 401297 387024 469913 575472 442415 233963
16777 233963 150594 89805 -3738 5204 87239 111145 39298 104327 79826 -9596 -6606 -99447
16765 -99447 -300516 -398943 -269690 -139638 -73607 -84457 -305165 -474377 -388893 -362427 -425362
$$ packed form
16842c12939J8000J19627Q8033L6433K6455j06295k13715p9703o3056k009J56950
16831c32219J75361K5069R4439q0985k23281L185J18123J19550L558p1505J26006
16820d2699L8037O8499q914j36452o7421K7776M1852k5246j14447p144J36713
16809h9446O4834J6418O3915R8903J39421P436k16241j36957j09074j00219j27823
16798c88833R2147J78838O649m7536j49889j86096K2638K86428L07603L3390j19672
16787C5667j72003Q1259K19443J82755N4176j4273Q2889J05559j33057k08452
16777B33963q3369o0789r3543Q942Q2035K3906p1847O5029k4501q9422K990r2841
16765i9447k01069r8427J29253J30052O6031j0850k20708j69212Q5484K6466o2935
$$ plain form
16754 -425362 -457823 -450637 -491771 -449125 -212003 110647 281741 136476 -68471 -99408 39908
16743 39908 177473 249492 268015 214008 14307 -93132 169684 332243 284754 306373 219759
16732 219759 141840 30114 -124464 -309856 -365698 -392736 -404013 -442532 -534508 -595308 -524535
16721 -524535 -586918 -556644 -416530 -389172 -375520 -422216 -295453 -205035 -288201 -287388 -72921
16710 -72921 19254 -40958 -81169 -98747 -155806 -57968 121742 150972 39713 -57846 -102492
16699 -102492 -199679 -82407 172546 221358 274378 493594 532181 367661 53893 -269773
16689 -269773 -320657 -72999 267228 355211 259012 87317 44821 11613 -80451 -141060 -52632
16678 -52632 -10667 -28195 -44965 -15544 -10023 -46415 40535 45169 -207699 -440531 -367225 -87384
$$ packed form
16754d25362l2461P186m1134M2646K37122L22650J71094j45265k04947l0937J39316
16743C9908J37565P2019J8523n4007j99701j07439K62816J62559m7489K1619q6614
16732B19759p7919j11726j54578j85392n5842k7038j1277l8519r1976o0800P0773
16721e24535o2383L0274J40114K7358J3652m6696J26763R0418q3166Q13K14467
16710g2921R2175o0212m0211j7578n7059R7838J79710K9230j11259r7559m4646
16699a02492r7187J17272K54953M8812N3020K19216L8587j64520l13768l23666
16689b69773n0884K47658L40227Q7983r6199j71695m2496l3208r2064o0609Q8428
16678e2632M1965j7528j6770K9421N521l6392Q6950M634k52868k32832P3306K79841
$$ plain form
16666 -87384 -54117 -406679 -545866 -561620 -590421 -524893 -483919 -326764 -214845 -219667 -209480
16655 -209480 -183178 -74559 -124284 -426282 -650982 -609718 -307674 62231 227727 265979
16645 265979 242365 78790 41013 5615 -347007 -584037 -467410 -314456 -193088 -152565
16635 -152565 -175073 -116026 -15638 104809 77856 -5812 -78226 -122967 -91037 75754 194812
16624 194812 147646 107439 -16295 -352929 -455820 -238540 -98224 34912 128686 183126
16614 183126 79210 16716 -124020 -244336 -307448 -303465 -270470 -377499 -492360 -516733 -342567
16603 -342567 -70825 111184 144415 -78516 -345920 -361803 -305228 -228248 -62525 112974
16593 112974 -106921 -399972 -471727 -403974 -213920 -132362 -118791 -138303 -269011 -237778 -93954
$$ packed form
16666h7384L3267l52562j39187j5754k8801O5528M0974J57155J11919m822J0187
16655b09480K6302J08619m9725l01998k24700M1264L02044L69905J65496L8252
16645B65979k3614j63575l7777l5398l52622k37030J16627J52954J21368M0523
16635a52565k2508N9047J00388J20447k6953q3668p2414m4741L1930J66791J19058
16624A94812m7166m0207j23734l36634j02891K17280J40316J33136R3774N4440
16614A83126j03916o2494j40736j20316o3112L983L2995j07029j14861k4373J74166
16603c42567K71742J82009L3231k22931k67404j5883N6575P6980J65723J75499
16593A12974k19895k93051p1755O7753J90054Q1558J3571j9512j30708L1233J43824
$$ plain form
16582 -93954 -64442 -65417 91038 269337 277761 391225 420124 322083 398895 434688 395223 395524
16570 395524 270549 161514 -51563 -284527 -188568 -27508 -4804 -7419 260302 431022
16560 431022 292364 18157 -125152 -84235 -27906 -49052 -79690 -47417 -115900 -141142 -34744
16549 -34744 103258 77665 98675 221054 200402 -4421 -143778 -168606 -139553 -286076 -522030
16538 -522030 -363505 -325634 -389947 -454253 -458353 -266731 -114192 44069 193450 103008 -152744
16527 -152744 -317841 -489760 -680044 -661125 -574165 -605120 -592525 -282677 -150606 -222379
16517 -222379 -436209 -607284 -587517 -489966 -362128 -375994 -367312 -415587 -429402 -346689 -299209
16506 -299209 -392582 -257807 -208082 -273848 -220691 -53155 185182 214373 229153 183117 84713
$$ packed form
16582i3954K9512r75J56455J78299Q424J13464K8899r8041P6812L5793l9465L01
16570C95524j24975j09035k13077k32964R5959J61060K2704k615K67721J70720
16560D31022j38658k74207j43309M0917N6329k1146l0638L2273o8483k5242J06398
16549c4744J38002k5593K1010J22379k0652k04823j39357k4828K9053j46523k35954
16538e22030J58525L7871o4313o4306m100J91622J52539J58261J49381r0442k55752
16527a52744j65097j71919j90284J8919Q6960l0955J2595L09848J32071p1773
16517b22379k13830j71075J9767R7551J27838j3866Q682m8275j3815Q2713M7480
16506b99209r3373J34775M9725o5766N3157J67536K38337K9191J4780m6036r8404
$$ plain form
16495 84713 242611 334354 293191 226536 252078 348965 287600 262495 257932 261372 94497 -108578
16483 -108578 -200976 -439889 -630816 -624822 -576497 -434426 -322097 -277444 -291608 -412444 -421023
16472 -421023 -181396 60559 -28394 -115143 -244650 -515862 -657228 -670512 -565656 -433061
16462 -433061 -272842 -116591 7432 132043 154776 135963 -1335 -170521 -277370 -242298
16452 -242298 -128315 -134611 -70321 53147 156244 143418 -132618 -213637 -4208 -72277 -294244
16441 -294244 -341838 -543774 -809208 -823262 -624096 -447874 -245466 -73409 -48311 -109629
16431 -109629 -270536 -401272 -429825 -329752 -236608 -304258 -533885 -444737 -164015 37923
16421 37923 242434 294910 202000 -52246 -258133 -303950 -80867 216694 179252 -138978
$$ packed form
16495H4713J57898R1743m1163o6655K5542R6887o1365k5105m563L440j66875k03075
16483a08578r2398k38913j90927N994M8325J42071J12329M4653j4164j20836q579
16472d21023K39627K41955q8953q6749j29507k71212j41366j3284J04856J32595
16462d33061J60219J56251J24023J24611K2733j8813j37298j69186j06849L5072
16452b42298J13983o296O4290J23468J03097j2826k76036q1019K09429o8069k21967
16441b94244m7594k01936k65434j4054J99166J76222K02408J72057K5098o1318
16431a09629j60907j30736k8553J00073R3144o7650k29627Q9148K80722K01938
16421C7923K04511N2476r2910k54246k05887m5817K23083K97561l7442l18230
$$ plain form
16411 -138978 -317473 -195213 -134052 -119403 11554 -29021 -290362 -422464 -310131 -146114
16401 -146114 -8372 6288 61390 64265 -36308 -38443 -80029 -278389 -562223 -582818 -475158
16390 -475158 -433221 -506146 -549603 -488477 -452165 -257579 308539 795732 924940 978714 950323
16379 950323 649075 418933 301817 348978 378108 182637 56820 169902 320917 327156
16369 327156 220533 82423 -23018 -18744 100870 109669 32565 -68005 -64358 7051 93486
16358 93486 145221 221668 252196 268346 310073 363155 246171 -53604 -168114 695 16487
16347 16487 -182640 -328488 -294583 -96869 55326 235646 368223 260726 101900 21503
16337 21503 -62156 19787 39261 -241620 -544795 -599705 -679043 -725395 -607264 -429234 -361755
$$ packed form
16411a38978j78495J22260O1161J4649J30957m0575k61341j32102J12333J64017
16401a46114J37742J4660N5102K875j00573k135m1586j98360k83834k0595J07660
16390d75158M1937p2925m3457O1126L6312J94586N66118M87193J29208N3774k8391
16379I50323l01248k30142j17116M7161K9130j95471j25817J13082J51015O239
16369C27156j06623j38110j05441M274J19614Q799p7104j00570L647P1409Q6435
16358I3486N1735P6447L0528J6150M1727N3082j16984k99775j14510J68809J5792
16347A6487j99127j45848L3905J97714J52195J80320J32577j07497j58826q0397
16337B1503q3659Q1943J9474k80881l03175n4910p9338m6352J18131J78030O7479
$$ plain form
16326 -361755 -517361 -599299 -614594 -680302 -541700 -278899 -126230 -172238 -356956 -476473
16316 -476473 -444619 -186792 -19494 -49234 -79386 -31213 40294 7108 -2952 56560 84135
16305 84135 5837 -663 55526 100534 111749 56845 91148 157600 237875 121419 -177531
16294 -177531 -241351 -222626 -142826 91642 144890 203716 238530 207934 344549 518563 605771
16283 605771 550272 528201 382009 242882 236319 272837 223404 -98369 -308074 -332609 -260120
16272 -260120 -107176 -15129 -36776 -79104 -197687 -233187 -170853 -181041 -197996 -21969 139660
16261 139660 140120 -41142 -401044 -390944 -183123 3110 94627 -28328 -21243 -122650 -465352
16250 -465352 -668156 -683247 -506340 -240938 -26621 -83670 -182690 -205684 -296230 -195796
$$ packed form
16326c61755j55606q1938j5295o5708J38602K62801J52669m6008j84718j19517
16316d76473L1854K57827J67298k9740l0152M8173P1507l3186j0060N9512K7575
16305H4135p8298o500N6189M5008J1215n4904L4303O6452Q0275j16456k98950
16294a77531o3820J8725P9800K34468N3248N8826L4814l0596J36615J74014Q7208
16283F05771n5499k2071j46192j39127o563L6518m9433l21773k09705k4535P2489
16272b60120J52944R2047k1647m2328j18583l5500O2334j0188j6955J76027J61629
16261A39660M60j81262l59902J0100K07821J86233R1517j22955P085j01407l42702
16250d65352k02804j5091J76907K65402K14317n7049r9020k2994r0546J00434
$$ plain form
16240 -195796 -405 23236 -30684 72033 134332 162056 150986 -2174 -241861 -270625 -189007
16229 -189007 805 -91343 -166172 -77548 34471 234286 317227 174595 139210 237088 249229
16218 249229 262128 281974 194103 -3097 -143501 -117630 23669 99278 164523 79400 5727
16207 5727 -95173 -172459 -130030 -119679 -116302 -211873 -295255 -154949 -61744 -164132 -293946
16196 -293946 -188540 39505 6832 -79168 47158 138640 35829 1202 118387 191214
16186 191214 145164 143916 242875 264570 145707 37367 -173232 -297302 -187251 -233225 -431438
16175 -431438 -427747 -303917 -172327 -128448 -150625 -281974 -305665 -28267 234775 246921 213034
16164 213034 360890 327000 69394 35164 102988 177290 317036 232331 108754 197794 246160
$$ packed form
16240a95796J95391K3641n3920J02717O2299K7724j1070j53160k39687k8764Q1618
16229a89007J89812r2148p4829Q8624J12019J99815Q2941j42632l5385R7878J2141
16218B49229J2899J9846q7871j97200j40404K5871J41299P5609O5245q5123p3673
16207E727j00900p7286M2429J0351L377r5571q3382J40306R3205j02388j29814
16196b93946J05406K28045l2673q6000J26326R1482j02811l4627J17185P2827
16186A91214m6050j248R8959K1695j18863j08340k10599j24070J10051m5974j98213
16175d31438L691J23830J31590M3879k2177j31349k3691K77398K63042J2146l3887
16164B13034J47856l3890k57606l4230O7824P4302J39746q4705j23577Q9040M8366
$$ plain form
16153 246160 181483 77235 152811 336468 376243 449065 382369 292173 272078 341660 314743
16142 314743 266462 148515 211201 185033 193920 289933 341546 376071 332400 331498 356799 366845
16130 366845 281218 75267 89406 141745 34125 33224 -20123 -146830 -188399 -162689 -56045
16119 -56045 21978 -63489 -129461 -184676 -213482 -51594 128397 -54785 -339881 -360868 -199974
16108 -199974 -80108 48566 108954 155047 158993 102610 138662 108416 60030 -10969 71767
16097 71767 42690 -59371 -66907 7867 43782 56851 103318 186204 116798 -67962 -188148
16086 -188148 -276305 -330549 -263630 -34653 -14144 -55639 123595 260351 186196 5025 -220248
16075 -220248 -158533 -34044 81589 323567 429250 328196 48194 -219889 -294386 -139257
$$ packed form
16153B46160o4677j04248P5576J83657L9775P2822o6696r0196k0095O9582k6917
16142C14743m8281j17947O2686k6168Q887R6013N1613L4525m3671r02K5301J0046
16130C66845q5627k05951J4139N2339j07620r01n3347j26707m1569K5710J06644
16119e6045P8023q5467o5972n5215k8806J61888J79991j83182k85096k0987J60894
16108a99974J19866J28674O0388M6093L946n6383L6052l0246m8386p0999Q2736
16097G1767k9077j02061p536P4774L5915J3069M6467Q2886o9406j84760j20186
16086a88148q8157n4244O6919K28977K0509m1495J79234J36756p4155j81171k25273
16075b20248O1715J24489J15633K41978J05683j01054k80002k68083p4497J55129
$$ plain form
16065 -139257 45748 -61254 -164531 -38338 2968 -88388 -273610 -315064 -334285 -367813
16055 -367813 -248064 -66909 30464 49508 -170472 -527499 -559609 -301959 -159085 -129222
16045 -129222 -96790 -234294 -315959 -294902 -259253 -109143 117156 181109 78271 85593 148769
16034 148769 168151 216539 7481 -172172 -114410 6591 39077 -10522 56434 -29044 47785
16023 47785 154521 121843 110572 188290 182844 -32448 -252027 -411295 -331209 -199555 -139862
16012 -139862 -41781 -102389 -297903 -506684 -455009 -305847 -306009 -299833 -361231 -438059 -562633
16001 -562633 -916095 -988851 -782350 -518304 -207962 -63361 118690 264251 382939 417827
$$ packed form
16065a39257J85005j07002j03277J26193M1306r1356j85222m1454j9221l3528
16055c67813J19749J81155R7373J9044k19980l57027l2110K57650J42874K9863
16045a29222L2432j37504q1665K1057L5649J50110K26299O3953j02838P322O3176
16034A48769J9382M8388k09058j79653N7762J21001L2486m9599O6956q5478P6829
16023D7785J06736l2678j1271P7718n446k15292k19579j59268Q0086J31654N9693
16012a39862R8081o0608j95514k08781N1675J49162j62O176o1398p6828j24574
16001e62633l53462p2756K06501K64046L10342J44601J82051J45561J18688L4888
$$ [...]
##END NTUPLES=NMR SPECTRUM
##END=
