##TITLE=C13_SL90-Dau
 CDCl3,  20100 sc

 28.09.2021
##JCAMPDX= 6.0         $$ Bruker NMR JCAMP-DX V2.0
##DATA TYPE= NMR SPECTRUM
##DATA CLASS= NTUPLES
##ORIGIN= UXNMR, Bruker Analytische Messtechnik GmbH
##OWNER= root
$$ XWIN-NMR		Version 3.5
$$ Wed Sep 29 08:53:18 2021 Russian Standard Time (UT+4h)  she@DPX200
##.OBSERVE FREQUENCY= 50.327896
##.OBSERVE NUCLEUS= ^13C
##.ACQUISITION MODE= SIMULTANEOUS
##.ACQUISITION SCHEME= undefined
##.AVERAGES= 20100
##.DIGITISER RES= 17
##SPECTROMETER/DATA SYSTEM= spect
##.PULSE SEQUENCE= zgpg30
##.SOLVENT NAME= DMF
##.SHIFT REFERENCE= (INTERNAL, DMF, 0, 217.489)
##AUDIT TRAIL= $$ (NUMBER, WHEN, WHO, WHERE, WHAT)
$$ ##TITLE= Audit trail, XWIN-NMR		Version 3.5
$$ ##JCAMPDX= 5.01
$$ ##ORIGIN= Bruker BioSpin GmbH
$$ ##OWNER= she
$$ F:/spectra/data/she/nmr/c13/1/pdata/1/auditp.txt
$$ ##AUDIT TRAIL=  $$ (NUMBER, WHEN, WHO, WHERE, WHAT)
(   1,<2021-09-29 08:52:15.95 +0400>,<she>,<DPX200>,
      <created by zg, POWCHK disabled, PULCHK disabled
       terminated by command 'halt'
       configuration hash MD5:
       00 E9 B6 7A A2 85 ED C7 34 08 36 98 17 FE 4E 26
       data hash MD5: 32K
       67 36 3E 2F 74 0E A4 B8 2C 40 43 3D 6A F8 BD DE>)
(   2,<2021-09-29 08:52:20.84 +0400>,<she>,<DPX200>,
      <Start of raw data processing
       efp BC_mod = 2 LB = 1 FT_mod = 6 PKNL = 1 PHC0 = -336.8167 PHC1 = 31.76238 SI = 32K 
       data hash MD5: 32K
       EA 04 63 54 53 62 DC AF 79 AF 52 51 EB 0D 4C E2>)
(   3,<2021-09-29 08:52:23.57 +0400>,<she>,<DPX200>,
      <abs ABSG = 5 
       data hash MD5: 32K
       AD 99 7B F4 5D BD 10 57 6E D7 CB 02 D4 F6 C0 0E>)
$$ ##END=
$$ 
$$ hash MD5
$$ BF B9 B6 05 E9 A9 B9 AD BB 32 3D 73 2E 68 FC BC
##$RELAX= 
##$RELAX= 
##$RELAX= 
##$RELAX= 
##$RELAX= 
##$RELAX= 
##$RELAX= 
##$RELAX= 
$$ Bruker specific parameters
$$ --------------------------
##$DU= <F:/spectra>
##$EXPNO= 1
##$NAME= <c13>
##$PROCNO= 1
##$TYPE= <nmr>
##$USER= <she>
##$AMP= (0..31)
100 100 100 100 100 100 100 100 100 100 100 100 100 100 100 100 100 100 
100 100 100 100 100 100 100 100 100 100 100 100 100 100 
##$AQSEQ= 0
##$AQ_mod= 1
##$AUNM= <au_zg>
##$AUTOPOS= <>
##$BF1= 50.322709
##$BF2= 200.13
##$BF3= 50.322709
##$BF4= 500.13
##$BF5= 500.13
##$BF6= 500.13
##$BF7= 500.13
##$BF8= 500.13
##$BYTORDA= 1
##$CFDGTYP= 0
##$CFRGTYP= 5
##$CHEMSTR= <none>
##$CNST= (0..31)
1 1 145 1 1 1 1 1 1 1 1 1 1 1 1 1 1 1 1 1 1 1 1 1 1 1 1 1 1 1 1 1 
##$CPDPRG= <waltz16>
##$CPDPRG1= <>
##$CPDPRG2= <waltz16>
##$CPDPRG3= <>
##$CPDPRG4= <mlev>
##$CPDPRG5= <mlev>
##$CPDPRG6= <mlev>
##$CPDPRG7= <mlev>
##$CPDPRG8= <mlev>
##$CPDPRGB= <>
##$CPDPRGT= <>
##$D= (0..31)
0 2 0.00345 0 0 0 0 0 0 0 0 0.03 2e-05 3e-06 0 0 0 0 0 0 0 0 0 0 0 0 0 
0 0 0 0 0 
##$DATE= 1632822567
##$DBL= (0..7)
120 120 120 120 120 120 120 120 
##$DBP= (0..7)
150 150 150 150 150 150 150 150 
##$DBP07= 0
##$DBPNAM0= <>
##$DBPNAM1= <>
##$DBPNAM2= <>
##$DBPNAM3= <>
##$DBPNAM4= <>
##$DBPNAM5= <>
##$DBPNAM6= <>
##$DBPNAM7= <>
##$DBPOAL= (0..7)
0.5 0.5 0.5 0.5 0.5 0.5 0.5 0.5 
$$ [...]
##$SUBNAM4= <"">
##$SUBNAM5= <"">
##$SUBNAM6= <"">
##$SUBNAM7= <"">
##$SUBNAM8= <"">
##$SUBNAM9= <"">
##$SW= 239.972175391363
##$SWIBOX= (0..15)
0 1 3 0 0 0 0 0 0 0 0 0 0 0 0 0 
##$SW_h= 12077.2946859903
##$TD= 32768
##$TD0= 1
##$TE= 0
##$TE2= 300
##$TE3= 300
##$TEG= 300
##$TL= (0..7)
120 120 120 120 120 120 120 120 
##$TP= (0..7)
150 150 150 150 150 150 150 150 
##$TP07= 0
##$TPNAME0= <>
##$TPNAME1= <>
##$TPNAME2= <>
##$TPNAME3= <>
##$TPNAME4= <>
##$TPNAME5= <>
##$TPNAME6= <>
##$TPNAME7= <>
##$TPOAL= (0..7)
0.5 0.5 0.5 0.5 0.5 0.5 0.5 0.5 
##$TPOFFS= (0..7)
0 0 0 0 0 0 0 0 
##$TUNHIN= 0
##$TUNHOUT= 0
##$TUNXOUT= 0
##$USERA1= <user>
##$USERA2= <user>
##$USERA3= <user>
##$USERA4= <user>
##$USERA5= <user>
##$V9= 5
##$VALIST= <valist>
##$VCLIST= <CCCCCCCCCCCCCCC>
##$VD= 0
##$VDLIST= <DDDDDDDDDDDDDDD>
##$VPLIST= <PPPPPPPPPPPPPPP>
##$VTLIST= <TTTTTTTTTTTTTTT>
##$WBST= 1024
##$WBSW= 4
##$XGAIN= (0..3)
0 0 0 0 
##$XL= 0
##$YL= 0
##$YMAX_a= 114850471
##$YMIN_a= -26050306
##$ZGOPTNS= <>
##$ZL1= 120
##$ZL2= 120
##$ZL3= 120
##$ZL4= 120
##$ABSF1= 217.4887
##$ABSF2= -22.50688
##$ABSG= 5
##$ABSL= 3
##$ALPHA= 0
##$AQORDER= 0
##$ASSFAC= 0
##$ASSFACI= 0
##$ASSFACX= 0
##$ASSWID= 0
##$AUNMP= <proc_1d>
##$AZFE= 0.1
##$AZFW= 0.5
##$BCFW= 0
##$BC_mod= 2
##$BYTORDP= 0
##$COROFFS= 0
##$CY= -3
##$DATMOD= 1
##$DC= 0
##$DFILT= <>
##$DTYPP= 0
##$F1P= 0
##$F2P= 0
##$FCOR= 0.5
##$FTSIZE= 32768
##$FT_mod= 6
##$GAMMA= 0
##$GB= 0
##$INTBC= 1
##$INTSCL= 4.134877e-10
##$ISEN= 128
##$LB= 1
##$LEV0= 0
##$LPBIN= 0
##$MAXI= 10000
##$MC2= 0
##$MEAN= 0
##$ME_mod= 0
##$MI= 0.1934396
##$NCOEF= 0
##$NC_proc= 3
##$NLEV= 6
##$NOISF1= 120.0001
##$NOISF2= 80.00006
##$NSP= 0
##$NTH_PI= 0
##$NZP= 0
##$OFFSET= 217.4887
##$PC= 1.4
##$PHC0= -336.8167
##$PHC1= 31.76238
##$PH_mod= 1
##$PKNL= yes
##$PPARMOD= 0
##$PSCAL= 0
##$PSIGN= 0
##$REVERSE= no
##$SF= 50.3229899661168
##$SI= 32768
##$SIGF1= 140
##$SIGF2= 120
##$SINO= 11.81781
##$SIOLD= 32768
##$SREGLST= <13C.CDCl3>
##$SSB= 0
##$STSI= 32768
##$STSR= 0
##$SW_p= 12077.2946859903
##$SYMM= 0
##$S_DEV= 0
##$TDeff= 32768
##$TDoff= 0
##$TI= <>
##$TILT= no
##$TM1= 0
##$TM2= 0
##$TOPLEV= 0
##$USERP1= <user>
##$USERP2= <user>
##$USERP3= <user>
##$USERP4= <user>
##$USERP5= <user>
##$WDW= 1
##$XDIM= 32768
##$YMAX_p= 261932488
##$YMIN_p= -1129784
$$ End of Bruker specific parameters
$$ ---------------------------------
##NTUPLES= NMR SPECTRUM
##VAR_NAME=  FREQUENCY,     SPECTRUM/REAL,   SPECTRUM/IMAG
##SYMBOL=    X,             R,               I
##VAR_TYPE=  INDEPENDENT,   DEPENDENT,       DEPENDENT
##VAR_FORM=  AFFN,          ASDF,            ASDF
##VAR_DIM=   32768,         32768,           32768
##UNITS=     HZ,            ARBITRARY UNITS, ARBITRARY UNITS
##FACTOR=    0.368581032318806, 1,           1
##FIRST=     10944.6813275247, 0,            0
##LAST=      -1132.61335846556, 0,           0
##MIN=       -1132.61335846556, -1129784,    0
##MAX=       10944.6813275247, 261932488,    0
$$ Real data points
##PAGE= N=1
##DATA TABLE= (X++(R..R)), XYDATA
$$ [...]
$$ plain form
15981 140237 171663 152678 126243 -5445 -21737 27746 -115651 -343105 -327198 -282800 -244933
15970 -244933 -10346 109523 228775 439480 422726 450062 430789 177739 -151823 -393381
15960 -393381 -377776 -403858 -318427 -28093 75600 8153 -60642 -197658 -104673 175616 249730
15949 249730 227487 212867 100347 -39315 -221861 -322891 -148416 103161 186792 185416
15939 185416 135321 50588 -11226 -7226 49704 18334 73736 149928 -51218 -334865 -428345
15928 -428345 -182884 172895 352461 374340 344546 151246 39963 -64658 29032 95942
15918 95942 97360 185319 235523 140898 64457 92290 134613 159789 -3087 -180040 -147664
15907 -147664 -65256 216647 391652 356105 240283 308682 452565 627174 592950 669797
$$ packed form
15981A40237L1426j8985k6435j31688j6292M9483j43397k27454J5907M4398L7867
15970b44933K34587J19869J19252K10705j6754K7336j9273k53050l29562k41558
15960c93381J5605k6082Q5431K90334J03693o7447o8795j37016R2985K80289P4114
15949B49730k2243j4620j12520j39662j82546j01030J74475K51577Q3631j376
15939A85416n0095q4733o1814M000N6930l1370N5402P6192k01146k83647r3480
15928d28345K45461L55779J79566K1879k9794j93300j11283j04621R3690O6910
15918I5942J418Q7959N0204r4625p6441K7833M2323K5176j62876j76953L2376
15907a47664Q2408K81903J75005l5547j15822O8399J43883J74609l4224P6847
$$ plain form
15897 669797 558386 318380 276009 266558 119112 -124774 -48915 8364 46699 230454 262045
15886 262045 44081 -140483 -134923 -53432 -21628 -71238 -33041 -57024 -158326 -174763 4775
15875 4775 265727 201180 -74533 -214155 -273916 -531377 -669903 -417429 -163931 -212524
15865 -212524 -213782 -138419 -7687 159877 228038 136076 87097 204636 182962 18367 -152830
15854 -152830 -342984 -427102 -348125 -271459 -211233 -115941 -2732 7092 -163354 -272465 -269819
15843 -269819 -280329 -465459 -655649 -552182 -497135 -564691 -571859 -419493 -258691 -151325
15833 -151325 -114978 -21437 -15346 7973 196550 343674 135208 -150274 -231409 -168687 -18246
15822 -18246 -51794 -291816 -310151 -328619 -243777 -272827 -176337 161030 146729 194202 247399
$$ packed form
15897F69797j11411k40006m2371r451j47446k43886P5859N7279L8335J83755L1591
15886B62045k17964j84564N560Q1491L1804m9610L8197k3983j01302j6437J79538
15875D775K60952o4547k75713j39622n9761k57461j38526K52474K53498m8593
15865b12524j258P5363J30732J67564O8161r1962m8979J17539k1674j64595j71197
15854a52830j90154q4118P8977P6666O0226R5292J13209R824j70446j09111K646
15843b69819j0510j85130j90190J03467N5047o7556p168J52366J60802J07366
15833a51325L6347R3541O091K3319J88577J47124k08466k85482q1135O2722J50441
15822a8246l3548k40022j8335j8468Q4842k9050R6490L37367j4301M7473N3197
$$ plain form
15811 247399 154763 -62104 -51140 104194 214835 144940 -86114 -130777 -17015 93690
15801 93690 88785 -848 -92246 -211567 -126946 128161 319250 326054 229155 151454 12873
15790 12873 -139656 -107498 85466 338313 336659 236303 208006 104647 10476 55327 57026
15779 57026 32567 11780 11833 -19245 28400 159892 129883 140025 -15901 -59038 188931 165536
15767 165536 123005 231216 275163 252827 305796 409673 431257 397091 368319 232714 -12038
15756 -12038 37893 264270 305722 209412 189567 41079 -213885 -364251 -464185 -544512 -600289
15745 -600289 -544949 -505324 -202352 242321 456153 469578 332323 12073 -399251 -576545
15735 -576545 -507233 -468226 -495012 -246840 1837 118412 237041 355779 401908 246953
$$ packed form
15811B47399r2636k16867J0964J55334J10641o9895k31054m4663J13762J10705
15801I3690m905q9633r1398j19321Q4621K55107J91089O804r6899p7701j38581
15790A2873j52529L2158J92964K52847j654j00356k8297j03359r4171M4851J699
15779E7026k4459k0787N3l1078M7645J31492l0009J0142j55926m3137K47969k3395
15767A65536m2531J08211M3947k2336N2969J03877K1584l4166k8772j35605k44752
15756a2038M9931K26377M1452r6310j9845j48488k54964j50366r9934q0327n5777
15745f00289N5340L9625L02972M44673K13832J3425j37255l20250m11324j77294
15735e76545O9312L9007k6786K48172K48677J16575J18629J18738M6129j54955
$$ plain form
15725 246953 134778 82005 -46061 626 23839 20678 44453 -93699 -91160 -51269 -40436
15714 -40436 -156216 -103667 31998 73541 228539 383013 310589 32718 -176066 -152801
15704 -152801 -118471 -163493 -164975 -110517 -119688 -3368 157501 139652 3612 -71827 -192711
15693 -192711 -108690 90058 186686 111737 139778 240799 252136 351697 311447 139528 85688
15682 85688 42142 54430 54187 -41419 -74427 -92267 -228660 -397178 -460985 -410290 -237862
15671 -237862 127761 361846 498259 586848 496421 370091 237554 117402 30560 -45016
15661 -45016 21183 105689 40276 -39466 -58617 -26120 -1487 -212690 -156971 95975 160705
15650 160705 16636 -179460 -321233 -386912 -125985 154974 171891 238292 201210 -12845
$$ packed form
15725B46953j12175n2773j28066M6687K3213l161K3775j38152K539L9891J0833
15714d0436j15780N2549J35665M1543J54998J54474p2424k77871k08784K3265
15704a52801L4330m5022j482N4458r171J16320J60869j7849j36040p5439j20884
15693a92711Q4021J98748R6628p4949K8041J01021J1337R9561m0250j71919n3840
15682H5688m3546J2288k43r5606l3008j7840j36393j68518o3807N0695J72428
15671b37862L65623K34085J36413Q8589r0427j26330j32537j20152q6842p5576
15661d5016O6199Q4506o5413p9742j9151L2497K4633k11203N5719K52946O4730
15650A60705j44069j96096j41773o5679K60927K80959J6917O6401l7082k14055
$$ plain form
15640 -12845 -71250 62519 254556 157264 17835 17190 183863 225802 153942 90770 32517
15629 32517 -125706 -145069 90582 128361 28371 50264 181659 211813 -19330 -192753 30724
15618 30724 280771 370658 214671 -31671 -96656 -42603 -21794 34537 43610 -67801 -238441
15607 -238441 -213901 -74410 -15818 129998 156109 98075 182209 342310 489228 521532 540478
15596 540478 556055 585564 490980 446807 438748 433771 654227 595496 180278 -2483 -76984
15585 -76984 -169629 -182843 -197290 -171430 -231513 -398095 -564122 -450609 -284594 -230923 -215635
15574 -215635 -204104 -233318 -139808 59504 135668 264026 348203 389017 331262 155289 248536
15563 248536 279840 204666 206214 211295 166006 140338 248901 334925 61111 -174062 -131962
$$ packed form
15640a2845n8405J33769J92037r7292j39429o45J66673M1939p1860o3172n8253
15629C2517j58223j9363K35651L7779r9990K1893J31395L0154k31143j73423K23477
15618C0724K50047Q9887j55987k46342o4985N4053K0809N6331R073j11411j70640
15607b38441K4540J39491N8592J45816K6111n8034Q4134J60101J46918L2304J8946
15596E40478J5577K9509r4584m4173q059m977K20456n8731m15218j82761p4501
15585g6984r2645j3214j4447K5860o0083j66582j66027J13513J66015N3671J5288
15574b15635J1531k9214R3510J99312P6164J28358Q4177M0814n7755j75973R3247
15563B48536L1304p5174J548N081m5289k5668J08563Q6024k73814k35173M2100
$$ plain form
15552 -131962 -63125 -7406 129363 363590 433554 535635 600205 537552 335360 279588 195528
15541 195528 96839 228099 442155 629227 607590 345659 26475 -250152 -333767 -169219
15531 -169219 20265 24921 -111387 -162839 -103433 -42099 -88433 -58095 94809 239155 202689
15520 202689 25194 -42709 90505 300566 571234 777548 754428 712352 613512 323422
15510 323422 53859 29657 206284 403422 342399 341890 322384 113075 -52090 -78001 59861
15499 59861 132392 83311 -14693 52274 189713 3248 -210675 -62831 107678 251318
15489 251318 173027 3058 -109458 -104450 -70946 -66588 -61208 47950 120616 130845 225839
15478 225839 494563 649492 513759 220207 51834 -123054 -232549 -91316 9015 -14503
$$ packed form
15552a31962O8837N5719J36769K34227O9964J02081O4570o2653k02192n5772q4060
15541A95528r8689J31260K14056J87072k1637k61931l19184k76627q3615J64548
15531a69219J89484M656j36308n1452N9406O1334m6334L0338J52904J44346l6466
15520B02689j77495o7903J33214K10061K70668K06314k3120m2076r8840k90090
15510C23422k69563k4202J76627J97138o1023n09j9506k09309j65165k5911J37862
15499E9861P2531m9081r8004O6967J37439j86465k13923J47844J70509J43640
15489B51318p8291j69969j12516N008L3504M358N380J09158P2666J0229R4994
15478B25839K68724J54929j35733k93552j68373j74888j09495J41233J00331k3518
$$ plain form
15468 -14503 10142 61756 97619 26357 -146168 -78409 107151 43341 -105125 -99261 -233911
15457 -233911 -261200 -137445 -144081 -206988 -181536 -292321 -373963 -469145 -546891 -497132 -551794
15446 -551794 -435503 -330081 -103637 6301 -57816 19087 20707 -68417 -58321 -176117 -268507
15435 -268507 -167483 -174664 -137072 -72853 -129697 -187843 -96271 -7875 -128162 -370110 -391573
15424 -391573 -253049 -368104 -352091 -408783 -584475 -438972 -180188 -61825 -12819 -118413
15414 -118413 -374905 -636823 -564573 -358223 -374301 -348840 -185356 -130929 21741 90328
15404 90328 19057 63600 88600 -55190 -154416 -243791 -244215 -299943 -336531 -401400 -469142 -447904
15392 -447904 -207733 -44825 58862 -53486 -140589 -42489 -25253 -62732 93722 225570
$$ packed form
15468a4503K4645N1614L5863p1262j72525O7759J85560o3810j48466N864j34650
15457b33911k7289J23755o636o2907K5452j10785q1642r5182p7746M9759n4662
15446e51794J16291J05422K26444J09938o4117P6903J620q9124J0096j17796r2390
15435b68507J01024p181L7592O4219n6844n8146R1572Q8396j20287k41948k1463
15424c91573J38524j15055J6013n6692j75692J45503K58784J18363M9006j05594
15414a18413k56492k61918P2250K06350j6078K5461J63484N4427J52670O8587
15404I0328p1271M4543K5000j43790r9226q9375m24n5728l6588o4869o7742K1238
15392d47904K40171J62908J03687j12348q7103R8100J7236l7479J56454J31848
$$ plain form
15382 225570 202000 -18686 -328048 -499160 -535301 -620947 -744063 -630651 -550036 -525224
15372 -525224 -635074 -649093 -527273 -451667 -501220 -440662 -132426 50398 57988 -67052 -370055
15361 -370055 -566204 -381590 -44386 146364 181919 396066 446119 356677 490312 671822
15351 671822 617867 232450 72083 -34490 -40674 -68687 -58795 -25869 -13381 -201619 -265243
15340 -265243 -137061 -175135 -395292 -419390 -336522 -224696 -63867 -72969 -70529 66661 -128613
15329 -128613 -338100 -237903 -134028 -328738 -648927 -742744 -704108 -610457 -508580 -535632
15319 -535632 -577545 -523136 -562362 -629385 -591037 -388772 -237748 -160812 -56610 53405 275573
15308 275573 368023 607374 715139 377778 -10496 -140213 67429 217776 89883 89667
$$ packed form
15382B25570k3570k20686l09362j71112l6141q5646j23116J13412Q0615K4812
15372e25224j09850j4019J21820P5606m9553O0558L08236J82824P590j25040l03003
15361c70055j96149J84614L37204J90750L5555K14147N0053q9442J33635J81510
15351F71822n3955l85417j60367j06573o184k8013R892L2926J2488j88238o3624
15340b65243J28182l8074k20157k4098Q2868J11826J60829r102K440J37190j95274
15329a28613k09487J00197J03875j94710l20189r3817L8636R3651J01877k7052
15319e35632m1913N4409l9226o7023L8348K02265J51024P6936J04202J10015K22168
15308B75573R2450K39351J07765l37361l88274j29717K07642J50347j27893k16
$$ plain form
15298 89667 232465 256847 231379 218804 163086 -39951 -329476 -275149 -112960 -21362 102076
15287 102076 156534 -104171 -304710 -197264 40032 151757 114500 -159270 -348933 -301065
15277 -301065 -203001 -142866 -295581 -310654 -200012 -178852 -69467 -56431 -157951 -196258 -194743
15266 -194743 -287200 -390775 -236208 -87410 -164556 -150723 -34801 49489 76505 -141924
15256 -141924 -408123 -429650 -490599 -549718 -345532 -219229 -187313 -91892 -3641 -134213 -172426
15245 -172426 -39498 194106 306037 101108 -28536 50054 237980 286540 218402 213714
15235 213714 151815 -181923 -530844 -670008 -615551 -355568 -230087 -263423 -318091 -340308
15225 -340308 -128798 -206274 -581628 -761885 -746682 -638184 -503303 -428639 -274697 -43431
$$ packed form
15298H9667J42798K4382k5468j2575n5718k03037k89525N4327J62189R1598J23438
15287A02076N4458k60705k00539J07446K37296J11725l7257k73770j89663M7868
15277c01065R8064O0135j52715j5073J10642K1160J09385J3036j01520l8307J515
15266a94743r2457j03575J54567J48798p7146J3833J15922Q4290K7016k18429
15256a41924k66199k1527o0949n9119K04186J26303L1916R5421Q8251j30572l8213
15245a72426J32928K33604J11931k04929j29644P8590J87926M8560o8138m688
15235B13714o1899l33738l48921j39164N4457K59983J25481l3336n4668k2217
15225c40308K11510p7476l75354j80257J5203J08498J34881P4664J53942K31266
$$ plain form
15215 -43431 95916 -56912 -272791 -381611 -318801 -126142 47612 242447 282942 201386
15205 201386 130548 135633 160504 40667 -88863 -26895 -189623 -295598 -149584 -899
15195 -899 46389 15487 -95844 -63922 41095 73531 67955 104310 -57992 -266742 -218905
15184 -218905 82552 215265 31130 -11455 25418 -4990 -59121 -282932 -516663 -472967
15174 -472967 -311130 -73335 135742 322599 437572 377076 373750 287082 157389 -5386
15164 -5386 -214001 -203060 -121177 -76833 -120928 -208797 -148266 -117718 -163932 -301201 -364109
15153 -364109 -256262 -156586 -18864 -102640 -142565 -71471 6182 -104143 -382522 -507582
15143 -507582 -416880 -349523 -316847 -335563 -400228 -506938 -561776 -567941 -547654 -378325 -150062
$$ packed form
15215d3431J39347j52828k15879j08820O2810J92659J73754J94835M0495q1556
15205B01386p0838N085K4871j19837j29530O1968j62728j05975J46014J48685
15195h99M7288l0902j11331L1922J05017L2436n576L6355j62302k08750M7837
15184b18905L01457J32713j84135m2585L6873l0408n4131k23811k33731M3696
15174d72967J61837K37795K09077J86857J14973o0496l326q6668j29693j62775
15164e386k08615J0941Q1883M4344m4095q7869O0531L0548m6214j37269o2908
15153c64109J07847R9676J37722q3776l9925P1094P7653j10325k78379j25060
15143e07582R0702O7357L2676j8716o4665j06710n4838o165K0287J69329K28263
$$ plain form
15132 -150062 -34549 -10692 -77083 -210102 -238054 -283547 -95525 155891 461437 489803
15122 489803 355653 169972 -72433 -23122 62485 -17889 -8849 178955 318965 329418 286473
15111 286473 187081 11990 76108 195399 223371 281929 297005 118254 -68244 -217979
15101 -217979 -336873 -473348 -523540 -500777 -357234 -172187 -51774 -16024 -28323 -12744
15091 -12744 -252788 -487620 -449994 -523156 -665068 -568375 -403405 -587551 -852729 -858832 -619986
15080 -619986 -337900 -166134 -18844 14615 -22567 -47488 77982 207218 138459 -66075
15070 -66075 -90999 -36083 -55456 -247233 -398933 -326384 -181893 -210777 -240255 -154599 -178535
15059 -178535 -166567 -145340 -203731 -388964 -456706 -441949 -359555 -296401 -164934 -55856 -44088
$$ packed form
15132a50062J15513K3857o6391j33019k7952m5493J88022K51416L05546K8366
15122D89803j34150j85681k42405M9311Q5607q0374R040J87804J40010J0453m2945
15111B86473r9392j75091O4118J19291K7972N8558J5076j78751j86498j49735
15101b17979j18894j36475n0192K2763J43543J85047J20413L5750j2299J5579
15091a2744k40044k34832L7626p3162j41912R6693J64970j84146k65178o103K38846
15080f19986K82086J71766J47290L3459l7182k4921J25470J29236o8759k04534
15070f6075k4924N4916j9373j91777j51700P2549J44491k8884k9478Q5656k3936
15059a78535J1968K1227n8391j85233o7742J4757Q2394O3154J31467J09078J1768
$$ plain form
15048 -44088 -155441 -265758 -145148 -42137 122570 319136 340792 294262 214382 84754
15038 84754 -9453 -20651 95998 22902 -200478 -479333 -795345 -843268 -677483 -429569
15028 -429569 -311373 -272778 25563 208390 232019 266695 82128 5787 144051 165066
15018 165066 76302 -89863 -200326 -252071 -337748 -488098 -665699 -834698 -575266 -280951
15008 -280951 -107547 -138144 -382318 -422913 -423815 -474496 -493568 -445674 -309382 -120105 -67112
14997 -67112 -156648 -190136 -23720 261710 456739 410364 403386 377887 363289 330054 196509
14986 196509 214862 275209 145759 8816 141360 444381 209663 -171910 -443470 -608003
14976 -608003 -507710 -234539 127874 308048 289557 83815 77832 384247 254411 -70094
$$ packed form
15048d4088j11353j10317J20610J03011J64707J96566K1656m6530p9880j29628
15038H4754r4207j1198J16649p3096k23380k78855l16012m7923J65785K47914
15028d29569J18196L8595K98341J82827K3629L4676j84567p6341J38264K1015
15018A65066q8764j66165j10463n1745q5677j50350j77601j68999K59432K94315
15008b80951J73404l0597k44174m0595r02n0681j9072M7894J36292J89277N2993
14997f7112q9536l3488J66416K85430J95029m6375o978k5499j4598l3235j33545
14986A96509J8353O0347j29450j36943J32544L03021k34718l81573k71560j64533
14976f08003J00293K73171L62413J80174j8491k05742n983L06415j29836l24505
$$ plain form
14966 -70094 -21581 117629 117938 184087 245887 119173 30364 -34650 -71448 -65081 -65039 -114118
14954 -114118 -49867 170632 326597 245015 39644 -167546 -288144 -311807 -207144 -148411
14944 -148411 -163855 -16617 -23901 -269194 -347302 -330592 -335992 -225959 -157877 -28403 152939
14933 152939 143969 59787 -31665 -87985 -257086 -353550 -346673 -349713 -385638 -279988 -234031 -331816
14921 -331816 -272589 -101695 27944 150243 233080 151011 101415 109037 79121 1392 -232166
14910 -232166 -246340 -150702 -345254 -349190 -161698 -1829 216158 397806 420006 311633
14900 311633 10632 -249047 -316208 -207332 -16887 188327 198102 63524 -69214 -217456
14890 -217456 -243703 -169056 -167647 -234223 -167731 -163341 -146358 -350247 -458163 -175184 87928
$$ packed form
14966g0094M8513J39210L09O6149O1800j26714q8809o5014l6798O367M2m9079
14954a14118O4251K20499J55965q1582k05371k07190j20598k3663J04663N8733
14944a48411j5444J47238p284k45293p8108J6710n400J10033O8082J29474J81342
14933A52939q970q4182r1452n6320j69101r6464O877l040l5925J05650M5957r7785
14921c31816N9227J70894J29639J22299Q2837q2069m9596P622k9916p7729k33558
14910b32166j4174R5638j94552l936J87492J59869K17987J81648K2200j08373
14900C11633l01001k59679o7161J08876J90445K05214R775j34578j32738j48242
14890b17456k6247P4647J409o6576O6492M390J6983k03889j07916K82979K63112
$$ plain form
14879 87928 157374 65198 -118198 -314410 -367094 -276284 -294555 -301835 -190158 -148822 -373866
14868 -373866 -427928 -337761 -343059 -380350 -228827 -48747 -49331 -167106 -224564 -103426 75109
14857 75109 153682 7847 -61760 186193 285994 155946 10320 -89064 -132591 -237989 -183755
14846 -183755 -66547 -97540 -180379 -74881 -85868 -562192 -632925 -221301 -9741 31558
14836 31558 -32116 -86290 55001 74465 -8315 48992 117234 256703 427762 429524 238956
14825 238956 174089 356887 520237 492676 243338 9819 -88996 -100759 73305 249613
14815 249613 97812 -79866 -246265 -449858 -427341 -298313 -363074 -285943 -296194 -417293
14805 -417293 -290384 -33594 66142 68326 -49076 5973 102583 66483 12372 95081 268966
$$ packed form
14879H7928O9446r2176j83396j96212n2684R0810j8271p280J11677M1336k25044
14868c73866n4062R0167n298l7291J51523J80080n84j17775n7458J21138J78535
14857G5109P8573j45835o9607K47953R9801j30048j45626r9384m3527j05398N4234
14846a83755J17208l0993q2839J05498j0987m76324p0733M11624K11560M1299
14836C1558o3674n4174J41291J9464q2780N7307O8242J39469J71059J762j90568
14825B38956o4867J82798J63350k7561k49338k33519r8815j1763J74064J76308
14815B49613j51801j77678j66399k03593K2517J29028o4761P7131j0251j21099
14805d17293J26909K56790R9736K184j17402N5049R6610l6100n4111Q2709J73885
$$ plain form
14794 268966 263816 175986 153091 90962 -106068 -278967 -359802 -311581 -37117 243200 279092
14783 279092 445807 446133 253362 299122 456805 411061 359974 287912 371906 413562 288564
14772 288564 86590 -111311 -317606 -366270 -354640 -316427 -303052 -100651 191564 325128
14762 325128 293241 -69991 -320069 -298725 -307008 -321861 -243663 -195973 -282948 -476311 -604642
14751 -604642 -606275 -423775 -87775 -59936 -160763 -318590 -578690 -634354 -443793 -335997
14741 -335997 -140288 -4260 134653 203322 214981 118494 -97815 -111907 -16925 -91407 -296339
14730 -296339 -296810 -222316 -339705 -613343 -790477 -746212 -655179 -464468 -481412 -654196 -876032
14719 -876032 -794446 -665664 -713907 -676497 -563510 -410637 -139150 69839 187603 338855
$$ packed form
14794B68966n150q7830k2895o2129j97030j72899q0835M8221K74464K80317L5892
14783B79092J66715L26j92771M5760J57683m5744n1087p2062Q3994M1656j24998
14772B88564k01974j97901k06295m8664J1630L8213J3375K02401K92215J33564
14762C25128l1887l63232k50078K1344q283j4853P8198M7690q6975j93363j28331
14751f04642j633J82500L36000K7839j00827j57827k60100n5664J90561J07796
14741c35997J95709J36028J38913O8669J1659r6487k16309j4092R4982p4482k04932
14730b96339m71P4494j17389k73638j77134M4265R1033J90711j6944j72784k21836
14719h76032Q1586J28782m8243L7410J12987J52873K71487K08989J17764J51252
$$ plain form
14709 338855 480962 489989 296886 353914 570344 656871 537532 444301 261348 -21099
14699 -21099 -215774 -270430 -78734 177129 189185 195803 152205 -1235 -100241 -116293 -279764
14688 -279764 -369951 -284747 -249674 -215618 -126525 -185900 -365420 -317054 -314652 -339951 -201559
14677 -201559 9571 84682 36942 -158826 -348404 -388238 -334586 -424932 -396231 -200425 -213219
14666 -213219 -341786 -254415 -154597 -185216 -133220 -107322 -68183 -25339 30472 190460 286259
14655 286259 501808 675777 570765 375519 155092 -10687 -171818 -322590 -401390 -325255
14645 -325255 -248382 -305790 -197588 -178889 -119830 -26016 -168097 -332545 -292348 -183132 -159518
14634 -159518 -28188 64597 115266 109150 80701 -33191 19540 135222 122507 -154839 -246403
$$ packed form
14709C38855J42107R027j93103N7028K16430Q6527j19339r3231j82953k82447
14699b1099j94675n4656J91696K55863J2056O618m3598j53440r9006j6052j63471
14688b79764r0187Q5204L5073L4056Q9093n9375j79520M8366K402k5299J38392
14677b01559K11130P5111m7740j95768j89578l9834N3652r0346K8701J95806j2794
14666b13219j28567Q7371R9818l0619N1996K5898L9139M2844N5811J59988R5799
14655B86259K15549J73969j05012j95246k20427j65779j61131j50772p8800P6135
14645c25255P6873n7408J08202J8699N9059R3814j42081j64448M0197J09216K3614
14634a59518J31330R2785N0669o116k8449j13892N2731J15682j2715k77346r1564
$$ plain form
14623 -246403 -158848 -196889 -191553 -90101 60531 154973 120381 -34899 -204145 -302011 -220401
14612 -220401 -52901 -49164 -57341 -30194 -96556 -100026 -12364 -98264 -89784 -88812 -129904 -170375
14600 -170375 -28449 -51959 -45419 26954 71828 169982 376256 234229 -19263 5777 -60021
14589 -60021 -80032 114799 307122 65733 -358074 -444542 -325061 -240071 -334659 -360918 -215654
14578 -215654 -169002 -133240 -206553 -195403 -191128 -203344 -281080 -310050 -264582 -203896 -224805 -269906
14566 -269906 -347053 -327607 -214057 -113602 -110625 19540 14927 -172720 -238862 -318647 -355492
14555 -355492 -389953 -318522 -160491 -117525 -42872 52391 137343 -8466 -98566 16656 140621
14544 140621 135394 99691 90745 -65716 -88154 106242 444856 523834 340211 315715 487620
$$ packed form
14623b46403Q7555l8041N336J01452J50632R4442l4592j55280j69246r7866Q1610
14612b20401J67500L737q177K7147o6362l470Q7662q5900Q480R72m1092m0471
14600a70375J41926k3510O540P2373M4874R8154K06274j42027k53492K5040o5798
14589f0021k0011J94831J92323k41389m23807q6468J19481Q4990r4588k6259J45264
14578b15654M6652L5762p3313J1150M275j2216p7736k8970M5468O0686k0909m5101
14566b69906p7147J9446J13550J00455K977J30165m613j87647o6142p9785l6845
14555c55492l4461P1431J58031M2966P4653R5263Q4952j45809r0100J15222J23965
14544A40621n227l5703q946j56461k2438J94396L38614P8978j83623k4496J71905
$$ plain form
14533 487620 410521 220765 152884 64591 -44258 30225 -13130 -313742 -490441 -562423 -526898
14522 -526898 -215734 -12755 18466 35746 135058 204175 253061 190999 -113268 -221785 -235944
14511 -235944 -165631 33180 49706 -17477 -127443 -239308 -60344 15078 126942 158957
14501 158957 -49786 -292497 -231416 -166543 -252843 -348723 -317361 -97559 93149 133286 152416
14490 152416 30294 30720 35783 -209965 -379615 -340097 -296211 -260964 -306627 -269220 -198888
14479 -198888 -138579 -109970 -52820 -141089 -170788 -258628 -459498 -547672 -619049 -621416 -588667
14468 -588667 -363602 -327119 -429616 -626904 -812629 -705864 -315215 -169319 -118473 -230680
14458 -230680 -488368 -575825 -392354 -335271 -296988 -365834 -565536 -502635 -376455 -343689 -398560
$$ packed form
14533D87620p7099j89756o7881q8293j08849P4483m3355l00612j76699p1982L5525
14522e26898L11164K02979L1221J7280R9312O9117M8886o2062l04267j08517j4159
14511b35944P0313J98811J6526o7183j09966j11865J78964P5422J11864L2015
14501A58957k08743k42711O1081O4873q6300r5880L1362K19802J90708M0137J9130
14490A52416j22122M26N063k45748j69650L9518M3886L5247m5663L7407P0332
14479a98888O0309K8609N7150q8269k9699q7840k00870q8174p1377k367L2749
14468e88667K25065L6483j02497j97288j85725J06765L90649J45896N0846j12207
14458b30680k57688q7457J83471N7083L8283o8846j99702O2901J26180L2766n4871
$$ plain form
14447 -398560 -271503 99608 327823 353988 284506 222346 220925 118844 51772 10295 39277
14436 39277 59453 -149463 -380494 -517939 -419568 -160942 -5982 167605 300721 309320
14426 309320 202220 149489 107258 -149556 -354740 -308321 -96779 -24724 -82554 -196881
14416 -196881 -286922 -304563 -212186 -258982 -338746 -417689 -380437 -407736 -466091 -419731 -431493
14405 -431493 -369356 -200202 -60454 32304 113682 329932 227224 -125253 -233693 -75529
14395 -75529 50715 11112 42954 54583 -44097 -195935 -264458 -262564 -191382 -274243 -424853
14384 -424853 -444014 -247831 -160371 -191257 -241179 -315420 -362630 -183376 -146820 -282723 -401807
14373 -401807 -298428 65434 289403 156807 -10219 45552 160832 128725 220648 419644
$$ packed form
14447c98560J27057L71111K28215K6165o9482o2160j421j02081o7072m1477K8982
14436C9277K0176k08916k31031j37445R8371K58626J54960J73587J33116Q599
14426C09320j07100n2731m2231k56814k05184M6419K11542P2055n7830j14327
14416a96881r0041j7641R2377m6796p9764p8943L7252k7299n8355M6360j1762
14405d31493O2137J69154J39748R2758Q1378K16250j02708l52477j08440J58164
14395g5529J26244l9603L1842J1629r8680j51838o8523J894P1182q2861j50610
14384d24853j9161J96183Q7460l0886m9922p4241m7210J79254L6556j35903j19084
14373d01807J03379L63862K23969j32596j67026N5771J15280l2107R1923J98996
$$ plain form
14363 419644 374645 149925 -75022 -147719 -155972 -65050 77912 35956 -140474 -278651 -401601
14352 -401601 -388711 -333342 -174009 -80501 -63770 -41761 -88385 36438 163263 72846 18093
14341 18093 77550 116252 46108 58792 79494 183261 211289 28732 -204790 -65876 113290
14330 113290 -220053 -407463 -164046 -11422 25270 -18925 -10457 6571 164523 408140
14320 408140 348629 96501 -10422 -48719 -171115 -178538 -68388 32968 9642 -65397 -92363
14309 -92363 -111024 -93012 -12610 -26408 -258271 -345756 -331040 -79308 160490 -57288 -423969
14298 -423969 -563208 -500523 -290868 -67624 -12185 -85110 -282986 -376403 -371584 -437954 -530070
14287 -530070 -631282 -572000 -345174 -139118 53188 70258 -125659 -370962 -256623 -33554
$$ packed form
14363D19644m4999k24720k24947p2697q253R0922J42962m1956j76430j38177j22950
14352d01601J2890N5369J59333R3508J6731K2009m6624J24823J26825r0417n4753
14341A8093N9457L8702p0144J2684K0702J03767K8028j82557k33522J38914J79166
14330A13290l33343j87410K43417J52624L6692m4195Q468J7028J57952K43617
14320D08140n9511k52128j06923l8297j22396p423J10150J01356k3326p5039k6966
14309i2363j8661J8012Q0402j3798k31863q7485J4716K51732K39798k17778l66681
14298d23969j39239O2685K09655K23244N5439p2925j97876r3417M819o6370r2116
14287e30070j01212N9282K26826K06056J92306J7070j95917k45303J14339K23069
$$ plain form
14277 -33554 236559 569391 526765 75514 -260914 -348761 -282832 -169291 49663 250007
14267 250007 99158 -88265 -130112 13000 -52492 -299577 -475207 -530808 -631189 -816520
14257 -816520 -924636 -880204 -898770 -777280 -564032 -370549 -121276 76587 236685 292190
14247 292190 225985 346121 414068 354821 377651 365928 268721 117717 120196 207583 164697
14236 164697 -127307 -226174 -112970 -140285 -230809 -210133 61018 257909 168555 -60588
14226 -60588 -167807 -119014 -10319 47715 -112993 -369731 -405766 -299255 -271487 -163570
14216 -163570 -223721 -429118 -541009 -494660 -491675 -628021 -779154 -749088 -726797 -665593 -597629
14205 -597629 -437850 -272608 -345690 -322911 -61845 225343 425110 464860 260047 -26591
$$ packed form
14277c3554K70113L32832m2626m51251l36428q7847O5929J13541K18954K00344
14267B50007j50849j87423m1847J43112o5492k47085j75630n5601j00381j85331
14257h16520j08116M4432j8566J21490K13248J93483K49273J97863J60098N5505
14247B92190o6205J20136O7947n9247K2830j1723r7207j51004K479Q7387m2886
14236A64697k92004r8867J13204k7315r0524K0676K71151J96891q9354k29143
14226f0588j07219M8793J08695N8034j60708k56738l6035J06511K7768J07917
14216a63570o0151k05397j11891M6349K985j36346j51133L0066K2291O1204O7964
14205e97629J59779J65242p3082K2779K61066K87188J99767L9750k04813k86638
$$ plain form
14195 -26591 -254109 -150858 47682 28735 -127702 -301240 -243269 13382 215431 278299
14185 278299 465998 407024 262675 163757 -55373 -294530 -375069 -266211 -89496 -155514
14175 -155514 -63835 198938 155772 -85379 -311192 -403952 -258291 -160192 -109305 -1794
14165 -1794 96014 31549 -73947 -83312 -142238 -138435 -143032 -71340 68226 174677 347974 520537
14153 520537 401983 328170 402512 456699 325299 175085 29363 -84526 7949 1262 -159635
14142 -159635 -295387 -284369 -86226 -30578 -26890 -23142 -127572 -185994 -269028 -156057 -106518
14131 -106518 -97501 -94346 -350307 -609634 -399332 -325738 -401331 -317375 -244412 -195410 -120884
14120 -120884 94751 231862 43380 -243501 -252982 -310133 -540804 -454491 -164450 118520
$$ packed form
14195b6591k27518J03251J98540j8947j56437j73538N7971K56651K02049O2868
14185B78299J87699n8974j44349r8918k19130k39157q0539J08858J76715o6018
14175a55514R1679K62773m3166k41151k25813r2760J45661R8099N0887J07511
14165a794R7808o4465j05496r365n8926L803m597P1692J39566J06451J73297J72563
14153E20537j18554p3813P4342N4187j31400j50214j45722j13889R2475o687j60897
14142a59635j35752J1018J98143N5648L688L748j04430n8422q3034J12971M9539
14131a06518R017L155k55961k59327K10302P3594p5593Q3956P2963M9002P4526
14120a20884K15635J37111j88482k86881r481n7151k30671Q6313K90041K82970
$$ plain form
14110 118520 212186 69254 -87280 -246153 -305997 -348313 -426210 -425451 -525635 -666010 -574527
14099 -574527 -416966 -351103 -153515 -25893 120886 146820 129793 183389 316983 545237
14089 545237 592883 474712 286070 241118 231216 -87141 -229357 -140455 -193471 -152184 -80778
14078 -80778 107129 350603 197858 -142572 -238969 -92610 -71415 -33043 118568 115486 240870
14067 240870 230906 44949 -191428 -212281 -66168 -32474 -195782 -390828 -349879 -264537 -158518
14056 -158518 -13702 52300 -29721 -189617 -118026 113971 178359 159958 157860 250793 124786
14045 124786 185151 305225 466707 586138 513316 391824 456071 564537 455383 454876 751012
14034 751012 808934 470304 136024 -86828 -156350 -113108 24354 171020 217232 151287
$$ packed form
14110A18520R3666j42932j56534j58873n9844m2316p7897P59j00184j40375R1483
14099e74527J57561O5863J97588J27622J46779K5934j7027N3596J33594K28254
14089E45237M7646j18171j88642m4952r902l18357j42216Q8902n3016M1287P1406
14078h0778J87907K43474j52745l40430r6397J46359K1195L8372J51611l082J25384
14067B40870r964j85957k36377k0853J46113L3694j63308j95046M0949Q5342J06019
14056a58518J44816O6002q2021j59896P1591K31997O4388j8401k098R2933j26007
14045A24786O0365J20074J61482J19431p2822j21492O4247J08466j09154n07K96136
14034G51012N7922l38630l34280k22852o9522M3242J37462J46666M6212o5945
$$ plain form
14024 151287 165915 302854 586816 872234 1096359 1299020 1502170 1934386 2527497 2962334
14014 2962334 3432202 4073149 5155642 6814104 8806523 10784855 12259650 11941038 10060229
14005 10060229 8022613 6314720 4985316 4035248 3207287 2694697 2376078 1984035 1470636
13996 1470636 1150415 1008197 985357 993701 977682 856912 689858 706552 810300 872412
13986 872412 760365 641750 578270 440546 561015 740250 693111 484165 503115 455143
13976 455143 356356 369153 349080 87137 -159176 -142509 85762 285030 176791 21413
13966 21413 -92805 -80744 -207513 -143669 154849 377498 406783 474713 455600 291242 38312
13955 38312 -286141 -495443 -547555 -351301 -36809 112384 16579 -22881 25338 66500 133923
$$ packed form
14024A51287J4628J36939K83962K85418K24125K02661K03150M32216N93111M34837
14014B962334M69868O40947J082493J658462J992419J978332J474795l18612j880809
14005A0060229k037616j707893j329404r50068q27961n12590l18619l92043n13399
13996A470636l20221j42218k2840Q344j6019j20770j67054J6694J03748O2112
13986H72412j12047j18615o3480j37724J20469J79235m7139k08946J8950m7972
13976D55143r8787J2797k0073k61943k46313J6667K28271J99268j08239j55378
13966B1413j14218J2061j26769O3844K98518K22649K9285O7930j9113j64358k52930
13955C8312l24453k09302n2112J96254L14492J49193r5805l9460M8219M1162O7423
$$ plain form
13944 133923 3086 -169875 -107367 46344 234086 252760 202226 267538 282738 327316 265544
13933 265544 246949 339285 365348 398577 579015 630642 519687 350518 206755 35496
13923 35496 -109915 -3206 177485 253062 258181 125167 2813 80565 198385 380823
13913 380823 394499 210095 83480 -86951 -318294 -336213 -174036 16886 153136 274847
13903 274847 461930 677820 639255 344332 153293 162686 185661 201487 126213 60965 -127966
13892 -127966 -120552 -90103 -174780 -228253 -264157 -350691 -302505 -168470 -305528 -431387 -406635
13881 -406635 -263320 -85875 -50131 42740 71502 -35422 -6078 256977 463985 244212
13871 244212 -116443 -148266 1909 -86010 -200858 -362737 -483442 -470621 -267365 -7687
$$ packed form
13944A33923j30837j72961O2508J53711J87742J8674n0534O5312J5200M4578o1772
13933B65544j8595R2336K6063L3229J80438N1627j10955j69169j43763j71259
13923C5496j45411J06709J80691P5577N119j33014j22354P7752J17820J82438
13913C80823J3676j84404j26615j70431k31343j7919J62177J90922J36250J21711
13903B74847J87083K15890l8565k94923j91039R393K2975J5826p5274o5248j88931
13892a27966P414L0449q4677n3473l5904q6534M8186J34035j37058j25859K4752
13881d06635J43315J77445L5744R2871K8762j06924K9344K63055K07008k19773
13871B44212l60655l1823J50175q7919j14848j61879j20705J2821K03256K59678
$$ plain form
13861 -7687 -60994 22885 304875 293425 97053 115112 200594 166191 263262 434460 406572
13850 406572 281649 290458 362089 228518 217285 282579 293133 230229 141421 3884 -192850
13839 -192850 -349048 -339224 -187635 -284060 -310728 -205997 -191878 -148015 56140 134831 44679
13828 44679 -233594 -588546 -726672 -726467 -642308 -604655 -570338 -553345 -590020 -424903 -323751
13817 -323751 -428962 -271784 -134953 -215932 -283024 -242167 -402463 -458754 -488759 -287777
13807 -287777 -199488 -406831 -512646 -261075 -19536 45487 46762 -63161 -59669 -55139 -46008
13796 -46008 -245854 -386548 -445636 -428318 -373517 -272470 -142740 -123689 -200013 -159568 25205
13785 25205 90879 32759 -251 -45566 -5329 -209559 -467830 -568542 -522846 -476271 -344303
$$ packed form
13861g687n3307Q3879K81990j1450j96372J8059Q5482l4403R7071J71198k7888
13850D06572j24923Q809P1631j33571j1233O5294J0554o2904q8808j37537j96734
13839a92850j56198R824J51589r6425k6668J04731J4119M3863K04155P8691r0152
13828D4679k78273l54952j38126K05Q4159L7653L4317J6993l6675J65117J01152
13817c23751j05211J57178J36831q0979o7092M0857j60296n6291l0005K00982
13807b87777Q8289k07343j05815K51571K41539O5023J275j09923L492M530R131
13796d6008j99846j40694n9088J7318N4801J01047J29730J9051p6324M0445J84773
13785B5205O5674n8120l3010m5315M0237k04230k58271j00712M5696M6575J31968
$$ plain form
13774 -344303 -260588 -322490 -345103 -270341 -278177 -116923 122289 79349 -324291 -627092 -654235
13763 -654235 -633111 -563907 -565595 -550894 -487577 -547853 -600494 -426357 -340571 -433082 -411707
13752 -411707 -366416 -346518 -383471 -321212 -243651 -212184 -275712 -433291 -532870 -627786 -639350
13741 -639350 -613553 -569238 -471774 -361124 -312185 -222186 -217025 -111529 -224492 -440467 -598298
13730 -598298 -705535 -563513 -300443 -67427 2387 -34116 -44278 -91292 -104566 -77734 -78785
13719 -78785 -55378 53762 61269 -35612 -142255 -222147 -224959 -110398 -48068 -107867 -307220
13708 -307220 -558475 -574220 -548560 -499344 -277349 110415 186006 120217 145764 72508 82820
13697 82820 -9415 -221372 -405409 -506954 -473427 -293650 -106045 8957 -61695 -233750
$$ packed form
13774c44303Q3715o1902k2613P4762p836J61254K39212m2940m03640l02801k7143
13763f54235K1124O9204j688J4701O3317o0276n2641J74137Q5786r2511K1375
13752d11707M5291J9898l6953O2259P7561L1467o3528j57579r9579r4916j1564
13741f39350K5797M4315R7464J10650M8939Q9999N161J05496j12963k15975j57831
13730e98298j07237J42022K63070K33016O9814l6503j0162m7014j3274K6832j051
13719g8785K3407J09140P507r6881j06643p9892k812J14561O2330n9799j99353
13708c07220k51255j5745K5660M9216K21995L87764P5591o5789K5547p3256J0312
13697H2820r2235k11957j84037j01545L3527J79777J87605J15002p0652j72055
$$ plain form
13687 -233750 -263724 -262956 -413549 -520846 -362318 -98132 164929 230841 240484 62518 -131399
13676 -131399 -124568 101746 229646 252680 147629 115823 135632 25737 3760 132403 126638
13665 126638 18915 -78719 -130401 -135345 -126908 -150478 -209022 -116545 -51942 -125786 -40590 157220
13653 157220 175592 13043 -337644 -647907 -611294 -463289 -427252 -358651 -330733 -337020 -218141
13642 -218141 -222095 -218896 48476 227613 55162 -85267 -99471 -218602 -295499 -224528 -405865
13631 -405865 -663058 -415853 45578 262875 380138 307599 182966 138393 -63369 -111728
13621 -111728 37461 119045 138522 132532 -8149 -79787 -15738 27232 66327 37334 67619
13610 67619 128030 168401 35882 -191775 -296265 -223924 23970 37594 -85213 -75282 204360
$$ packed form
13687b33750k9974P68j50593j07297J58528K64186K63061O5912R643j77966j93917
13676a31399O831K26314J27900K3034j05051l1806J9809j09895k1977J28643n765
13665A26638j07723r7634n1682m944Q437k3570n8544R2477O4603p3844Q5196J97810
13653A57220J8372j62549l50687l10263L6613J48005L6037O8601K7918o287J18879
13642b18141l954L199K67372J79137j72451j40429j4204j19131p6897P0971j81337
13631d05865k57193K47205M61431K17297J17263p2539j24633m4573k01762m8359
13621a11728J49189Q1584J9477n990j40681p1638O4049M2970L9095k8993L0285
13610F7619O0411M0371j32519k27657j04490P2341K47894J3624j22807R931K79642
$$ plain form
13599 204360 417248 419412 314683 283164 336416 174602 -69834 -248357 -463848 -540389
13589 -540389 -612264 -794118 -682032 -429265 -253871 -113394 -48642 -133615 -68869 -115222
13579 -115222 -34591 -61247 -535975 -623533 -387509 -178281 -84983 -122679 -107556 13629 303714
13568 303714 341335 230907 48491 -123079 -51263 233892 427068 352361 348016 393137 469350
13557 469350 575581 713651 649815 400927 154758 -49141 -281498 -384337 -327581 -354801
13547 -354801 -395205 -232681 -116227 -136373 -83102 -86954 -136380 -245612 -259860 -144346 -241127
13536 -241127 -388444 -241813 -123673 -112916 -121046 -108980 43 53167 -45908 -135028 -361804
13525 -361804 -433445 -239924 23114 60186 21767 74094 23318 62716 40742 -138895 -306583
$$ packed form
13599B04360K12888K164j04729l1519N3252j61814k44436j78523k15491p6541
13589e40389p1875j81854J12086K52767J75394J40477O4752q4973O4746m6353
13579a15222Q0631k6656m74728q7558K36024K09228R3298l7696J5123J21185K90085
13568C03714L7621j10428j82416j71570P1816K85155J93176p4707m345M5121P6213
13557D69350J06231J38070o3836k48888k46169k03899k32357j02839N6756k7220
13547c54801m0404J62524J16454k0146N3271l852m9426j09232j4248J15514r6781
13536b41127j47317J46631J18140J0757q130J2066J09023N3124r9075q9120k26776
13525c61804p1641J93521K63038L7072l8419N2327n0776L9398k1974j79637j67688
$$ plain form
13514 -306583 -209200 -209341 -283273 -315371 -616078 -924748 -900043 -671479 -570905 -508161 -291093
13503 -291093 -134256 56484 189416 337417 370450 306799 232214 305970 353496 460604
13493 460604 482476 512644 399398 160048 667 -280213 -543490 -578735 -356965 -120648
13483 -120648 -166873 -308159 -479255 -431244 -223912 -129743 20698 68518 121268 40017 29357
13472 29357 119815 93954 21022 -37620 -77556 -212344 -223716 -256812 -260882 37708 137267
13461 137267 144226 234265 152844 -11512 -102085 -28000 120070 311094 541128 714747 668877
13450 668877 567081 535412 692318 759790 531636 355979 227456 124762 -63342 -116438
13440 -116438 65081 206850 325304 392305 269415 127924 78288 54913 -5450 -5395 75018
$$ packed form
13514c06583R7383j41p3932l2098l00707l08670K4705K28564J00574O2744K17068
13503b91093J56837J90740J32932J48001L3033o3651p4585P3756M7526J07108
13493D60604K1872L0168j13246k39350j59381k80880k63277l5245K21770K36317
13483a20648m6225j41286j71096M8011K07332R4169J50441M7820N2750q1251j0660
13472B9357R0458k5861p2932n8642l9936j34788j1372l3096m070K98590R9559
13461A37267O959R0039q1421j64356r0573P4085J48070J91024K30034J73619m5870
13450F68877j01796l1669J56906O7472k28154j75657j28523j02694j88104n3096
13440a16438J81519J41769J18454O7001j22890j41491m9636k3375o0363N5Q0413
$$ plain form
13429 75018 75988 181764 353002 393289 304780 196808 61288 -77917 -179891 -205764 -62003
13418 -62003 52933 -82732 -244608 -197412 -312058 -511156 -436914 -316847 -207310 -219655
13408 -219655 -322842 -308707 -406251 -453021 -216195 -123977 -239105 -228461 -244180 -495701 -526661
13397 -526661 -395550 -183055 142839 404828 479762 162094 -103238 -180834 -392673 -495685
13387 -495685 -318040 77232 191746 59052 -6051 104241 242733 163297 134442 231631
13377 231631 214331 127888 288141 530268 440182 289538 261815 296638 287645 59904 -167212
13366 -167212 -233044 -296084 -332992 -383573 -366786 -363429 -165561 -107239 -316152 -403942 -402294
13355 -402294 -417080 -524396 -715286 -818873 -775483 -585108 -527179 -379046 -107263 -71536
$$ packed form
13429G5018R70J05776J71238M0287q8509j07972j35520j39205j01974k5873J43761
13418f2003J14936j35665j61876M7196j14646j99098P4242J20067J09537j2345
13408b19655j03187J4135r7544m6770K36826R2218j15128J0644j5719k51521l0960
13397e26661J31111K12495L25894K61989P4934l17668k65332p7596k11839j03012
13387d95685J77645L95272J14514j32694o5103J10292J38492p9436k8855R7189
13377B31631j7300q6443J60253K42127r0086j50644k7723L4823q993k27741k27116
13366a67212o5832o3040l6908n0581J6787L357J97868N8322k08913q7790J648
13355d02294j4786j07316j90890j03587M3390J90375N7929J48133K71783L5727
$$ plain form
13345 -71536 -58812 -19709 43158 122509 203643 230733 195971 22992 -118078 -56824 41348
13334 41348 101127 18972 -46670 88220 318008 463086 441935 232407 16862 18782 29335
13323 29335 2281 -77354 29312 74124 -81947 -215941 -169047 169496 215384 103921 85442
13312 85442 -117650 -210321 -252164 -276556 -118938 96777 256932 267994 256292 403550 388813
13301 388813 212818 179595 144158 66930 59835 -91083 -93761 14589 106587 212323 259575
13290 259575 197791 -19328 -19335 102206 215063 284441 197056 221896 227216 -30921 -154007
13279 -154007 119315 236769 203895 178282 67177 -87881 -52814 72201 307272 400344
13269 400344 311710 459257 581278 489243 344260 365621 514608 536486 346677 213754
$$ packed form
13345g1536J2724L9103O2867P9351Q1134K7090l4762j72979j41070O1254R8172
13334D1348N9779q2155o5642J34890K29788J45078k1151k09528k15545J920J0553
13323B9335k7054p9635J06666M4812j56071j33994M6894L38543M5888j11463j8479
13312H5442k03092r2671m1843k4392J57618K15715J60155J1062j1702J47258j4737
13301C88813j75995l3223l5437p7228p095j50918k678J08350R1998J05736M7252
13290B59575o1784k17119pJ21541J12857O9378q7385K4840N320k58137j23086
13279a54007K73322J17454l2874k5613j11105j55058L5067J25015K35071R3072
13269D00344q8634J47547J22021r2035j44983K1361J48987K1878j89809j32923
$$ plain form
13259 213754 201068 430921 576749 679074 799483 699913 691344 538251 269551 9218
13249 9218 106872 396189 482277 327137 65903 -33274 27168 94047 209478 224321 69299
13238 69299 32047 135861 188790 106531 142377 224090 282629 489815 553884 421875 336383
13227 336383 230811 80797 242644 317659 10903 -74421 94326 83797 -163818 -297622
13217 -297622 -246146 -82934 219400 249226 101487 46610 100521 255925 398463 424679
13207 424679 372945 337433 409799 580191 662404 673681 679427 607326 444611 186037 74400
13196 74400 283011 476225 468235 207942 -7003 -62423 -214026 -466517 -486171 -230982
13186 -230982 -3491 -56061 -78452 228344 509971 705251 785132 853427 882937 920353 906575
$$ packed form
13259B13754j2686K29853J45828J02325J20409r9570q569j53093k68700k60333
13249I218R7654K89317Q6088j55140k61234r9177O0442O6879J15431J4843j55022
13238F9299l7252J03814N2929q2259L5846Q1713N8539K07186O4069j32009q5492
13227C36383j05572j50014J61847P5015l06756q5324J68747j0529k47615j33804
13217b97622N1476J63212L02334K9826j47739n4877N3911J55404J42538K6216
13207D24679n1734l5512P2366J70392Q2213J1277N746p2101j62715k58574j11637
13196G4400K08611J93214p990k60293k14945n5420j51603k52491j9654K55189
13186b30982K27491n2570k2391L06796K81627J95280P9881O8295K9510L7416j3778
$$ plain form
13175 906575 856488 655404 319934 175863 180245 245009 228317 39002 89921 433407 498145
13164 498145 520363 610530 718430 773209 749250 752274 660314 681547 763100 722460 773321
13153 773321 838794 763598 770625 749992 742128 729676 653920 676391 553847 409390 233996
13142 233996 225341 231336 182965 389753 455420 305260 448613 561213 556391 468772 454503
13131 454503 609893 647958 359041 78789 58806 67741 314164 535324 839303 933660
13121 933660 719970 635777 664258 705277 632098 566050 518058 405453 548923 651116 571676
13110 571676 360180 378243 458300 567024 894689 1028837 939824 855203 734738 548124
13100 548124 400760 481584 535702 446603 393574 495252 320772 -83128 -123567 179327
$$ packed form
13175I06575n0087k01084l35470j44071M382O4764j6692j89315N0919L43486O4738
13164D98145K2218R0167J07900N4779k3959L024r1960K1233Q1553m0640N0861
13153G73321O5473p5196P027k0633p864j2452p5756K2471j22544j44457j75394
13142B33996q655N995m8371K06788O5667j50160J43353J12600m822q7619j4269
13131D54503J55390L8065k88917k80252j9983Q935K46423K21160L03979R4357
13121I33660k13690q4193K8481M1019p3179o6048m7992j12605J43470J02193p9440
13110E71676k11496J8063Q0057J08724L27665J34148q9013q4621j20465j86614
13100E48124j47364Q0824N4118q9099n3029J01678j74480m03900m0439L02894
$$ plain form
13090 179327 584075 580299 600177 695011 767849 873783 984242 1201099 1446642 1382174 1191604
13079 1191604 1159744 1151643 1056779 1166315 1286173 1271900 1131291 919173 944055 919214 803507
13068 803507 899620 935243 918873 1001492 890083 710622 579992 768187 1023527 1008656
13058 1008656 1127720 1378279 1607503 1741943 1771897 1804092 1774356 1696363 1697361 1713414 1660129
13047 1660129 1777985 1917391 1849748 1742914 1736839 1637257 1629164 1617057 1661471 1701009 1814901
13036 1814901 2021162 2031712 2047909 1971529 2062937 2052752 1860980 1639981 1597489 1808748
13026 1808748 2034196 2131798 2299993 2415716 2491779 2535509 2470878 2534511 2764059 2856097
13016 2856097 2997675 3194877 3300779 3288406 3212884 3328149 3495658 3687886 3970892 4281174
$$ packed form
13090A79327M04748l776J9878R4834P2838J05934J10459K16857K45543o4468j90570
13079A191604l1860q101r4864J09536J19858j4273j40609k12118K4882k4841j15707
13068H03507R6113L5623j6370Q2619j11409j79461j30630J88195K55340j4871
13058A008656J19064K50559K29224J34440K9954L2195k9736p7993R98J6053n3285
13047A660129J17856J39406o7643j06834o075r9582q093j2107M4414L9538J13892
13036A814901K06261J0550J6197p6380R1408j0185j91772k20999m2492K11259
13026A808748K25448R7602J68195J15723P6063M3730o4631O3633K29548R2038
13016B856097J41578J97202J05902j2373p5522J15265J67509J92228K83006L10282
$$ plain form
13006 4281174 4608461 4658017 4753712 5098613 5289651 5423511 5662651 5931231 6487932 7114054
12996 7114054 7830621 8594349 9295847 10070894 10990352 12197059 13572089 15480933 17830701
12987 17830701 20598712 23845735 27853693 33040373 39581316 47699141 57624631 70736049
12979 70736049 88477065 111881468 142848780 181602384 222984091 252500486 253086816
12972 253086816 224900648 185157519 148109747 118421960 95706184 78450876 65144695
12965 65144695 54755131 46372344 39731591 34466419 29977463 26230698 22938542 20160937
12957 20160937 18041485 16314181 14887982 13690584 12736385 11914323 10940057 10038896 9377655
12948 9377655 8703517 8237117 8041621 7771106 7307322 6639536 6334945 6253389 6164330 6203724
$$ packed form
13006D281174L27287M9556R5695L44901J91038J33860K39140K68580N56701O26122
12996G114054P16567P63728P01498P75047R19458J206707J375030J908844K349768
12987A7830701K768011L247023M007958N186680O540943Q117825R925490J3111418
12979G0736049J7741016K3404403L0967312L8753604M1381707K9516395N86330
12972B53086816k8186168l9743129l7047772k9687787k2715776j7255308j3306181
12965F5144695j0389564q382787o640753n265172m488956l746765l292156k777605
12957B0160937k119452j727304j426199j197398r54199q22062r74266r01161o61241
12948I377655o74138m66400j95496k70515m63784o67786l04591q1556q9059L9394
$$ plain form
12938 6203724 6266196 6155487 5944688 5841548 5489388 5239455 5222918 5217391 5288090 5420277
12928 5420277 5610759 5778870 5687343 5576695 5693937 6024313 6468865 6916749 7341113 7834631
12918 7834631 8694482 9834402 11200934 12407547 12873950 12534393 11915245 11417674 11088658
12909 11088658 11094533 11372874 11916526 12670849 13569112 14710733 16229871 17915142 19998407
12900 19998407 22830929 26311804 30602822 36078513 42995668 51365930 61910252 75958297
12892 75958297 95004078 120448354 154074167 195581851 237575483 261932488 253261956
12885 253261956 218485633 176882831 140549692 112179374 90714332 74559923 61968509
12878 61968509 52143185 44333578 38374081 33855630 30195860 27016103 24209261 22034686
$$ packed form
12938F203724O2472j10709k10799j03140l52160k49933j6537n527P0699J32187
12928E420277J90482J68111r1527j10648J17242L30376M44552M47884M24364M93518
12918G834631Q59851J139920J366532J206613M66403l39557o19148m97571l29016
12909A1088658N875K78341N43652P54323Q98263J141621J519138J685271K083265
12900A9998407K832522L480875M291018N475691O917155Q370262J0544322J4048045
12892G5958297J9045781K5444276L3625813M1507684M1993632K4357005q670532
12885B53261956l4776323m1602802l6333139k8370318k1465042j6154409j2591414
12878F1968509r825324p809607n959497m518451l659770l179757k806842k174575
$$ plain form
12870 22034686 20727816 20108815 19957341 20502124 22090618 25153239 28074120 26714334
12862 26714334 22107103 18117834 15367698 13391068 11767118 10531292 9561339 8780860
12854 8780860 7973674 7331994 6863605 6573880 6369653 6051036 5974823 6024997 5848185 5731966
12844 5731966 5577342 5476516 5595773 5673557 5612598 5436646 5309047 5501520 5722813 5940367
12834 5940367 6086265 6091482 6068745 6186223 6272549 6296569 6425710 6590522 6852896 7073729
12824 7073729 7568873 8252481 8842167 9509904 10490425 11635719 12793294 14029518 15436303
12815 15436303 17223314 19661819 22676997 26390274 30952323 36727167 44068681 53413221
12807 53413221 65145889 80187639 100391195 127521236 162866312 204455434 242091612
$$ packed form
12870B2034686j306870o19001j51474N44783J588494L062621K920881j359786
12862B6714334m607231l989269k750136j976630j623950j235826r69953p80479
12854H780860q07186o41680m68389k89725k04227l18617p6213N0174j76812j16219
12844E731966j54624j00826J19257P7784o0959j75952j27599J92473K21293K17554
12834E940367J45898N217k2737J17478Q6326K4020J29141J64812K62374K20833
12824G073729M95144O83608N89686O67737R80521J145294J157575J236224J406785
12815A5436303J787011K438505L015178L713277M562049N774844P341514R344540
12807E3413221J1732668J5041750K0203556K7130041L5345076M1589122L7636178
$$ plain form
12800 242091612 257530751 241210372 204377028 164495152 130712683 104542316 84557021
12793 84557021 69318159 57558925 48555329 41605524 35870706 31062594 27187542 24036268
12785 24036268 21350951 19019284 16792811 14699980 12975761 11564942 10367009 9433004
12777 9433004 8588012 7976665 7490939 6948269 6600525 6129075 5860654 5877824 5681070 5225630
12767 5225630 4927556 4601497 4178626 3865754 3527832 3240866 3126749 3178705 3131327 2881191
12757 2881191 2697921 2656084 2571975 2324910 2065360 1896110 1632437 1429452 1372014 1254551
12747 1254551 1265323 1447313 1322477 1260037 1491685 1674169 1603624 1277056 1140211 1163342
12737 1163342 1212126 1238281 1213584 1035545 941532 991606 945861 1028199 1108030 1037646 1116811
$$ packed form
12800B42091612J5439139j6320379l6833344l9881876l3782469k6170367j9985295
12793H4557021j5238862j1759234r003596o949805n734818m808112l875052l151274
12785B4036268k685317k331667k226473k092831j724219j410819j197933r34005
12777I433004q44992o11347m85726n42670l47744m71450k68421J7170j96754m55440
12767E225630k98074l26059m22871l12872l37922k86966j14117N1956m7378k50136
12757B881191j83270m1837q4109k47065k59550j69250k63673k02985n7438j17463
12747A254551J0772J81990j24836o2440K31648J82484p0545l26568j36845K3131
12737A163342M8784K6155k4697j78039r4013N0074m5745Q2338P9831p0384P9165
$$ plain form
12726 1116811 1322754 1246278 958818 746610 598577 746896 779723 750681 729489 679181
12716 679181 699386 785401 980651 1014364 811747 583649 440676 317831 295338 453887
12706 453887 580551 700410 695408 597741 638150 496410 374578 538649 699937 672348
12696 672348 709104 665481 505578 404003 417888 419909 354254 388764 478715 280745 114048
12685 114048 243035 282945 448343 664191 803178 971987 903815 643983 460474 415155
12675 415155 468423 642188 692820 609041 461504 476219 690067 782430 609172 383678
12665 383678 269328 232009 327007 557189 708551 892907 1112057 1061828 875966 631918
12655 631918 410354 461767 532929 479144 396691 577940 716242 761814 574262 513087 570065
$$ packed form
12726A116811K05943p6476k87460k12208j48033J48319L2827k9042k1192n0308
12716F79181K0205Q6015J95250L3713k02617k28098j42973j22845k2493J58549
12706D53887J26664J19859n002r7667M0409j41740j21832J64071J61288k7589
12696F72348L6756m3623j59903j01575J3885K021o5655L4510Q9951j97970j66697
12685A14048J28987L9910J65398K15848J38987J68809o8172k59832j83509m5319
12675D15155N3268J73765N0632q3779j47537J4715K13848R2363j73258k25494
12665C83678j14350l7319R4998K30182J51362J84356K19150n0229j85862k44048
12655F31918k21564N1413P1162n3785q2453J81249J38302M5572j87552o1175N6978
$$ plain form
12644 570065 701368 771301 809925 936068 874806 699160 579432 429282 81990 -95941
12634 -95941 -44873 127293 12073 -109726 -153820 -178849 -197416 -159211 -38485 110105 305685
12623 305685 273730 79999 154356 169670 257878 165597 -32154 -103514 30978 14282 -10994
12612 -10994 -212867 -335042 -418804 -522036 -385688 -137563 -123528 -21956 208746 238778
12602 238778 182996 107934 314353 659483 754486 867370 797737 434433 274818 369634
12592 369634 367855 296174 138891 -131847 -252345 -307129 -202261 -245148 -282393 -312684 -410652
12581 -410652 -358240 -295585 -99885 148515 345846 198915 -165713 -330228 -178407 -11434
12571 -11434 3034 180837 440797 735160 917845 712439 364754 309793 197342 137532
$$ packed form
12644E70065J31303O9933L8624J26143o1262j75646j19728j50150l47292j77931
12634i5941N1068J72166j15220j21799m4094k5029j8567L8205J20726J48590J95580
12623C05685l1955j93731P4357J5314Q8208r2281j97751p1360J34492j6696k5276
12612a0994k01873j22175q3762j03232J36348K48125J4035J01572K30702L0032
12602B38778n5782p5062K06419L45130R5003J12884o9633l63304j59615R4816
12592C69634j779p1681j57283k70738j20498n4784J04868m2887l7245l0291r7968
12581d10652N2412O2655J95700K48400J97331j46931l64628j64515J51821J66973
12571a1434J4468J77803K59960K94363J82685k05406l47685n4961j12451n9810
$$ plain form
12561 137532 182271 250756 254172 20126 -58320 32713 39404 49230 57575 111034 42015 114960
12549 114960 159662 88972 61698 117375 261666 328815 256717 240611 457776 686694 776630
12538 776630 579097 308786 125822 84381 166622 204990 317897 283761 119136 -111597
12528 -111597 -264532 -186777 105126 296213 365624 324250 65538 -85185 14386 132418
12518 132418 249545 521652 604370 485728 335150 299122 446782 541312 396126 268648
12508 268648 242427 98769 -14845 -91132 -38962 22606 42778 113970 258055 169195 95215
12497 95215 149496 135244 257671 443942 520877 432454 436548 582588 623225 523522 317844
12486 317844 161807 28609 6808 -106934 -293973 -462782 -484271 -382652 -162088 48214
$$ packed form
12561A37532M4739O8485L416k34046p8446R1033O691R826Q345N3459o9019P2945
12549A14960M4702p0690k7274N5677J44291O7149p2098j6106K17165K28918Q9936
12538G76630j97533k70311j82964m1441Q2241L8368J12907l4136j64625k30733
12528a11597j52935P7755K91903J91087O9411m1374k58712j50723R9571J18032
12518A32418J17127K72107Q2718j18642j50578l6028J47660R4530j45186j27478
12508B68648k6221j43658j13614p6287N2170O1568K0172P1192J44085q8860p3980
12497I5215N4281j4252J22427J86271P6935q8423M094J46040M0637r9703k05678
12486C17844j56037j33198k1801j13742j87039j68809k1489J01619K20564K10302
$$ plain form
12476 48214 92071 -24439 -30264 98517 149160 5023 -38705 53311 92641 188705 81941
12465 81941 -180046 -161266 -45651 61533 4798 -90259 57698 184567 65992 -137594
12455 -137594 -50658 64136 184373 569188 670252 438799 166500 15819 -62995 4984
12445 4984 88880 -165860 -426444 -594616 -588719 -458021 -396224 -260959 -61450 132590 115235
12434 115235 -51177 -148619 4552 399034 489148 506499 366579 139331 -30416 -192601
12424 -192601 -24433 345354 583754 653084 474456 180837 -165730 -283786 -237572 -221909
12414 -221909 -265666 -221157 -67400 241796 435737 320865 221189 246900 228790 65460
12404 65460 -90112 -18683 170438 294106 337806 221336 60788 -111115 -260747 -258700
$$ packed form
12476D8214M3857j16510n825J28781N0643j44137m3728R2016L9330R6064j06764
12465H1941k61987J8780J15615J07184n6735r5057J47957J26869j18575k03586
12455a37594Q6936J14794J20237L84815J01064k31453k72299j50681p8814O7979
12445D984Q3896k54740k60584j68172N897J30698O1797J35265J99509J94040j7355
12434A15235j66412r7442J53171L94482R0114J7351j39920k27248j69747j62185
12424a92601J68168L69787K38400O9330j78628k93619l46567j18056M6214J5663
12414b21909m3757M4509J53757L09196J93941j14872r9676K5711j8110j63330
12404F5460j55572P1429J89121J23668M3700j16470j60548j71903j49632K047
$$ plain form
12394 -258700 -77438 149169 273681 58075 -142174 -181823 -222571 -244773 -192993 -83527
12384 -83527 -110869 -168533 22207 200312 334442 289162 130001 55623 191075 233172 143273
12373 143273 -91456 -204763 -277988 -272544 -128995 -125434 -37023 74602 -27878 -148295 -34007
12362 -34007 -51040 -111148 -101277 -17423 131730 173764 -14160 -142546 -84487 66729 210494
12351 210494 435267 418121 392049 472401 458113 449568 365356 92050 36685 33942 108686
12340 108686 44395 -156220 -268737 -124865 -113709 -302850 -376493 -206023 -49718 13773
12330 13773 -56315 -34765 -29084 26705 275622 466513 589354 539120 428449 452766 432125
12319 432125 295500 318140 399594 416526 258861 125190 32316 -149343 -73171 -13809 -182380
$$ packed form
12394b58700J81262K26607J24512k15606k00249l9649m0748k2202N1780J09466
12384h3527k7342n7664J90740J78105J34130m5280j59161p4378J35452M2097q9899
12373A43273k34729j13307p3225N444J43549L561Q8411J11625j02480j20417J14288
12362c4007j7033o0108R871Q3854J49153M2034j87924j28386N8059J51216J43765
12351B10494K24773j7146k6072Q0352j4288q545q4212k73306n5365k743P4744
12340A08686o4291k00615j12517J43872J1156j89141p3643J70470J56305O3491
12330A3773p0088K1550N681N5789K48917J90891J22841n0234j10671K4317k0641
12319D32125j36625K2640Q1454J6932j57665j33671r2874j81659P6172N9362j68571
$$ plain form
12308 -182380 -232602 -203448 -148717 -235853 -122389 122002 243573 246297 114301 -127808 -104591
12297 -104591 133405 315654 386355 339262 316049 206339 58674 34916 28920 -84808 24326
12286 24326 256368 310048 267000 273550 274560 204202 132431 191222 259832 414688 428497 402668
12274 402668 433606 386129 279985 25312 -28363 -68379 -23082 -11416 23844 82556 150813
12263 150813 123910 -110083 -318723 -248388 -160901 -335575 -359835 -147964 4371 207814
12253 207814 431243 410897 351154 355839 410688 479004 430433 382232 421324 459068 399019
12242 399019 378609 241156 207699 157482 194673 239365 190339 154319 230008 284592 131605
12231 131605 54755 136456 168824 97695 200128 233811 225350 40970 -170672 -294122 -228344
$$ packed form
12308a82380n0222K9154N4731q7136J13464K44391J21571K724j31996k42109K3217
12297a04591K37996J82249P0701m7093k3213j09710j47665k3758n996j13728J09134
12286B4326K32042N3680m3048O550J010p0358p1771N8791O8610J54856J3809k5829
12274D02668L0938m7477j06144k54673n3675m0016M5297J1666L5260N8712O8257
12263A50813k6903k33993k08640P0335Q7487j74674k4260K11871J52335K03443
12253B07814K23429k0346n9743M685N4849O8316m8571m8201L9092L7744o0049
12242C99019k0410j37453l3457n0217L7191M4692m9026l6020P5689N4584j52987
12231A31605p6850Q1701L2368p1129J02433L3683q461j84380k11642j23450O5778
$$ plain form
12220 -228344 35201 -2661 -125890 -175320 -169338 -165181 -280159 -156669 -42276 37501 202324
12209 202324 200803 228858 358667 275380 157188 225646 208298 54425 -107544 -301362 -441518
12198 -441518 -440107 -312394 -165878 -54393 78427 -7867 -74541 379 84930 16145 -1627
12187 -1627 -148259 -349004 -380682 -333361 -331951 -242495 -55699 -61787 -388121 -563744 -433520
12176 -433520 -329942 -34644 300012 329271 15207 -130685 -69846 -179204 -335468 -144310
12166 -144310 -169832 -298966 -396765 -474105 -335252 -224354 -208211 -231466 -328860 -364073 -268357
12155 -268357 -236959 -116150 -41172 -205232 -400030 -446949 -423575 -411945 -279922 -164255
12145 -164255 -54030 130430 251554 307910 182866 123411 224046 296434 336204 250380
$$ packed form
12220b28344K63545l7862j23229m9430N982M157j14978J23490J14393P9777J64823
12209B02324j521K8055J29809q3287j18192O8458j7348j53873j61969j93818j40156
12198d41518J411J27713J46516J11485J32820q6294o6674P4920Q4551o8785j7772
12187a627j46632k00745l1678M7321J410Q9456J86796o088l26334j75623J30224
12176d33520J03578K95298L34656K9259l14064j45892O0839j09358j56264J91158
12166a44310k5522j29134r7799p7340J38853J10898J6143k3255r7394l5213R5716
12155b68357L1398J20809P4978j64060j94798m6919K3374J1630J32023J15667
12145a64255J10225J84460J21124N6356j25044n9455J00635P2388L9770q5824
$$ plain form
12135 250380 328445 422203 411186 345880 197965 279174 398687 203928 -15102 -7908 143596
12124 143596 147556 34021 -13759 -82858 -63688 120183 216568 267252 188873 182412 285956
12113 285956 309767 230369 318992 388383 84664 20267 150066 215296 314937 400010 431549
12102 431549 396847 353225 309737 372806 405425 470247 479885 274856 109002 41963 -169647
12091 -169647 -300299 -303778 -245128 -187105 -186047 -58 401311 617875 524459 489089 515796
12080 515796 542262 766657 772763 441058 210960 111970 63915 181678 336906 364877 266321
12069 266321 -53122 -173195 -324518 -431723 -225199 62554 264427 334892 295930 151583
12059 151583 19371 8306 171093 428639 478477 524732 443046 274553 238594 223667 166542
$$ packed form
12135B50380P8065R3758j1017o5306j47915Q1209J19513j94759k19030P194J51504
12124A43596L960j13535m7780o9099J9170J83871R6385N0684p8379o461J03544
12113B85956K3811p9398Q8623O9391l03719o4397J29799O5230R9641Q5073L1539
12102D31549l4702m3622m3488O3069L2619O4822R638k05029j65854o7039k11610
12091a69647j30652l479N8650N8023J058J85989M01369K16564r3416l5370K6707
12080E15796K6466K24395O106l31705k30098r8990m8055J17763J55228K7971r8556
12069B66321l19443j20073j51323j07205K06524K87753K01873P0465l8962j44347
12059A51583j32212j1065J62787K57546M9838M6255q1686j68493l5959j4927n7125
$$ plain form
12048 166542 169343 102855 -200419 -434119 -385625 -402349 -376867 -202412 19084 151403 133185
12037 133185 128513 49547 -100733 -266031 -453194 -691646 -681281 -553096 -442031 -162799
12027 -162799 138758 325800 162546 -96379 -211009 -108061 -17155 183057 320626 147327
12017 147327 -90167 -261173 -355168 -428715 -621336 -630867 -365355 132774 708347 995092
12007 995092 854699 488465 296256 128868 20977 115003 349126 405387 244285 144991
11997 144991 275052 512969 589115 532775 544649 483830 167566 -75272 -10238 -99881 -311325
11986 -311325 -355666 -290946 -248156 -303560 -244928 -89671 103052 138197 21048 -328255 -551657
11975 -551657 -441174 -288964 -264241 -167756 -116686 -88137 -187868 -298995 -246697 -211360 -375157
$$ packed form
12048A66542K801o6488l03274k33700M8494j6724K5482J74455K21496J32319j8218
12037A33185m672p8966j50280j65298j87163k38452J0365J28185J11065K79232
12027a62799L01557J87042j63254k58925j14630J02948R0906K00212J37569j73299
12017A47327k37494j71006r3995p3547j92621r531K65512M98129N75573K86745
12007I95092j40393l66234j92209j67388j07891R4026K34123N6261j61102r9294
11997A44991J30061K37917P6146n6340J1874o0819l16264k42838O5034q9643k11444
11986c11325m4341O4720M2790n5404N8632J55257J92723L5145j17149l49303k23402
11975e51657J10483J52210K4723R6485N1070K8549r9731j11127N2298L5337j63797
$$ plain form
11964 -375157 -510048 -366001 -41146 -24081 -194738 -151212 -22408 154119 213404 224599
11954 224599 148189 96191 275566 473973 576876 694392 743029 696878 505965 375539
11944 375539 396724 476385 542191 545310 578050 586043 567231 713195 815717 739967 601720
11933 601720 929957 1476270 2142970 2858241 3239669 3610590 4323484 5205614 5950183 6844901
11923 6844901 8115682 9638210 10954220 11481836 10828441 9390244 7710186 6233085
11915 6233085 5250259 4422282 3773204 3272451 2766516 2365150 2025315 1625994 1244823
11906 1244823 1066279 1171745 1236764 1137491 951650 765671 608960 558509 536394 403114
11896 403114 242150 96306 -151560 -287487 -240352 -130580 -66882 -182339 -226248 -41155
$$ packed form
11964c75157j34891J44047L24855J7065j70657M3526J28804J76527N9285J1195
11954B24599p6410n1998J79375J98407J02903J17516M8637m6151j90913j30426
11944C75539K1185P9661O5806L119L2740P993j8812J45964J02522p5750j38247
11933F01720L28237N46313O66700P15271L81428L70921P12894Q82130P44569Q94718
11923F844901J270781J522528J316010N27616o53395j438197j680058j477101
11915F233085r82826q27977o49078n00753n05935m01366l39835l99321l81171
11906A244823j78544J05466O5019r9273j85841j85979j56711n0451k2115j33280
11896D03114j60964j45844k47866j35927M7135J09772O3698j15457m3909J85093
$$ plain form
11886 -41155 14072 70182 156279 105146 183519 363120 521251 727985 792186 863734 766731
11875 766731 452662 301136 428999 693189 802425 761176 596793 481887 286816 70019
11865 70019 129459 207314 151878 204584 197433 125181 105685 77315 -80958 -308242 -482712
11854 -482712 -377022 -176581 -11054 80763 83305 134574 122143 169089 243704 298110 86706
11843 86706 -122711 -132133 -78291 -166500 -215223 10499 214873 151127 129125 337514 481238
11832 481238 411103 330355 182660 59419 -9792 1892 96799 106812 162805 217720 143733
11821 143733 52125 -6800 -35686 97750 311617 280645 290114 325578 479175 548429 529728
11810 529728 502837 345929 183533 -22063 14126 251507 249305 8122 -299513 -369519
$$ packed form
11886d1155N5227N6110Q6097n1133P8373J79601J58131K06734O4201P1548r7003
11875G66731l14069j51526J27863K64190J09236m1249j64383j14906j95071k16797
11865G0019N9440P7855n5436N2706p151p2252j9496k8370j58273k27284j74470
11854d82712J05690K00441J65527R1817K542N1269j2431M6946P4615N4406k11404
11843H6706k09417r422N3842q8209m8723K25722K04374o3746k2002K08389J43724
11832D81238p0135q0748j47695j23241o9211J1684R4907J0013N5993N4915p3987
11821A43733r1608n8925k8886J33436K13867l0972R469L5464J53597O9254j8701
11810E29728k6891j56908j62396k05596L6189K37381k202k41183l07635p0006
$$ plain form
11800 -369519 -352432 -249731 -170299 -79293 -111672 -306663 -354894 -333025 -397312 -406285 -234929
11789 -234929 -178052 -89222 141015 165240 129754 59186 -43187 -63850 -82732 -87308 81843
11778 81843 53825 -66725 -108597 -199463 -277752 -457797 -307447 -71685 -41736 -43790 56454
11767 56454 243022 478535 499667 416838 189270 69257 142788 97273 -35440 83595
11757 83595 224891 154050 -139052 -202655 56084 -6311 89216 26571 -272150 -262511 -203863
11746 -203863 -109171 -241776 -346832 -143837 5373 90844 260658 507578 684247 647419
11736 647419 353957 175507 165944 248330 278249 244078 440947 472848 393459 387625 370872
11725 370872 354393 173621 45986 36804 -5845 -191487 -201364 11689 185254 222706 308469
$$ packed form
11800c69519J7087J02701P9432R1006l2379j94991m8231K1869o4287q973J71356
11789b34929N6877Q8830K30237K4225l5486p0568j02373k0663j8882m576J69151
11778H1843k8018j20550m1872r0866p8289j80045J50350K35762K9949k054J00244
11767E6454J86568K35513K1132q2829k27568j20013P3531m5515j32713J19035
11757H3595J41296p0841k93102o3603K58739o2395R5527o2645k98721R639N8648
11746b03863R4692j32605j05056K02995J49210Q5471J69814K46920J76669l6828
11736F47419k93462j78450r563Q2386K9919l4171J96869L1901p9389n834j6753
11725C70872j6479j80772j27635r182m2649j85642r877K13053J73565L7452Q5763
$$ plain form
11714 308469 428362 354642 326285 200219 79318 63673 -5520 -15216 42999 -64895 -148246
11703 -148246 -285679 -439058 -501701 -463147 -568482 -587571 -364159 -58395 110086 241503
11693 241503 373163 348978 299955 184647 177812 159292 -44756 -168033 -235899 -198279 90638
11682 90638 229261 147350 101206 -87246 -231992 3915 265698 262432 527208 1062633
11672 1062633 1400572 1352870 1048668 691372 493638 422334 395698 314422 200123 99120
11662 99120 46760 140833 174222 58875 -27514 -242274 -242704 -90861 -5303 247028 413598
11651 413598 589069 584327 549792 584381 452372 410079 374865 264663 17800 -260973 -350366
11640 -350366 -328564 -298293 -356197 -271483 -126409 84483 155874 21453 -147611 -227299 -149381
$$ packed form
11714C08469J19893p3720k8357j26066j20901j5645o9193r696N8215j07894q3351
11703a48246j37433j53379o2643L8554j05335j9089K23412L05764J68481J31417
11693B41503J31660k4185m9023j15308o835j8520k04048j23277o7866L7620K88917
11682I0638J38623q1911m6144j88452j44746K35907K61783l266K64776N35425
11672A062633L37939m7702l04202l57296j97734p1304k6636q1276j14299j01003
11662I9120n2360R4073L3389j15347q6389k14760m30J51843Q5558K52331J66570
11651D13598J75471m742l4535L4589j32009m2293l5214j10202k46863k78773q9393
11640c50366K1802L0271n7904Q4714J45074K10892P1391j34421j69064p9688P7918
$$ plain form
11629 -149381 -217477 -272479 -190126 111560 343770 423301 367762 123658 -82149 -144696 -152367
11618 -152367 -212870 -348069 -219669 17343 50697 -108886 -371365 -431154 -281523 -145392
11608 -145392 -42272 -96406 -136989 -20456 146180 168707 205571 491704 608377 437807
11598 437807 471700 590327 773229 673331 371800 178081 86421 -54680 -83193 -322746
11588 -322746 -574221 -583762 -379779 4568 139539 17079 -165987 -367357 -544782 -675406
11578 -675406 -478482 -194171 -49490 -49568 -150398 -191739 -188200 -51475 49004 212385 391354
11567 391354 632010 673718 491018 343707 284129 282816 229833 166333 341641 426630 291774
11556 291774 181934 156347 302556 341805 148691 -88454 -50951 75934 -30736 -87760
$$ packed form
11629a49381o8096n5002Q2353L01686K32210P9531n5539k44104k05807o2547p671
11618a52367o0503j35199J28400K37012L3354j59583k62479n9789J49631J36131
11608a45392J03120n4134m0583J16533J66636K2527L6864K86133J16673j70570
11598D37807L3893J18627J82902r9898l01531j93719r1660j41101k8513k39553
11588c22746k51475r541K03983L84347J34971j22460j83066k01370j77425j30624
11578f75406J96924K84311J44681p8j00830m1341L539J36725J00479J63381J78969
11567C91354K40656M1708j82700j47311n9578j313n2983o3500J75308Q4989j34856
11556B91774j09840k5587J46209L9249j93114k37145L7503J26885j06670n7024
$$ plain form
11546 -87760 -114966 -181931 -402101 -425948 -280699 -13603 185236 151803 35202 -48159 -12720
11535 -12720 86075 395756 590243 286147 104871 227205 444888 528419 383366 347717
11525 347717 629995 963755 933424 837586 861589 974031 1179470 1277460 1359473 1460980
11515 1460980 1679077 1724965 1917082 2214685 2701788 3499877 4346954 5293371 6422560
11506 6422560 7780470 9633041 11101333 11610799 10788718 9174207 7570641 6183307
11498 6183307 5106715 4306743 3630017 3238652 2996823 2736897 2721211 2859410 2949398 2826802
11488 2826802 2829777 2985488 3012191 3026352 3318364 3826560 4398815 4936386 5982288 7478304
11478 7478304 9036252 10909021 12556506 12706519 11440020 9590306 7842799 6324913
$$ packed form
11546h7760k7206o6965k20170k3847J45249K67096J98839l3433j16601q3361L5439
11535a2720R8795L09681J94487l04096j81276J22334K17683Q3531j45053l5649
11525C47717K82278L33760l0331r5838K4003J12442K05439R7990Q2013J01507
11515A460980K18097M5888J92117K97603M87103P98089Q47077R46417J129189
11506F422560J357910J852571J468292N09466q22081j614511j603566j387334
11498F183307j076592p99972o76726l91365k41829k59926j5686J38199Q9988j22596
11488B826802K975J55711K6703J4161K92012N08196N72255N37571J045902J496016
11478G478304J557948J872769J647485J50013j266499j849714j747507j517886
$$ plain form
11470 6324913 5130198 4304514 3645844 3076736 2438507 1967492 1659647 1539719 1519877
11461 1519877 1361135 1165355 1028185 581384 147975 162184 258618 302004 502742 692277
11451 692277 874346 965346 731894 359518 265073 438749 645232 811779 780979 578257
11441 578257 346373 112188 -4303 59630 208804 287955 260901 155070 243292 388722
11431 388722 370450 372089 452036 386895 380661 456509 419084 122898 -28842 -62965 25387
11420 25387 277998 366304 211912 5696 -34357 -27272 -41807 -73163 -432816 -662492 -593178
11409 -593178 -440764 -312042 -168684 180326 314933 365939 264020 83686 81230 347695
11399 347695 384285 157851 44902 156639 179067 191460 173865 256592 360306 349218 241223
$$ packed form
11470F324913j194715q25684o58670n69108o38229m71015l07845j19928j9842
11461A519877j58742j95780j37170m46801m33409J4209R6434M3386K00738J89535
11451F92277J82069R1000k33452l72376r4445J73676K06483J66547l0800k02722
11441E78257k31884k34185j16491O3933J49174P9151k7054j05831Q8222J45430
11431C88722j8272J639P9947o5141o234P5848l7425k96186j51740l4123Q8352
11420B5387K52611Q8306j54392k06216m0053P085j4535l1356l59653k29676O9314
11409e93178J52414J28722J43358L49010J34607N1006j01919j80334k456K66465
11399C47695L6590k26434j12949J11737K2428J2393j7595Q2727J03714j1088j07995
$$ plain form
11388 241223 90878 27442 -8373 -30046 230714 397588 433028 399223 355634 188753 75216
11377 75216 82232 22139 123561 375399 414571 428615 625204 834009 824377 795946 1230409
11366 1230409 1777088 2176175 2750121 3502318 4628467 6514599 8545841 8340585 6167612
11357 6167612 4407465 3394499 2638262 2085799 1702338 1453867 1203366 910483 795696
11348 795696 759747 753059 905440 893979 652037 490795 451267 563961 542332 560982 564903
11337 564903 354375 39007 -135915 -17730 72792 -39483 -121244 13097 91379 15963
11327 15963 -196168 -189417 9747 172813 140752 -214697 -451837 -385046 -198857 -13417
11317 -13417 178433 134588 -32860 -187926 -223388 -143985 -39164 -89963 -202528 -283843 -120291
$$ packed form
11388B41223j50345o3436l5815k1673K60760J66874L5440l3805m3589j66881j13537
11377G5216P016o0093J01422K51838L9172J4044J96589K08805r632k8431M34463
11366A230409N46679L99087N73946P52197J126149J886132K031242k05256k172973
11357F167612j760147j012966p56237n52463l83461k48471k50501k92883j14787
11348G95696l5949o688J52381j1461k41942j61242l9528J12694k1629J8650L921
11337E64903k10528l15368j74922J18185R0522j12275q1761J34341P8282p5416
11327A5963k12131O751J99164J63066l2061l55449k37140O6791J86189J85440
11317a3417J91850m3845j67448j55066l5462P9403J04821n0799j12565q1315J63552
$$ plain form
11306 -120291 -131610 -230535 -238196 -212345 66393 245874 207380 150639 111659 -86088 -204615
11295 -204615 -138910 -223171 -394969 -355649 -266369 -276881 -317263 -368907 -370465 -277423 -269468 -170197
11283 -170197 -135083 -193459 -107487 -264148 -479614 -389978 -310159 -364142 -302938 -141447 75155
11272 75155 151506 -34193 -136529 -318086 -463451 -438228 -418230 -449807 -378557 -216339 -99010
11261 -99010 -119392 -226547 -186297 -66987 -252491 -166080 227611 355693 249771 93312
11251 93312 120314 83920 31852 28849 9384 -16543 -133110 -57757 9851 -7653 88805 65765
11239 65765 -150672 -424682 -477996 -493954 -506766 -418152 -182848 28067 39284 136292 185252
11228 185252 -55823 -261110 -502928 -508846 -147646 162561 239452 254003 232310 208505 -71485
$$ packed form
11306a20291j1319r8925p661K5851K78738J79481l8494n6741l8980j97747j18527
11295b04615O5705q4261j71798L9320Q9280j0512m0382n1644j558R3042P955R9271
11283a70197L5114n8376Q5972j56661k15466Q9636P9819n3983O1204J61491K16602
11272G5155P6351j85699j02336j81557j45365K5223J9998l1577P1250J62218J17329
11261i9010k0382j07155M0250J19310j85504Q6411L93691J28082j05922j56459
11251I3312K7002l6394n2068l003j9465k5927j16567P5353O7608j7504R6458k3040
11239F5765k16437k74010n3314j5958j2812Q8614K35304K10915J1217R7008M8960
11228A85252k41075k05287k41818n918L61200L10207P6891J4551k1693k3805k79990
$$ plain form
11217 -71485 -301503 -401592 -435489 -394450 -318055 -225057 -48648 134956 136255 172929 242507
11206 242507 128233 93922 147598 128889 177124 198722 217038 258480 294921 257682 29695
11195 29695 -138850 -165900 -70745 -29085 4566 51235 -80704 -406685 -503079 -298226 -318013
11184 -318013 -487181 -486696 -351921 -167350 -207942 -210837 -181292 -163979 -20512 189963 154504
11173 154504 -161443 -249477 -202528 -175788 -206141 -287064 -195848 -101416 17871 339776 613800
11162 613800 808246 870761 853730 423475 152954 232240 263819 119399 -119345 -156700
11152 -156700 -50689 -148230 -159953 -326100 -575147 -640746 -612923 -528088 -505037 -363034 -247192
11141 -247192 -208484 -244026 -244401 -175211 -285754 -296560 8868 340381 383630 94944 -151998
$$ packed form
11217g1485k30018j00089l3897M1039P6395R2998J76409J83604J299L6674O9578
11206B42507j14274l4311N3676j8709M8235K1598J8316M1442L6441l7239k27987
11195B9695j68545k7050R5155M1660L3651M6669j31939l25981r6394K04853j9787
11184c18013j69168M85J34775J84571m0592k895K9545J7313J43467K10475l5459
11173A54504l15947q8034M6949K6740l0353q0923R1216R4432J19287L21905K74024
11162F13800J94446O2515j7031m30255k70521P9286L1579j44420k38744l7355
11152a56700J06011r7541j1723j66147k49047o5599K7823Q4835K3051J42003J15842
11141b47192L8708l5542l75O9190j10543j0806L05428L31513M3249k88686k46942
$$ plain form
11130 -151998 9054 99190 -18552 -17965 19485 -122344 -188657 -179518 -194809 89555 376456
11119 376456 482591 638056 622426 316707 -37510 -65903 185795 235425 163338 124963
11109 124963 217296 325688 403051 358804 154440 -255359 -584265 -563177 -250414 130962
11099 130962 378631 293639 74155 18366 42899 111656 844 -112491 -192604 17378
11089 17378 94394 -66691 -201877 -57554 -21133 -32066 37257 -90782 -232905 -60493
11079 -60493 95084 36062 113340 120754 -49604 -74937 4723 23597 -49009 -52519 51266
11068 51266 54077 -46308 -100399 -6766 -36514 -86779 50989 24934 -186568 -100327 86654
11057 86654 185890 17358 -335035 -577929 -625445 -366542 -132562 -82429 -82092 101590 361984
$$ packed form
11130a51998J61052R0136j17742N87L7450j41829o6313R139j5291K84364K86901
11119C76456J06135J55465j5630l05719l54217k8393K51698M9630p2087l8375
11109A24963R2333J08392P7363m4247k04364m09799l28906K1088L12763L81376
11099A30962K47669q4992k19484n5789K4533O8757j10812j13335q0113K09982
11089A7378P7016j61085j35186J44323L6421j0933O9323j28039j42123J72412
11079f0493J55577n9022P7278P414j70358k5333P9660J8874p2606l510J03785
11068E1266K811j00385n4091R3633k9748n0265J37768k6055k11502Q6241J86981
11057H6654R9236j68532l52393k42894m7516K58903K33980N0133L37J83682K60394
$$ plain form
11046 361984 335244 210554 24270 -23563 143891 84330 114119 181854 85453 -35571 -6670
11035 -6670 -14156 -173525 -302558 -231201 -173881 -298796 -433159 -518855 -662874 -802924 -793342
11024 -793342 -585748 -348303 -141605 -89542 155595 566208 627164 477452 225240 -11387
11014 -11387 -119819 -220363 -335647 -453075 -610725 -850552 -1001955 -894491 -627665 -475081
11004 -475081 -313480 -86952 29540 50397 106486 186482 79967 23081 -134988 -289124
10994 -289124 -97298 240988 239937 78176 -29521 130389 343779 470400 669655 590721
10984 590721 187693 -105599 -29838 66926 -119597 -92996 276076 326354 46783 -181744
10974 -181744 -155667 -73286 -40985 158795 421543 464469 249462 128366 156670 3043
$$ packed form
11046C61984k6740j24690j86284m7833J67454n9561K9789O7735r6401j21024K8901
11035f670p486j59369j29033P1357N7320j24915j34363q5696j44019j40050R582
11024g93342K07594K37445K06698N2063K45137M10613O0956j49712k52212k36627
11014a1387j08432j00544j15284j17428j57650k39827j51403J07464K66826J52584
11004d75081J61601K26528J16492K0857N6089P9996j06515n6886j58069j54136
10994b89124J91826L38286j051j61761j07697J59910K13390J26621J99255p8934
10984E90721m03028k93292P5761R6764j86523K6601L69072N0278k79571k28527
10974a81744K6077Q2381L2301J99780K62748M2926k15007j21096K8304j53627
$$ plain form
10964 3043 -208322 -338089 -378486 -125257 136842 98967 -166083 -297600 -418795 -533182
10954 -533182 -342647 -198458 -38861 160273 190846 223152 103490 169338 228911 95177
10944 95177 -81220 -134257 24280 161427 193100 218795 376405 478945 454140 633185
10934 633185 716500 747472 656553 589478 626163 565101 332315 297746 413694 350825 -101841
10923 -101841 -486256 -471890 -269042 -381250 -475888 -342065 -190309 -157727 -173693 -341387
10913 -341387 -475785 -482819 -463629 -563007 -396646 -203669 -234387 -355765 -602430 -641968 -496234
10902 -496234 -416817 -278022 -148629 -80207 -46913 -48675 -32242 23677 93120 73444 -160273
10891 -160273 -404523 -430241 -277133 -221026 -230701 -288059 -235055 -108295 -84951 -211511 -273917
$$ packed form
10964C043k11365j29767m0397K53229K62099l7875k65050j31517j21195j14387
10954e33182J90535J44189J59597J99134L0573L2306j19662O5848N9573j33734
10944I5177j76397n3037J58537J37147L1673K5695J57610J02540k4805J79045
10934F33185Q3315L0972r0919o7075L6685o1062k32786l4569J15948o2869m52666
10923a01841l84415J4366K02848j12208r4638J33823J51756L2582j5966j67694
10913c41387j34398p034J9190r9378J66361J92977l0718j21378k46665l9538J45734
10902d96234P9417J38795J29393O8422L3294j762J6433N5919O9443j9676k33717
10891a60273k44250k5718J53108N6107r675n7358N3004J26760K3344j26560o2406
$$ plain form
10880 -273917 -44280 1155 182890 379066 456126 202108 -68523 -189185 -319560 -377168
10870 -377168 -341049 -407793 -539865 -461884 -237333 -71696 -82686 -260259 -451382 -458159 -542123
10859 -542123 -616517 -513190 -555778 -645477 -717694 -411642 -73612 -63793 -47987 147092 112792
10848 112792 -153312 -505295 -647956 -590515 -433832 -302820 -133595 -232371 -346872 -242556
10838 -242556 -195870 -95134 168561 244438 273092 188311 51850 -40750 54026 146908 72884
10827 72884 12099 -92862 -73362 -165525 -255852 -168941 -53230 16167 4311 -140543 -397070
10816 -397070 -361050 -139966 -85965 -185676 -325378 -361809 -374820 -322299 -146856 -150397 -367884
10805 -367884 -355354 -277184 -258811 -239334 -357847 -281550 -163722 -143110 -12905 -51841 -169751
$$ packed form
10880b73917K29637M5435J81735J96176P7060k54018k70631j20662j30375n7608
10870c77168L6119o6744j32072P7981K24551J65637j0990j77573j91123o777q3964
10859e42123p4394J03327m2588q9699p2217L06052L38030R819J5806J95079l4300
10848A12792k66104l51983j42661N7441J56683J31012J69225r8776j14501J04316
10838b42556M6686J00736K63695P5877K8654q4781j36461r2600R4776R2882p4024
10827G2884o0785j04961J9500r2163r0327Q6911J15711O9397j1856j44854k56527
10816c97070L6020K21084N4001r9711j39702l6431j3011N2521J75443l541k17487
10805c67884J2530P8170J8373J9477j18513P6297J17828K0612J30205l8936j17910
$$ plain form
10794 -169751 -102298 38651 163852 167921 90902 -106975 -252822 -155304 13443 -21939 -145026
10783 -145026 -178918 -389049 -646880 -796969 -791367 -746300 -597050 -549591 -575169 -323833 -30905
10772 -30905 -25730 -85856 50119 -92804 -394801 -644158 -846684 -737424 -498199 -468710
10762 -468710 -403154 -367886 -333903 -284582 -75420 107977 4800 -203990 -222871 -48150
10752 -48150 158049 299845 207014 -33866 -111723 -57068 -182051 -45264 28219 -146428
10742 -146428 -185325 -99470 -150132 -193975 -164101 -201384 -343581 -394748 -334448 -139191 9307
10731 9307 -16869 19022 30084 62374 147995 24742 -158994 -161460 -172369 -75041 90038
10720 90038 137586 161881 309805 296393 222968 283511 269081 130810 97270 140305 121156
$$ packed form
10794a69751O7453J40949J25201M069p7019j97877j45847R7518J68747l5382j23087
10783a45026l3892k10131k57831j50089N602M5067J49250M7459k5578K51336K92928
10772c0905N175o0126J35975j42923l01997k49357k02526J09260K39225K9489
10762d68710O5556L5268L3983M9321K09162J83397j03177k08790j8881J74721
10752d8150K06199J41796r2831k40880p7857N4655j24983J36787P3483j74647
10742a46428l8897Q5855n0662m3843K9874l7283j42197n1167O0300J95257J48498
10731I307k6176L5891J1062L2290Q5621j23253j83736k466j0909R7328J65079
10720I0038M7548K4295J47924j3412p3425O0543j4430j38271l3540M3035j9149
$$ plain form
10709 121156 40491 -238366 -405773 -244200 -86698 -186358 -377347 -245264 46670 -12076
10699 -12076 -147976 -108495 54872 44573 -85567 -255910 -358373 -327734 -473484 -587056
10689 -587056 -486461 -476400 -526359 -529145 -418536 -220850 -239637 -366603 -283477 -490190 -776440
10678 -776440 -787533 -704645 -435488 -396226 -293817 16695 237725 311191 139654 121247
10668 121247 331851 434022 496232 588242 524779 357899 251774 109325 -14684 -102427
10658 -102427 -145476 -232771 -249149 -227071 -276512 -160796 11722 36066 -28315 -84942 -178950
10647 -178950 -322139 -474902 -535080 -517820 -505348 -620816 -790774 -805146 -582812 -473983
10637 -473983 -495964 -442317 -481702 -539071 -427891 -483343 -688147 -667703 -376883 -112939 94257
$$ packed form
10709A21156q0665k78857j67407J61573J57502r9660j90989J32083K91934n8746
10699a2076j35900L9481J63367j0299j30140j70343j02463L0639j45750j13572
10689e87056J00595J0061m9959k786J10609J97686j8787j26966Q3126k06713k86250
10678g76440j1093Q2888K69157L9262J02409L10512K21030P3466j71537j8407
10668A21247K10604J02171O2210R2010o3463j66880j06125j42449j24009q7743
10658a02427m3049q7295j6378K2078m9441J15716J72518K4344o4381n6627r4008
10647a78950j43189j52763o0178J7260J2472j15468j69958j4372K22334J08829
10637d73983k1981N3647l9385n7369J11180n5452k04804K0444K90820K63944K07196
$$ plain form
10626 94257 115454 34025 -49204 -210627 -149515 -193023 -312829 -256037 -241182 -169039 -121672
10615 -121672 -291348 -247755 18951 202199 203239 350616 380828 190803 189438 288403 267063
10604 267063 127765 129332 197716 274761 205513 55222 7772 48721 -51273 -149912 -220309
10593 -220309 -237199 -158944 -154852 -265487 -149530 -72147 -118907 -24284 -25579 -120267 -131375
10582 -131375 -75970 -93957 -36994 -99022 -459772 -663133 -677567 -512189 -324025 -238198 -255406
10571 -255406 -193188 -66331 -92789 -32867 60752 74812 34410 155737 104176 -29237 -64358
10560 -64358 -69286 -160136 -292645 -214146 -182772 -129204 -217029 -120971 77149 -13147 -192409
10549 -192409 -231618 -28242 98293 82790 -20325 -69154 -174597 -240876 -146466 -9295
$$ packed form
10626I4257K1197q1429q3229j61423O1112m3508j19806N6792J4855P2143M7367
10615a21672j69676M3593K66706J83248J040J47377L0212j90025j365R8965k1340
10604B67063j39298J567O8384P7045o9248j50291m7450M0949r9994r8639p0397
10593b20309j6890P8255M092j10635J15957P7383m6760R4623j295r4688j1108
10582a31375N5405j7987N6963o2028l60750k03361j4434J65378J88164Q5827j7208
10571b55406O2218J26857k6458N9922R3619J4060m0402J21327n1561j33413l5121
10560f4358m928r0850j32509P8499L1374N3568q7825R6058J98120r0296j79262
10549a92409l9209K03376J26535j5503j03115m8829j05443o6279R4410J37171
$$ plain form
10539 -9295 -20425 -95563 -75670 51229 139241 248204 332185 161034 -61488 -130887 -322728
10528 -322728 -365983 -285904 -322753 -316376 -378089 -288886 -121781 -73607 -61164 9113 -140385
10517 -140385 -337441 -392469 -443198 -409886 -453400 -568534 -619758 -543917 -414607 -403797 -233507
10506 -233507 -35718 -12992 -183378 -435600 -362952 -68226 -119994 -230668 -152915 -134797
10496 -134797 -102850 151164 340867 160657 7417 -132360 -263993 -374947 -418060 -468104
10486 -468104 -420162 -311094 -155006 -149886 -344503 -454058 -361741 -217194 -44233 73550
10476 73550 273755 202751 72300 -53754 -136838 -116510 -242074 -245589 -128087 -69620 60027
10465 60027 14583 -83944 55400 184256 210261 36473 -3716 129630 158432 144579 84322
$$ packed form
10539i295j1130p5138J9893J26899Q8012J08963Q3981j71151k22522o9399j91841
10528c22728m3255Q0079l6849O377o1713Q9203J67105M8174J2443P0277j49498
10517a40385j97056n5028n0729L3312m3514j15134n1224P5841J29310J0810J70290
10506b33507J97789K2726j70386k52222P2648K94726n1768j10674P7753J8118
10496a34797L1947K54014J89703j80210j53240j39777j31633j10954m3113n0044
10486d68104M7942J09068J56088N120j94617j09555R2317J44547J72961J17783
10476G3550K00205p1004j30451j26054q3084K0328j25564l515J17502N8467J29647
10465F0027m5444r8527J39344J28856K6005j73788m0189J33346K8802j3853o0257
$$ plain form
10454 84322 136044 233687 310843 234830 12952 -264407 -339929 -235497 -184414 -283998 -154922
10443 -154922 145171 134766 49108 12808 -63295 -69434 142401 154095 131200 40302 45291
10432 45291 159001 97811 65441 34673 -41435 -80823 -99934 -120101 -1557 157707 251872
10421 251872 268562 201013 209987 323717 372434 424126 584663 512851 134561 -62382 -43051
10410 -43051 -114042 -136203 -158903 -225067 -297323 -398379 -359477 -329581 -202647 38812 -15112
10399 -15112 -150571 -176248 -207346 -48268 90677 14344 -126720 -200949 -309121 -432330
10389 -432330 -481129 -456197 -427004 -217951 -24549 -7538 214966 214496 -151334 -148718 206754
10378 206754 360025 290879 -5934 -249002 -286792 -454594 -538811 -541852 -596069 -639594 -625800
$$ packed form
10454H4322N1722R7643P7156p6013k21878k77359p5522J04432N1083r9584J29076
10443a54922L00093j0405q5658l6300p6103o139K11835J1694k2895r0898M989
10432D5291J13710o1190l2370l0768p6108l9388j9111k0167J18544J59264R4165
10421B51872J6690o7549Q974J13730M8717N1692J60537p1812l78290j96943J9331
10410d3051p0991k2161k2700o6164p2256j01056L8902K9896J26934K41459n3924
10399a5112j35459k5677l1098J59078J38945p6333j41064p4229j08172j23209
10389d32330m8799K4932K9193K09053J93402J7011K22504m70l65830K616L55472
10378B06754J53271o9146k96813k43068l7790j67802q4217l041n4217m3525J3794
$$ plain form
10367 -625800 -440940 -322589 -415341 -463245 -434258 -405552 -387996 -410539 -159887 -153600 -409601
10356 -409601 -466430 -407031 -442428 -634919 -658739 -395230 -118944 -93028 -54748 21223 -251594
10345 -251594 -483927 -421123 -288774 -250602 -87588 78512 99487 -55792 -244057 -241164
10335 -241164 -281020 -436142 -301609 -208548 -106591 5901 257255 441609 366463 91951
10325 91951 -23970 -228439 -331200 -176733 -252277 -300278 -95205 -62991 -49401 -6727 -1205
10314 -1205 -130051 -276308 -352253 -384359 -204906 115632 155994 7494 -269077 -408288
10304 -408288 -304378 -64404 -121445 -223802 -80493 74630 185553 274425 254085 220275
10294 220275 128195 42801 99236 167658 141295 -7028 -351597 -679571 -602094 -398225 -198201
$$ packed form
10367f25800J84860J18351r2752m7904K8987K8706J7556k2543K50652O287k56001
10356d09601n6829N9399l5397j92491k3820K63509K76286K5916L8280P5971k72817
10345b51594k32333O2804J32349L8172J63014J66100K0975j55279j88265K893
10335b41164l9856j55122J34533R3061J01957J12492K51354J84354p5146k74512
10325I1951j15921k04469j02761J54467p5544m8001K05073L2214J3590M2674N522
10314a205j28846j46257p5945l2106J79453L20538M0362j48500k76571j39211
10304d08288J03910K39974n7041j02357J43309J55123J10923Q8872k0340l3810
10294B20275r2080q5394N6435O8422k6363j48323l44569l27974P7477K03869K00024
$$ plain form
10283 -198201 -146857 -257391 -555554 -582436 -388950 -130540 153532 365000 330086 223383
10273 223383 47463 80261 9547 -251475 -312225 -158776 -55241 -26417 45639 18159 64603
10262 64603 322687 443182 446728 380563 234710 176809 227690 138487 84004 16964 -45306
10251 -45306 174050 420905 548423 683974 691765 650919 500300 350197 302494 194071
10241 194071 118527 -74075 -135141 -133971 -67697 -207289 -204215 -264071 -544999 -483441 -332925
10230 -332925 -259103 -199392 -98168 -131384 -226829 -261734 -385803 -511716 -552669 -509658 -345748
10219 -345748 25693 358727 417126 247716 42790 -94181 -139160 -101112 -180816 -393999
10209 -393999 -503019 -444370 -300976 -110506 -309057 -567875 -505120 -152765 -41337 -45387
$$ packed form
10283a98201N1344j10534k98163k6882J93486K58410K84072K11468l4914j06703
10273B23383j75920L2798p0714k61022o0750J53449J03535K8824P2056k7480M6444
10262F4603K58084J20495L546o6165j45853n7901N0881q9203n4483o7040o2270
10251d5306K19356K46855J27518J35551P791m0846j50619j50103m7703j08423
10241A94071p5544j92602o1066J170O6274j39592L074n9856k80928O1558J50516
10230c32925P3822N9711J01224l3216r5445l4905j24069j25913m0953M3011J63910
10219c45748L71441L33034N8399j69410k04926j36971m4979L8048p9704k13183
10209c93999j09020N8649J43394J90470j98551k58818O2755L52355J11428m050
$$ plain form
10199 -45387 -124925 -182610 -152934 -128470 -201810 -239303 -151520 -156086 -325624 -283406 -231195 -148833
10187 -148833 -108745 -247090 -425139 -449579 -368445 -345537 -225668 -239681 -640529 -936215
10177 -936215 -995952 -648695 -536534 -627239 -600819 -553490 -371934 -254933 -325000 -501579
10167 -501579 -642088 -663595 -441779 -243405 -144986 -120394 -70448 -87852 -262872 -343377 -316242
10156 -316242 -283024 -143451 -12620 155483 240450 67513 -46442 -33820 -134865 -95184
10146 -95184 -94813 -210346 -88653 113815 203864 276367 387287 371292 238052 358546 627527
10135 627527 753976 685718 690284 500053 134078 -12041 287892 542708 514284 551174
10125 551174 509739 316151 122566 241390 399023 697314 1053248 1116240 1158449 1113166
$$ packed form
10199d5387p9538n7685K9676K4464p3340l7493Q7783m566j69538M2218N2211Q2362
10187a48833M0088j38345j78049k4440Q1134K2908J19869j4013m00848k95686
10177i36215n9737L47257J12161r0705K6420M7329J81556J17001p0067j76579
10167e01579j40509k1507K21816J98374R8419K4592M9946j7404j75020q0505K7135
10156c16242L3218J39573J30831J68103Q4967j72937j13955J2622j01045L9681
10146i5184L71j15533J21693K02468R0049P2503J10920j5995j33240J20494K68981
10135F27527J26449o8258M566j90231l65975j46119K99933K54816k8424L6890
10125E51174m1435j93588j93585J18824J57633K98291L55934O2992M2209m5283
$$ plain form
10115 1113166 1234285 1596996 2142540 2977758 4122089 5453826 7125734 9455762 12732846
10106 12732846 16489486 18450484 16722586 13090621 9883165 7592509 5927745 4646424
10098 4646424 3810131 3228457 2812282 2456599 2196188 1992904 1780257 1456245 1159209
10089 1159209 1045227 1032532 1163168 1178995 1059717 942865 614635 450725 370471 301149
10079 301149 219702 355890 665170 819446 711316 410304 119432 51370 120792 45108
10069 45108 -9009 2598 -322823 -308565 100045 274802 224368 5268 -164988 -349245
10059 -349245 -292673 -115905 20892 34737 68718 311290 408055 348360 132276 -166282
10049 -166282 -177541 -109286 -136800 -219886 -263005 -290437 -283848 -312379 -402538 -324311 -99638
$$ packed form
10115A113166J21119L62711N45544Q35218J144331J331737J671908K330028L277084
10106A2732846L756640J960998j727898l631965l207456k290656j664764j281321
10098D646424q36293n81674m16175l55683k60411k03284k12647l24012k97036
10089A159209j13982j2695J30636J5827j19278j16852l28230j63910q0254o9322
10079C01149q1447J36188L09280J54276j08130l01012k90872o8062O9422p5684
10069D5108n4117J1607l25421J4258M08610J74757n0434k19100j70256j84257
10059c49245N6572J76768J36797J3845L3981K42572R6765n9695k16084k98558
10049a66282j1259O8255k7514q3086m3119k7432O589k8531r0159P8227K24673
$$ plain form
10038 -99638 -81671 -33993 186752 493933 636989 556425 459130 320449 260614 101112 -145674
10027 -145674 -247003 -419642 -395502 -256329 -168752 56711 190003 76382 -67424 -122135
10017 -122135 4237 105529 258851 326875 290128 227368 151656 40025 -268511 -403393
10007 -403393 -385077 -186191 237028 521165 378182 99798 -112218 59988 261483 172697
9997 172697 102230 147894 173466 179910 238421 204743 191300 365089 413930 447426 552284
9986 552284 819566 941277 853206 769636 662265 425668 328502 469508 661235 602082
9976 602082 536714 538510 546243 805702 1088413 1288097 1293232 1255535 1302635 1340404 1334961 1545635
9964 1545635 2085422 2767436 3116499 3490225 4171605 5059316 6319650 8393496 10946907
$$ packed form
10038i9638J7967M7678K20745L07181J43056q0564r7295j38681n9835j59502k46786
10027a45674j01329j72639K4140J39173Q7577K25463J33292j13621j43806n4711
10017a22135J26372J01292J53322O8024l6747o2760p5712j11631l08536j34882
10007d03393J8316J98886M23219K84137j42983k78384k12016J72206K01495q8786
9997A72697p0467M5664K5572O444N8511l3678j3443J73789M8841L3496J04858
9986E52284K67282J21711q8071q3570j07371k36597r7166J41006J91727n9153
9976F02082o5368J796P733K59459K82711J99684N135l7697M7100L7769n443K10674
9964A545635N39787O82014L49063L73726O81380Q87711J260334K073846K553411
$$ plain form
9955 10946907 12809348 12600453 10644211 8280486 6324293 4997581 4053231 3392136 2870778
9946 2870778 2466900 2107379 1797212 1497494 1308885 1105698 880098 657932 458544 312653
9936 312653 218145 -55364 -85541 141644 209197 111366 71942 61011 28198 59558 85050
9925 85050 24121 129555 205243 136253 72709 223080 243093 373140 489452 401757 491516
9914 491516 647924 706242 582355 415436 386282 535215 568645 342103 94505 109384
9904 109384 239890 203457 118247 623190 1084925 1209427 1001955 463096 -36346 -219943
9894 -219943 -266795 -109960 -54321 -151513 -234043 -243351 -337094 -409219 -247982 -67907 -115724
9883 -115724 31455 310488 363066 377283 158065 -190769 -242190 -128819 -121737 -184806 -109222
$$ packed form
9955A0946907J862441k08895j956242k363725j956193j326712r44350o61095n21358
9946B870778m03878l59521l10167k99718j88609k03187k25600k22166j99388j45891
9936C12653r4508k73509l0177K27185O7553r7831l9424j0931l2813L1360K5492
9925H5050o0929J05434P5688o8990o3544J50371K0013J30047J16312q7695Q9759
9914D91516J56408N8318j23887j66919k9154J48933L3430k26542k47598J4879
9904A09384J30506l6433q5210N04943M61735J24502k07472n38859m99442j83597
9894b19943m6852J56835N5639r7192q2530r308r3743p2125J61237J80075m7817
9883a15724J47179K79033N2578J4217k19218l48834n1421J13371P082o3069P5584
$$ plain form
9872 -109222 155750 319596 362837 207013 -104764 -285075 -496034 -589427 -497933 -400473
9862 -400473 -250440 -157849 -146204 123442 210604 -11702 -220976 -300206 -300523 -241455 -70179
9851 -70179 -60327 -21340 119143 178386 248319 205254 228626 333110 513031 467523 304532
9840 304532 240527 -45165 -554974 -735180 -733664 -728488 -502824 -128875 11026 40270 -12055
9829 -12055 -159176 -97705 -24815 162763 592868 882183 889323 646585 442499 492303 582621
9818 582621 386572 173129 121907 205909 346468 378060 217870 7846 -165182 -265789
$$ packed form
9872a09222K64972J63846M3241j55824l11777j80311k10959r3393R1494R7460
9862d00473J50033R2591J1645K69646Q7162k22306k09274p9230l17N9068J71276
9851g0179R852L8987J40483N9243O9933m3065K3372J04484J79921m5508j62991
9840C04532o4005k85692n09809j80206J516N176K25664L73949J39901K9244n2325
9829a2055j47121O1471P2890J87578M30105K89315P140k42738k04086M9804R0318
9818E82621j96049k13443n1222Q4002J40559L1592j60190k10024j73028j00607
$$ [...]
##END NTUPLES=NMR SPECTRUM
##END=
