##TITLE=C13_SL89-Dau-Alpha(f4)
 CDCl3, 19700 sc

 29.6.2021
##JCAMPDX= 6.0         $$ Bruker NMR JCAMP-DX V2.0
##DATA TYPE= NMR SPECTRUM
##DATA CLASS= NTUPLES
##ORIGIN= UXNMR, Bruker Analytische Messtechnik GmbH
##OWNER= root
$$ XWIN-NMR		Version 3.5
$$ Wed Jun 30 08:30:33 2021 Russian Standard Time (UT+4h)  she@DPX200
##.OBSERVE FREQUENCY= 50.327896
##.OBSERVE NUCLEUS= ^13C
##.ACQUISITION MODE= SIMULTANEOUS
##.ACQUISITION SCHEME= undefined
##.AVERAGES= 19701
##.DIGITISER RES= 17
##SPECTROMETER/DATA SYSTEM= spect
##.PULSE SEQUENCE= zgpg30
##.SOLVENT NAME= DMSO
##.SHIFT REFERENCE= (INTERNAL, DMSO, 0, 222.653)
##AUDIT TRAIL= $$ (NUMBER, WHEN, WHO, WHERE, WHAT)
$$ ##TITLE= Audit trail, XWIN-NMR		Version 3.5
$$ ##JCAMPDX= 5.01
$$ ##ORIGIN= Bruker BioSpin GmbH
$$ ##OWNER= she
$$ F:/spectra/data/she/nmr/c13/1/pdata/1/auditp.txt
$$ ##AUDIT TRAIL=  $$ (NUMBER, WHEN, WHO, WHERE, WHAT)
(   1,<2021-06-30 08:28:04.59 +0400>,<she>,<DPX200>,
      <created by zg, POWCHK disabled, PULCHK disabled
       terminated by command 'halt'
       configuration hash MD5:
       00 E9 B6 7A A2 85 ED C7 34 08 36 98 17 FE 4E 26
       data hash MD5: 32K
       56 EA C8 74 36 07 B1 D5 A3 CD C5 EF 30 70 FF C5>)
(   2,<2021-06-30 08:28:07.51 +0400>,<she>,<DPX200>,
      <Start of raw data processing
       efp BC_mod = 2 LB = 1 FT_mod = 6 PKNL = 1 PHC0 = -333.4474 PHC1 = 30.36243 SI = 32K 
       data hash MD5: 32K
       E8 D4 2B AF 1C 3B FE 4E 43 EF 3D 9B AD 73 D2 75>)
(   3,<2021-06-30 08:28:12.03 +0400>,<she>,<DPX200>,
      <abs ABSG = 5 
       data hash MD5: 32K
       4C 19 2D 12 00 EA 3E 7C 32 A0 96 A6 66 D5 85 7A>)
(   4,<2021-06-30 08:29:11.21 +0400>,<she>,<DPX200>,
      <pk PHC0 = -2.02808 PHC1 = 4 
       data hash MD5: 32K
       84 48 DE 55 73 D7 E9 47 5E 2F 39 F4 60 7A 10 BE>)
(   5,<2021-06-30 08:29:15.35 +0400>,<she>,<DPX200>,
      <abs ABSG = 5 
       data hash MD5: 32K
       D3 F8 42 3A EE 37 58 F3 B3 03 25 3C 38 AC 5C 65>)
$$ ##END=
$$ 
$$ hash MD5
$$ B9 A0 94 F6 EB AA BC 5C 60 4D EC 59 01 1C A6 BB
##$RELAX= 
##$RELAX= 
##$RELAX= 
##$RELAX= 
##$RELAX= 
##$RELAX= 
##$RELAX= 
##$RELAX= 
$$ Bruker specific parameters
$$ --------------------------
##$DU= <F:/spectra>
##$EXPNO= 1
##$NAME= <c13>
##$PROCNO= 1
##$TYPE= <nmr>
##$USER= <she>
##$AMP= (0..31)
100 100 100 100 100 100 100 100 100 100 100 100 100 100 100 100 100 100 
100 100 100 100 100 100 100 100 100 100 100 100 100 100 
##$AQSEQ= 0
##$AQ_mod= 1
##$AUNM= <au_zg>
##$AUTOPOS= <>
##$BF1= 50.322709
##$BF2= 200.13
##$BF3= 50.322709
##$BF4= 500.13
##$BF5= 500.13
##$BF6= 500.13
##$BF7= 500.13
##$BF8= 500.13
##$BYTORDA= 1
##$CFDGTYP= 0
##$CFRGTYP= 5
##$CHEMSTR= <none>
##$CNST= (0..31)
1 1 145 1 1 1 1 1 1 1 1 1 1 1 1 1 1 1 1 1 1 1 1 1 1 1 1 1 1 1 1 1 
##$CPDPRG= <waltz16>
##$CPDPRG1= <>
##$CPDPRG2= <waltz16>
##$CPDPRG3= <>
##$CPDPRG4= <mlev>
##$CPDPRG5= <mlev>
##$CPDPRG6= <mlev>
##$CPDPRG7= <mlev>
##$CPDPRG8= <mlev>
##$CPDPRGB= <>
##$CPDPRGT= <>
##$D= (0..31)
$$ [...]
##$SUBNAM4= <"">
##$SUBNAM5= <"">
##$SUBNAM6= <"">
##$SUBNAM7= <"">
##$SUBNAM8= <"">
##$SUBNAM9= <"">
##$SW= 239.972175391363
##$SWIBOX= (0..15)
0 1 3 0 0 0 0 0 0 0 0 0 0 0 0 0 
##$SW_h= 12077.2946859903
##$TD= 32768
##$TD0= 1
##$TE= 0
##$TE2= 300
##$TE3= 300
##$TEG= 300
##$TL= (0..7)
120 120 120 120 120 120 120 120 
##$TP= (0..7)
150 150 150 150 150 150 150 150 
##$TP07= 0
##$TPNAME0= <>
##$TPNAME1= <>
##$TPNAME2= <>
##$TPNAME3= <>
##$TPNAME4= <>
##$TPNAME5= <>
##$TPNAME6= <>
##$TPNAME7= <>
##$TPOAL= (0..7)
0.5 0.5 0.5 0.5 0.5 0.5 0.5 0.5 
##$TPOFFS= (0..7)
0 0 0 0 0 0 0 0 
##$TUNHIN= 0
##$TUNHOUT= 0
##$TUNXOUT= 0
##$USERA1= <user>
##$USERA2= <user>
##$USERA3= <user>
##$USERA4= <user>
##$USERA5= <user>
##$V9= 5
##$VALIST= <valist>
##$VCLIST= <CCCCCCCCCCCCCCC>
##$VD= 0
##$VDLIST= <DDDDDDDDDDDDDDD>
##$VPLIST= <PPPPPPPPPPPPPPP>
##$VTLIST= <TTTTTTTTTTTTTTT>
##$WBST= 1024
##$WBSW= 4
##$XGAIN= (0..3)
0 0 0 0 
##$XL= 0
##$YL= 0
##$YMAX_a= 105568337
##$YMIN_a= -24849681
##$ZGOPTNS= <>
##$ZL1= 120
##$ZL2= 120
##$ZL3= 120
##$ZL4= 120
##$ABSF1= 222.6533
##$ABSF2= -17.34351
##$ABSG= 5
##$ABSL= 3
##$ALPHA= 0
##$AQORDER= 0
##$ASSFAC= 0
##$ASSFACI= 0
##$ASSFACX= 0
##$ASSWID= 0
##$AUNMP= <proc_1d>
##$AZFE= 0.1
##$AZFW= 0.5
##$BCFW= 0
##$BC_mod= 2
##$BYTORDP= 0
##$COROFFS= 0
##$CY= -3
##$DATMOD= 1
##$DC= 0
##$DFILT= <>
##$DTYPP= 0
##$F1P= 0
##$F2P= 0
##$FCOR= 0.5
##$FTSIZE= 32768
##$FT_mod= 6
##$GAMMA= 0
##$GB= 0
##$INTBC= 1
##$INTSCL= 4.134877e-10
##$ISEN= 128
##$LB= 1
##$LEV0= 0
##$LPBIN= 0
##$MAXI= 10000
##$MC2= 0
##$MEAN= 0
##$ME_mod= 0
##$MI= 0.1934396
##$NCOEF= 0
##$NC_proc= 2
##$NLEV= 6
##$NOISF1= 120.0001
##$NOISF2= 80.00006
##$NSP= 0
##$NTH_PI= 0
##$NZP= 0
##$OFFSET= 222.6533
##$PC= 1.4
##$PHC0= -335.4755
##$PHC1= 34.36243
##$PH_mod= 1
##$PKNL= yes
##$PPARMOD= 0
##$PSCAL= 0
##$PSIGN= 0
##$REVERSE= no
##$SF= 50.3227301278049
##$SI= 32768
##$SIGF1= 140
##$SIGF2= 120
##$SINO= 11.81781
##$SIOLD= 32768
##$SREGLST= <13C.CDCl3>
##$SSB= 0
##$STSI= 32768
##$STSR= 0
##$SW_p= 12077.2946859903
##$SYMM= 0
##$S_DEV= 0
##$TDeff= 32768
##$TDoff= 0
##$TI= <>
##$TILT= no
##$TM1= 0
##$TM2= 0
##$TOPLEV= 0
##$USERP1= <user>
##$USERP2= <user>
##$USERP3= <user>
##$USERP4= <user>
##$USERP5= <user>
##$WDW= 1
##$XDIM= 32768
##$YMAX_p= 486990264
##$YMIN_p= -7590208
$$ End of Bruker specific parameters
$$ ---------------------------------
##NTUPLES= NMR SPECTRUM
##VAR_NAME=  FREQUENCY,     SPECTRUM/REAL,   SPECTRUM/IMAG
##SYMBOL=    X,             R,               I
##VAR_TYPE=  INDEPENDENT,   DEPENDENT,       DEPENDENT
##VAR_FORM=  AFFN,          ASDF,            ASDF
##VAR_DIM=   32768,         32768,           32768
##UNITS=     HZ,            ARBITRARY UNITS, ARBITRARY UNITS
##FACTOR=    0.368581032318806, 1,           1
##FIRST=     11204.5221822817, 0,            0
##LAST=      -872.772503708586, 0,           0
##MIN=       -872.772503708586, -7590208,    0
##MAX=       11204.5221822817, 486990264,    0
$$ Real data points
##PAGE= N=1
##DATA TABLE= (X++(R..R)), XYDATA
$$ [...]
15836d92407n8956K50981J06524l23662k75010J31212K12020r0723j18978J28758
15826e30241K38167K43594K10847k44934l59614j7511K42847K71133L59500k4262
15816C89526p7755K72603K32263k8925l45650k94760l47321m27784j1909O68190
15806B8478J10725l82675j16000l06577j9822k956L48737K81267o5102K8401J90327
15795I4803K7762p081n5816K01570M69884J92103Q3593p1063L12914K69150m22303
15784A095516q31664m72090J52338J18993M06155N8629J2353K39451j7609J8641
15774G80713j55505m43646j05696J34823j7032l82925j17290K5689P2763N58317
15764C50211N74427J82510l23478j72773l29028k86729q6148o4002m12264l72577
$$ plain form
15836 -492407 -551363 -300382 -193858 -517520 -792530 -661318 -449298 -540021 -658999 -530241
15826 -530241 -292074 -48480 162367 -82567 -442181 -459692 -216845 54288 413788 389526
15816 389526 311771 584374 816637 787712 442062 147302 -200019 -627803 -639712 28478
15806 28478 139203 -243472 -359472 -666049 -685871 -688827 -340090 -58823 -123925 -95524 94803
15795 94803 122565 115484 59668 261238 731122 923225 1006818 935755 1248669 1517819 1095516
15784 1095516 263852 -208238 -55900 63093 469248 527877 540230 779681 762072 780713
15774 780713 625208 181562 75866 210689 193657 -189268 -306558 -280869 -208106 350211
15764 350211 924638 1107148 783670 610897 281869 -4860 -91008 -155010 -567274 -939851
15754i39851L69966L46975R7468K12557j37071J50712K28020k57347o9455m7360
15744d5386l98993l8913j64395j87467r4655m054L34267N90002K20718K12736
15734D23860J91951j87301m64331j0281M24295L53897J71622k9250n7923J0675
15724H27214M19570l38743p40978o27360l84660M3156N49756N68435m1960k20816
15714E3614j19128k45793k00378j4678k40767l08554k86860O6349J92873K55106
15704h48216L95025L62677R8765j43567J29389K23587j66699l90649k61015q9226
15694f89929o5933L25316M95739J82707k90653o06361n44141k4854L70988N5613
15684g91508M3184L94950M38777Q8024J90857L66597j30062o73225m72222k05990
$$ plain form
15754 -939851 -569885 -222910 -125442 87115 -49956 100756 328776 71429 1974 -45386
15744 -45386 -444379 -483292 -647687 -835154 -929809 -933863 -599596 -9594 211124 423860
15734 423860 615811 428510 -35821 -46102 378193 732090 903712 874462 816539 827214
15724 827214 1246784 908041 167063 -460297 -844957 -801801 -252045 316390 274430 53614
15714 53614 -65514 -311307 -511685 -526363 -767130 -1075684 -1362544 -1296195 -1103322 -848216
15704 -848216 -453191 -90514 8251 -135316 -5927 217660 50961 -339688 -600703 -689929
15694 -689929 -755862 -430546 65193 247900 -42753 -649114 -1193255 -1218109 -847121 -791508
15684 -791508 -748324 -353374 85403 173427 364284 730881 600819 -72406 -544628 -750618
15674g50618k18885k20602J28473N82043M11640K6884j77653j81419M61449L32504
15664C93816j30414m37612q69868k96773L37721N79719Q71168J95046j12242p4352
15654D56209n59291p75106k31203Q6439M09423L61583j52660n64562l37917J07637
15644a199448K42898J3095l3313L51157K00306l07496k03677K84906L77262M50548
15634A76238K53921k69709j16304M1817k32604l9863J14986J139O9686L06115
15624C05422K84367K6023l3952J49313p2131l45522j4172k69335k67528j94734
15614d32249m668K20937K88049L7471n06097l6561K47767M5031k20488k39735
15604f00543l7254R2053l48623k20188L6394J90308M3190m0375N25995P89591
$$ plain form
15674 -750618 -969503 -1190105 -1061632 -479589 -67949 -41065 -218718 -400137 61312 393816
15664 393816 263402 -174210 -1044078 -1340851 -1003130 -423411 447757 642803 530561 456209
15654 456209 -103082 -878188 -1109391 -1022952 -613529 -251946 -404606 -969168 -1307085 -1199448
15644 -1199448 -956550 -943455 -976768 -625611 -425305 -732801 -936478 -651572 -274310 176238
15634 176238 430159 160450 44146 85963 -146641 -186504 -71518 -70379 -693 305422
15624 305422 589789 615812 581860 731173 659042 313520 299348 30013 -237515 -432249
15614 -432249 -436917 -215980 72069 109540 -396557 -433118 -185351 -140320 -360808 -600543
15604 -600543 -637797 -545744 -894367 -1114555 -1078161 -887853 -844663 -885038 -359043 430548
15594D30548M03889J01611o0954n25714n55243j58974K31491Q5583r9115j36191
15584b83069j84740N6143L61235K33789L00454L05086k40100m28148o04670m62604
15574i46624k5586M20415O01612j80220l81111k22751J42463l7112l23083k22578
15564a174575L98956M01391L6207n084K0042R6256O07044L81222m12343n59631
15554b10515k6714M09072l6151o54432m95430L97309N54386J91283J35435J6825
15544B81068j84525j45535l05210j35707N050R4495O1769m41677l67149N8286
15534a079135J75316N40321K25383R9295J98176J61391j96300l99469l35763k26981
15524h37766j8991j60366O6116J10152O2188j53022l14160J19267L67403O4447
$$ plain form
15594 430548 834437 936048 875094 349380 -205863 -364837 -133346 -47763 -146878 -283069
15584 -283069 -467809 -411666 -50431 183358 483812 788898 548798 120650 -484020 -946624
15574 -946624 -972210 -551795 49817 -130403 -511514 -734265 -591802 -628914 -951997 -1174575
15564 -1174575 -775619 -374228 -338021 -343105 -323063 -226807 380237 761459 349116 -210515
15554 -210515 -237229 171843 135692 -518740 -1014170 -616861 -62475 128808 264243 281068
15544 281068 96543 -48992 -354202 -489909 -484859 -390364 -328595 -770272 -1137421 -1079135
15534 -1079135 -903819 -363498 -138115 -38820 159356 320747 124447 -275022 -610785 -837766
15524 -837766 -856757 -1017123 -951007 -840855 -778667 -931689 -1245849 -1126582 -759179 -694732
15514f94732J2225Q2530k91422k86575L99372M03261l6028k43439P5048K74366
15504c05394j30706K75143K29033k3842L7952J57785j64404n16060n07632J767
15494i46358m7501J07112L12372j41832k12851N1825R4668n0906P0199L86343
15484c76929L83144r4165j8395l1741k52549m3029j18333m79137l58605k11835
15474a601574l46313K20605P43607N16997J80621j24927k37802n8720j24628K76570
15464e55564Q01128O06720k41765l52671Q2377k7686m9934m4018j15241K23671
15454C27017O41100L90225p6333O0927m5942m92617p11027l23694L6239J79454
15444a4651K83861P7528J32849K15447P397j05826K3962k45790m36947j77480
$$ plain form
15514 -694732 -682507 -599977 -891399 -1177974 -778602 -375341 -411369 -654808 -579760 -305394
15504 -305394 -436100 -160957 68076 44234 82186 239971 75567 -440493 -948125 -946358
15494 -946358 -993859 -886747 -574375 -716207 -929058 -877233 -782565 -833471 -763272 -376929
15484 -376929 6215 -87950 -106345 -138086 -390635 -433664 -551997 -1031134 -1389739 -1601574
15474 -1601574 -1947887 -1727282 -983675 -466678 -286057 -410984 -648786 -707506 -832134 -555564
15464 -555564 245564 852284 610519 257848 340225 312539 262605 218587 103346 327017
15454 327017 968117 1358342 1282009 1342936 1296994 804377 93350 -230344 -194105 -14651
15444 -14651 269210 346738 479587 695034 702431 596605 620567 374777 -62170 -239650
15434b39650J95642n4451n75558n953K03254J4590m065K55164Q13768K30354j51689
15423F81406j13894l48325n70630o81625j01582J50233l00921l36978L9080N77042
15413a006194O83944M88168j14876k65277J37903j54879k31089J12240O31415
15404B81355L65602R794L3166j71214l9599n594J5682J81241K43445j57463n64569
15393A91846K95026M11190k31575l75353J90821O1422J48858K18321K62413J87074
15383A360043k51160l85401l17199l22852l83322j33446K14240L19190K30401
15374C30494l757m82977n62633L18991L45379O7439l29083m60924q8234P0031
15364g95274L89988M92466K30702J28132L64771k55116l31262o6773k35380J11387
$$ plain form
15434 -239650 -44008 -98459 -674017 -679970 -476716 -462126 -466191 -211027 602741 833095 681406
15423 681406 567512 219187 -351443 -1033068 -1134650 -984417 -1285338 -1622316 -1583236 -1006194
15413 -1006194 -322250 165918 51042 -214235 -76332 -231211 -462300 -350060 281355
15404 281355 646957 656751 689917 518703 479104 473510 489192 670433 913878 756415 191846
15393 191846 486872 898062 666487 291134 481955 543377 692235 910556 1172969 1360043
15383 1360043 1108883 723482 406283 83431 -299891 -433337 -219097 100093 330494
15374 330494 326737 -156240 -718873 -399882 -54503 12936 -316147 -777071 -865305 -795274
15364 -795274 -405286 87180 317882 446014 810785 555669 224407 157634 -77746 33641
15354C3641L30396j13010m61864j79071L95505O56212O781n17886p0579L51875
15344D32000J05339j66620k49350n48539j14786j60184l07930l06589J47489L10309
15334h58861m679K13081J93089J35134J77627j30614k94856k58356K72653N16829
15324c8953J15592r9611K33861L71092J68497N8661k3298m20727l62885l32548
15314c30319m47305k29857K10348j73217k2776J24357M7203L14530O27336M40214
15304E60514M25529M60436K893j02064k43495k08426k83257l54014r955J11712
15294C59873L636k15884k86739q8540K10369L53492J39146n9832k3895j51165
15284B40461l99215j36795K72990J10521M581K44869J57572r3312j43432L01895
$$ plain form
15354 33641 364037 251027 -210837 -389908 5597 661809 668590 150704 80125 432000
15344 432000 537339 370719 121369 -427170 -541956 -702140 -1010070 -1316659 -1169170 -858861
15334 -858861 -863540 -650459 -457370 -322236 -144609 -275223 -570079 -828435 -555782 -38953
15324 -38953 76639 -22972 210889 581981 750478 809139 785841 365114 2229 -330319
15314 -330319 -777624 -1007481 -797133 -970350 -993126 -868769 -821566 -507036 120300 560514
15304 560514 986043 1446479 1449372 1347308 1103813 895387 612130 258116 248161 359873
15294 359873 363509 147625 -139114 -227654 -17285 336207 475353 415521 391626 240461
15284 240461 -158754 -295549 -22559 87962 92543 337412 494984 401672 258240 560135
15274E60135M88416J43037j46675k57807k51864j90791m18352m79745j57718J30467
15264e80897L65521J79026o2460j69167j04395J37861M83146M04656j24723k16157
15254C12411K37881K38884L38158p3132m71330k06031j50956j34029k97390p455
15244b12989M94509L34661j08035k64379k99189l26926O521L39339K26402k5795
15234A64119k41002l04377j33969j03976j29484j75850L29103K92977P1780K38048
15224G369K86048J67604k05639l84146n69500m79513j14049J68049J13096k82522
15214a293203m1082M01660M39672J80293l9937k55308m1129J79147J68862K29047
15204g1978N53426Q0788p50800m64946J15573M95593M10881l8262r6819j42700
$$ plain form
15274 560135 1048551 1191588 1044913 787106 535242 344451 -73901 -553646 -711364 -580897
15264 -580897 -215376 -36350 -98810 -267977 -372372 -234511 248635 653291 528568 312411
15254 312411 550292 789176 1127334 1054202 582872 376841 225885 91856 -205534 -212989
15244 -212989 281520 616181 508146 243767 -55422 -382348 -375827 -36488 189914 164119
15234 164119 -76883 -381260 -515229 -619205 -748689 -924539 -595436 -302459 -230679 7369
15224 7369 293417 461021 255382 -128764 -698264 -1177777 -1291826 -1123777 -1010681 -1293203
15214 -1293203 -1334285 -932625 -492953 -312660 -352597 -607905 -649034 -469887 -301025 -71978
15204 -71978 481448 562236 -188564 -653510 -537937 -42344 368537 330275 233456 90756
15194I0756k43411O8055k20785l41067O26955L76624k15782j20122p2201j46476
15184a97454m08513k94797J42085K43495j55406j35416L28524M98916J81299q3345
15174A19388k44503Q0808J29492Q9396m5307Q8931J96651l135l30304M0138J27488
15163B49043p6130O8871l48532n07554L09406k9099m18635L97470N83020p5257
15153A52603l59059l73581m76429J58635N34200M09237J6279o64023n66944j39362
15143a308444J70998K8784J01590L00008j52017o9916J69028M37071J59815j53206
15133c16289K72714L36994L9689n18112o71641j44951J69054K15498N43442J39512
15123F5910j31234j79586P9501J96767o214r5984M16379M32368l70762p96286
$$ plain form
15194 90756 -152655 -84600 -305385 -646452 -19497 357127 141345 21223 -50978 -197454
15184 -197454 -605967 -900764 -758679 -515184 -670590 -806006 -477482 21434 202733 119388
15174 119388 -125115 -44307 85185 174581 129274 218205 414856 411721 81417 121555 249043
15163 249043 172913 241784 -106748 -614302 -304896 -333995 -752630 -355160 227860 152603
15153 152603 -206456 -580037 -1056466 -897831 -363631 45606 61885 -602138 -1169082 -1308444
15143 -1308444 -1137446 -1108662 -1007072 -707064 -859081 -928997 -759969 -322898 -163083 -316289
15133 -316289 -43575 293419 333108 -185004 -856645 -1001596 -832542 -617044 -73602 65910
15123 65910 -65324 -244910 -165409 31358 25144 -70840 345539 777907 407145 -389141
15113c89141o48397o0298N22455N59749O9177J04365J51055K14209K21868j64151
15103E80891k08882J82265q4552l284k19322j89697Q1705J95221J8426q6656l697
15092B62418q8479p3764r871m4608j50304L11688q0426j70471l6077n4462J14254
15081b0102j35664j42678L1086k12648j78369K04565N26101M17371J05187j00481
15071D94368J31003l5013j72452j22795k54119j48496N6729J08448R4154J35537
15061B87364r5607J98720J98186k69212j24082J40830N0233k2953l00240o98350
15051f35111p7390J91413L59458J75966L30909L48886k05304l30214O6800J31649
15041C57062q5645K65512L63604m11657q41113l57102K23419J72684J85927N6883
$$ plain form
15113 -389141 -1037538 -1097836 -575381 -15632 53545 157910 308965 523174 745042 580891
15103 580891 372009 554274 469722 466438 247116 57419 139124 334345 352771 266115 262418
15092 262418 173939 100175 90304 45696 -104608 207080 126654 -43817 -79894 -134356 -20102
15081 -20102 -155766 -298444 -267358 -480006 -658375 -453810 72291 489662 594849 494368
15071 494368 625371 590358 417906 295111 40992 -107504 -50775 57673 151827 287364
15061 287364 191757 390477 588663 319451 195369 336199 386432 363479 63239 -635111
15051 -635111 -712501 -521088 -161630 14336 345245 694131 488827 158613 225413 357062
15041 357062 271417 536929 900533 488876 -352237 -709339 -485920 -313236 -127309 -70426
15031g0426j14942J86k48599l82613J62123N34607K21506l42274m38050J86409
15021d92073M28267j92712k18889K98109M30232M26180L765m25284k69600l36131
15011c48136k41615J55801M09744K41041m49053j82129j22677l64530r8536J7150
15001i82940N5416J35092j2884J13139K51339n0601l29890L05974L02851j78196
14991c90700o4538K90625L76530M895l33068j52034K62152L40902J10094K2361
14981D67219j64999n78361n29577j14944K88620M99353N3012l04562k12135k98319
14971h94693N1721K40511l03245k31516O0130R1198K7512M0775O20314Q17213
14961E19920M89072L5330l21863k7756j32746M3907L86840K46978K08785J97306
$$ plain form
15031 -70426 -185368 -185182 -433781 -816394 -654271 -119664 101842 -240432 -678482 -492073
15021 -492073 -63806 -256518 -475407 -177298 252934 679114 682879 257595 -12005 -348136
15011 -348136 -589751 -433950 -24206 216835 -232218 -414347 -537024 -901554 -1000090 -982940
15001 -982940 -927524 -792432 -805316 -692177 -440838 -491439 -821329 -515355 -212504 -390700
14991 -390700 -455238 -164613 211917 216812 -116256 -268290 -6138 334764 444858 467219
14981 467219 302220 -276141 -805718 -920662 -632042 -132689 -79677 -384239 -596374 -894693
14971 -894693 -842972 -602461 -905706 -1137222 -1077092 -985894 -958382 -917607 -297293 519920
14961 519920 1008992 1044322 722459 694703 561957 605864 992704 1239682 1448467 1645773
14951A645773l65193o25848o62802n45133k95439J06592j12589n80325k10502
14942a645466M64183P11016N01523Q4929K25771L16280J28398j51900l23246K7026
14932C38514J2539Q0262K71372k08541n20896k57678J31509R4518K51588L50455
14922E43642L09633L10562n7455k25692l79942p5702n7773J08021j10873j05703
14912B58718J55624l3769J1913o7288p387j79655l07038j13763K5321K26410j08999
14901a39913l80833L4794K88633L01745j5909k59190k69022j94475k53456k11699
14891a099325k61598p3440K87540N99937M79067k55184j89191K73119J51179J04519
14881A6623O9335n6784j42296J73840R0249l28883n19328K0925N61035L84845
$$ plain form
14951 1645773 1280580 654732 -8070 -553203 -848642 -742050 -854639 -1434964 -1645466
14942 -1645466 -1181283 -470267 31256 116185 341956 658236 786634 634734 311488 338514
14932 338514 351053 431315 702687 494146 -26750 -284428 -152919 -58401 193187 543642
14922 543642 853275 1163837 1106382 880690 500748 425046 367273 475294 364421 258718
14912 258718 414342 380573 392486 325198 317811 138156 -168882 -282645 -257324 -30914 -139913
14901 -139913 -520746 -485952 -197319 104426 88517 -170673 -439695 -634170 -887626 -1099325
14891 -1099325 -1360923 -1434363 -1146823 -546886 -67819 -323003 -512194 -239075 -87896 16623
14881 16623 85958 29174 -113122 60718 150967 -177916 -697244 -676319 -115284 269561
14871B69561L18656M61499O07297P3148m41013m70807k35567r7580k13827J8886
14861B90253J66627L6011J886j66943k29405J78497K83579k66119l67856k58702
14851c32172O181p2734r0001m40507l61023l08021j23556M07316O20864N45716
14841a47937K23454L30440J11179l14347o04269q4332M32735J57613j45984J22383
14831H0935O29554K68997l54918k59724j00382M63984K93135l60443j89823n26640
14821e5325n39048k80526r2538n0927n46237l98131K77731P84739J75152m60960
14811a186070Q8284M97509L42354K7337j25694m29820m11090O9671K03311N19210
14801d04998N26433K2631m4946J42056K49488J92413k22037M6439N96993R3537
$$ plain form
14871 269561 588217 1049716 1657013 1730161 1289148 818341 582774 485194 271367 290253
14861 290253 456880 492891 494777 327834 98429 276926 560505 294386 -73470 -332172
14851 -332172 -325991 -398725 -488726 -929233 -1290256 -1598277 -1721833 -1314517 -693653 -147937
14841 -147937 75517 405957 517136 202789 -401480 -485812 -53077 104536 -41448 80935
14831 80935 710489 979486 624568 364844 264462 728446 1021581 661138 471315 -55325
14821 -55325 -594373 -874899 -967437 -1018364 -1564601 -1962732 -1685001 -900262 -725110 -1186070
14811 -1186070 -1097786 -600277 -257923 -230586 -356280 -786100 -1197190 -1127519 -924208 -404998
14801 -404998 121435 144066 99120 241176 490664 683077 461040 507479 1104472 1198009
14791A198009o53896n46517m20772k09156J71078M12203K73206J9103m9105r3483
14781A00670j07543k56780q9616l360J61747K23544k21600j22295J82446L0800
14771a01987k2437K72954L95954p324L7412k54569l64888l15703k18063N73183
14761e468M46598n9897R460k28390l05140m14595j39355J19489L33832J66602
14751g6864j9903J95764K18995l0641j22587j4600k80644l20577j79571M8931
14741e81697N605K21582K33591J76817l28607k66138K71208O27960K10834n05706
14731F5449o70665l92081K4487J77273O5163J23657K21532L46821L21541Q7035
14721C70212l18392o37651N7043k9034k37388J97849N33391O9562k52400n57755
$$ plain form
14791 1198009 544113 -2404 -423176 -632332 -461254 -49051 224155 243258 194153 100670
14781 100670 -6873 -263653 -353269 -356629 -194882 28662 -192938 -315233 -132787 -101987
14771 -101987 -124424 148530 544484 537160 574572 320003 -44885 -360588 -578651 -5468
14761 -5468 441130 381233 390693 162303 -142837 -557432 -696787 -577298 -243466 -76864
14751 -76864 -96767 98997 317992 287351 164764 150164 -130480 -451057 -630628 -581697
14741 -581697 -576092 -354510 -120919 55898 -272709 -538847 -267639 360321 571155 65449
14731 65449 -605216 -997297 -972810 -795537 -730374 -606717 -385185 -38364 283177 370212
14721 370212 51820 -585831 -528788 -557822 -795210 -597361 -63970 5592 -246808 -804563
14711h04563q6425K78176j57890r4321K38937M31668L35117J0141j41168j04798
14701i5126k47536K726O51876P35638L8129n92588K43397L17791l15614p10748
14691B7945m36762K99911L90825K75956L03260K42206l08555m40452k03793j57888
14681g347M875J53160l70032k60031L40027K81884J52361P8176j75060j73627
14671B4386L554j78692m85768m67318k14890N2021L65387M92332J92413J08736
14661a07839p4962k46795j58788K86209K46888p6208j82082Q9154L58451L62103
14651D96131P3148k65050J92214N09414K04554r7524l80051p18237k29904J74338
14641d0967M9751j59283l01387j4271J75063M79174N38995M42375l9693l49733
$$ plain form
14711 -804563 -890988 -612812 -770702 -865023 -626086 -194418 140699 150840 9672 -95126
14701 -95126 -342662 -339936 311940 1047578 1085707 493119 736516 1054307 738693 27945
14691 27945 -408817 -108906 281919 557875 861135 1103341 794786 354334 150541 -7347
14681 -7347 -2472 150688 -219344 -479375 -139348 142536 294897 373073 198013 24386
14671 24386 27940 -150752 -636520 -1103838 -1318728 -1266707 -901320 -408988 -216575 -107839
14661 -107839 -182801 -429596 -588384 -302175 -55287 -131495 -313577 -224423 134028 496131
14651 496131 569279 304229 496443 1005857 1210411 1112887 732836 14599 -215305 -40967
14641 -40967 8784 -150499 -451886 -466157 -291094 188080 727075 1169450 1129757 780024
14631G80024m54739l60123k32388J87915J30080l20450m51142j97530o4517K09261
14621g73609M22458N84822M57379K19760O04709k35064l19112m77100p20901O4810
14611a71848M73098L08381k7007n2156j32052k06165N7300o8647m26285m0916
14601b86297r8539l33535l0434J38151m3354J62110L41289K77786J30975K79285
14591E37437L59025J93549K02104j87071l24669L5595P6819n71121m56795J87807
14581E2680J96261o86361m46098J64796j27166l03944j75525J89537M14067L93432
14571c28321K24426J52738P2559j62750k58239j28239M19915N24263J7832J5221
14561E49405R3291k44675K7134J81732L6876k29605m17114m10286K6237J53983
$$ plain form
14631 780024 325285 -34838 -267226 -79311 50769 -269681 -720823 -918353 -982870 -773609
14621 -773609 -351151 233671 691050 910810 1515519 1280455 961343 484243 -236658 -171848
14611 -171848 301250 609631 582624 530468 398416 192251 249551 180904 -245381 -286297
14601 -286297 -384836 -718371 -748805 -610654 -654008 -491898 -150609 127177 258152 537437
14591 537437 896462 1090011 1292115 1105044 780375 815970 892789 321668 -135127 52680
14581 52680 248941 -437420 -883518 -718722 -845888 -1149832 -1325357 -1135820 -721753 -328321
14571 -328321 -103895 48843 121402 -41348 -299587 -427826 -7911 516352 534184 549405
14561 549405 642696 398021 425155 606887 643763 414158 -2956 -413242 -387005 -233022
14551b33022Q3918K3132J30897L55864M8011l15300j62753J72677m165j87513
14541h8254P7843M09179M8568j19888l04112j95767l14302m06523l03278K22398
14531i74136N39301J33167J51867K4541k87269j08502K14603L16106M6777r1086
14521c4631J83428P9726J81463O4182n31738n41859k18408j93194J67181N78936
14511b64914K92587J21130l0711k86291k43650o7816K62993K61448l5918J32464
14501A41322N2721k62533m65181L6244L39239K92032Q5409J14381j083p2672K2159
14490B82038j43797k35042l84051j34550J30592r4641q0825l8712J10229K74888
14480c13871M49981R6977J61069K42836J14779m54201o71321J36976J88440j12061
$$ plain form
14551 -233022 -149104 -125972 4925 360789 408800 93500 -69253 103424 99259 -88254
14541 -88254 -10411 398768 447336 327448 23336 -172431 -486733 -893256 -1196534 -974136
14531 -974136 -434835 -301668 -149801 -125260 -412529 -521031 -306428 9678 56455 -34631
14521 -34631 148797 228523 409986 474168 -57570 -599429 -817837 -1011031 -843850 -264914
14511 -264914 27673 148803 118092 -168199 -411849 -479665 -216672 44776 8858 141322
14501 141322 194043 -68490 -533671 -497427 -158188 133844 219253 333634 332551 259879 282038
14490 282038 138241 -96801 -480852 -615402 -484810 -579451 -660276 -698988 -588759 -313871
14480 -313871 136110 233087 394156 636992 751771 297570 -373751 -236775 -48335 -160396
14470a60396m74729r1962J96560M8943P02243J64416m11288j70294K2861M4637
14460a29009j46493j0483K84625N02861N23733O55690p1343o60270m0544L8697
14450I47464m67093o81336k64083R7039J09929q5382r8890k49276m49578J85123
14440i56083N6978p5282J39557O77683M07355o3037q3569k54284l47907j96690
14430f95279R2315o012k20379M0911L46423K85636M9563k43194j97656N4579J08594
14419c84499J0457K00202O9214l46270p2535p7391n3242M26347K50311n66942
14409e44348m30261L20630L40476J00917k13249o04703k31587p4455J43154K92029
14399i01397L37287M76372M18713r1637k62608j34535m3194L33813J2313K6662
$$ plain form
14470 -160396 -635125 -727087 -530527 -481584 220659 385075 -26213 -196507 -173646 -129009
14460 -129009 -275502 -285985 -1360 501501 1025234 1680924 1609581 949311 908767 947464
14450 947464 480371 -200965 -465048 -368009 -258080 -343462 -442352 -691628 -1141206 -956083
14440 -956083 -899105 -974387 -834830 -157147 250208 187171 103602 -150682 -498589 -695279
14430 -695279 -602964 -608976 -829355 -788444 -442021 -156385 -106822 -350016 -547672 -493093 -384499
14419 -384499 -374042 -173840 -104626 -450896 -523431 -600822 -654064 -227717 22594 -544348
14409 -544348 -974609 -653979 -313503 -212586 -425835 -1030538 -1262125 -1336580 -1193426 -901397
14399 -901397 -564110 -87738 330975 239338 -23270 -157805 -200999 132814 145127 171789
14389A71789K84039K19927J44552l53992k10558j65043o0015j58903o2398L0063
14379a60539L2745K44083M67710M67543J113k15226j11058J71541L0401k28040
14369G00273k71414q05491r59289m16266J35023K69394O88217M47085k20484k80837
14359g13789J17294K96688K62581K03886K83833J9310l23459j08904J38429o2615
14349A13254n96370k53294M05859M77895J02172J34147J14066J80649J67415l20170
14339E25623n70586r5581O16116K04765o16533m15665m14016l68547p4427J67691
14329a041160K19489J98866K48301L77808P1698K22506N30619R1586l47504o02200
14319b9991p56361l02042L28409L06865m8466j07068n9398Q7932K93804R2842
$$ plain form
14389 171789 455828 675755 820307 466315 255757 90714 30699 -128204 -190602 -160539
14379 -160539 -127794 116289 583999 1051542 1052655 837429 726371 897912 928313 700273
14369 700273 428859 -376632 -1335921 -1752187 -1617164 -1347770 -659553 -212468 -432952 -713789
14359 -713789 -596495 -299807 -37226 166660 450493 469803 146344 37440 175869 113254
14349 113254 -483116 -736410 -330551 147344 249516 383663 497729 678378 845793 525623
14339 525623 -44963 -140544 475572 680337 63804 -351861 -765877 -1134424 -1208851 -1041160
14329 -1041160 -821671 -622805 -374504 3304 75002 297508 828127 919713 572209 -29991
14319 -29991 -786352 -1088394 -759985 -453120 -501586 -608654 -668052 -580120 -286316 -193474
14309a93474j7282j38790L46558N91727L31452O9440j80539n65326l85126r0117
14299b31477m93655m82482j77795K11552J19652j21099K15155M41692M8542K9217
14289d40698J77234M00464q8176l75389R4371J60161L70103j4441k66288m584
14279A2757J6195l53810k62099L52727M42648K01980J47714L42156N8839j55902
14269H03205L2786J16206k44578N4292j41648k78892J07800K59621N2849l39379
14259D22262l68786K58789L74195Q1302l9632n0791J8144Q7557K1492J60983j6097
14248I49418k01261r3599m34401n99057J8829Q3919k05025l72108L56199O02279
14238A05193j36101k11710m05204k17869j90423N30632M65584J84508q1405J78677
$$ plain form
14309 -193474 -210756 -349546 -2988 588739 920191 989631 809092 243766 -141360 -231477
14299 -231477 -725132 -1207614 -1385409 -1173857 -1054205 -1175304 -960149 -518457 -469915 -440698
14289 -440698 -263464 137000 48824 -326565 -232194 -72033 298070 283629 17341 12757
14279 12757 28952 -324858 -586957 -234230 208418 410398 558112 900268 959107 803205
14269 803205 835991 952197 707619 761911 620263 341371 449171 708792 761641 422262
14259 422262 53476 312265 686460 767762 728130 677339 695483 783040 804532 965515 949418
14248 949418 748157 654558 220157 -378900 -360071 -276152 -481177 -853285 -497086 105193
14238 105193 -30908 -242618 -647822 -865691 -1056114 -525482 -59898 124610 43205 221882
14228B21882J62200P1114j18809m80376k36251j0806K29891j34997l37011q1029
14218g14192N34720N01837j82006k9446K43753L96622L22586k77224o32995m89716
14208c26061n60356k38399J36975L6537L4956j91300J69982M59782k14869m33140
14198a125893P2417M98461L92845p1902k8495l78241j08170M26324K65083l20489
14188c78060l90867J26138J51019M49050O01977K82697j80731j15102P8085N920
14178F30126J15897l16693m23453j48544O3937K45953J70533K27821L66983K03129
14168A135689J26039k86573n12259l55218k95393n74069l92216K81930P91897
14159h0173K45370P352L18010J46733j59324j35298J52227o699j32119k02885
$$ plain form
14228 221882 384082 455196 336387 -143989 -380240 -391046 -161155 -296152 -633163 -714192
14218 -714192 -179472 322365 140359 110913 354666 751288 1073874 796650 163655 -326061
14208 -326061 -886417 -1124816 -987841 -951304 -916348 -1107648 -937666 -477884 -692753 -1125893
14198 -1125893 -1053476 -555015 -162170 -234072 -262567 -640808 -748978 -322654 -57571 -378060
14188 -378060 -768927 -642789 -491770 -42720 559257 841954 661223 546121 624206 630126
14178 630126 746023 429330 5877 -142667 -78730 167223 337756 565577 932560 1135689
14168 1135689 1261728 975155 462896 107678 -187715 -761784 -1154000 -872070 -80173
14159 -80173 165197 172549 490559 637292 477968 342670 494897 488198 356079 153194
14149A53194l22668M0114K53543J53684j43289k28044K95531K65876l57872p6537
14139C3532J51785L69954p669l73993k34230J28096J1978n50968n17689k54724
14129a243928j15580J32835N89648M14445J49916Q6396L0417j35330J74029k92022
14119b09174n204N45898K22436J36418J23988o0329m31622p27502m82472j15570
14109a003133L18094K86275J28232K37600j24341L1107J5322j35731j75119M1435
14099c80259Q855K0701J74417L46502J4049k84913j53667J19830j56998m36186
14089g27669m50032n43190J86223M61907l5681r4034j67927n1417L9956L8992
14079a342872K64896K81836J98479L74765P80567K69397j29215k06435R039o4232
$$ plain form
14149 153194 -169474 -129360 124183 277867 134578 -93466 202065 467941 110069 33532
14139 33532 185317 555271 547602 173609 -60621 67475 79453 -471515 -989204 -1243928
14129 -1243928 -1359508 -1226673 -637025 -222580 -72664 13732 44149 -91181 82848 -209174
14119 -209174 -214378 331520 553956 690374 814362 754033 322411 -405091 -887563 -1003133
14109 -1003133 -685039 -398764 -270532 -32932 -157273 -126166 -110844 -246575 -421694 -380259
14099 -380259 -371404 -350703 -176286 170216 184265 -100648 -254315 -134485 -291483 -727669
14089 -727669 -1177701 -1720891 -1534668 -1072761 -1108442 -1202476 -1370403 -1421820 -1381864 -1342872
14079 -1342872 -1077976 -796140 -597661 -222896 557671 827068 697853 491418 500457 436225
14069D36225l86369m20705k35974j79949J37416K12784Q3562P077J32237J57487
14059e6209K05566J23732j71656k51572k8342K32867K69657k25429m87001P2686
14049c15701J79092J44607J65349J6887l13065m20320j98288k7210k0486n72225
14039a361360l42538M75938O50957p7796k14762q2172k73725J70172N02607K87485
14029b65194K89024j95049l37669K1455K99750J63001k5847j98953j12100J14193
14019b47389K05208J48132j00000k42231r4597K65582K77991j99954l03494J72647
14009a18105L23930K37506j073k52804m37055j13324r4396n4954P420l57005k1782
13998h81642K20908N0855J79412K94755L78521J65642p5938m70283l73172J75642
$$ plain form
14069 436225 49856 -370849 -606823 -786772 -649356 -436572 -353010 -345933 -213696 -56209
14059 -56209 149357 273089 101433 -150139 -178481 54386 324043 98614 -388387 -315701
14049 -315701 -136609 7998 173347 190234 -122831 -543151 -741439 -768649 -789135 -1361360
14039 -1361360 -1703898 -1227960 -577003 -654799 -869561 -951733 -1225458 -1055286 -552679 -265194
14029 -265194 23830 -171219 -508888 -487433 -187683 -24682 -50529 -249482 -361582 -247389
14019 -247389 -42181 105951 5951 -236280 -330877 -65295 212696 12742 -290752 -118105
14009 -118105 205825 443331 442258 189454 -247601 -360925 -455321 -510275 -502855 -859860 -881642
13998 -881642 -660734 -609879 -430467 -135712 242809 408451 332513 -137770 -510942 -335300
13988c35300Q974k80k66448o76377l32471M117N8742m21267M56N97200N40267
13977h22387J05237K00425J67362p1450J86409K95007Q372m98022k84036K98179
13967d14904K04020k922J85102L47403L7640l76817j75776J36178J65225J40028
13957B45177P4696N2035r0785L4533q8933j17281j39108n6957L46028M47072l9515
13946F66962r28973o08441J64995J09634K20484L66632p009k96656m75036j87584
13936i74992l538M19807L64514M0793k16676o0485p547k91343j10991K31689L2684
13925e76085k21165j13456J81250J56256M03046J02047l96759j06827K12045o539
13915c66187k93528m94335k41628N7184M36211O2032m2969M51900L59462J65918
$$ plain form
13988 -335300 -326326 -326606 -593054 -1269431 -1601902 -1597785 -1539043 -1960310 -1959854 -1362654 -822387
13977 -822387 -717150 -516725 -349363 -420813 -234404 60603 68975 -429047 -713083 -414904
13967 -414904 -210884 -213806 -28704 318699 356339 -20478 -196254 -60076 105149 245177
13957 245177 319873 371908 281123 315656 226723 109442 -29666 -86623 259405 706477 666962
13946 666962 -262011 -870452 -705457 -595823 -375339 -8707 -15716 -312372 -787408 -974992
13936 -974992 -978530 -558723 -194209 -153416 -370092 -430577 -438124 -729467 -840458 -608769 -576085
13925 -576085 -797250 -910706 -729456 -573200 -170154 -68107 -464866 -571693 -359648 -366187
13915 -366187 -659715 -1154050 -1395678 -1338494 -902283 -840251 -883220 -431320 -71858 94060
13905I4060o0366o9439J44554J48397j03196m25770j93528J15756M6488J97231
13895a05813K65253l15091p22461l41470j17513K61590O21618L20324j20633m07696
13885f61892l11539M0643J38796o5415j02979l8907J23492J91424N28193O61663
13875E03479k2218l04766k23207N2043J62239J96552M2264J40921P8862M7856
13865F74025K14228l4115n46235k22394M4512m758J68037M01768M5932O1255M5478
13854H47733k8747k60471l02492r3887m13961j18779L57910M1049k20894L9045
13844a53494K13210N5887n5514J68639R7223k32513n27094j43941M93247J25754
13834D1404j50337J6353K28833m233q70756p60949n8609O05282O27945M27639
$$ plain form
13905 94060 33694 -35745 108809 257206 154010 -271760 -465288 -349532 -303044 -105813
13895 -105813 159440 -155651 -878112 -1219582 -1337095 -1075505 -453887 -133563 -254196 -661892
13885 -661892 -973431 -932788 -793992 -859407 -962386 -1001293 -877801 -686377 -158184 503479
13875 503479 481261 176495 -46712 5331 167570 364122 406386 547307 626169 674025
13865 674025 888253 854138 307903 85509 130021 125263 293300 695068 741000 802255 847733
13854 847733 818986 558515 256023 162136 -251825 -370604 -12694 28355 -192539 -153494
13844 -153494 59716 115603 60089 228728 325951 93438 -433656 -577597 -84350 41404
13834 41404 -108933 -92580 136253 132020 -738736 -1499685 -1558294 -953012 -325067 102572
13824A02572O30103R6771l54258j99415k23060o56461p70036k8831N95801N41361
13814b65453K28753k36982P965N37374N1361k41373j14688j5139O7785J63960
13804A83563L61067J06590n59396m80733K07188N63450m8683n15492k00764l5086
13794d18296r4888l75641l64922J61770J89741P7093Q7595K6106K98138M60127
13784D6823L79377j4789j18419k84544l71067j81355J83726j7400J00539J25089
13774a52020j92781k86478J84010K96036K00488j75543l27073k7116J6418P9379
13764c84680J05351k33633j34619K65292L43386Q7682K44043L41023j80879l88785
13754F4181m05645l24437q2133n377J61516M35517L96810M75371J42540n92n97656
$$ plain form
13824 102572 732675 829446 475188 275773 52713 -603748 -1373784 -1402615 -806814 -265453
13814 -265453 -36700 -273682 -265717 271657 323018 81645 -33043 -48182 19603 183563
13804 183563 544630 651220 91824 -388909 -181721 381729 333046 -182446 -383210 -418296
13794 -418296 -513184 -888825 -1253747 -1091977 -902236 -825143 -737548 -711442 -413304 46823
13784 46823 426200 411411 292992 8448 -362619 -543974 -360248 -377648 -277109 -152020
13774 -152020 -344801 -631279 -447269 -151233 49255 -126288 -453361 -480477 -464059 -384680
13764 -384680 -279329 -512962 -647581 -382289 -38903 48779 292822 633845 452966 64181
13754 64181 -341464 -665901 -748034 -753411 -591895 -156378 240432 715803 858343 857751 260095
13743B60095k56443L74410Q92J69805k85188n09805j28112l08949R8906O16756
13733C2367N66003k3309M9032o7842k56378m15225l00748M64323L24087o5833
13723C06477m55295m06203q7928j24416k8346K21524L11143O8272J51742j86448
13713b29478l29995j09449J88266L83084K38046j53529k45601j13481J56760P1561
13703a43816r6290L47898K67820j70064k16651j38368k70595j59752j05769j78791
13693h64378M0451Q5677j45583M1873K17181R8297J69975J51838j51180k16072
13683e71921P2926L69421L45884K82564k9141j17856J95244K99772K36749K58178
13673A341820l42250j52155J01193l72236o56509m23134n06065m96386j50507
$$ plain form
13743 260095 3652 378062 378954 548759 263571 -246234 -374346 -683295 -584389 32367
13733 32367 598370 575061 624093 556251 299873 -115352 -416100 48223 372310 306477
13723 306477 -148818 -555021 -642949 -767365 -795711 -574187 -263044 -194772 -43030 -229478
13713 -229478 -559473 -668922 -480656 -97572 140474 -13055 -258656 -372137 -215377 -143816
13703 -143816 -240106 107792 375612 205548 -11103 -149471 -420066 -579818 -685587 -864378
13693 -864378 -823927 -738250 -883833 -841960 -624779 -526482 -356507 -204669 -355849 -571921
13683 -571921 -498995 -129574 216310 498874 469733 351877 547121 846893 1083642 1341820
13673 1341820 999570 847415 948608 576372 -80137 -503271 -1009336 -1505722 -1656229
13664a656229L76311O46838N55670N32105J4786n36251l88075m29645j28837K02156
13654h11171r2705k78562j48722N1179K47785Q22637Q57474k36001o80019m40047
13644g08152j92940J84016K57301j07209j38718M8738m6942M22241N32921j10151
13634A41105m39362k78231k33776R3690K68084J58132L58101j6291j58828j25502
13624b32878p0211J62169j73408m80231j1590K50519J33208L33476K08544N1940
13614A71538l28597j50149M17588N73781N00167J6583l41177l81474n25020n49634
13604e96394l96184J51306M86477K62804l12320m01147j69532o5953M6125r6712
13594a091530K37746N09533K69017N5893j58477k06639j85966j57106n67179j80831
$$ plain form
13664 -1656229 -1279918 -633080 -77410 454695 469481 -66770 -454845 -884490 -1013327 -811171
13654 -811171 -903876 -1182438 -1331160 -1279981 -1032196 -209559 647915 411914 -268105 -708152
13644 -708152 -901092 -717076 -459775 -566984 -705702 -656964 -703906 -281665 251256 141105
13634 141105 -298257 -576488 -810264 -716574 -448490 -290358 67743 51452 -107376 -232878
13624 -232878 -303089 -140920 -314328 -794559 -806149 -555630 -422422 -88946 119598 171538
13614 171538 -157059 -307208 110380 684161 1184328 1200911 859734 478260 -46760 -596394
13604 -596394 -992578 -841272 -354795 -91991 -404311 -805458 -974990 -1040943 -994818 -1091530
13594 -1091530 -853784 -344251 -75234 -19341 -177818 -384457 -570423 -727529 -1294708 -1475539
13584a475539j06671j75468K8075M55450L92844k13496M31565K34709k45085J31040
13574e42576K8416k87335k50254l7839J82046L65005J43037o235j96186k44816
13564h46737l87298m39500n722M21973J30548o3098K28321l3485k7410L89779
13554f32629J23091J73446J24067j74791k18096M66589N67868J58805l5950R5472
13544F47872O9889M4848J37576J76734j70432m77967o17165l08952K92746j98433
13534d03284k4422R0035K79971M66675L14122k14589m42862J837K50491o8058
13524B49916l82380m35502k1587L35948K65577M50953K77203l17810m00715J82054
13514B03657M91362N96547j5704m79268j49420N9483k1754n9402L98040j19762
$$ plain form
13584 -1475539 -1582210 -1757678 -1729603 -1274153 -881309 -1094805 -663240 -428531 -673616 -542576
13574 -542576 -514160 -801495 -1051749 -1089588 -907542 -542537 -399500 -405735 -601921 -846737
13564 -846737 -1234035 -1673535 -1679257 -1257284 -1126736 -1189834 -961513 -994998 -1022408 -632629
13554 -632629 -509538 -336092 -212025 -386816 -604912 -138323 429545 588350 552400 647872
13544 647872 717761 762609 900185 1076919 906487 428520 -188645 -497597 -204851 -403284
13534 -403284 -427706 -337671 -57700 408975 723097 508508 65646 67483 317974 249916
13524 249916 -132464 -567966 -589553 -253605 11972 462925 740128 422318 21603 203657
13514 203657 695019 1291566 1275862 796594 647174 706657 684903 625501 1023541 903779
13504I03779j12776K22870j80849m69225k62030l87470j88601P718o7117K47839
13494b85862K12368J36719j56772O2681l62921l17322O8613K03757L06497k5894
13484a58136m73150m31722m61780q9857R7146l7500L80222K18927q9740M29456
13474f16134J95805k87574L58931L16914l56096k80294k24507l30877j1718j82753
13464a418303J44651N10158M90414L94339K80759k29449k99271Q5042J68366j86960
13454f0254k57921l89217n45708J58709O15177K01187p0429n72j16428k21264
13444f86720p2726K44249N21562M34806m3753n62489o92518m15568l8908N69456
13434g42609M96044m1535l18526m8720K90735j78236M522M79953M18212P5625
$$ plain form
13504 903779 791003 1013873 833024 363799 101769 -285701 -474302 -466584 -533701 -285862
13494 -285862 -73494 63225 -93547 -30866 -393787 -711109 -642496 -438739 -132242 -158136
13484 -158136 -631286 -1063008 -1524788 -1614645 -1517499 -1554999 -1174777 -955850 -1045590 -616134
13474 -616134 -420329 -707903 -348972 -32058 -388154 -668448 -892955 -1223832 -1235550 -1418303
13464 -1418303 -1273652 -763494 -273080 121259 402018 172569 -126702 -41660 126706 -60254
13454 -60254 -318175 -707392 -1253100 -1094391 -479214 -278027 -348456 -349028 -465456 -686720
13444 -686720 -759446 -515197 6365 441171 397418 -165071 -857589 -1273157 -1312065 -742609
13434 -742609 -246565 -288100 -606626 -655346 -364611 -542847 -538325 -58372 359840 435465
13424D35465j78877j2440n5743k05893K21778J56890m37528n73455j3690j9669
13414f83162n5428Q7077N7903j7567L18504O0523l71721K0834Q5136M4875j87845
13403f40871J45104L95966L0806K2261n06784k71029K06479L21721P6850n34739
13393g54236l64023M6055M74297Q9195o974j28711n5077J12878J01746L21098
13383a63752Q6232l6391j60996L13468J51715p658J08362j41840K64623K11362
13373F25125n87111p74718o4459N11511L37003l64246o27399Q4062P53215O3913
13363d3104l37043j61885j29391O7278Q9511k91021j4721R1409K24206K76123
13353b28638K25243j50536l76303m7213N1275L82367L48939j37074k69893n24247
$$ plain form
13424 435465 256588 244148 188405 -17488 204290 361180 -76348 -649803 -663493 -683162
13414 -683162 -738590 -651513 -593610 -611177 -292673 -232150 -603871 -583037 -497901 -453026 -640871
13403 -640871 -495767 -99801 -68995 -46734 -553518 -824547 -618068 -296347 -219497 -754236
13393 -754236 -1118259 -1072204 -597907 -508712 -515686 -644397 -699474 -586596 -484850 -163752
13383 -163752 -77520 -113911 -274907 38561 190276 182618 290980 149140 413763 625125
13373 625125 38014 -736704 -801163 -289652 47351 -316895 -944294 -860232 -107017 -43104
13363 -43104 -380147 -542032 -671423 -604145 -514634 -805655 -820376 -728967 -504761 -228638
13353 -228638 -3395 -153931 -530234 -577447 -526172 -143805 205134 68060 -201833 -726080
13343g26080n50243o2617J77787L61301P57581M43406n20935r03371m27869J70834
13333a280206N25495N07210l48281l39472K68701K92332N80765K44654R8274J14939
13323F64411m64122l72733k05153k68632K51860J34779j53664k69243J07193M30281
13313a45023M31296O9977j5561j40674j52415n1316k23225j83795P791J75872
13303b27073J92747J6600j82668o0695j24504r5517K5489P9430L69555O37575
13293F30939N89930M4652l33144j40402K3994n7374m06797l40373j73835J85020
13283B2610K62045R2985K99041L21319j77793k63957j71784k72126l45424j50664
13273c83748q7339J08817k9187n385n0493j29733k73089l77900P6438N38569O16258
$$ plain form
13343 -726080 -1276323 -1338940 -1161153 -799852 -42271 401135 -119800 -1023171 -1451040 -1280206
13333 -1280206 -754711 -247501 -595782 -935254 -666553 -374221 206544 451198 549472 664411
13323 664411 200289 -172444 -377597 -646229 -394369 -259590 -413254 -682497 -575304 -145023
13313 -145023 286273 356250 340689 200015 47600 -3716 -226941 -410736 -402945 -227073
13303 -227073 -34326 -17726 -200394 -261089 -385593 -481110 -455621 -376191 -6636 630939
13293 630939 1220869 1265521 932377 791975 815969 758595 351798 11425 -162410 22610
13283 22610 284655 377640 676681 998000 820207 556250 384466 112340 -233084 -383748
13273 -383748 -471087 -362270 -391457 -396842 -447335 -577068 -850157 -1228057 -1151619 -613050 3208
13262C208N02122P5983j42518k68056k76476k88775r7176p5733q3426L11838L74247
13251C5238P4036R3032P645L4995O2506K0461j6241k83869Q9352K40942l1478
13240C26619J30302K605j84958k28487J56020L83124L8425k97934K4747L30758
13230F81221K81219m47902r11984p11048k13897L93508M16001K64608Q4158o3877
13220b27993k03808J86622K95171L20971R6360R1760L52513J09780q4673J17543
13210A054246J77493j32213L9536K19102k82363m66372j19280j06206l92020k47342
13200b55419j12742j6361K33109M98817L60965J84459k130l45305j46942j83664
13190B14787k33475L9132K19988M73787L93470N1646n391k03973m8831j80882
$$ plain form
13262 3208 505330 581313 438795 170739 -105737 -394512 -491688 -567421 -650847 -339009 35238
13251 35238 109274 202306 209951 244946 307452 327913 311672 27803 117155 358097 326619
13240 326619 456921 459526 274568 46081 202101 585225 623650 325716 350463 681221
13230 681221 962440 514538 -397446 -1108494 -1322391 -928883 -512882 -248274 -164116 -227993
13220 -227993 -431801 -245179 49992 370963 467323 559083 911596 1021376 936703 1054246
13210 1054246 1231739 1099526 1139062 1358164 1075801 609429 490149 383943 -8077 -255419
13200 -255419 -368161 -384522 -151413 347404 708369 892828 890698 545393 398451 214787
13190 214787 -18688 20444 240432 714219 1107689 1159335 1153944 949971 901140 720258
13180G20258k36601M9855L05219R1468k15752l99053m42763l44150j29881j2917
13170f14317L7540L81437O92148P55086L75009K76192J24427j80755n26938k38224
13160A081605L52469M06238j69180j042326p67283K86620P59534N13930n4982
13151A366625o2408q5116m36970k24564J9948k08658N3226L25952R962l74885
13141C83112j74160N649K29178l6307q4267J07759J59183K49346L6726p7895j3182
13130G85142J44037J04943l60145l47955j42262J20708M1033M8257L83964J70790
13120I48512n951J34720k76537k65542j6906J61238J97326k19042l31805j16574
13110B09439k1929R5738K45763N19626P32755N5052k80305K45614J50304k17129
$$ plain form
13180 720258 483657 533512 838731 930199 714447 315394 -127369 -471519 -601400 -614317
13170 -614317 -576777 -195340 496808 1251894 1626903 1903095 2027522 1846767 1319829 1081605
13160 1081605 1434074 1840312 1671132 628806 -138477 148143 907677 1421607 1366625
13151 1366625 1304217 1219101 782131 557567 577515 368857 422083 748035 757997 383112
13141 383112 208952 214601 443779 407472 323205 430964 590147 839493 876219 798324 785142
13130 785142 929179 1034122 673977 326022 183760 304468 345501 393758 777722 948512
13120 948512 942561 1077281 800744 535202 518296 679534 876860 657818 326013 209439
13110 209439 187510 283248 529011 1048637 1781392 1836444 1556139 1801753 1952057 1734928
13100A734928j15697j05529q8997J31969P2588M0159K36336k08126k68668l9425
13090A389538N604j36946l38662k94089j74604K0204r8206Q3266L66969L15501
13080A138575M69066L70631k396j50922k91042o8746P3994K6962j12040K46395
13070A700477N2147j57815k3723M8681P7776J72906K90002j76802k63834k4482
13060A695333k84042j07549J30066O9222J44908K47594k0585j16240o3250K17708
13050A913165P98662L92703R2656k93057m61972o02298p6914L99351N74165P09289
13040C445750M90216K28279j85193j18354N9350l11423j48242j59770l56541K52825
13030C196897P44815L10016j25018K01919N528Q2565J61605J15477J76162K16931
$$ plain form
13100 1734928 1619231 1513702 1424705 1556674 1629262 1669421 1905757 1697631 1428963 1389538
13090 1389538 1395142 1258196 919534 625445 450841 471045 372839 456105 823074 1138575
13080 1138575 1607641 1978272 1975876 1824954 1533912 1465166 1539160 1566122 1454082 1700477
13070 1700477 1752624 1594809 1571086 1619767 1697543 1870449 2160451 1983649 1719815 1695333
13060 1695333 1411291 1303742 1433808 1503030 1647938 1895532 1874947 1758707 1695457 1913165
13050 1913165 2711827 3104530 3197186 2904129 2442157 1839859 1762945 2162296 2736461 3445750
13040 3445750 3935966 4164245 3979052 3860698 3920048 3608625 3460383 3300613 2944072 3196897
13030 3196897 3941712 4251728 4126710 4328629 4334157 4416722 4578327 4693804 4869966 5086897
13020E086897J22487J01074J84018O49772O59681O9404k20116k04678l8860M6231
13010F455910K87675K62542k1608J04532K87137N94983L93080N9096N86511O45503
13000I655361P58597Q42993J092502J119500J134187J487476J520402J503672
12992A9114690K471530L109046L315439L729329M570994N785503P083467R183597
12984E8363595J1783168J4449599J8247975K3381076L1500442M2849183N7429182
12977B58004220P2673370P9593509N9492267O454114m8404939p3118293p0279960
12970B84414288n6941477m4123820l4081895k5790519j9625828j5582078j2434503
12963G5834168j0175883q869549p067586n783305m775542l978651l414968l193985
$$ plain form
13020 5086897 5209384 5310458 5494476 6144248 6803929 6873333 6653217 6448539 6409679 6455910
13010 6455910 6743585 7006127 6984519 7089051 7376188 7971171 8364251 8423347 9009858 9655361
13000 9655361 10413958 11256951 12349453 13468953 14603140 16090616 17611018 19114690
12992 19114690 21586220 24695266 28010705 31740034 36311028 42096531 49179998 58363595
12984 58363595 70146763 84596362 102844337 126225413 157725855 200575038 258004220
12977 258004220 330677590 410271099 469763366 476217480 427812541 354694248 284414288
12970 284414288 227472811 183348991 149267096 123476577 103850749 88268671 75834168
12963 75834168 65658285 56788736 49721150 43937845 39162303 35183652 31768684 28574699
12955B8574699k755283k261121j496164j223269j484794j168426r75601r56747
12947A6253294j096276j104128m90376l49164q67574p78659o19735k01882K87586
12938A1033086M75586K31486m37312j77891j10506k82093j54210p6119p9755N9345
12928A0481617K41167L41070K59586K03813L88404P85856J103323J271068J174515
12919A6250419J464403K351535K634261K100584O74604l40604j160816j336328
12911B2638058j061142q8701M06028M71939J229312J190706J246080K031539K851661
12902C0915480L587145M827314O036280P565663J0057057J2758272J5859814J9870641
12894A11477666K5502565L4067295M6496993O1260207P6851170Q0486300N0848068
$$ plain form
12955 28574699 25819416 23558295 22062131 20838862 19354068 18185642 17210041 16253294
12947 16253294 15157018 14052890 13562514 13213350 12345776 11567117 10947382 10745500 11033086
12938 11033086 11508672 11740158 11302846 11124955 11014449 10732356 10578146 10502027 10422272 10481617
12928 10481617 10722784 11063854 11323440 11527253 11915657 12701513 13804836 15075904 16250419
12919 16250419 17714822 20066357 22700618 24801202 25475806 25135202 23974386 22638058
12911 22638058 21576916 21488215 21894243 22366182 23595494 24786200 26032280 28063819 30915480
12902 30915480 34502625 39329939 45366219 52931882 62988939 75747211 91607025 111477666
12894 111477666 136980231 171047526 217544519 278804726 355655896 436142196 486990264
12887D86990264r288776o0473064p7049667o8950996n4256060m1523478l1408490
12880A44039733k4080347j9245839j5454147j1994389r676549p832046o016206
12873D9740210n114898m633753l960650l017421k417479j860195j618711j366731
12865B5750372p01189o0489Q71854J209897K470078M279524N790910P309303L669555
12856E0589815o076887r050235o554565m194098l093623k554645k190762j816145
12848A5058855j057711q43193p11894j54198k98217l65974o1989j12351m3069
12839A1410259k60354n1239j16429n03342n13248J6516N66808Q17002M09948P9153
12829A1855074K59324M89214N81578O59539O51042R28260J474426J603206J835803
$$ plain form
12887 486990264 477701488 417228424 340178757 271227761 216971701 175448223 144039733
12880 144039733 119959386 100713547 85259400 73265011 63588462 55756416 49740210
12873 49740210 44625312 39991559 36030909 33013488 30596009 28735814 27117103 25750372
12865 25750372 25049183 24988694 25860548 27070445 29540523 33820047 39610957 46920260 50589815
12856 50589815 44512928 35462693 28908128 24714030 21620407 19065762 16875000 15058855
12848 15058855 14001144 13157951 12446057 12291859 11993642 11627668 11565679 11453328 11410259
12839 11410259 11149905 11098666 10982237 10478895 9965647 9982163 10548971 11365973 11775921 11855074
12829 11855074 12114398 12603612 13185190 13844729 14495771 15424031 16898457 18501663 20337466
12820B0337466J665485J575164J895000K372526L424894M602593N321999O367124
12812D7562251P844457R940868J2693855J6230526K0709576K6998726L6533456
12805A78513715M9630258O4855558P7620360P3551214L5396606k3908354o4756946
12798C90902411p3542810o4563390n0577269l8264391k9355629k2780497j7662803
12791I4155622j4038615j1799933r650334p689754n866621m911810m670259l727374
12783C1800922l130960k963497k550922j766414j429526j179601r83277j303582
12775A6493143j601752j323918r20616m38001n49413o83152q83511q12171m72925
12766H807684j41787n16244p40405q5631L56602k32372q72454q35154l24592P4411
$$ plain form
12820 20337466 22002951 23578115 25473115 27845641 31270535 35873128 41195127 47562251
12812 47562251 55406708 65347576 78041431 94271957 114981533 141980259 178513715
12805 178513715 228143973 292999531 370619891 444171105 479567711 455659357 390902411
12798 390902411 317359601 252796211 202218942 163954551 134598922 111818425 94155622
12791 94155622 80117007 68317074 58666740 50976986 45110365 40198555 35528296 31800922
12783 31800922 28669962 25706465 23155543 21389129 19959603 18780002 17796725 16493143
12775 16493143 14891391 13567473 12646857 12208856 11659443 10976291 10092780 9280609 8807684
12766 8807684 8665897 8149653 7409248 7323617 7680219 7447847 6575393 5740239 5415647 5490058
12756E490058l19492m16313k1046K02037K59336K99432J76463j55941p52834n53607
12746D208093m05240p6550j79823j24103k08267j04757L2594n3964M0130k99105
12736B829008n44293k91959R8117J06896L45094J86127k41372N1510N73860M52497
12726C565485l28001n29974j97804J0442J89726K4824k79782k19842l94616m49522
12716A390936O7490K89396m3519m80686P1459P99153J012534O80003L05477L48324
12706D440567M99013N88957N76166Q53227J229007J934994K374318K135452K823658
12697A7455359M029181M697307L364762l72397l347777m452672m438799l448162
12689A3486802k316535j446926j107978j199244j226270j201954p93589m98972
$$ plain form
12756 5490058 5170566 4754253 4733207 4935244 5194580 5494012 5670475 5514534 4761700 4208093
12746 4208093 3802853 3726303 3546480 3422377 3214110 3109353 3141947 3087983 3128113 2829008
12736 2829008 2284715 1992756 2090873 2197769 2542863 2728990 2487618 2539128 3112988 3565485
12726 3565485 3237484 2707510 2509706 2520148 2709874 2734698 2454916 2235074 1840458 1390936
12716 1390936 1458426 1747822 1704303 1223617 1295076 2094229 3106763 3786766 4092243 4440567
12706 4440567 4939580 5528537 6104703 6957930 8186937 10121931 12496249 14631701 17455359
12697 17455359 21484540 26181847 29546609 29174212 25826435 21373763 16934964 13486802
12689 13486802 11170267 9723341 8615363 7416119 6189849 4987895 4194306 3695334
12681C695334m88014n4452P4364J44712J92765Q3695k3639k86699k56265n3651
12671C028150m80193m48718l6662J17870l65012l48013O5236k4807k09483k42212
12661A056156R7421k8612l73137l02723p3321Q4876J81739L0985j83225J43861
12651F34020M96538J22522j2987M4794k579M78525L07492j25819l44658j78939
12641A418909p4850N5044j33476l00550l09951j58587O9427L92536M06389L72237
12631A737128K7533j99734j71357l38114p38543r8761J68846J81082N97684L97804
12621A563568k49861m73525k48270j5596J62386M4474k2169K92448N18867j48980
12611A423342l73414k81821n00365J41538L46214K06605J44694k96253j00072
$$ plain form
12681 3695334 3207320 3152868 3227232 3371944 3564709 3648404 3624765 3338066 3081801 3028150
12671 3028150 2547957 2099239 2062577 2180447 1815435 1467422 1532658 1507851 1298368 1056156
12661 1056156 1153577 1124965 751828 449105 375784 460660 642399 673384 490159 634020
12651 634020 1130558 1253080 1240093 1284887 1282308 1760833 2068325 1942506 1597848 1418909
12641 1418909 1344059 1399103 1265627 965077 655126 496539 565966 958502 1364891 1737128
12631 1737128 1764661 1564927 1393570 1055456 316913 218152 386998 568080 1165764 1563568
12621 1563568 1313707 840182 591912 576316 738702 783176 761007 1053455 1572322 1423342
12611 1423342 1049928 768107 267742 409280 755494 962099 1106793 810540 710468
12602G10468O4311J85009J70781k78374l98290p8128L24974K32862p0029m35374
12592D28210k76010J27542q7735l83185j94425J92420L92290L55772M98389K32785
12582A286053m01530m12464M1708M2770J82916J65699n3666J98702J94983R5687
12572A340858j06116k88368j33084r5032Q822L49327L05783P8769k97010n59752
12562F04197m57393j75630J27794N08591L02351m6748k24840p9973P4859J78472
12552H11680q4161k12187n8882K33300L3604l65897P7126R4835j33134j49644
12542B46640n0206L40746L31864L60424O6330j55939l45799Q1734J20941k494
12532I94241Q8610O4328l9603J14933j36092j48793M74940L39543j57095Q6008
$$ plain form
12602 710468 774779 959788 1130569 852195 453905 375777 700751 933613 863584 428210
12592 428210 152200 279742 192007 -191178 -385603 -193183 199107 554879 1053268 1286053
12582 1286053 884523 472059 513767 556537 739453 905152 851486 1050188 1245171 1340858
12572 1340858 1234742 946374 813290 718258 727080 1076407 1382190 1460959 1163949 604197
12562 604197 146804 -28826 98968 607559 909910 863162 638322 558349 633208 811680
12552 811680 727519 515332 456450 689750 723354 357457 434583 529418 396284 246640
12542 246640 196434 537180 869044 1229468 1295798 1139859 794060 875794 996735 994241
12532 994241 1082851 1147179 1107576 1222509 1086417 937624 1412564 1752107 1595012 1681020
12522A681020L65295k45424p74796n31297k10755p0800j67514k28879l99367K43933
12512c38584O07142J66295k38195k5670J56231o5117R2459m1225j15241K75629
12502D73724K1158j92241o2346j01286J31060O3061j93190l09322k22811R9579
12492b92614J313L6203J93962L3164K59905J24364j15405j95623k21651J32624
12482d3758k8214j01190J68446k93499n64011l76537k31812k17494J59987N37809
12472i90273K25060L0086L02131O25481N43342j38912p12345k89430J310J16346
12462b87204j5925L22834L82992J79152l355l84989k75153J20601M37283M93806
12452I70042J71081m00531n29945l62991l6957N9772j45470l54643j35599J47863
$$ plain form
12522 1681020 2046315 1800891 1026095 494798 284043 213243 45729 -183150 -582517 -338584
12512 -338584 268558 434853 196658 170988 327219 262102 354561 313336 198095 473724
12502 473724 494882 302641 240295 139009 270069 333130 139940 -169382 -392193 -292614
12492 -292614 -291301 -255098 -61136 -27972 231933 356297 240892 45269 -176382 -43758
12482 -43758 -71972 -173162 -4716 -298215 -862226 -1238763 -1470575 -1688069 -1528082 -990273
12472 -990273 -765213 -735127 -432996 192485 735827 596915 -115430 -404860 -403550 -287204
12462 -287204 -303129 19705 402697 581849 578494 193505 -81648 38953 476236 970042
12452 970042 1141123 740592 210647 -152344 -189301 -129529 -274999 -629642 -765241 -617378
12442f17378K53446K06601J88321j13645l43611m32671m86107J90185M89820P5349
12432e89690J79101K9882j55123J1692J10185J31306L73707K00471l94986n30348
12422f33803J43003N53158O78322L73432k24935l51754l4238Q8649K38426K8460
12412H58720k33767l4053J27362l91172l11152Q6857J65816M61307J60402j52676
12402G37644j33861j86117q7265r356p9323J44980k54660q6121j53446n90150
12392f97675l68113l20644J12112N96958M70285K44600K13227Q2506K04035J37510
12382F74801l35099j62251K26267R8417k26717k40229R3719o3840k14498k23740
12372c73170n0988m6513K77998M65991L97308L58291J52637m32882n42752k34155
$$ plain form
12442 -617378 -363932 -157331 30990 -82655 -426266 -858937 -1345044 -1154859 -665039 -589690
12432 -589690 -410589 -380707 -535830 -524138 -413953 -282647 91060 291531 -103455 -633803
12422 -633803 -490800 62358 740680 1114112 889177 537423 503185 591834 830260 858720
12412 858720 624953 590900 718262 327090 15938 102795 268611 729918 890320 737644
12402 737644 603783 417666 330401 321045 241722 386702 132042 45921 -107525 -697675
12392 -697675 -1065788 -1386432 -1274320 -677362 -207077 37523 250750 333256 537291 674801
12382 674801 339702 177451 403718 502135 275418 35189 128908 65068 -149430 -373170
12372 -373170 -424158 -470671 -192673 273318 670626 1028917 1181554 748672 205920 -28235
12362b8235P241j63807k59196k08734J91078M11443J97296k49542k18392k5892
12352c46740K84832P08151L20751J81281J1278m60945j71004o2985j66742J32954
12342D30831J34972j96791j45327J18824L82566K27638j95703l36251l48431M9688
12332A22016J97524k01688l38604j70952P9318J85094L70063J07215l04460J5314
12322F0840j09520J16923M24684L00535k78973m46528j76340L84849N39959k1606
12312G94823l38663p0556O4318j42728l72771l40233j72934j96284R6583K8774
12302f49671O4747n676l75770K8359N1965J10472J41545J70271l6025k04146J88394
12291e15535K14232J36090r7123l44458J82134J71467P8338j79848m9807J98636
$$ plain form
12362 -28235 -20994 -184801 -443997 -652731 -461653 -50210 147086 -102456 -320848 -346740
12352 -346740 -61908 646243 966994 1148275 1159553 698608 527604 464619 297877 430831
12342 430831 565803 369012 223685 342509 725075 952713 757010 420759 72328 122016
12332 122016 319540 117852 -220752 -391704 -312386 -127292 242771 349986 45526 60840
12322 60840 -48680 68243 492927 793462 514489 67961 -108379 276470 816429 794823
12312 794823 456160 385604 449922 307194 -65577 -405810 -578744 -775028 -678445 -649671
12302 -649671 -584924 -590600 -966370 -938011 -886046 -775574 -634029 -463758 -499783 -703929 -515535
12291 -515535 -301303 -165213 -262336 -606794 -424660 -253193 -174855 -354703 -404510 -205874
12281b05874J01436Q3435J07989M32972N53370J95460n0130n633K36626l3816
12271A415835q86480j406396j076252k26865K52638N98063P49609K81427P3952
12262b24469k17218n40394k89486N54321N85753K19524M5942Q4288N2698m04111
12252a33152k71688J79293p555j1554q3514O7410J93377m3451J20068J9701N6204
12241H5139M31495J53646j8584j04058P3203M24935J67950L88651m2601m05921
12231A153855n56620m88402j11970k28808j05620K67598L27850j63579n44728
12222d50424l84998p0576L09902J04068r9681k80168p4071M80044M0750j84816
12212f09970L6043l7710J54604O32705N62278k91695l23491j39928l09928l03051
$$ plain form
12281 -205874 -104438 -21003 86986 519958 1073328 1268788 1218658 1213025 1449651 1415835
12271 1415835 529355 -877041 -1953293 -2180158 -1927520 -1329457 -579848 -298421 -224469
12262 -224469 -441687 -982081 -1271567 -717246 -131493 88031 133973 218261 270959 -133152
12252 -133152 -404840 -225547 -233102 -244656 -328170 -260760 -67383 -110834 9234 28935 85139
12241 85139 516634 670280 651696 547638 620841 1045776 1213726 1602377 1559776 1153855
12231 1153855 597235 108833 -3137 -231945 -337565 -69967 257883 94304 -450424
12222 -450424 -835422 -905998 -596096 -492028 -591709 -871877 -945948 -465904 -425154 -609970
12212 -609970 -573927 -611637 -457033 175672 737950 446255 122764 -17164 -327092 -630143
12202f30143J9203M25427L58950J95346o9670j40866k06667O6650P0029P4693
12192A62952J57066J37164O1192l18410q2573K92220P708l10059l69499j22937
12182c85176J39424K7186q439L22430J82870M8218j86016k10184r9741k08647
12172c78075J31508L24363k58577m37523K17878L82636M81889L86896L69644J9553
12162A240192k52685j44730j00020r2312j93793j33283Q4050M1298n1382k42440
12152A54895l28054l60039j06418N14656N16635K41815K46400k00624j23515K67357
12142H23108K9651m02475L854N47588K06123O9903k99636o82867m32361J6264
12132a20848K11311J72994Q530m2081K16642K14216j08472k49494K9459R7242
$$ plain form
12202 -630143 -610940 -185513 173437 368783 299113 158247 -48420 18230 88259 162952
12192 162952 320018 457182 518374 199964 117391 409611 417319 107260 -262239 -385176
12182 -385176 -245752 -218566 -227005 95425 278295 326513 140497 -69687 -169428 -378075
12172 -378075 -246567 77796 -180781 -618304 -400426 -17790 464099 850995 1220639 1240192
12162 1240192 987507 842777 742757 650445 456652 323369 407419 448717 397335 154895
12152 154895 -173159 -533198 -639616 -124960 391675 633490 879890 679266 555751 823108
12142 823108 852759 450284 454138 1001726 1207849 1277752 978116 295249 -137112 -120848
12132 -120848 90463 263457 271987 229906 446548 660764 552292 302798 332257 429499
12122D29499n2577n47749m11937K52097J13804k73430m88447k71226J94476N26000
12112e29490K80287m1524j24781L47264J97777R5652K51048L74956M41075k24225
12102A068039n60684k73817o2230k04855o8361J26587J85425J15648k95515j9164
12092A1073K878k93933J47610L5276n1469j13911j50112l72133j65701M62774
12082d87648K20935q456L19461J91850J54209r2344l98260p58201j54864K84282
12072g29036K10500L7364K33080Q83451N86352J24020l69114m53945j27987k87391
12062A07294m72669P667K94788L54995M96692r4175m57592l92953j96041K22838
12052a29156K03759J25499N70147L65370l17795k94190L9456j41284q2322o6601
$$ plain form
12122 429499 376922 -170827 -582764 -330667 -216863 -490293 -978740 -1249966 -1055490 -529490
12112 -529490 -249203 -290727 -415508 -68244 129533 225185 476233 851189 1292264 1068039
12102 1068039 507355 233538 171308 -33547 -101908 24679 210104 325752 30237 11073
12092 11073 13951 -279982 -132372 -97096 -148565 -262476 -412588 -784721 -950422 -487648
12082 -487648 -266713 -275169 44292 236142 390351 298007 -100253 -858454 -1013318 -729036
12072 -729036 -518536 -481172 -248092 635359 1221711 1345731 976617 522672 394685 107294
12062 107294 -365375 -357708 -62920 292075 788767 694592 237000 -155953 -351994 -129156
12052 -129156 74603 200102 770249 1135619 817824 523634 563090 421806 339484 272883
12042B72883k29281r7965l4406l44543n6610j1407p7230M03606N23632Q8361K71332
12031G08372M8556j62923L0083K73614j74011o13023n05957K35027N26116m5445
12021C20409j03089j38352m39553l74777J07151J96331K28331k8631n66841k38937
12011a037958J74006N9255J38523K78163J53264J59626J21481k14793j34961J817
12001c01577j91173r4771J63185q1193l278K61768j0884m34805n03777N4055L07758
11990h34692J29129J22658L53215O99455M54418k27854l30419l98904j93602J63595
11980f3001K1038p4222K64289N14963L8702n57684n30079j83024J67085Q02154
11970D00221M18198j83283j2947k06942k51068r4239M9408K42346l0026m0126
$$ plain form
12042 272883 43602 -54363 -88769 -433312 -489922 -501329 -578559 -174953 348679 437040 708372
12031 708372 756928 594005 624088 897702 723691 110668 -395289 -160262 365854 320409
12021 320409 217320 78968 -360585 -735362 -628211 -431880 -203549 -232180 -799021 -1037958
12011 -1037958 -863952 -804697 -666174 -388011 -234747 -75121 46360 -168433 -303394 -301577
12001 -301577 -492750 -587521 -424336 -505529 -508807 -247039 -257923 -692728 -1196505 -1142450 -834692
11990 -834692 -705563 -582905 -229690 469765 924183 696329 365910 -32994 -226596 -63001
11980 -63001 -41963 -116185 148104 663067 701769 144085 -385994 -569018 -401933 400221
11970 400221 818419 635136 622189 415247 164179 69940 119348 361694 331668 291542
11960B91542M3989N8718K07209K52535j64536m77181k69799J52549N4851L30583
11950D80460O2074m24139l63140K99818P60602K57682m30229l80983j64022O4574
11940A62697M8419J89580L05257R17953Q04905P56384O32868J69104K81916J053371
11930E322454J878287K383715K549493K687420L472200M025367L006503N40214
11922B5865653j982897k574184k831376k861718k290159k232574j585372r81903
11914H525470j269703j423523j172573o63498l60868k73592n27305o11989o29912
11905A592507m09030R2407L14212R5400J22504l8796k99585k67937m83063k93617
11895D25002J61022j3097k53887n37146n99326j53189J98430K58625J74452k6261
$$ plain form
11960 291542 335531 394249 601458 853993 689457 212276 -57523 95026 149877 480460
11950 480460 542534 118395 -244745 55073 815675 1073357 643128 262145 98123 162697
11940 162697 211116 400696 705953 1623906 2428811 3185195 3818063 3987167 4269083 5322454
11930 5322454 7200741 9584456 12133949 14821369 18293569 22318936 25325439 25865653
11922 25865653 23882756 21308572 18477196 15615478 13325319 11092745 9507373 8525470
11914 8525470 7255767 5832244 4659671 3996173 3635305 3361713 2834408 2222419 1592507
11905 1592507 1183477 1275884 1590096 1685496 1808000 1769204 1469619 1201682 718619 425002
11895 425002 586024 572927 319040 -218106 -817432 -970621 -772191 -513566 -339114 -365375
11885c65375l47845k16371j7203K36508o6097j43237K85150M63583L40459N81379
11875G50951K88856k76798l91596j47066Q4775j98452l32741J73234J1213j53229
11865a90853o8275J66187K25697L50641K60005j12246n1239j3679J08165M7268
11855G21671K09906j17551n57270j76244K30264J50122J02123J26054L10326k24749
11845G74652o33690j00650J3760l45813j57249j9680K24792M69619O51191O69843
11835A546775n6543l65786j90897p374J02147J79959J07326l96240o33703n2838
11825B32826J40197o4410l78038l18170k15520J15532M25166K39097j17924K0078
11815G8834O15153O87658L1035j41099j54285k74014m38568o50970k35768R3033
$$ plain form
11885 -365375 -713220 -929591 -946794 -710286 -776383 -919620 -634470 -170887 169572 750951
11875 750951 1039807 763009 371413 224347 309122 110670 -222071 -48837 -37624 -190853
11865 -190853 -259128 -92941 132756 483397 743402 631156 579917 566238 674403 721671
11855 721671 931577 814026 256756 80512 310776 460898 563021 689075 999401 774652
11845 774652 140962 40312 54072 -291741 -448990 -468670 -243878 225741 876932 1546775
11835 1546775 1490232 1124446 933549 926175 1028322 1208281 1315607 919367 285664 232826
11825 232826 373023 308613 -69425 -387595 -603115 -487583 -62417 176680 58756 78834
11815 78834 693987 1381645 1412680 1271581 1117296 843282 404714 -246256 -482024 -388991
11805c88991l8814k35548J42199N77323L53343q9268k3761J60033j23451j71554
11795A61511K5950J77957J62487O0916n6504j8979K60045Q3878n1377O7743j19779
11784G53848m10905l81870l08196j29792J38441j3285k07895l57916l84809j84080
11774a486459J24925O57515O19833j2539j06107J49748r9247j49829L34924M17861
11764D50625o74939p57134L86800K78258o8196L00046J65465K10868k45522p14484
11754f68213l09974j14295J07741L98374M62790L16969J24208n1151k97338l85110
11744d15999j9890L50510K13423K40828K35494K17807l5126o29597o06943l35256
11734g84749R5679m5304J60284K90198K50369k53563m54806k06365j8240K76981
$$ plain form
11805 -388991 -427805 -663353 -521154 56169 409512 320244 296483 456516 333065 161511
11795 161511 187461 365418 527905 588821 532317 513338 773383 857261 805884 873627 753848
11784 753848 342943 -38927 -347123 -476915 -338474 -351759 -559654 -917570 -1302379 -1486459
11774 -1486459 -1361534 -704019 -84186 -96725 -202832 -53084 -152331 -302160 32764 450625
11764 450625 -224314 -981448 -594648 -316390 -384586 -84540 80925 291793 46271 -668213
11754 -668213 -978187 -1092482 -984741 -586367 -123577 193392 317600 266449 -30889 -415999
11744 -415999 -435889 -85379 128044 368872 604366 822173 787047 157450 -449493 -784749
11734 -784749 -689070 -734374 -574090 -283892 -33523 -287086 -741892 -948257 -966497 -689516
11724f89516L53119L92417P3042j37605P8376k25178k83454L14017M99499Q5819
11714D60536j12516N5233J7931q1300k80002l66724k55935j196Q5629O8892j46188
11703e55640M0322K05362J6802N160k45099p8301J94688L8275L28945K38075p0697
11692A17892N3592L9230k58876k00727k6614l48435r7686k09848l92301l03917
11682a627690j7060M15339M17800L40513l1914j85770n2635N3505J68380P8848
11672d40684k43876k80845q8879K18331M53727L90634L5357r9902M4137K60725
11662B48725l84701n18947J9439m1605j20146M4348K38975L50261N7622o9656
11652a75685K95059k48020j80490M47229K50686o8089l90187n31354r4632o8918
$$ plain form
11724 -689516 -336397 56020 129062 -8543 69833 -155345 -438799 -124782 374717 460536
11714 460536 348020 403253 421184 339884 59882 -306842 -562777 -563973 -478344 -409452 -555640
11703 -555640 -515318 -309956 -293154 -287994 -533093 -611394 -416706 -378431 -49486 188589 117892
11692 117892 171484 210714 -48162 -248889 -275503 -623938 -721624 -931472 -1323773 -1627690
11682 -1627690 -1644750 -1229411 -811611 -471098 -503012 -688782 -741417 -687912 -519532 -440684
11672 -440684 -684560 -965405 -1054284 -835953 -382226 8408 43765 -56137 -12000 248725
11662 248725 -135976 -654923 -635484 -677089 -797235 -752887 -513912 -163651 -106029 -175685
11652 -175685 119374 -128646 -309136 138093 388779 320690 -69497 -600851 -695483 -764401
11642g64401k30860K95617N66036N51944J23775n11099n16522m13654O4181O9207
11632g65776O4325M0815L70353K62251j7465j59507l6563K06585M12622j9274
11622C58366l38746k86644J36361L42544J79590K18053l55800l15968K52374J70094
11612C60224n58097k72958J13953O59582K27668j10394J85301l7540l91876l30359
11602a54496J11039K46194k49232n16894k67853k26379j3843K01153K69366J56185
11592d44760J70190M81935P33482J75508j49539K39701M82652L21538m7131l0626
11582A932950K77890k31250m59174k02381m6545k30228l40518l19122m26920N0358
11572E060M92220J98919l45218j37777k40609o09091j64373L00151M90490Q7038
$$ plain form
11642 -764401 -995261 -699644 -133608 418336 542111 31012 -485510 -899164 -834983 -765776
11632 -765776 -701451 -660636 -290283 -28032 -45497 -205004 -241567 -34982 377640 358366
11622 358366 19620 -267024 -130663 211881 391471 609524 253724 -62244 190130 360224
11612 360224 -197873 -470831 -356878 302704 530372 419978 605279 567739 175863 -154496
11602 -154496 -43457 202737 -46495 -563389 -831242 -1057621 -1071464 -870311 -600945 -444760
11592 -444760 -274570 207365 940847 1116355 966816 1206517 1689169 2010707 1963576 1932950
11582 1932950 2210840 1979590 1520416 1318035 1271490 1041262 700744 381622 -45298 5060
11572 5060 497280 696199 350981 213204 -27405 -636496 -800869 -500718 -10228 76810
11562G6810l92246j87594J36290L15990R9242q1513q7824N1380m2220m6461M63283
11551C05137K40159r0587j68031j56109L21756N09374P5877j5452J05284J7962
11541A145370j66928k52085r4304J70130J14266K9615j98664j23193j00568K11528
11531G35167L90450N70454O09126K84639j58329o9835L00737K43635j59240K16970
11521B963774O21945Q85372J056354P92791J177827J802018K518028L299436L360640
11512A8478185L064064J769465m21750k404904l214564l176584k530437j858254
11504I705221r68954l77221n09010l04870k12419m25534m23756P2127J45908n1371
11494F650121K14982P10896N69585J020063J708359K175120L064970L900875L446994
$$ plain form
11562 76810 -315436 -503030 -366740 -50750 48492 -33021 -120845 -69465 -111685 -158146 305137
11551 305137 545296 454709 286678 130569 452325 961699 1037576 1022124 1127408 1145370
11541 1145370 978442 726357 632053 802183 916449 946064 747400 624207 523639 735167
11531 735167 1125617 1696071 2305197 2589836 2431507 2361672 2662409 2906044 2746804 2963774
11521 2963774 3585719 4471091 5527445 6320236 7498063 9300081 11818109 15117545 18478185
11512 18478185 21542249 23311714 22889964 20485060 17270496 14093912 11563475 9705221
11504 9705221 8736267 8359046 7850036 7545166 7332747 6907213 6483457 6555584 6701492 6650121
11494 6650121 6865103 7575999 8145584 9165647 10874006 13049126 16114096 20014971 23461965
11485B3461965J799134r03735l048596l498962k998813k760100k518949k205162
11477G326782j336090j078425p93771k32363l58217o92495l52413r2157k34495
11468B156356j19200K60274L81429j01488l99345m06947m15404l81956m30559
11459E43160l21562R4531L87532p99m46060m14962K3410J95862M1526L71978L99428
11448H74044K74909J00373k18637r0391J05680L58232q8416k59655l50314m68389
11438B37436k01836p0869J570j47834j66087Q3371J73155m2093l61225m2420K88589
11427b48243k97749l59362L97178L89808n2165m24535n6816M44533O437j18867
11417c19781J88565K09010J34862k61469J5179Q38008Q92399J40894q0174q8951
$$ plain form
11485 23461965 25261099 24357364 21308768 17809806 14810993 12050893 9531944 7326782
11477 7326782 5990692 4912267 4118496 3886133 3527916 2835421 2483008 2390851 2156356
11468 2156356 2037156 2297430 2678859 2577371 2178026 1771079 1355675 973719 543160
11459 543160 221598 316129 703661 702862 256802 -158160 -134750 61112 102638 474616 874044
11448 874044 1148953 1249326 1030689 940298 1045978 1404210 1315794 1056139 705825 237436
11438 237436 35600 -35269 -33699 -181533 -347620 -264249 -91094 -133187 -494412 -536832 -248243
11427 -248243 -545992 -905354 -508176 -118368 -170533 -595068 -651884 -207351 -200914 -319781
11417 -319781 -131216 77794 212656 -48813 -33634 804374 1696773 1837667 1757493 1668542
11407A668542j8847L8880L15311P17122J012103O3491j078511j046738l39237
11398A332116j1023k90820j54844j67973j66783K20856J00315m96091m359N66872
11388I28266O43523J71369n35311k97846M9021j98068o98188l60949k22985n4112
11378e75280M11668J8393O529L65295K06968j88167j58957J063J47862l6475n3712
11367A45187q137K18347J0654m4396M04977O03402P10680J162999J367205P59654
11357E330572o60748j264380q52893m49115l22443n19301l62617l99757k06531
11348B92787L65237K47455o3332n165Q1459N9587j47352j25414j18885l51108
11338B35269l78355J34712J70171R9272N1947J36862K63984M4138J24178N35905
$$ plain form
11407 1668542 1649695 1688575 2003886 2721008 3733111 3796602 2718091 1671353 1332116
11398 1332116 1321093 1030273 875429 707456 540673 761529 861844 365753 361394 928266
11388 928266 1571789 1743158 1207847 910001 959022 760954 62766 -298183 -521168 -575280
11378 -575280 -163612 -145219 -138690 226605 433573 245406 86449 87512 235374 198899 145187
11367 145187 137050 355397 366051 321655 726632 1330034 2040714 3203713 4570918 5330572
11357 5330572 4669824 3405444 2552551 2103436 1780993 1261692 899075 499318 292787
11348 292787 658024 905479 842147 836982 918441 978028 830676 705262 586377 235269
11338 235269 -143086 -8374 161797 261069 313016 449878 713862 758000 882178 1418083
11328A418083J22263k88891l53360j32201R412N6365p4833J51971K13058l80632
11318G41235l19426J15151k61987l33161Q4840J57185R9892K5843K72963L21519
11308I04054N572l20731m59430m12219q4047J50534L59773L14320R967k34513
11298B33280N6346O20194J78855l38294N0066k29993j89795K93549j33447o20340
11288g9579m19937K52191L61514K10450J83224J85208K71868j80113m65009p6867
11278B42950M07526L87492M1072j39171K0248k15623N775j3568l14459m59001
11268c6759q2964K26667k9804k70426K42717M60835L46210J45726q2625m2793
11258H76784M25439K09538k84924q0088O5005J09499j43699k20936k21324l37708
$$ plain form
11328 1418083 1540346 1251455 898095 765894 775306 831671 756838 908809 1121867 741235
11318 741235 421809 536960 274973 -58188 26652 183837 283729 309572 582535 904054
11308 904054 909626 588895 129465 -282754 -366801 -216267 143506 457826 467793 233280
11298 233280 289626 909820 1088675 750381 800447 570454 380659 674208 540761 -79579
11288 -79579 -499516 -247325 114189 324639 507863 693071 964939 784826 319817 242950
11278 242950 650476 1037968 1079040 939869 960117 744494 750269 736701 422242 -36759
11268 -36759 -119723 106944 77140 -193286 49431 510266 856476 1002202 919577 876784
11258 876784 1302223 1511761 1226837 1146749 1211754 1321253 1177554 956618 735294 397586
11248C97586m31431l28253L58363O46976L30703n5349k29250j27475j65199l3547
11238C63124p094j09721k44399j92309O4083L57913M83677Q6490k45450k31606
11228C24708l39199j34571l92002k41418M10844M54513R6177L10193J61459l49042
11218C01662j54361J54088J84765K86213l4150j4324Q7102j25918k43158l86571
11208E5348l15797k87746j05010k42637K1234L8210K95142Q01283N44977J72869
11198I77873l79061n72206l87516l07684j85040l25041M8793L62543K58250j97101
11188g06190k22189J8062k80213L9555K76175k48180L2708P08538L04891j70948
11178b47791o3141j35398j6635m8825K06711J51396j92600j66704j21479n19958
$$ plain form
11248 397586 -33845 -362098 -3735 643241 973944 918595 689345 561870 396671 363124
11238 363124 356030 246309 1910 -190399 -126316 231597 715274 801764 556314 324708
11228 324708 -14491 -149062 -541064 -782482 -371638 82875 179052 489245 650704 301662
11218 301662 147301 301389 486154 772367 738217 723893 810995 685077 441919 55348
11208 55348 -260449 -548195 -653205 -895842 -874608 -836398 -541256 260027 805004 977873
11198 977873 598812 26606 -360910 -668594 -853634 -1178675 -1129882 -767339 -509089 -706190
11188 -706190 -928379 -910317 -1190530 -1150975 -874800 -1122980 -1090272 -381734 -76843 -247791
11178 -247791 -310932 -446330 -462965 -511790 -305079 -153683 -346283 -512987 -634466 -1154424
11168a154424q0000K03756O885Q5248L10506O43005P35891J60501m55686j23305
11158C32377J50241j4665L23673P8089j68008k91228m48794k34457M8588K40228
11148A6044j52303j43808K97423N5416o50209j14169O63928M25569J31786r2302
11138D37375n2421O1515l2494l06744k45002J30248J06425j13042r6944R4737
11128a6347j43096p4425P6309j43597k61708j81708J38531L03615J08512L51172
11118A57258M69774j19549j10854k30572m52434k53382L5883K72699P16040L53711
11108H38574k40007K56519J60285m31897M3636J93348K03992k92526n71976k0359
11098A39589k02283k52572J45498P03201L43870K50524k2410l41842m92406k52812
$$ plain form
11168 -1154424 -1234424 -1030668 -1023783 -938535 -628029 14976 750867 911368 455682 332377
11158 332377 482618 467953 791626 869715 701707 410479 -38315 -272772 -224184 16044
11148 16044 -136259 -280067 17356 72772 -577437 -691606 -27678 397891 529677 437375
11138 437375 384954 446469 413975 107231 -137771 -7523 98902 -14140 -111084 -16347
11128 -16347 -159443 -233868 -157559 -301156 -562864 -744572 -606041 -302426 -193914 157258
11118 157258 627032 507483 396629 166057 -286377 -539759 -503876 -231177 484863 838574
11108 838574 598567 855086 1015371 583474 627110 820458 1024450 731924 159948 139589
11098 139589 -62694 -315266 -169768 533433 877303 1127827 1105417 763575 271169 18357
11088A8357p0236o1916L04055L20894j54699j90244m48759m21346l47906o7286
11078a119086N5803K02914K43978n4332j74062k05971J39921M42660K20064n1486
11068b99597l05020k80711R9958L28893J24250L38380M02409J32962l48436m03429
11058b10341k30965j07668k21717R1871J65843J53516M30366K25679j23715j70489
11048B380P0264o23M7434J41950j83051k61788J37849K37587k07511l44538m3441
11037d03488K97354m2279l93693j1379M28787L01590Q149K98318K6390j21848
11027C87901m3340l15601k61392J56393k40622L6058L13177J66089M56614K76993
11017I32270l73916k96817R1633L78913L2417o02547p32541k49431K91646k32969
$$ plain form
11088 18357 -51879 -113795 190260 511154 356455 166211 -282548 -703894 -1051800 -1119086
11078 -1119086 -1063283 -860369 -616391 -670723 -844785 -1050756 -910835 -468175 -248111 -299597
11068 -299597 -604617 -885328 -785370 -456477 -332227 6153 408562 541524 193088 -210341
11058 -210341 -441306 -548974 -770691 -678820 -512977 -359461 70905 296584 172869 2380
11048 2380 72644 72021 119455 261405 78354 -183434 -45585 192002 -15509 -360047 -403488
11037 -403488 -106134 -148413 -542106 -553485 -124698 176892 185041 483359 509749 387901
11027 387901 344561 28960 -232432 -76039 -316661 -280603 32574 198663 655277 932270
11017 932270 558354 261537 353170 732083 764500 161953 -570588 -820019 -528373 -761342
11007g61342l89030J18921M22849K07168j90222J5122K15909j54527Q0877O30448
10997A96173K31171J90340K74728j04280m35605l22844l20207j08526j8994k93752
10987g11796j39985n792l45798j97582K99873R6605J96169k0355m54942k5848
10977a309451L20201J90395l4095K07619K00402o7702r3895N5712L96943P82404
10967F48533J76840n26417n54259n7285J80768K15281L27610j59634l90984N8705
10957h0842n1327j95227j0619k25769j96425J20041K25118J64346k07574k00633
10947f58911J39746M9256J03466j47821k8336J91797M8122K4309j18842k72040
10937f69254l79102m98985n41874l2667L54876L05920J29552J96374J30998M85109
$$ plain form
11007 -761342 -1150372 -1031451 -608602 -401434 -591656 -576534 -360625 -515152 -434275 196173
10997 196173 427344 617684 892412 788132 352527 29683 -290524 -399050 -418044 -711796
10987 -711796 -851781 -857573 -1203371 -1400953 -1101080 -1004475 -808306 -828661 -1283603 -1309451
10977 -1309451 -989250 -798855 -832950 -625331 -424929 -492631 -586526 -530814 -133871 648533
10967 648533 825373 298956 -255303 -312588 -131820 83461 411071 251437 -139547 -80842
10957 -80842 -132169 -327396 -338015 -563784 -760209 -640168 -415050 -250704 -458278 -658911
10947 -658911 -519165 -469909 -366443 -514264 -542600 -350803 -302681 -278372 -397214 -669254
10937 -669254 -1048356 -1547341 -2089215 -2121882 -1767006 -1461086 -1331534 -1135160 -1004162 -519053
10927e19053M63566M2521o468K79043K44634k15037k56617k80652j97597o733
10917d52393K25438p8256j92840m50660p43327J43292P27876L80424K30475O0812
10907a49159j23659l24979j65442J57178K71705o2851J47733L37760j61270l04463
10897c77447o6217O3716p1777j00684J76406L44842j66768l92201j21501M06647
10887c04984J30770m25422J8044L56930M08682j65148m05662j08652j20005k05752
10877h21199K42122O91025M53984j00924l51258m2723J33534k68095n29491m10298
10867a003323J5838P3570J84720L37704J33080J01814K59052R4559k51584m17684
10857d72254L1533J38176J28277M16673J29365J53513k11990n43528j58696J1347
$$ plain form
10927 -519053 -55487 -12966 -19434 259609 504243 289206 32589 -248063 -445660 -452393
10917 -452393 -226955 -305211 -498051 -948711 -1692038 -1548746 -820870 -440446 -209971 -149159
10907 -149159 -272818 -597797 -763239 -606061 -334356 -397207 -249474 88286 -72984 -377447
10897 -377447 -443664 -379948 -451725 -552409 -376003 -31161 -197929 -590130 -711631 -304984
10887 -304984 -174214 -599636 -581592 -224662 184020 18872 -386790 -495442 -615447 -821199
10877 -821199 -579077 111948 565932 465008 113750 71027 204561 -63534 -593025 -1003323
10867 -1003323 -987485 -913915 -729195 -391491 -258411 -156597 102455 197014 -54570 -472254
10857 -472254 -440721 -302545 -174268 242405 371770 525283 313293 -230235 -388931 -377584
10847c77584j84961p2085o0787O1563p4887R4299K6121j67517M3253J61494K53438
10836b97653J57168Q5695J717L0591p7080k10103j19762o6572m2376K5209q9425
10825f02591j89686k05130M28849J88740M4259J6952l70756r0798K20759K86930
10815b72472L63945K84198l81496k38318p8631j3654K73310j47444l15781m14219
10805i40562l40901J22277O1519m6106L36859N50685P13457K69545l22086J59788
10795E64475j16213l13804k44017m81657l5790M45999N61280O4124m47771o90229
10785f93603m92640Q8901O72176O31626J64329l45534n40359j74023n0805j54325
10775h94257k66306J3565K77819M08363J1421l14050K60181N26199K8746k28693
$$ plain form
10847 -377584 -562545 -634630 -695417 -633854 -708741 -614442 -588321 -755838 -712585 -551091 -297653
10836 -297653 -140485 -54790 -53073 -22482 -99562 -309665 -429427 -495999 -538375 -513166 -602591
10825 -602591 -792277 -997407 -568558 -379818 -335559 -318607 -689363 -780161 -559402 -272472
10815 -272472 91473 375671 -5825 -244143 -322774 -336428 -63118 -210562 -526343 -940562
10805 -940562 -1281463 -1159186 -1097667 -1143773 -806914 -256229 457228 726773 404687 564475
10795 564475 448262 134458 -109559 -591216 -627006 -181007 380273 444397 -3374 -693603
10785 -693603 -1186243 -1097342 -425166 206460 370789 25255 -515104 -689127 -739932 -894257
10775 -894257 -1160563 -1146998 -869179 -460816 -449395 -763445 -503264 22935 51681 -177012
10765a77012K52328M95032M12815Q6967j82311l09871l82093j06537L70158j55308
10755C04168j77981J53692k21441j88831k41688L8937M03613O1910K26030K99541
10745F57950m7837m60709m49084K2664L18037J62173J74240j68659k44943L32999
10735B96831K02630j56707k88733k58060R9874M7123k41821j33668q4583q2191
10725e99305o7290J45576J16720J47433q3483o837P3960l45781j47395j03249
10715h69651L57641N74656O7575J75760M29334P7424l25462m90490l21538J30935
10705a93816K01149k34178m63416o62707k75964N26157O04932K69893J11414j00965
10695b17501n23922m32651N029M2342J77680J72209J63463M09940L71795L11217
$$ plain form
10765 -177012 75316 570348 983163 1070130 887819 577948 195855 89318 459476 304168
10755 304168 126187 279879 58438 -130393 -372081 -333144 70469 132379 358409 657950
10745 657950 610113 149404 -299680 -277016 41021 203194 377434 208775 -36168 296831
10735 296831 499461 342754 54021 -204039 -104165 -57042 -298863 -432531 -517114 -599305
10725 -599305 -666595 -521019 -404299 -256866 -340349 -347186 -273226 -619007 -766402 -869651
10715 -869651 -512010 62646 130221 305981 735315 812739 487277 -3213 -324751 -193816
10705 -193816 7333 -226845 -690261 -1352968 -1628932 -1102775 -497843 -227950 -116536 -217501
10695 -217501 -741423 -1174074 -1169045 -1126703 -949023 -776814 -613351 -203411 168384 479601
10685D79601L83075n1111n60570k78218j93744l57056l88197L09095J96469J11904
10675c48752K94444J87575J81494J60043l27146l90531k2480K11055J04764Q2150
10665A32616p9729k64178N2541J24038k37413n55419m19861J46861K10196R3177
10655g97171k53815l67513k00042L09367K28624R8777J55934L52335K20837q6579
10645c39246M0507J0640J61031J84934m8332l03015r8634j79784n4942L9771l43455
10634i30525k7024k8620m0964K62026K64072o566j53637J99041P857j96911j38683
10623g89934J73771O64986O64378L65509N8645k42765j53372K79230N37243L7215
10613A594906k02413m08771m85305m37391l09120m01633O647K45109K73708J34202
$$ plain form
10685 479601 862676 811565 250995 -27223 -220967 -578023 -966220 -657125 -460656 -348752
10675 -348752 -54308 133267 314761 474804 147658 -242873 -265353 -54298 50466 132616
10665 132616 52887 -211291 -158750 -34712 -272125 -827544 -1247405 -1100544 -890348 -797171
10655 -797171 -1050986 -1418499 -1618541 -1309174 -1080550 -981773 -825839 -473504 -252667 -339246
10645 -339246 -298739 -288099 -127068 57866 9534 -293481 -392115 -571899 -626841 -587070 -930525
10634 -930525 -957549 -986169 -1027133 -765107 -501035 -507601 -661238 -462197 -454340 -651251 -789934
10623 -789934 -616163 48823 713201 1078710 1137355 894590 741218 1020448 1557691 1594906
10613 1594906 1392493 983722 498417 61026 -248094 -649727 -643080 -397971 -124263 9939
10603I939J03696K13734j51581k78016P734J20435p9879n37968l00942L47424
10593e45424k2645k54816j50688j75637J79462M82475N46476M12573J29963k31403
10583C70336r7914l03768l46952J29629K59435J02618k10314m28546k27083J37544
10573f15015L82898L56490J90064J70989K18082L75366J33765n0445k18628k31087
10563G12479l08558l67552n22864j91217M95264M09938R1423Q6868j39169m05059
10553a38447l19582M59921J21069l90951o6963N08074M13894O6676m7890k83774
10543C22027k93160N3821Q8705K69479N5453p9279M71145j67213o15188J41274
10533B47064K86170k39061j07561j48532k97588j14129J98098M62704K57218l27526
$$ plain form
10603 9939 113635 327369 175788 -102228 -94494 25941 -53938 -591906 -892848 -545424
10593 -545424 -568069 -822885 -973573 -1149210 -969748 -487273 59203 471776 601739 370336
10583 370336 272422 -31346 -378298 -248669 10766 113384 -96930 -525476 -752559 -615015
10573 -615015 -232117 124373 314437 485426 703508 1078874 1212639 1162194 943566 712479
10563 712479 403921 36369 -486495 -677712 -182448 227490 318913 405781 266612 -138447
10553 -138447 -458029 1892 122961 -267990 -334953 173121 587015 653691 605801 322027
10543 322027 28867 82688 171393 440872 496325 417046 888191 720978 105790 247064
10533 247064 533234 294173 186612 38080 -259508 -373637 -175539 287165 544383 216857
10523B16857k31282L41613K20521l04936l72630L3710L16827L6153n60380o13986
10513i17533k24972j61619q6032L60052L37160n1240k19405K75624O04285N75671
10503D91991J54641m6473j27080r7673j19255o3403k53822m53162J59367K67296
10493h7573n5899L2401J65955M7973j59719k06778k68746j13119K50871J01233
10483b93401Q5562j17188J93504R91697M34768l16050n40577l08019j08572o5654
10473d3930M3460K48574O9864j31626J77149k3730J2549Q2809l41862l60681j93471
10462d60895P0949K37951L60538J89287k45680j40510Q1716j04171m99068o04242
10452a114125j15501L34197M95733N27761K52481J46971l36912o72833l12838
$$ plain form
10523 216857 -14425 327188 547709 242773 -129857 -96147 220680 256833 -303547 -917533
10513 -917533 -1142505 -1304124 -1390156 -1030104 -692944 -744184 -963589 -687965 -83680 491991
10503 491991 646632 600159 473079 375406 256151 192748 -61074 -514236 -354869 -87573
10493 -87573 -143472 -111071 54884 102857 -56862 -263640 -532386 -645505 -394634 -293401
10483 -293401 -207839 -325027 -131523 860174 1294942 978892 438315 130296 21724 -43930
10473 -43930 -470 248104 317968 186342 363491 339761 352310 435119 93257 -267424 -460895
10462 -460895 -389946 -151995 208543 397830 152150 11640 93356 -10815 -509883 -1114125
10452 -1114125 -1229626 -895429 -399696 128065 380546 527517 190605 -482228 -795066
10443g95066J66060J44257L19952J40310j59041m1611K35192j29506J91103M65821
10433E37471q7116M9937K784m16900n68696J68866K14675j86130j26957o3606
10423d75672l9897J48404R4087k24381J8849K03319K74910J63402j34485j74177
10413a45641r3306J3059K73872k29897m27868o8598J02952o1313l23324J90330
10403g69734M11910k7124p8870L24174K42980j70681l75766j19820M28306M26550
10393B91925J34369j09488l41284k17050q5390j34544r3726p39J1825k15834j27764
10382h87700K43147M50313j6964l92614j34649j34598l92514j49662k51743J73662
10372a493322M13474K50425K21850J70346K27820J01525j02117n29429l57964
$$ plain form
10443 -795066 -629006 -484749 -164797 -24487 -183528 -225139 10053 -119453 71650 537471
10433 537471 450355 500292 503076 86176 -482520 -313654 -98979 -285109 -412066 -475672
10423 -475672 -515569 -367165 -273078 -497459 -478610 -275291 -381 163021 28536 -145641
10413 -145641 -238947 -225888 47984 -181913 -609781 -678379 -575427 -636740 -960064 -769734
10403 -769734 -357824 -384948 -463818 -139644 103336 -67345 -443111 -562931 -134625 291925
10393 291925 426294 316806 -24478 -241528 -326918 -461462 -555188 -555927 -544102 -759936 -887700
10382 -887700 -644553 -194240 -211204 -603818 -738467 -873065 -1265579 -1415241 -1666984 -1493322
10372 -1493322 -1079848 -829423 -607573 -437227 -209407 -107882 -209999 -739428 -1097392
10363a097392q7187L07291O95592J86825j33731k52144j73495l52950l16278N7503
10353a165966J84955J39122L32663K54038j9764m2052L47521O78555K97498k01227
10343H05343o36082p23183q2821K99269n6857m8941M45977M38472J4168k63136
10333A92209l6097k718J31683q3228k28608J66318J58730N3550J57707K09066
10323G18612L57074O2192l49444m0295J01929k08386k54769J47766M1143k86319
10313B89503k28555j85367j89630J42068O7296K1774p1040k36261k50418J82855
10303d57775J34569J43879M73938P8959l68583m28929m47653O2753M27893N81781
10293B00832N98707L87527J25229n32917k41230k09421l31732j31666j36627p741
$$ plain form
10363 -1097392 -1184579 -877288 -181696 5129 -128602 -380746 -554241 -907191 -1223469 -1165966
10353 -1165966 -981011 -841889 -509226 -255188 -274952 -317004 30517 709072 1006570 805343
10343 805343 169261 -553922 -636743 -337474 -394331 -443272 2705 441177 455345 192209
10333 192209 156112 153394 285077 201849 -26759 139559 298289 351839 509546 718612
10323 718612 1075686 1137878 788434 748139 850068 641682 386913 534679 575822 289503
10313 289503 60948 -124419 -314049 -171981 -104685 -82911 -153951 -390212 -640630 -457775
10303 -457775 -323206 -179327 294611 373570 4987 -423942 -871595 -808842 -380949 200832
10293 200832 799539 1187066 1312295 779378 538148 328727 -3005 -134671 -271298 -279039
10283b79039J87767L43980o0073k76766M2848m2913n94515l79107J09421K11181
10273g37216O7491q934J82351k8356j32464J24149K59465j32505j98813J38364
10263d66468J26524K9326m61063j1699L68442j18744p9948M06837K63289k26089
10253a69593j61582J84366L85273J79938j03041k18097J31005J48458o5086l49028
10243c7387m43277J34105J89739o1078k34340m4680M40623J61110n43905m24586
10233h63676o9050M36979P01731L89354q9926l29567j61848J56827K00713L84067
10223G55604K18473J26665J55269K64392J51095j63473k5849K91002N17587L6373
10213B327138k21390j83465m4428k33532q12018m73234o5877j50805Q8231l4287
$$ plain form
10283 -279039 -91272 252708 192635 -84131 -41283 -84196 -678711 -1057818 -948397 -737216
10273 -737216 -669725 -678659 -496308 -524664 -657128 -532979 -273514 -406019 -604832 -466468
10263 -466468 -339944 -310618 -771681 -783380 -414938 -533682 -613630 -206793 56496 -169593
10253 -169593 -331175 -146809 238464 418402 315361 97264 228269 376727 311641 -37387
10243 -37387 -480664 -346559 -156820 -217898 -452238 -496918 -56295 104815 -439090 -863676
10233 -863676 -932726 -495747 205984 595338 505412 175845 13997 170824 371537 755604
10223 755604 974077 1100742 1256011 1520403 1671498 1508025 1482176 1773178 2290765 2327138
10213 2327138 2105748 1922283 1877855 1644323 832305 359071 293194 142389 230620 196333
10203A96333j15296O4598L97838Q8171O339o9928m6628j39411l9828j42460l43921
10192a44193L797k481r1579J1867Q2675m0102P4046J8527m69547l03345K58974
10181f01361R1421k14897L22254O15680M32101J24405K2471k85483k50590O2715
10171C18716N17818M99575k51815l23305m196m40533l36649J64592K04875J0981
10161C60059l15557k92087Q0611J94003j15208j13973j55999j15965J81549K17301
10151g5266l05820q8694J36662J29739m1722J27093j73011j42688l49652l03572
10141a086931k16138o2936J65557o344k9052J14195K04619O1908N7592L03160
10131d94370j14464k14525K36553N82956Q6179m7548L19091R8307l11644K766
$$ plain form
10203 196333 81037 145635 543473 631644 637983 568055 521427 382016 342188 199728 -144193
10192 -144193 -140396 -142877 -234456 -222589 -139914 -180016 -105970 -87443 -556990 -860335 -601361
10181 -601361 -509940 -724837 -402583 213097 645198 769603 792074 506591 256001 318716
10171 318716 836534 1336109 1084294 760989 756793 316260 -20389 144203 349078 360059
10161 360059 44502 -247585 -166974 27029 -88179 -202152 -358151 -474116 -292567 -75266
10151 -75266 -381086 -469780 -333118 -203379 -245101 -118008 -291019 -433707 -783359 -1086931
10141 -1086931 -1303069 -1366005 -1200448 -1206792 -1235844 -1121649 -917030 -855122 -797530 -494370
10131 -494370 -608834 -823359 -586806 -3850 82329 34781 353872 452179 140535 143301
10121A43301M21826J792L47354M86455J89820N3179Q5676M54864Q15760J107997
10111D108024J339318J910511K540951L019392M433645N978839P294903P028273
10103C7653856Q99407n693945p095059n923874m122279l262807k529964j779749
10095H145586j560311j165433q44136m90405l32400p70044r22502k15590J16257
10086A961022l3971o2944j89657m93527j50586n3903k51598k40446l79832O770
10076A11328L85558K35817K18898L625j82205q0979r4755n2496o7826k64009j00438
10065A12518J44836K91787k1598j08051j61099K5372K60656L3447k99803m98944
10055b20879R7027L76069L48212R8547L56182J99065k79097j72656M1539k07838
$$ plain form
10121 143301 565127 566919 914273 1400728 1590548 1643727 1729403 2184267 3000027 4108024
10111 4108024 5447342 7357853 9898804 12918196 17351841 23330680 30625583 37653856
10103 37653856 38553263 32859318 25764259 19840385 15718106 12455299 9925335 8145586
10095 8145586 6585275 5419842 4575706 4085301 3752901 2982857 2060355 1844765 1961022
10086 1961022 1927051 1864107 1674450 1180923 1030337 976434 724836 484390 104558 111328
10076 111328 496886 732703 951601 955226 773021 692042 597287 544791 476965 212956 112518
10065 112518 257354 549141 527543 419492 258393 283765 544421 577868 278065 -220879
10055 -220879 -123852 252217 600429 698976 1055158 1254223 975126 802470 844009 636171
10045F36171j21979M7867k33782n94336o30623o7521M20127M06711P3978j73172
10035b36559j13437N68393M45071o805M088J99810o773l29894k90883l25771j27175
10024b19935J65247M60453O830n33834J8955L40422M991j28856k77824l5479K48925
10013D9895L19083j3867n718l90241k91364J13395K58814j52288j6271n8039o3083
10002b49684j22325j46718M5922j50665j846J27593J91711n2850J15427j84022
9992d27457r1867K04485K09622J81149N1955j06291j28950k03216q4196n9546
9982d54312o53505k7935O07999M89206l5585m1379o693O0479J9990o9509q5266
9971a96510J06530L14693m72629m02525j57859L84990O61256K16756j63732m17262
$$ plain form
10045 636171 514192 562059 328277 -266059 -896682 -964203 -544076 -137365 -63387 -236559
10035 -236559 -349996 218397 663468 656663 660751 860561 853788 523894 233011 -92760 -219935
10024 -219935 -54688 405765 412595 -121239 -102284 238138 243129 114273 -163551 -199030 49895
10013 49895 368978 355111 349393 -40848 -332212 -218817 39997 -112291 -128562 -186601 -249684
10002 -249684 -372009 -518727 -472805 -623470 -625316 -497723 -306012 -358862 -243435 -427457
9992 -427457 -519324 -314839 -105217 75932 127887 21596 -107354 -310570 -394766 -454312
9982 -454312 -1107817 -1135752 -527753 -38547 -74132 -115511 -122204 -61725 -41735 -111244 -196510
9971 -196510 -89980 224713 -247916 -650441 -808300 -423310 237946 454702 290970 -126292
9961a26292n68017k498k3623k2766K41649K99841L50986Q7257j70271J76622L8129
$$ plain form
9961 -126292 -694309 -696807 -720430 -743196 -501547 -201706 149280 236537 66266 242888 281017
$$ [...]
##END NTUPLES=NMR SPECTRUM
##END=
