##TITLE=C13_SL88-Dau(f7)
 CDCl3, 21600 sc

 11.5.2021
##JCAMPDX= 6.0         $$ Bruker NMR JCAMP-DX V2.0
##DATA TYPE= NMR SPECTRUM
##DATA CLASS= NTUPLES
##ORIGIN= UXNMR, Bruker Analytische Messtechnik GmbH
##OWNER= root
$$ XWIN-NMR		Version 3.5
$$ Wed May 12 09:55:10 2021 Russian Standard Time (UT+4h)  she@DPX200
##.OBSERVE FREQUENCY= 50.327896
##.OBSERVE NUCLEUS= ^13C
##.ACQUISITION MODE= SIMULTANEOUS
##.ACQUISITION SCHEME= undefined
##.AVERAGES= 21600
##.DIGITISER RES= 17
##SPECTROMETER/DATA SYSTEM= spect
##.PULSE SEQUENCE= zgpg30
##.SOLVENT NAME= CDCl3
##.SHIFT REFERENCE= (INTERNAL, CDCl3, 0, 222.653)
##AUDIT TRAIL= $$ (NUMBER, WHEN, WHO, WHERE, WHAT)
$$ ##TITLE= Audit trail, XWIN-NMR		Version 3.5
$$ ##JCAMPDX= 5.01
$$ ##ORIGIN= Bruker BioSpin GmbH
$$ ##OWNER= she
$$ F:/spectra/data/she/nmr/c13/1/pdata/1/auditp.txt
$$ ##AUDIT TRAIL=  $$ (NUMBER, WHEN, WHO, WHERE, WHAT)
(   1,<2021-05-12 09:54:01.62 +0400>,<she>,<DPX200>,
      <created by zg, POWCHK disabled, PULCHK disabled
       terminated by command 'halt'
       configuration hash MD5:
       00 E9 B6 7A A2 85 ED C7 34 08 36 98 17 FE 4E 26
       data hash MD5: 32K
       74 34 BE 57 91 9F 28 D3 64 78 E6 7A 62 A1 BC 21>)
(   2,<2021-05-12 09:54:05.54 +0400>,<she>,<DPX200>,
      <Start of raw data processing
       efp BC_mod = 2 LB = 1 FT_mod = 6 PKNL = 1 PHC0 = -273.5427 PHC1 = 32.96243 SI = 32K 
       data hash MD5: 32K
       A9 56 6F 59 7A FF 34 F0 C8 B0 65 6C 4C A8 69 08>)
(   3,<2021-05-12 09:54:08.09 +0400>,<she>,<DPX200>,
      <abs ABSG = 5 
       data hash MD5: 32K
       47 87 68 74 A4 FF 11 10 0E 8E 68 66 20 48 55 52>)
(   4,<2021-05-12 09:54:36.62 +0400>,<she>,<DPX200>,
      <pk PHC0 = -0.2029137 PHC1 = 0 
       data hash MD5: 32K
       A4 AF CE 0E 18 5E 6C 3A 06 1B E0 2F 78 09 59 B3>)
(   5,<2021-05-12 09:54:40.23 +0400>,<she>,<DPX200>,
      <abs ABSG = 5 
       data hash MD5: 32K
       85 D3 C3 C1 07 3B BE A7 3A D2 94 CC C7 80 E9 22>)
$$ ##END=
$$ 
$$ hash MD5
$$ 94 7A FD F5 8A C3 3A 82 5F 2F 2D C3 F1 7B 73 B2
##$RELAX= 
##$RELAX= 
##$RELAX= 
##$RELAX= 
##$RELAX= 
##$RELAX= 
##$RELAX= 
##$RELAX= 
$$ Bruker specific parameters
$$ --------------------------
##$DU= <F:/spectra>
##$EXPNO= 1
##$NAME= <c13>
##$PROCNO= 1
##$TYPE= <nmr>
##$USER= <she>
##$AMP= (0..31)
100 100 100 100 100 100 100 100 100 100 100 100 100 100 100 100 100 100 
100 100 100 100 100 100 100 100 100 100 100 100 100 100 
##$AQSEQ= 0
##$AQ_mod= 1
##$AUNM= <au_zg>
##$AUTOPOS= <>
##$BF1= 50.322709
##$BF2= 200.13
##$BF3= 50.322709
##$BF4= 500.13
##$BF5= 500.13
##$BF6= 500.13
##$BF7= 500.13
##$BF8= 500.13
##$BYTORDA= 1
##$CFDGTYP= 0
##$CFRGTYP= 5
##$CHEMSTR= <none>
##$CNST= (0..31)
1 1 145 1 1 1 1 1 1 1 1 1 1 1 1 1 1 1 1 1 1 1 1 1 1 1 1 1 1 1 1 1 
##$CPDPRG= <waltz16>
##$CPDPRG1= <>
##$CPDPRG2= <waltz16>
##$CPDPRG3= <>
##$CPDPRG4= <mlev>
##$CPDPRG5= <mlev>
##$CPDPRG6= <mlev>
##$CPDPRG7= <mlev>
##$CPDPRG8= <mlev>
##$CPDPRGB= <>
##$CPDPRGT= <>
##$D= (0..31)
$$ [...]
##$SUBNAM4= <"">
##$SUBNAM5= <"">
##$SUBNAM6= <"">
##$SUBNAM7= <"">
##$SUBNAM8= <"">
##$SUBNAM9= <"">
##$SW= 239.972175391363
##$SWIBOX= (0..15)
0 1 3 0 0 0 0 0 0 0 0 0 0 0 0 0 
##$SW_h= 12077.2946859903
##$TD= 32768
##$TD0= 1
##$TE= 0
##$TE2= 300
##$TE3= 300
##$TEG= 300
##$TL= (0..7)
120 120 120 120 120 120 120 120 
##$TP= (0..7)
150 150 150 150 150 150 150 150 
##$TP07= 0
##$TPNAME0= <>
##$TPNAME1= <>
##$TPNAME2= <>
##$TPNAME3= <>
##$TPNAME4= <>
##$TPNAME5= <>
##$TPNAME6= <>
##$TPNAME7= <>
##$TPOAL= (0..7)
0.5 0.5 0.5 0.5 0.5 0.5 0.5 0.5 
##$TPOFFS= (0..7)
0 0 0 0 0 0 0 0 
##$TUNHIN= 0
##$TUNHOUT= 0
##$TUNXOUT= 0
##$USERA1= <user>
##$USERA2= <user>
##$USERA3= <user>
##$USERA4= <user>
##$USERA5= <user>
##$V9= 5
##$VALIST= <valist>
##$VCLIST= <CCCCCCCCCCCCCCC>
##$VD= 0
##$VDLIST= <DDDDDDDDDDDDDDD>
##$VPLIST= <PPPPPPPPPPPPPPP>
##$VTLIST= <TTTTTTTTTTTTTTT>
##$WBST= 1024
##$WBSW= 4
##$XGAIN= (0..3)
0 0 0 0 
##$XL= 0
##$YL= 0
##$YMAX_a= 131148850
##$YMIN_a= -113377802
##$ZGOPTNS= <>
##$ZL1= 120
##$ZL2= 120
##$ZL3= 120
##$ZL4= 120
##$ABSF1= 222.6533
##$ABSF2= -17.34351
##$ABSG= 5
##$ABSL= 3
##$ALPHA= 0
##$AQORDER= 0
##$ASSFAC= 0
##$ASSFACI= 0
##$ASSFACX= 0
##$ASSWID= 0
##$AUNMP= <proc_1d>
##$AZFE= 0.1
##$AZFW= 0.5
##$BCFW= 0
##$BC_mod= 2
##$BYTORDP= 0
##$COROFFS= 0
##$CY= -3
##$DATMOD= 1
##$DC= 0
##$DFILT= <>
##$DTYPP= 0
##$F1P= 0
##$F2P= 0
##$FCOR= 0.5
##$FTSIZE= 32768
##$FT_mod= 6
##$GAMMA= 0
##$GB= 0
##$INTBC= 1
##$INTSCL= 4.134877e-10
##$ISEN= 128
##$LB= 1
##$LEV0= 0
##$LPBIN= 0
##$MAXI= 10000
##$MC2= 0
##$MEAN= 0
##$ME_mod= 0
##$MI= 0.1934396
##$NCOEF= 0
##$NC_proc= 3
##$NLEV= 6
##$NOISF1= 120.0001
##$NOISF2= 80.00006
##$NSP= 0
##$NTH_PI= 0
##$NZP= 0
##$OFFSET= 222.6533
##$PC= 1.4
##$PHC0= -273.7456
##$PHC1= 32.96243
##$PH_mod= 1
##$PKNL= yes
##$PPARMOD= 0
##$PSCAL= 0
##$PSIGN= 0
##$REVERSE= no
##$SF= 50.3227301278049
##$SI= 32768
##$SIGF1= 140
##$SIGF2= 120
##$SINO= 11.81781
##$SIOLD= 32768
##$SREGLST= <13C.CDCl3>
##$SSB= 0
##$STSI= 32768
##$STSR= 0
##$SW_p= 12077.2946859903
##$SYMM= 0
##$S_DEV= 0
##$TDeff= 32768
##$TDoff= 0
##$TI= <>
##$TILT= no
##$TM1= 0
##$TM2= 0
##$TOPLEV= 0
##$USERP1= <user>
##$USERP2= <user>
##$USERP3= <user>
##$USERP4= <user>
##$USERP5= <user>
##$WDW= 1
##$XDIM= 32768
##$YMAX_p= 273999594
##$YMIN_p= -1451406
$$ End of Bruker specific parameters
$$ ---------------------------------
##NTUPLES= NMR SPECTRUM
##VAR_NAME=  FREQUENCY,     SPECTRUM/REAL,   SPECTRUM/IMAG
##SYMBOL=    X,             R,               I
##VAR_TYPE=  INDEPENDENT,   DEPENDENT,       DEPENDENT
##VAR_FORM=  AFFN,          ASDF,            ASDF
##VAR_DIM=   32768,         32768,           32768
##UNITS=     HZ,            ARBITRARY UNITS, ARBITRARY UNITS
##FACTOR=    0.368581032318806, 1,           1
##FIRST=     11204.5221822817, 0,            0
##LAST=      -872.772503708586, 0,           0
##MIN=       -872.772503708586, -1451406,    0
##MAX=       11204.5221822817, 273999594,    0
$$ Real data points
##PAGE= N=1
##DATA TABLE= (X++(R..R)), XYDATA
$$ [...]
16101e02607O6251J61868J00084m1810j45633k17933M0078J97070J30310j92061
$$ -502607 -436356 -274488 -174404 -216214 -361847 -579780 -539702 -342632 -212322 -404383
16091d04383j51986J08568K30880Q2492k68758k50881o328Q5734K57774J89351
$$ -404383 -556369 -447801 -216921 -134429 -403187 -654068 -660396 -574662 -316888 -127537
16081a27537R4055J30693K21927O121j46632j49869k74424j38512J75494K08451
$$ -127537 -33482 97211 319138 325259 178627 28758 -245666 -384178 -208684 -233
16071b33J89930J18206p1133j51427l84841k24984N1824J30825J19661l5355m5482
$$ -233 189697 307903 236770 85343 -299498 -524482 -472658 -341833 -222172 -257527 -303009
16060c03009Q0697L34944L20199k1192j42598k4413p2755j71496n0791J08437
$$ -303009 -222312 112632 432831 411639 269041 244628 171873 377 -50414 58023
16050E8023J42641J63523P3111m8306k45010j34072K5264L2182R4301R7550K28203
$$ 58023 200664 364187 437298 388992 143982 9910 35174 67356 161657 259207 487410
16039D87410J75698j02688o9585j00802j37487j56347L6794M4102j82311j28412
$$ 487410 663108 560420 490835 390033 252546 96199 132993 177095 -5216 -133628
16029a33628j48289j24774J01977K81728R0774k51143l60483j02156n839L8227
$$ -133628 -281917 -406691 -304714 -22986 67788 -183355 -543838 -645994 -651833 -613606
16019f13606J65804K40911J66867r6011O9667r918p2546p2883K20501J80187m6280
$$ -613606 -447802 -206891 -40024 -136035 -66368 -76286 -148832 -221715 -1214 178973 132693
16008A32693n666j21166O5646M8845J4365J21903J48168P8542K6541l954j09974
$$ 132693 127027 5861 71507 120352 134717 256620 404788 483330 509871 505917 395943
15997C95943k10457j36753q1437j25662l3044L8022J1408L0533j3104J09922R459
$$ 395943 185486 48733 -32704 -158366 -191410 -153388 -141980 -111447 -124551 -14629 -5170
15986e170j26855L717l9486J8414J55692M3249O7951L6402l9838R877P154k59733
$$ -5170 -132025 -128308 -167794 -149380 6312 49561 117512 153914 114076 123953 131107 -128626
15974a28626k82517R3841K00066J50340j16879M9302N8198O8156Q2244p0868q5713
$$ -128626 -411143 -317302 -117236 33104 -83775 -34473 23725 91881 174125 103257 17544
15963A7544Q4360K00618m5115j30294k7327J56789K1274J01897K93023J5584k16002
$$ 17544 101904 302522 257407 127113 99786 256575 277849 379746 672769 688353 472351
15952D72351j01749m5680k5485o4877o3268r8874k0373o8175j16585k82734p8939
$$ 472351 370602 324922 299437 234560 171292 72418 52045 -16130 -132715 -415449 -494388
15941d94388J39683L1843k0937J71401Q9450L4608J79684Q0246M3795L560q1363
$$ -494388 -354705 -322862 -343799 -172398 -82948 -48340 131344 211590 255385 258945 177582
15930A77582J3971J02882N2542j10447J4054O0730j53980m2798K12612P6208J20685
$$ 177582 191553 294435 346977 236530 250584 311314 157334 114536 327148 403356 524041
15919E24041M6937J7737j1384k03234p1501n0782j40236k17749k9634L1705M5494
$$ 524041 570978 588715 577331 374097 302596 251814 111578 -106171 -135805 -104100 -58606
15908e8606J45413J12049m290j08663p5439p9125j4749J27579p6280k03208o2639
$$ -58606 86807 198856 194566 85903 10464 -68661 -83410 44169 -32111 -235319 -297958
15897b97958q043Q414q9443M9494K56327O0074L0768O7065k9961n6179M4215O0707
$$ -297958 -306001 -297587 -387030 -337536 -81209 -21135 9633 76698 46737 -9442 34773 95480
15885I5480O6108J02345R4717N6582o2856j32728r7881k9877q6537r8473J87997
$$ 95480 161588 263933 358650 415232 352376 219648 121767 91890 5353 -93120 94877
15874I4877J75093r5883j80063j38791M2155k0573j29184K812L8807j9996J08466
$$ 94877 269970 174087 -5976 -144767 -102612 -123185 -252369 -249557 -210750 -230746 -122280
15863a22280L2371L5874J1354L8018j33684j37596K18225K91472K2182K14301
$$ -122280 -89909 -54035 -42681 -4663 -138347 -275943 -57718 233754 255936 470237
15853D70237K67887N8713k7941j94192p3191m2504p8421K4910q0069k81802j25907
$$ 470237 738124 796837 768896 574704 501513 459009 380588 405498 325429 43627 -82280
15842h2280j53166m8011J05268N3652l4882q744q1746o0559J11334L12142J04579
$$ -82280 -235446 -283457 -178189 -124537 -159419 -168163 -249909 -310468 -199134 113008 217587
15831B17587l58270k18072M888m3745J2674j6063J92536N9157j60550J30108K30644
$$ 217587 -140683 -358755 -353867 -397612 -384938 -401001 -208465 -149308 -309858 -179750 50894
15820E0894J47780o478j62892j99280j65970l5297j743j41888j39339k7252J34943
$$ 50894 198674 192196 29304 -169976 -335946 -371243 -372986 -514874 -654213 -681465 -546522
15809e46522J78924P9710J83370J13498M177j40727L494K16773O0863j61107q0252
$$ -546522 -367598 -287888 -104518 8980 13157 -127570 -124076 92697 153560 -7547 -87799
15798h7799K6840O5693Q5913R9346J39693j78547j96111l9419m3960O2837Q8133
$$ -87799 -60959 4734 90647 189993 329686 151139 -44972 -84391 -128351 -65514 22619
15787B2619N514M9634J01577J40329K88734J61500q8198k02655k87559o9302J63170
$$ 22619 28133 77767 179344 319673 608407 769907 681709 479054 191495 122193 285363
15776B85363l4383M4870J5457M1454K1518k54511j26131j1393j44842j52504Q7505
$$ 285363 250980 295850 311307 352761 374279 119768 -6363 -17756 -162598 -315102 -227597
15765b27597n8303k12184R8032K77087J95756O6748j00310j10744J1323j08710
$$ -227597 -285900 -498084 -400052 -122965 72791 139539 39229 -71515 -60192 -168902
15755a68902k68253k95668j79778O7914J97396j00314K4364K70751L12393L26215
$$ -168902 -437155 -732823 -912601 -844687 -647291 -747605 -723241 -452490 -140097 186118
15745A86118M6761j14328M461J13295N4745O2849P5314L526p8440j42480k39152
$$ 186118 232879 118551 123012 236307 291052 353901 429215 432741 354301 211821 -27331
15734b7331l8878J7886O8549l5266p642K27428J04132j85085j37741j7245j46822
$$ -27331 -66209 -48323 20226 -15040 -22682 204746 308878 123793 -13948 -31193 -178015
15723a78015L63K30179J53932k5670L9877j7253k97082o9774J9023M3197J69629
$$ -178015 -177652 52527 206459 180789 220666 203413 -93669 -163443 -144420 -101223 68406
15712F8406l0781k64417k87635o6913J62964K63793L07030K50658n9594k6043
$$ 68406 37625 -226792 -514427 -581340 -418376 -154583 152447 403105 343511 317468
15702C17468J32559p8116j50559k25901k16064r629Q1689J30248K83997K55589
$$ 317468 450027 371911 221352 -4549 -220613 -230242 -148553 -18305 265692 521281
15692E21281l37647m65757j668K25187J98939j861L0560M2666r5015r6187O227
$$ 521281 183634 -282123 -283791 -58604 140335 138474 169034 211700 116685 20498 26725
15681B6725O2606L457p4673O6210J66679O786j66304j13812O8476K19894j03125
$$ 26725 89331 92788 18115 84325 251004 257790 91486 -22326 46150 266044 162919
15670A62919l16385j28628j32963q5182M6207J52128J62934K73351J56417q0096
$$ 162919 -153466 -282094 -415057 -500239 -454032 -301904 -138970 134381 290798 210702
15660B10702j34977k22199k26907l5949m327j8849k6798K28059L36153J29675
$$ 210702 75725 -146474 -373381 -409330 -413657 -432506 -459304 -231245 104908 234583
15650B34583J8954k21028j73236L3036J14948J19159J9334K5260K13952O5361
$$ 234583 253537 32509 -140727 -107691 7257 126416 145750 171010 384962 450323
15640D50323j10744j65437j63229P081N5421P1577J3432r5392j858N8162N7544
$$ 450323 339579 174142 10913 17994 73415 144992 158424 63032 61174 119336 176880
15629A76880R4610o6267j95835l1884J1227j20777j23491O0269L3721L2488J00897
$$ 176880 271490 205223 9388 -22496 -11269 -132046 -255537 -195268 -161547 -129059 -28162
15618b8162K6439l5320j24197L1951R8296Q3524J94567M08977M3392m38540l23202
$$ -28162 -1723 -37043 -161240 -129289 -30993 52531 247098 656075 699467 260927 -62275
15607f2275j6399J86394K40053p0699l60885j51302j28758L5446J46875O5953
$$ -62275 -78674 107720 347773 277074 -83811 -235113 -363871 -328425 -181550 -115597
15597a15597Q7898J26089j59494j46027Q3510m7831j13060K3324J781N8115J43914
$$ -115597 -27699 98390 -61104 -207131 -123621 -171452 -284512 -261188 -259407 -201292 -57378
15586e7378J60362k4398j74038M6439J47700o7392j03933J17297P5915j06413
$$ -57378 102984 78586 -95452 -49013 98687 31295 -72638 44659 120574 14161
15576A4161k8250K7755Q5963L40237K8582k71477l22505k11984J47002M03635
$$ 14161 -14089 13666 99629 439866 468448 196971 -125534 -337518 -190516 213119
15566B13119J41392j17985j57707j46649j11638j27558n8723K49931K99975k39901
$$ 213119 354511 236526 78819 -67830 -179468 -307026 -365749 -115818 184157 -55744
15556e5744k11114J28368O7500K3476Q9436N2121k44315k8586J06730K1479K38082
$$ -55744 -266858 -138490 -70990 -47514 41922 94043 -150272 -178858 -72128 -50649 187433
15545A87433K94976J06317l6446j43242j23798j28977l2891l0288r4173o293Q2178
$$ 187433 482409 588726 552280 409038 285240 156263 123372 93084 -1089 -7382 74796
15534G4796J4599m3414r4718j03300o2490o2402j44300r2086N3719J1144J26097
$$ 74796 89395 45981 -48737 -152037 -214527 -276929 -421229 -513315 -459596 -448452 -322355
15523c22355J85154L02569N2141m5465j92338j48605Q3649J48515O6551o0505
$$ -322355 -137201 165368 217509 172044 -20294 -168899 -85250 63265 129816 69311
15513F9311j64767k18516j89399j01591L7124J78040J81803J52782J25222K0837
$$ 69311 -95456 -313972 -503371 -604962 -567838 -389798 -207995 -55213 70009 90846
15503I0846M8323J77807J30619q0377j60560l04740j07758J37275P0667N381k43809
$$ 90846 139169 316976 447595 367218 206658 -98082 -205840 -68565 2102 7483 -236326
15492b36326j71963R5662J89268L61847J26184O4185K888l9477Q450j8471j01146
$$ -236326 -408289 -312627 -123359 238488 364672 428857 431745 392268 400718 382247 281101
15481B81101k07307k02150n5824j2308O2875j88585j69979J18526J03520q578
$$ 281101 73794 -128356 -184180 -196488 -133613 -322198 -492177 -373651 -270131 -278709
15471b78709K535K17835K13963J38100Q6664P4496n2095j40423J62026K7078j67771
$$ -278709 -276174 -58339 155624 293724 380388 454884 402789 262366 424392 451470 283699
15460B83699P924k1414k97438l57599o8524O9847J77501m0912j58671O61Q0980
$$ 283699 291623 270209 -27229 -384828 -453352 -383505 -206004 -246916 -405587 -404926 -323946
15449c23946m6178r0818L7173M3299l6028j26632p4670K10463R7593K871j35471
$$ -323946 -370124 -460942 -423769 -380470 -416498 -543130 -617800 -407337 -309744 -306873 -442344
15438d42344J42074K38287K30526L43060J55784j34200l29290j94543J36224J93401
$$ -442344 -300270 -61983 168543 511603 667387 533187 203897 9354 145578 338979
15428C38979O9817j44559j69699J32874K32861J17295J86316P297p4854m9429
$$ 338979 408796 264237 94538 227412 460273 577568 763884 771181 696327 646898
15418F46898j97676k25019k46012o6849k3235L2348j61873j24341J25878J18027
$$ 646898 449222 224203 -21809 -88658 -111893 -79545 -241418 -365759 -239881 -121854
15408a21854o6928k3995M6660J27399N1475K1349K9797m6859p1503J55163J46605
$$ -121854 -188782 -212777 -166117 -38718 12757 34106 63903 17044 -54459 100704 247309
15397B47309Q3977Q1366O5204o4244l6549k6691l8910n4576K0072k8846k60973
$$ 247309 331286 412652 477856 413612 377063 350372 311462 256886 276958 248112 -12861
15386a2861l23014j84983K1120R8862K02717N9832J60452K09966j70915m01513
$$ -12861 -335875 -520858 -499738 -400876 -198159 -138327 22125 232091 61176 -340337
15376c40337j92629J64039K83230L7153j85321k7794M6579j55608j7755J74441
$$ -340337 -532966 -368927 -85697 -48544 -233865 -261659 -215080 -370688 -388443 -214002
15366b14002J47997p1988m9008J43553J69381r2350r7537k0024k16946p741K99823
$$ -214002 -66005 -137993 -187001 -43448 125933 33583 -63954 -83978 -300924 -308665 -8842
15355h842K30707r1528j07209J32304Q5364j9167j28561j50244n4380j176m1701
$$ -8842 221865 130337 23128 155432 240796 221629 93068 -57176 -111556 -112732 -154433
15344a54433m9873R7672K28782J67713l5011N1930l5272j74653k5915J51362J2903
$$ -154433 -204306 -106634 122148 289861 254850 306780 271508 96855 70940 222302 235205
15333B35205M1416O9114o6921n3209q9975j55286q3201N6295J93957P6766o1311
$$ 235205 276621 345735 278814 225605 135630 -19656 -102857 -46562 147395 224161 162850
15322A62850J07540K09924K4553n4532j16449k82458j49374q2873o4956n3882
$$ 162850 270390 480314 504867 450335 333886 51428 -97946 -180819 -245775 -299657
15312b99657J47074J91911k998k13012j75466n6764J562L02883J67705j67636
$$ -299657 -152583 39328 36330 -176682 -352148 -408912 -407350 -104467 63238 -104398
15302a04398j20516K1446R1564p6275l0384J14597J18535J00529J23719o4552
$$ -104398 -224914 -203468 -111904 -188179 -218563 -103966 14569 115098 238817 174265
15292A74265j35743p3338J33670m344j03126j10065j49997Q765j14491j74018
$$ 174265 38522 -34816 98854 94510 -8616 -118681 -268678 -259913 -374404 -548422
15282e48422j48991Q4379K35258L22424J09135o9066J11580m2653j59199j90000
$$ -548422 -697413 -613034 -377776 -55352 53783 -15283 96297 53644 -105555 -295555
15272b95555j52857n5412P8127K13693K05015k4586j42279j6823Q44J12371R3808
$$ -295555 -448412 -503824 -425697 -212004 -6989 -31575 -173854 -190677 -189833 -77462 16346
15261A6346p6990K534M4337p1295m4362N1502m9640M1123K10972k6664r5605j52082
$$ 16346 -60644 -58110 -13773 -85068 -129430 -77928 -127568 -86445 124527 97863 2258 -149824
15249a49824j57681n0007M4412r5952j26718J05976k7043J1150L29851L97364
$$ -149824 -307505 -357512 -313100 -409052 -535770 -429794 -456837 -445687 -115836 281528
15239B81528J69672j08393j73456j88218r1730p6922r6766m2457K18726J91777
$$ 281528 451200 342807 169351 -18867 -110597 -187519 -284285 -326742 -108016 83761
15229H3761J32161Q9084j82003l23471j12201n5122K6740K18405J23010j17201
$$ 83761 215922 305006 123003 -200468 -312669 -367791 -341051 -122646 364 -116837
15219a16837j18645K394J32707j7485O8007M390j92432j23712n3294N3836J93735
$$ -116837 -235482 -233088 -100381 -117866 -49859 -45469 -237901 -361613 -414907 -361071 -167336
15208a67336J74817k8686L732l6648q5686l739M3225J28157K38755J08483J77966
$$ -167336 7481 -21205 -17473 -54121 -139807 -143546 -100321 27836 266591 375074 553040
15197E53040J74866o3671k51271q5096L4878k14344j39937k1766L5132K05622
$$ 553040 727906 664235 412964 327868 362746 148402 8465 -13301 21831 227453
15187B27453J22722j77536r2621q9144r5234J28038J18687J63815K714j37984
$$ 227453 350175 172639 80018 -9126 -104360 23678 142365 306180 308894 170910
15177A70910n6269J42259R8216P6057l3038L4852M3230j0468k45399j77994l3798
$$ 170910 114641 256900 355116 431173 398135 432987 476217 465749 220350 42356 8558
15166H558J72403K04851L272O1377M6783k06521j73609j59786k56486j00530K51470
$$ 8558 180961 385812 389084 450461 497244 290723 117114 -42672 -299158 -399688 -148218
15155a48218L32085o069k26527j58676J23559J30226q119l5467P1518J43172j8922
$$ -148218 183867 177798 -48729 -207405 -83846 46380 38261 2794 74312 217484 198562
15144A98562k04865j71911j24519J03617j6995n8338J62437K10516J85659K6618
$$ 198562 -6303 -178214 -302733 -199116 -216111 -274449 -112012 98504 284163 310781
15134C10781k71502k27840K27809J28224p6631o8013j23211L729q1568j6818J88334
$$ 310781 39279 -188561 39248 167472 90841 22828 -100383 -96654 -178222 -195040 -6706
15123f706J25452J66946J97118j07594k69196j06692O8230J67319K4479P6074
$$ -6706 118746 285692 482810 375216 106020 -672 67558 234877 259356 335430
15113C35430R7842j27312l03601j75210j14162r1652l6867j1506L7944O4335q6690
$$ 335430 433272 305960 2359 -172851 -287013 -378665 -415532 -427038 -389094 -324759 -411449
15102d11449L108K10390K72103L9571j26047J425N1378L6872m9445j17804q0439
$$ -411449 -408341 -197951 74152 113723 -12324 -10899 40479 77351 27906 -89898 -170337
15091a70337O4807P4120J9261k3115M319K1012J76331O1648R5629N7354j59834
$$ -170337 -105530 -31410 -12149 -35264 -30945 -9933 166398 228046 323675 381029 221195
15080B21195l62173k58844M9190K64859K69889q796j77491j28112J2455K5812
$$ 221195 -140978 -399822 -350632 -85773 184116 175320 -2171 -130283 -117828 -92016
15070i2016l7211m0339J7752o7988J5232K18266K66409J40893J17055r384k34760
$$ -92016 -129227 -169566 -151814 -219802 -204570 13696 280105 420998 538053 528669 293909
15059B93909k48792Q3272n2496q1239n4172j71666j8252J16092O1241R0629L3116
$$ 293909 45117 128389 75893 -5346 -59518 -231184 -249436 -133344 -72103 18526 51642
15048E1642k11015j3582O3354l3376k31882j85264R0328P372O8153R9107m5822
$$ 51642 -159373 -172955 -109601 -142977 -374859 -560123 -469795 -462423 -394270 -295163 -340985
15037c40985M6905J85522N8944l40868l00287q6402N629N683J57536K82936K44102
$$ -340985 -294080 -108558 -49614 -390482 -690769 -777171 -771542 -765859 -608323 -325387 -81285
15026h1285j13905o1894J00738j16514k00018j54065J8363J12719P4983J78213
$$ -81285 -195190 -257084 -156346 -272860 -472878 -626943 -608580 -495861 -420878 -242665
15016b42665R4591J4761J07334O2747q6557j56325p7409j83459J07700M33170
$$ -242665 -148074 -133313 -25979 36768 -49789 -206114 -283523 -466982 -359282 73888
15006G3888K37410N7549q9576j48489l2340j37415j76743J31570J55985J84888
$$ 73888 311298 368847 279271 130782 98442 -38973 -215716 -84146 71839 256727
14996B56727J99939J72713q3913l20324r4260J20986l8379j28188p8726o3254
$$ 256727 456666 629379 545466 225142 130882 251868 213489 85301 6575 -56679
14986e6679j9978j04999p8702n1445q7857o0421O7957K06722O6812Q47j14733
$$ -56679 -76657 -181656 -260358 -311803 -399660 -460081 -392124 -185402 -118590 -117743 -232476
14975b32476k03588l5373J56202K92548K35705J57044n207q4086L1105P9253q8186
$$ -232476 -436064 -471437 -315235 -22687 213018 370062 364855 280769 311874 391127 302941
14964C02941j8059q4899k2455M3898l2061k5358p696K02326J91810j5859j67626
$$ 302941 284882 199983 177528 221426 189365 164007 156311 358637 550447 534588 366962
14953C66962j66128l8610R7229J5598K5855J05532J12006J51944J3291r046L545
$$ 366962 200834 162224 259453 275051 300906 406438 518444 670388 683679 674633 678178
14942F78178j41776k59145m7480J22988j60341k71199j78576k1705J05024o6397
$$ 678178 536402 277257 229777 352765 192424 -78775 -257351 -279056 -174032 -240429
14932b40429l9528J05185j40036j08281J72335J16268l1525j25336k03353p2475
$$ -240429 -279957 -174772 -314808 -423089 -250754 -134486 -166011 -291347 -494700 -567175
14922e67175j14087q5201q0704j3496K77989K42112L99451K56728k24493q8267
$$ -567175 -681262 -766463 -847167 -860663 -582674 -340562 58889 315617 91124 2857
14912B857J35947j399k0513O5370j03447p3669l2122r2852k02477l3946J75576
$$ 2857 138804 137405 116892 182262 78815 5146 -26976 -119828 -322305 -356251 -180675
14901a80675J50151J85801L750k44548j70493M5276R7242P3741J04136l4881j53052
$$ -180675 -30524 155277 159027 -85521 -256014 -210738 -113496 -39755 64381 29500 -123552
14890a23552n3504m8412k4411P3987K6564k4801J9060K0135M7725J16481k3905
$$ -123552 -177056 -225468 -249879 -175892 -149328 -174129 -155069 -134934 -87209 29272 5367
14879E367j37382M7154J73416P3840M3235K05137J31243j66749j67796O2455P0675
$$ 5367 -132015 -84861 88555 162395 205630 410767 542010 375261 207465 269920 340595
14868C40595j48401k60140k4903L1539m8113J0145m6429k03024M4111J70263p3017
$$ 340595 192194 -67946 -92849 -61310 -109423 -99278 -145707 -348731 -304620 -134357 -207374
14857b07374p856Q309J5098J32454J07906N4139n7993l3713O6491R7602K3196
$$ -207374 -215230 -206921 -191823 -59369 48537 102676 44683 10970 77461 175063 198259
14846A98259Q2627j5486j43731n1054m713k4312M0304j60123j64233J11044P6044
$$ 198259 280886 265400 121669 70615 65902 41590 81894 -78229 -242462 -131418 -55374
14835e5374n1671j35257j31748L0685K14863j9965p101K24789p773N7391K54647
$$ -55374 -107045 -242302 -374050 -343365 -128502 -148467 -155568 69221 61448 118839 373486
14824C73486O7551P9969N7092l04646l13537r7866L6244Q7244p4601q3510O7319
$$ 373486 441037 521006 578098 273452 -40085 -137951 -101707 -14463 -89064 -172574 -105255
14813a05255J88223K50372M9354k97066L765J65342M0423M4867K2920Q7486J08626
$$ -105255 82968 333340 382694 85628 89393 254735 295158 340025 362945 450431 559057
14802E59057j06685k42605k9875K86696o1314l10292l00609L9723K14100Q296
$$ 559057 452372 209767 179892 466588 405274 94982 -205627 -165904 48196 56492
14792E6492l856q4199m8915j5736n8086J40331L77496m3428j04800O6807N140
$$ 56492 52636 -31563 -80478 -96214 -154300 -13969 363527 320099 215299 282106 287246
14781B87246j86558k05432L747L6499M0550l8350j51360j82342n2372J30486R2274
$$ 287246 100688 -104744 -100997 -64498 -23948 -62298 -213658 -396000 -448372 -317886 -225612
14770b25612J41903J26735k5782k4701R0130Q7305n3231o8335n5476n7122Q8089
$$ -225612 -83709 43026 17244 -7457 82673 169978 116747 48412 -7064 -64186 23903
14759B3903k0454m6644l0480J1999J3176m2411K2223K24712J1738k86639M399
$$ 23903 3449 -43195 -73675 -61676 -48500 -90911 -68688 156024 167762 -118877 -114478
14748a14478K26464n989p9310n6750q4844k1270j74026j72246K46817K00199k0166
$$ -114478 111986 105997 26687 -30063 -114907 -136177 -310203 -482449 -235632 -35433 -55599
14737e5599P9583m8641o7552K0359O3266j2533j1400k27072j4606L44633R6741
$$ -55599 23984 -24657 -92209 -71850 -8584 -21117 -32517 -259589 -274195 70438 167179
14726A67179n6817j69177j24796j73185j24492k9923R4959J99282J68897J01480
$$ 167179 110362 -58815 -183611 -356796 -481288 -511211 -416252 -216970 -48073 53407
14716E3407J7838K15710J23946k0773n2223n9330p7495j57174l73921q5662L27375
$$ 53407 71245 286955 410901 390128 337905 278575 201080 43906 -330015 -415677 -88302
14705h8302P5748k5173O5860p1734j34456K8792K63240j7268j39128l3077L275
$$ -88302 -12554 -37727 28133 -43601 -178057 -149265 113975 96707 -42421 -75498 -72223
14694g2223K3919q2850J04493P0540m8487P6514K5948o1028n6982J1658K35068
$$ -72223 -48304 -131154 -26661 43879 -4608 71906 97854 36826 -20156 -8498 226570
14683B26570N5779j30771j91595l0064K34695R6519j35522o3866m5443j26250
$$ 226570 282349 151578 -40017 -70081 164614 261133 125611 61745 16302 -109948
14673a09948j32936K4720J75901j06633o8869K75317K05096q393n8295o939l4866
$$ -109948 -242884 -218164 -42263 -148896 -217765 57552 262648 254255 195960 189021 154155
14662A54155q5865p8073M0049P5979J7940M9456K7891l09189k23608J43263R3468
$$ 154155 68290 -9783 30266 106245 124185 173641 201532 -107657 -331265 -188002 -94534
14651i4534k24797j29106O358J2405J16784j14678j24410P1975J42252K6496J1450
$$ -94534 -319331 -448437 -442079 -429674 -312890 -427568 -551978 -480003 -337751 -311255 -299805
14640b99805K52418K86815j43515k35250L0324n4300n8397R955L9332K25967K99083
$$ -299805 -47387 239428 95913 -139337 -109013 -163313 -221710 -211755 -172423 53544 352627
14629C52627J72850O0583n3864k13617j76190m8979j26111j28818J84125K00359
$$ 352627 525477 586060 532196 318579 142389 93410 -32701 -161519 22606 222965
14619B22965Q2537k1486k7029k29362j16440J00566j0210J5017J41056J32674
$$ 222965 305502 284016 256987 27625 -88815 11751 1541 16558 157614 290288
14609B90288Q6734K4923q8375j50637k42632k2007R2329K17269J61751M7202J5061
$$ 290288 377022 401945 313570 162933 -79699 -101706 -9377 207892 369643 416845 431906
14598D31906k5465k6524M5985O2197Q8175j1694k18429j07576m7498j64554k10477
$$ 431906 406441 379917 425902 488099 576274 564580 346151 238575 191077 26523 -183954
14587a83954j09821K6747J35520k5224j63379j9644K4583R1106R9507O3068k7210
$$ -183954 -293775 -267028 -131508 -156732 -320111 -339755 -315172 -224066 -124559 -61491 -88701
14576h8701N922q5488L9786J92162P3241K8265k34296k21135m5835K00323L56089
$$ -88701 -82779 -168267 -128481 63681 136922 165187 -69109 -290244 -336079 -135756 220333
14565B20333K10190j15747j57797m3139J65629K64322N265j09206Q1030P8554
$$ 220333 430523 314776 156979 113840 279469 543791 549056 439850 520880 599434
14555E99434k5561L5591q9958j46333k13932k80022j05076M9697K11901J50106
$$ 599434 573873 609464 519506 373173 159241 -120781 -225857 -176160 35741 185847
14545A85847j65654l00039j16249j45811j0334J07337J48673J35337O70p4821
$$ 185847 20193 -279846 -396095 -541906 -552240 -444903 -296230 -160893 -160223 -235044
14535b35044k29858J9475P5672J1366K66176J97861j40178r1936J11154Q4906
$$ -235044 -464902 -445427 -369755 -358389 -92213 105648 -34530 -126466 -15312 69594
14525F9594J3875j13719J46600K12770p5437r7220O2585K73504N9916n044J78091
$$ 69594 83469 -30250 116350 329120 253683 156463 219048 492552 552468 547424 725515
14514G25515N5746j36880l09879j63200o9789o4125k27277j83361N4128J96884
$$ 725515 781261 644381 334502 171302 101513 37388 -189889 -373250 -319122 -122238
14504a22238l8479p1745K20546K83443J40402J889m4800l7572n9385O6984J96715
$$ -122238 -160717 -232462 -11916 271527 411929 413818 369018 331446 272061 339045 535760
14493E35760J16002P1539r9934j77397j28442k04791j36316L1603J10753P5700
$$ 535760 651762 723301 623367 445970 317528 112737 -23579 8024 118777 194477
14483A94477j9050k11499j27393K6948O8253N5577j02045j19595m2330R4131J15929
$$ 194477 175427 -36072 -163465 -136517 -68264 -12687 -114732 -234327 -276657 -182526 -66597
14472f6597K34488Q2502l23604l31850P3369K54813K74703K67770q8866j59850
$$ -66597 167891 250393 -73211 -405061 -331692 -76879 197824 465594 376728 216878
14462B16878M4451J8295n9162j78047k38434n072K20018j00195j37163j33559
$$ 216878 261329 279624 220462 42415 -196019 -201091 18927 -81268 -218431 -351990
14452c51990N0130k4O9386J70227K7320j90511l11177j41521p6773J0966L29353
$$ -351990 -301860 -301884 -232498 -62271 -34951 -225462 -536639 -678160 -754933 -743967 -414614
14441d14614K81402r4898j30567N1085P7557m2112J1027J20853K18880q2054j51247
$$ -414614 -133212 -228110 -358677 -307592 -230035 -272147 -261120 -140267 78613 -3441 -154688
14430a54688k34849l13823j16655J10301O0177L1639J02876M0163k6777j39432
$$ -154688 -389537 -703360 -820015 -709714 -649537 -617898 -515022 -474859 -501636 -641068
14420f41068Q7392L01322J29511O033J40870J1513p6778m6652M7533l5735j18189
$$ -641068 -553676 -252354 -122843 -116810 24060 35573 -41205 -87857 -40324 -76059 -194248
14409a94248j21709q2146R0845l192j78745O3519l676r1552J04040J58674r6377
$$ -194248 -315957 -398103 -307258 -310450 -489195 -425676 -429352 -520904 -416864 -258190 -354567
14398c54567m9604K17928K9071Q491L3161J53832N0088P0154j15710j48090M5143
$$ -354567 -404171 -186243 -157172 -148681 -115520 38312 88400 158554 42844 -105246 -60103
14387f0103j47871j81826P1584K37775N3678r6541J0565J48162R5952K3060j6821
$$ -60103 -207974 -389800 -318216 -80441 -26763 -123304 -112739 35423 131375 154435 137614
14376A37614o2301k13355k61594j23490Q7415p7774r1693R8621J00665J2389k12933
$$ 137614 75313 -138042 -399636 -523126 -435711 -513485 -605178 -506557 -405892 -393503 -606436
14365f06436k67174J0893J72387L04088J54815n1775j31158k46922n5569J50889
$$ -606436 -873610 -862717 -690330 -386242 -231427 -283202 -414360 -661282 -716851 -565962
14355e65962K45774K5838r1002N3999l1685o0409R2552K23755K54375J44455J84482
$$ -565962 -320188 -294350 -385352 -331353 -363038 -423447 -330895 -107140 147235 291690 476172
14344D76172J9459n3192p5530K7550m9845k76929j95721j68051m9220J10765J4706
$$ 476172 495631 442439 366909 394459 344614 67685 -128036 -296087 -345307 -234542 -219836
14333b19836j93402q0192k3786L8669K31673K06292O8544P8655j05927o3138P2606
$$ -219836 -413238 -493430 -517216 -478547 -246874 -40582 27962 106617 690 -62448 10158
14322A0158J38212m6472j56164K623m4974k86687j11769K39165K11907l4706m4532
$$ 10158 148370 101898 -54266 -51643 -96617 -383304 -495073 -255908 -44001 -78707 -123239
14311a23239K58346Q7423j44119j60232R1537K22103r414k15318q1568m2236l3146
$$ -123239 135107 222530 78411 -81821 9716 231819 222405 7087 -74481 -116717 -149863
14300a49863m0175r6607N729J35110K99142K90804K1740j28113j1626O3958M2027
$$ -149863 -190038 -286645 -280916 -145806 153336 444140 465880 337767 326141 390099 432126
14289D32126q926L622j2500j82652j71181L9472M8072K4675n5314n6589J90835
$$ 432126 423200 426822 414322 231670 60489 99961 148033 172708 117394 60805 251640
14278B51640K70995L2250r9188j55296k6998M555j48084j41346J92883K47418
$$ 251640 522635 554885 455697 300401 273403 277958 129874 -11472 181411 428829
14268D28829J1392l8138l7517j06233j70703j02099L5725M8754r8341q8846r8970
$$ 428829 440221 402083 364566 258333 87630 -14469 21256 70010 -28331 -117177 -216147
14257b16147m400r2204k714K10139K54750j14082q4320J11038R3063J44515O0111
$$ -216147 -220547 -312751 -315465 -105326 149424 35342 -48978 62060 155123 299638 359749
14246C59749l6925J8687J8330q4704M25M5454j83933k43435L5480K35639K09844
$$ 359749 322824 341511 359841 275137 275562 321016 137083 -106352 -70872 164767 374611
14235C74611M1441M9547o9144k07698j92116o8216K04007K02543K6210j59944
$$ 374611 416052 465599 396455 188757 -3359 -71575 132432 334975 361185 201241
14225B01241j24869l5136M9281P824m1313R1772N1956L7970J8008j55994k05236
$$ 201241 76372 41236 90517 98341 57028 148800 200756 238726 256734 100740 -104496
14214a04496l0343J29167J22906J2163j04898n9896m9283n1572J6875K21775J98701
$$ -104496 -134839 -5672 117234 129397 24499 -35397 -84680 -136252 -119377 102398 301099
14203C01099j34263r6005M0812j8129o3344j07700J8035L3007O3880Q3604L4530
$$ 301099 166836 70831 111643 93514 30170 -77530 -59495 -26488 37392 120996 155526
14192A55526M7615J81329R2095j78492j59314n108R7369J17233L2901k7607j84834
$$ 155526 203141 384470 476565 298073 138759 133651 231020 348253 381154 353547 168713
14181A68713j43603K6921L5122J0105J9473J28793L0962r3581k10821o9923J7925
$$ 168713 25110 52031 87153 97258 116731 245524 276486 182905 -27916 -97839 -79914
14170g9914l8863m4314O9004o3826K4058Q0978n6347n9317j51646J27226J82185
$$ -79914 -118777 -163091 -94087 -157913 -133855 -52877 -109224 -168541 -320187 -192961 -10776
14159a0776k8617j96489m8506K05751J82514R92j01147M924j9188o3845p5228
$$ -10776 -39393 -235882 -284388 -78637 103877 104869 3722 8646 -10542 -74387 -149615
14148a49615M1962K10227Q8408p5502j85421k86592L8137J62950J41562R2740
$$ -149615 -107653 102574 190982 115480 -69941 -356533 -318396 -155446 -13884 78856
14138G8856l2139Q9235J50892l3795j01037l7419q345O6185L8818J68419J51688
$$ 78856 46717 135952 286844 253049 152012 114593 106248 172433 211251 379670 531358
14127E31358J44634j2702l29896l51572m1034K02788K08409o7061k17250j31620
$$ 531358 675992 663290 333394 -18178 -59212 143576 351985 284924 67674 -63946
14117f3946r4055O478J34211P2698n9635O694O1644p0432k168N5592n9207o627
$$ -63946 -158001 -151523 -17312 55386 -4249 2445 64089 -6343 -8511 47081 -12126 -18753
14105a8753J08241J221j69892j54610l1659J87106J79562P7837O007J29628N4872
$$ -18753 89488 90709 -79183 -233793 -265452 -78346 101216 179053 185060 314688 369560
14094C69560O469m4531k25585K2655J25594N2931j4139k02840o5261j29966q0198
$$ 369560 376029 331498 105913 128568 254162 307093 292954 90114 24853 -105113 -185311
14083a85311P831O0360J82000O2643k32786k36173j83073J12862L25044O3030
$$ -185311 -177480 -117120 64880 127523 -105263 -341436 -524509 -411647 -86603 -23573
14073b3573k12436j10416j02391j3755n1865N5583K92742K64594K41980J59605
$$ -23573 -236009 -346425 -448816 -462571 -514436 -458853 -166111 98483 340463 500068
14063E00068M5422l9843j43076j04552j56118l19541l18792r6370j110K31546
$$ 500068 545490 505647 362571 258019 101901 -217640 -536432 -632802 -633912 -402366
14053d02366K64177J47520K10355Q5560M9958j36293j22615k29213r5037K3306
$$ -402366 -138189 9331 219686 305246 355204 218911 96296 -132917 -227954 -204648
14043b04648o4079j46618L5761K10308p8312j59351n0612J50899J31805m0670
$$ -204648 -268727 -415345 -379584 -169276 -247588 -406939 -457551 -306652 -174847 -215517
14033b15517j08883r1490K5488J35249p5873k17738n2552Q6099o4104k2284L41725
$$ -215517 -324400 -415890 -390402 -255153 -331026 -548764 -601316 -515217 -579321 -601605 -259880
14022b59880L30424K57721J13392P5806p8876k56513N7871j74244l42907k4693
$$ -259880 70544 328265 441657 517463 438587 182074 239945 65701 -277206 -301899
14012c01899q6480j98902j0194K61779K11779J56646O4051o8640p7056k2017j49020
$$ -301899 -388379 -587281 -597475 -335696 -123917 32729 96780 28140 -48916 -70933 -219953
14001b19953l44924l91609J08717L23934J07038j71125p6652K04476K13855K15723
$$ -219953 -564877 -956486 -847769 -523835 -416797 -587922 -664574 -460098 -246243 -30520
13991c0520J16343n640J7856P3327O7624k8656j13041k59770o9457m5404n4943
$$ -30520 85823 80183 98039 171366 238990 210334 97293 -162477 -231934 -277338 -332281
13980c32281M3635O660K1326K1077Q2817R3097l9312L0759J26224j5616j23667
$$ -332281 -288646 -281986 -260660 -239583 -156766 -63669 -102981 -72222 54002 38386 -85281
13969h5281k09606j31987N4882J38926O4062Q6812Q4657J16838q851l9777m5018
$$ -85281 -294887 -426874 -371992 -233066 -169004 -82192 2465 119303 110452 70675 25657
13958B5657j22095K1523j0484q3542p3142o241m5224p7893M9834K86404J14015
$$ 25657 -96438 -74915 -85399 -168941 -242083 -248324 -293548 -371441 -321607 -35203 78812
13947G8812r7977J76198Q7825j8616j00410j75105M6585m278j09531j10808j05343
$$ 78812 -19165 157033 244858 226242 125832 -49273 -2688 -6966 -116497 -227305 -332648
13936c32648O098J55824J20872J14633l7012r4601j5699J04668J44268K9675j16990
$$ -332648 -326550 -170726 -49854 64779 27767 -66834 -82533 22135 166403 196078 79088
13925G9088j24852j24652j80511j06660N1898J10262j19186j6796J98791K00233
$$ 79088 -45764 -170416 -350927 -457587 -405689 -295427 -414613 -431409 -232618 -32385
13915c2385J18096N7373j44231j61821Q8228J17149l063m7468j0714l2225j63002
$$ -32385 85711 143084 -1147 -162968 -74740 42409 39346 -8122 -18836 -51061 -214063
13904b14063k70274j65921k6207j07007J4300M33822M28283K36606k4375j65484
$$ -214063 -484337 -650258 -676465 -783472 -769172 -335350 92933 329539 305164 139680
13894A39680O1087n6021m3389p2531j01190r8618j52082l7544R8947l3257k15262
$$ 139680 200767 144746 101357 28826 -72364 -170982 -323064 -360608 -261661 -294918 -510180
13883e10180j15906q9912R1471K94508J63027j1588q2009J5015O3724j6583k6039
$$ -510180 -626086 -715998 -624527 -330019 -166992 -178580 -260589 -245574 -181850 -198433 -224472
13872b24472J2805O305P7855K44399K64036J89074o89l9912j61522j42658p4005
$$ -224472 -211667 -205362 -127507 116892 380928 570002 569313 529401 367879 225221 151216
13861A51216J0727j3356r3248K7358m6251q8126j42627m7226J6180O3664J23013
$$ 151216 161943 148587 55339 82697 36446 -51680 -194307 -241533 -225353 -161689 -38676
13850c8676P3122P7325J37192P5226N6508K184k01689k30860j72523j26456j05997
$$ -38676 34446 111771 248963 324189 380697 382881 181192 -49668 -222191 -348647 -454644
13839d54644m646J05257K80887J35824J60544J39745l1441J41418M6998j99960
$$ -454644 -459290 -354033 -73146 62678 223222 362967 331526 472944 519942 319982
13829C19982o727P0997j90559r7559J89060P9531N2396K38829q5584k27319j35448
$$ 319982 313255 384252 193693 96134 285194 364725 417121 655950 570366 343047 207599
13818B07599o2858j39377k1302k2623p060r7713p1562J36202Q4108j8979k8646
$$ 207599 144741 5364 -15938 -38561 -45621 -143334 -214896 -78694 5414 -13565 -42211
13807d2211Q7177P2791j25246j45639j08294j07240R8953K53458L09107J20419
$$ -42211 44966 117757 -7489 -153128 -261422 -368662 -269709 -16251 292856 413275
13797D13275O2802J0107j80023q7518K3356o1355k5696J57941J96710P6260j01684
$$ 413275 476077 486184 306161 218643 241999 180644 154948 312889 509599 585859 484175
13786D84175j85634M6843n6282M4412K05461o3928l74021l14255l8807l1530M846
$$ 484175 298541 345384 289102 333514 538975 475047 101026 -213229 -252036 -283566 -278720
13775b78720K9090J14869P1475k0061J8968j7675p9756J7294l3647k22399l70151
$$ -278720 -249630 -134761 -63286 -83347 -64379 -82054 -161810 -144516 -178163 -400562 -770713
13764g70713j42586J72736K80046L11774J35504p304k4578J38542k3178k86114
$$ -770713 -913299 -740563 -460517 -148743 -13239 -20543 -45121 93421 70243 -215871
13754b15871j51567Q8654K16477K10639P4803R8865K92178J06496m2263k42580
$$ -215871 -367438 -278784 -62307 148332 223135 322000 614178 720674 678411 435831
13744D35831k29489Q7455J10411j39319r1948Q2455O3264J4191k0858p531R887
$$ 435831 206342 293797 404208 264889 172941 255396 318660 332851 311993 304462 314349
13733C14349j45165m2616J17594k24366l30324j12874J96838K59494J01128r1813
$$ 314349 169184 126568 244162 19796 -310528 -423402 -226564 32930 134058 42245
13723D2245k66507l8362J04643K77435K13670j19566l15687k29759j71533j82297
$$ 42245 -224262 -262624 -157981 119454 333124 213558 -102129 -331888 -503421 -685718
13713f85718N0282J54113J53424Q513p3674J42647K9948q3871J1766P9185R1576
$$ -685718 -635436 -481323 -327899 -319386 -393060 -250413 -220465 -304336 -292570 -213385 -121809
13702a21809Q3147L4971J7048J4430j90685l45048j50920J56879K20480O4517
$$ -121809 -38662 -3691 13357 27787 -162898 -507946 -658866 -501987 -281507 -216990
13692b16990j3096m8805r7407J715p434Q785n8593M12R4528N4852l6975J94762
$$ -216990 -230086 -278891 -376298 -374583 -382017 -373232 -431825 -431413 -336885 -282033 -319008 -124246
13680a24246L21047L0928j9028L086k6679j97559j17286M7388q1667m7106J35945
$$ -124246 196801 227729 208701 211787 185108 -12451 -129737 -82349 -164016 -211122 -75177
13669g5177J35211l8828q4573l31943l77716N964J82074L4934L4360N6707J07047
$$ -75177 60034 21206 -63367 -395310 -773026 -767062 -584988 -550054 -515694 -458987 -351940
13658c51940J01354J93739K24285J88619J6874n3830j63344p2166J58730K71445
$$ -351940 -250586 -56847 167438 356057 372931 319101 155757 83591 242321 513766
13648E13766K72235J76243K6020l67978k50402P4609M4509n3785J8407j17476
$$ 513766 786001 962244 988264 620286 369884 444493 489002 435217 453624 336148
13638C36148q4236J6755q561J1587k4538r5782j62546j06686M5978K71887p494
$$ 336148 251912 268667 260106 271693 247155 151373 -11173 -117859 -71881 200006 192512
13627A92512L754q2569r4137J27743N1334J3985q7351j62385j07723J76181J70214
$$ 192512 196266 113697 19560 147303 198637 212622 125271 -37114 -144837 31344 201558
13616B01558l7858q9336j4241j6505p63r9369N1493K10666J69663j1274p5387
$$ 201558 163700 74364 60123 43618 42855 -56514 -5021 205645 375308 364034 288647
13605B88647J7983M1942k4826j89471j28933M3608L5382O9738M5750l74072l80841
$$ 288647 306630 348572 323746 134275 5342 48950 84332 154070 199820 -174252 -555093
13594e55093j41228K00501K92364J57816j16267m9632J30871m1631k05242j17640
$$ -555093 -696321 -495820 -203456 -45640 -161907 -211539 -80668 -122299 -327541 -445181
13584d45181R6734R7539m9051Q3375K49214n1052J78639L35214k5896o0696P6767
$$ -445181 -348447 -250908 -299959 -216584 32630 -18422 160217 495431 469535 408839 485606
13573D85606j305j76960j22727j00512j14722j57947j00812l5726r6454R1711
$$ 485606 484301 307341 184614 84102 -30620 -188567 -289379 -325105 -421559 -329848
13563c29848K81706L53969J58258m7522k49920j73086n7186J8794J15147J04143
$$ -329848 -48142 305827 464085 416563 166643 -6443 -63629 -44835 70312 174455
13553A74455O2383J44667O7295j10213j03349J01498n564r4010j229j26095j98248
$$ 174455 236838 381505 448800 338587 235238 336736 331172 237162 235933 109838 -88410
13542h8410j44406J73388M22198J67785j07193r1752L4841o0434L0534M1458l00548
$$ -88410 -232816 -59428 362770 530555 423362 331610 366451 306017 336551 378009 77461
13531G7461k87149L1373Q5522J8011J6019n2733j54774j07678L0181J3028J30102
$$ 77461 -209688 -178315 -92793 -74782 -58763 -111496 -266270 -373948 -343767 -330739 -200637
13520b00637Q5034k2344l233j2921J35841L67091K14556O0678j46341j92774M4756
$$ -200637 -115603 -137947 -141180 -154101 -18260 348831 563387 624065 477724 284950 329706
13509C29706O6560P5462O1847j18146j41610k6584j1408m9249n7556j03113M4207
$$ 329706 396266 471728 533575 415429 273819 247235 235827 186578 129022 25909 70116
13498G0116N1373R8190J63125O5047j40767j69474j24601J57570K23981M4992
$$ 70116 121489 219679 382804 447851 307084 137610 13009 170579 394560 439552
13488D39552p286J09461k3461j91068p7315k40463k20750k6103j5069J32111R3321
$$ 439552 432266 541727 518266 327198 249883 9420 -211330 -237433 -252502 -120391 -27070
13477b7070j17740j09333R1088J86793J05610j23751o7480J58061K12476J28760
$$ -27070 -144810 -254143 -163055 23738 129348 5597 -61883 96178 308654 437414
13467D37414K91j08003j69158k3257j46481j69357L639J24732J93484L04194M7138
$$ 437414 437705 329702 160544 137287 -9194 -178551 -174912 -50180 143304 447498 494636
13456D94636j47843j53192p3938j3980L0019o3020j88914j05337R2994J8448p6957
$$ 494636 346793 193601 119663 105683 135702 72682 -116232 -221569 -128575 -110127 -187084
13445a87084J646P0478L7004k622J23272J39631J55195j1240j40069j01958J61801
$$ -187084 -185438 -114960 -77956 -80578 42694 182325 337520 326280 186211 84253 246054
13434B46054K18705J8895k1747L010J4802j69845k10917j81827l34650k77070
$$ 246054 464759 483654 461907 464917 479719 309874 98957 -82870 -417520 -694590
13424f94590L3267K32254R3086N1128K13158J46077J07179j63622k37109K33337
$$ -694590 -661323 -429069 -335983 -284855 -71697 74380 181559 17937 -219172 14165
13414A4165K20046N1841l0422j23207j16069q028J89760L54564L03145k3817l57462
$$ 14165 234211 286052 255630 132423 16354 8326 198086 552650 855795 831978 474516
13403D74516l70090k4567J42235L5927l6598j3520N6138o6579m6543j49269j51552
$$ 474516 104426 79859 222094 258021 221423 207903 264041 197462 150919 1650 -149902
13392a49902J17033K95940J95709O9647M9476r9844l16632l12662j04626k0636
$$ -149902 -32869 263071 458780 528427 577903 478059 161427 -151235 -255861 -276497
13382b76497J15532J06538L2387j06546k50064r9262J15906K52809K07286J13963
$$ -276497 -160965 -54427 -22040 -128586 -378650 -477912 -362006 -109197 98089 212052
13372B12052j75930k68058K4351K5410R4123L8399k0777q891P2170l152K9372
$$ 212052 36122 -231936 -207585 -182175 -88052 -49653 -70430 -79321 -7151 -10303 19069
13361A9069J09683J86338Q6037j2393j48859q9085J8257o4599J3818K1573j9760
$$ 19069 128752 315090 401127 388734 239875 150790 169047 104448 118266 139839 120079
13350A20079Q5569r8894q8101J25783J28255M9850r7768k19088m2561O1373l451
$$ 120079 205648 106754 18653 144436 272691 322541 224773 5685 -36876 24497 21046
13339B1046R929J08573M112l2540j20917j5589J15996L3673J65587O2116L5825
$$ 21046 30975 139548 143660 111120 -9797 -25386 90610 124283 289870 351986 387811
13328C87811q2502j14950P4528J12277K5114P682j012q8939O8314o0637j19603
$$ 387811 305309 190359 264887 377164 402278 409960 408948 320009 388323 327686 208083
13317B08083j5757j90857j93941L2643Q2458J18855K4511j85879Q3464L33066
$$ 208083 192326 1469 -192472 -159829 -77371 41484 65995 -119884 -36420 296646
13307B96646L54466R91k12707l02446j78334m7503J46015K81163K38988J5465
$$ 296646 651112 652103 439396 136950 -41384 -88887 57128 338291 577279 592744
13297E92744P2097R3987j4385k136j31150K4752q9070j83763j45552m7512r7540
$$ 592744 664841 758828 744443 742307 611157 635909 546839 363076 217524 170012 72472
13286G2472J89299J76251j88424r3697n8273K5346K13675J59763J31714k0578
$$ 72472 261771 438022 249598 155901 97628 122974 336649 496412 628126 607548
13276F07548j35665j74623r3322p803j7505j42972k88504r9763O7533p115J02800
$$ 607548 471883 297260 203938 196135 178630 35658 -252846 -352609 -285076 -292191 -189391
13265a89391J49416j64852j45172K19690K03102J71119N4671k0261J19497J11847
$$ -189391 -39975 -204827 -349999 -130309 72793 243912 298583 278322 397819 509666
13255E09666O8263N8425J34372J39465M8705j17775j31254K2176Q2025j8633q759
$$ 509666 577929 636354 770726 910191 958896 841121 709867 732043 814068 795435 786676
13244G86676J4294j45789k97233j07909R3849K4317j27053k05921m0708K19071
$$ 786676 800970 655181 357948 250039 343888 368205 241152 35231 -5477 213594
13234B13594K73514J81859j5149l7160Q9073J14436j04715r0359n9737j69454
$$ 213594 487108 668967 653818 616658 705731 820167 715452 625093 565356 395902
13224C95902j87302m6473Q8297J42083J32488m6617r0414M1867P7771r4850j93566
$$ 395902 208600 162127 250424 392507 524995 478378 387964 429831 507602 412752 219186
13213B19186q6181K4666J30283K294j27476j1867K07539J04558q5472j91267o8522
$$ 219186 133005 157671 287954 290248 162772 150905 358444 463002 377530 186263 117741
13202A17741O6356J95399K078j40719L643K6075J02790J69215J22770j0045k8029
$$ 117741 184097 379496 381574 240855 244498 270573 373363 542578 665348 655303 627274
13191F27274n9436k20672k30042r9840K9624k9381j76455O9929M8557o3961n9035
$$ 627274 567838 347166 117124 17284 46908 17527 -158928 -88999 -40442 -104403 -163438
13180a63438J43691K15853K72879m0675k32569o1297J681p5268R873J69758j49175
$$ -163438 -19747 196106 468985 428310 195741 134444 136125 60857 70730 240488 91313
13169I1313l03477p12K42465J92802P0397k29761l5411J40976n2503k4223J46583
$$ 91313 -212164 -212876 29589 222391 292788 63027 27616 168592 116089 91866 238449
13158B38449J45048P4361n4200J22607J21943q9800j43385j26464J2932k4012
$$ 238449 383497 457858 403658 526265 648208 558408 415023 288559 301491 277479
13148B77479j96648j6068J52626K90607K65063N2941o3665r8137q4184q8549j04981
$$ 277479 80831 64763 217389 507996 773059 826000 762335 664198 580014 491465 386484
13137C86484K16051K43903j3603j48507l03126j39080J16399J25656J35098J94065
$$ 386484 602535 846438 832835 684328 381202 242122 358521 484177 619275 813340
13127H13340P3180p6900p1353j14278l8568j7942j4350L1315L2048N4034J16531
$$ 813340 886520 809620 738267 623989 585421 567479 553129 584444 616492 670526 787057
13116G87057J0532j44853j18145P2201K65717J74365k6335m9452j2239k9046r0072
$$ 787057 797589 652736 534591 606792 872509 1046874 1020539 971087 958848 929802 839730
13105H39730r8789N3361J31782K71640J67137j16686J4291R5342j97687k36289
$$ 839730 740941 794302 926084 1197724 1364861 1248175 1262466 1357808 1160121 923832
13095I23832j947Q4704K63287O3958m6009j37740O8732L97655K15556j94424j80177
$$ 923832 921885 1006589 1269876 1333834 1287825 1150085 1218817 1616472 1832028 1637604 1457427
13084A457427k9283j82164j33249K53192K97530J67285L13013L0051j74662K70662
$$ 1457427 1428144 1245980 1112731 1365923 1663453 1830738 2143751 2173802 1999140 2269802
13074B269802N22706L57980K97348L58470O10896R69815R36453K83344n26390
$$ 2269802 2792508 3150488 3447836 3806306 4417202 5387017 6323470 6606814 6080424
13065F080424p93204n78180m91435m91080m47065m18919m46294l31742r0840j62638
$$ 6080424 5287220 4709040 4217605 3726525 3279460 2860541 2414247 2082505 1991665 1829027
13055A829027j63363j17045K42796J36232m4161R9939m6042o8143O4106J28301
$$ 1829027 1665664 1548619 1791415 1927647 1883486 1983425 1937383 1869240 1933346 2061647
13045B061647P6858j19241n6487Q8836j9440j68486J88733K06066l3342J63297
$$ 2061647 2138505 2019264 1962777 2051613 2032173 1863687 2052420 2258486 2225144 2388441
13035B388441J99980K73125m2357r9711j54694k34723p4171J16300K67227J92647
$$ 2388441 2588421 2861546 2819189 2719478 2564784 2330061 2255890 2372190 2639417 2832064
13025B832064K71743K95732J97770J21190L1994P8968j10552n7829O3241m8381
$$ 2832064 3103807 3399539 3597309 3718499 3750493 3829461 3718909 3661080 3724321 3675940
13015C675940J01389P9644j1542p0203P0962J36004J62094J49970Q2299K59097
$$ 3675940 3777329 3856973 3845431 3775228 3846190 3982194 4144288 4294258 4376557 4635654
13005D635654L93240M61375J76714J37471L01549N07709M35380M41327N44302
$$ 4635654 5028894 5490269 5666983 5804454 6106003 6613712 7049092 7490419 8034721
12996H034721Q28904Q69248P01608P84107R86878J198036J436442J725480K165235
$$ 8034721 8863625 9732873 10434481 11218588 12205466 13403502 14839944 16565424 18730659
12987A8730659K787671L215923L939736M925892N828652P236269R216599J1445415
$$ 18730659 21518330 24734253 28673989 33599881 39428533 46664802 55881401 67326816
12979F7326816J4439073J8692986K3868893L0605765L7839678M0717525L0628132
$$ 67326816 81765889 100458875 124327768 154933533 192773211 233490736 264118868
12972B64118868K383797k8900612m3598232m1692430l3249651k5057940j8649473
$$ 264118868 266502665 237602053 194003821 152311391 119061740 94003800 75354327
12965G5354327j3864972j0358846q110289o442778n044989l911673l325680k805877
$$ 75354327 61489355 51130509 43020220 36577442 31532453 27620780 24295100 21489223
12957B1489223k284006k066892j871485j520931j155567p88994o87896q58487
$$ 21489223 19205217 17138325 15266840 13745909 12590342 11801348 11113452 10254965
12949A0254965p92972n53837o77900m23310k04393l40409m89735k50655j76093
$$ 10254965 9461993 8908156 8230256 7806946 7602553 7262144 6772409 6521754 6345661
12940F345661l03886k99376j36494j2637J06339L02617M0068j86846j6813k9908
$$ 6345661 6041775 5742399 5605905 5593268 5699607 6002224 6042292 5855446 5838633 5808725
12930E808725O2059J66599K38322K31839O2298j17160p9179L38348N74465N15023
$$ 5808725 5870784 6037383 6275705 6507544 6569842 6452682 6373503 6711851 7286316 7801339
12920G801339N06774O90287R46690J040532J133268J192732J150003O60734r7448
$$ 7801339 8308113 8998400 9945090 10985622 12118890 13311622 14461625 15122359 15024911
12911A5024911o01971o11811k57273j30775N228M22275P69335J205567J513405
$$ 15024911 14422940 13811129 13553856 13423081 13428309 13850584 14619919 15825486 17338891
12902A7338891J639272K015143K530364L214045M115526N014567O201932P670795
$$ 17338891 18978163 20993306 23523670 26737715 30853241 35867808 42069740 49740535
12894D9740535R588419J2092569J5426688K0096293K6264443L3526692M0482264
$$ 49740535 59328954 71421523 86848211 106944504 133208947 166735639 207217903
12887B07217903M1233224K5548467p441837l6926774m6034421m0678277l1347376
$$ 207217903 248451127 273999594 266557757 229630983 183596562 142918285 111570909
12880A11570909k3071374j7108282j2565382r633505p405371n694297m560683
$$ 111570909 88499535 71391253 58825871 49192366 41786995 36092698 31532015
12873C1532015l564619k622726j748534j000128l40715k121n34342k351557k613735
$$ 31532015 27967396 25344670 23596136 22596008 22255293 22253172 21718830 19367273 16753538
12864A6753538j663126j285085j574434j330541r34287p53383p60184n78866m88022
$$ 16753538 15090412 13805327 12230893 10900352 9966065 9212682 8452498 7873632 7385610
12855G385610m85819l28909k54419l48202j87129J07408r5555j54730o6366K2616
$$ 7385610 6899791 6570882 6316463 5968261 5781132 5888540 5792985 5638255 5571889 5594505
12845E594505L9292j17060q6287J17241J38360J9374l1784K1891J8684K9346L20761
$$ 5594505 5633797 5516737 5430450 5547691 5686051 5705425 5673641 5695532 5714216 5743562 6064323
12834F064323J58448L5443j1204J59840J99527R8090L23505N16232L53301L07283
$$ 6064323 6222771 6258214 6247010 6406850 6606377 6704467 7027972 7544204 7897505 8204788
12824H204788M17687L57267N38354Q26645P66801O66130R42666J514008K073073
$$ 8204788 8622475 8979742 9518096 10344741 11111542 11777672 12720338 14234346 16307419
12815A6307419K080782K191902K813873L519250M658651N711535O537827Q062631
$$ 16307419 18388201 20580103 23393976 26913226 31571877 37283412 43821239 51883870
12807E1883870J0039718J2713741J6701195K1744310K7937880L4835080M0428575
$$ 51883870 61923588 74637329 91338524 113082834 141020714 175855794 216284369
12800B16284369L7264850J6000041j7187982m0244004m4120668l7156720k8258032
$$ 216284369 253549219 269549260 252361278 212117274 167996606 130839886 102581854
12793A02581854k1089781j5836318j1978198r067346p193605n915622m730728
$$ 102581854 81492073 65655755 53677557 44610211 37416606 31500984 26770256
12786B6770256l710616k944098k388682k102592j957253j644496j108287q39422
$$ 26770256 23059640 20115542 17726860 15624268 13667015 12022519 10914232 10074810
12778A0074810q01823q21059p06430n46918n42535n44683m43876k65422k77550
$$ 10074810 9272987 8451928 7745498 7198580 6656045 6111362 5667486 5402064 5124514
12769E124514j32600j65707k78325j83175k35520l64725l44724j66141j4344P6720
$$ 5124514 4991914 4826207 4547882 4364707 4129187 3764462 3419738 3253597 3239253 3315973
12759C315973J5633j43446j69739k96599m46195k66347j35716j3170k1208j11664
$$ 3315973 3331606 3188160 3018421 2721822 2275627 2009280 1873564 1860394 1839186 1727522
12749A727522k06404o4165k532M5247q6688k43361L1268J08673o7025o7991L7681
$$ 1727522 1521118 1456953 1454421 1499668 1412980 1169619 1200887 1309560 1242535 1174544 1212225
12738A212225J15864J49664j7883j03362j15130j7776j06016k92549J161J65115
$$ 1212225 1328089 1477753 1459870 1356508 1241378 1223602 1117586 825037 826198 991313
12728I91313q1778q6045n0103j82968k48189q3445o2335m343Q0590k1931j06702
$$ 991313 909535 823490 773387 590419 342230 258785 196450 192107 272697 250766 144064
12717A44064M2228N8077J38824j16613r2959Q6478J94796K49783M4201J26026
$$ 144064 186292 244369 383193 266580 173621 260099 454895 704678 748879 874905
12707H74905K0925j21278j08212J0183l5249j42950j47147j35603r2886J2345
$$ 874905 895830 774552 666340 676523 641274 498324 351177 215574 122688 135033
12697A35033J13575K8961N8179J56720O6877o5225q2305k2331j09975k14932j96177
$$ 135033 248608 277569 335748 492468 559345 494120 411815 389484 279509 64577 -131600
12686a31600o1617J9628J21045K85555l1659l0096n852J4250P7617L03461K43026
$$ -131600 -193217 -173589 -52544 233011 201352 171256 165404 179654 257271 560732 803758
12675H03758p7786j03836j24899j22528l6357L9302J27879O4034p7100j9893K11112
$$ 803758 725972 622136 497237 374709 338352 377654 505533 569567 492467 472574 683686
12664F83686J23858k9993j39871q7747l9341k141K02945K23963J16318o6787k95465
$$ 683686 807544 777551 637680 549933 510592 508451 711396 935359 1051677 984890 689425
12653F89425j06005O7106n25k28780l85803p4687M2835O5048J28684R217K8121
$$ 689425 583420 650526 650001 421221 35418 -39269 3566 68614 197298 206515 234636
12642B34636Q137r0463m5884J45318K12170J58110R4496q6179j42786j42383M0179
$$ 234636 242773 152310 106426 251744 463914 622024 716520 630341 487555 345172 385351
12631C85351j8502K17N2998J49948J05709j51016j82674j86217j60059l73218
$$ 385351 366849 367066 420064 570012 675721 524705 342031 155814 -4245 -377463
12621c77463j43460K12393P7581r797j5099J27678Q04P9341K5515K0631J20883
$$ -377463 -520923 -308530 -230949 -240746 -255845 -128167 -127363 -48022 -22507 -1876 119007
12610A19007o8388k71327j69703j25551Q676P3178J98031K83418J10968m367J5082
$$ 119007 50619 -220708 -390411 -515962 -507286 -434108 -236077 47341 158309 153942 169024
12599A69024Q1822L3138J4157J1090q0652k3032N3306J29199Q4697m2831k32486
$$ 169024 250846 283984 298141 309231 228579 205547 258853 388052 472749 429918 197432
12588A97432j90913p1035L3446J03428J60729J17806o6203j16494M5692R394j83517
$$ 197432 6519 -64516 -31070 72358 233087 350893 284690 168196 213888 223282 39765
12577C9765O2086J34818o6744R1530J48766P8373J22301J02191n547j21465j50981
$$ 39765 101851 236669 169925 261455 410221 488594 610895 713086 707539 586074 435093
12566D35093M490r5406j62521Q107L7262M4052o771j73249k38593p4178K57863
$$ 435093 439583 344177 181656 189763 227025 271077 264306 91057 -147536 -221714 36149
12555C6149J29758p493k2539l40888l39538J58180L07884M2365Q9647J92616n1445
$$ 36149 165907 158414 135875 -205013 -544551 -386371 -78487 -36122 53525 246141 194696
12544A94696j06107k37247j99295J97145L11061P3003j14603j74640k47985j03938
$$ 194696 88589 -148658 -347953 -150808 160253 233256 118653 -55987 -303972 -407910
12534d07910q3850r698m444J45269M44918L46209P693j47404j22011r546L0703
$$ -407910 -491760 -501458 -505902 -360633 84285 430494 438187 290783 168772 159226 189929
12523A89929j72014k12098j79970q1327N4028r2822j23191M9842J12357J52503
$$ 189929 17915 -194183 -374153 -455480 -401452 -494274 -617465 -567623 -455266 -302763
12513c02763J15882P5170j35871j84327k31077j29917K161J21870L03766J29340
$$ -302763 -186881 -111711 -247582 -431909 -662986 -792903 -790742 -668872 -365106 -235766
12503b35766J42472J06501P3028j29687l44563q0968K11194L24535J95324J23868
$$ -235766 -93294 13207 86235 -43452 -388015 -468983 -257789 66746 262070 385938
12493C85938j02149k24992p7913J16749J68653o6671p8393m1533j93152j88138
$$ 385938 283789 58797 -19116 97633 266286 199615 121222 79689 -113463 -301601
12483c01601k89512j19112M2038L6183Q3525l6298K3826J45522m6200R8298K50062
$$ -301601 -591113 -710225 -668187 -632004 -548479 -584777 -560951 -415429 -461629 -363331 -113269
12472a13269k0868k12856M5071J37640j9859j14600n7915J75582L77253K57845
$$ -113269 -134137 -346993 -301922 -164282 -184141 -298741 -356656 -181074 196179 454024
12462D54024r9570k43551k94615K6159J88854m9498n531Q4859J87403M4525k11643
$$ 454024 354454 110903 -183712 -157553 31301 -18197 -23728 61131 248534 293059 81416
12451H1416j5284J60398K88333R7326O5743k2019l08319l67110j93360r8091m5217
$$ 81416 66132 226530 514863 612189 677932 655913 347594 -19516 -212876 -310967 -356184
12440c56184J52805Q2279j50815K630K05842J35539j54310o0289M9318J02489
$$ -356184 -203379 -121100 -271915 -269285 -63443 72096 -82214 -142503 -93185 9304
12430I304J80088j5821m6125o1715r3592k00687l31962r4567P3147J41989K0113
$$ 9304 189392 173571 127446 65731 -27861 -228548 -560510 -655077 -581930 -439941 -419828
12419d19828j87107l0306K59574L30841K57750J49310J84899J56539m2344j97070
$$ -419828 -606935 -637241 -377667 -46826 210924 360234 545133 701672 659328 462258
12409D62258j03423l6023j1522J33711K19287J13026j16818k38069l60935l61200
$$ 462258 358835 322812 311290 445001 664288 777314 660496 422427 61492 -299708
12399b99708k73241j0621J35697K29765K22069Q4481j20612k88151o8055R3067
$$ -299708 -572949 -583570 -447873 -218108 3961 88442 -32170 -320321 -388376 -295309
12389b95309J48818J32613j8048m6110J96863K17136J00728j17416l56969j7962
$$ -295309 -146491 -13878 -31926 -78036 118827 335963 436691 319275 -37694 -55656
12379e5656K68227J35516J9945Q2858K13391m8390k61835k07821L8282n7484j71480
$$ -55656 212571 348087 368032 450890 664281 615891 354056 146235 184517 127033 -44447
12368d4447o9832j64321m5332L9424J93831L43348J76912j66228k16725j62402
$$ -44447 -114279 -278600 -323932 -284508 -90677 252671 429583 263355 46630 -115772
12358a15772p6845l1406j4860L8713J44305M874j41466j32122p535J71805K3299
$$ -115772 -192617 -224023 -238883 -200170 -55865 -50991 -192457 -324579 -332114 -160309 -137010
12347a37010l2973o1338J59323J04665j74049j29482N4004M4707M7436O5311N987
$$ -137010 -169983 -231321 -71998 32667 -141382 -270864 -216860 -172153 -124717 -59406 -53419
12336e3419L2307P0316J59063J77764Q559j3454j83029k44253n743J41513M4216
$$ -53419 -21112 49204 208267 386031 394590 381136 198107 -46146 -51889 89624 133840
12325A33840N4805r7770J9972J34345N6K1453l8613K59554J71782k01289k77929
$$ 133840 188645 90875 110847 245192 245248 266701 228088 487642 659424 458135 180206
12314A80206j36139j60084o7772J67574L12258J10982m4102j52064k81512j4452
$$ 180206 44067 -116017 -183789 -16215 296043 407025 362923 210859 -70653 -85105
12304h5105K50762O8052j03088J1276m9777J07269R2148m7753R090J27118K16401
$$ -85105 165657 233709 130621 141897 92120 199389 291537 243784 252874 379992 596393
12293E96393J66831J07155N7123l389j29379j35662p1821n8601j06065r1629P3335
$$ 596393 763224 870379 927502 924113 794734 659072 587251 528650 422585 330956 404291
12282D04291J41418j5480j05637j69909j83240P3613J18654p0457j76941j04269
$$ 404291 545709 530229 424592 254683 71443 145056 263710 193253 16312 -87957
12272h7957j5166J70698J52328j58931k08953R2112J26633k01601o8540n599r2653
$$ -87957 -103123 67575 219903 60972 -147981 -55869 70764 -130837 -199377 -204976 -297629
12261b97629q479O2250M7269Q1878O8753L7047N4914l324J3560k819J07122J87366
$$ -297629 -306108 -243858 -196589 -114711 -45958 -8911 46003 42679 56239 53420 160542 347908
12249C47908P5670k0256K3357j54286k95840Q0072J75343P5384K50890K11971
$$ 347908 423578 403322 426679 272393 -23447 56625 231968 307352 558242 770213
12239G70213k23573k92126m2562Q2801k26760j18268M5923j78685j79667m4689
$$ 770213 546640 254514 211952 294753 67993 -50275 -4352 -183037 -362704 -407393
12229d07393P757J4645J45197J96825Q5504Q5126L33601m1171m17726k69842m3810
$$ -407393 -399636 -384991 -239794 -42969 42535 127661 461262 420091 2365 -267477 -311287
12218c11287J15010J37240M2241j44731O7149J70541J14073K14159r405j20567
$$ -311287 -196277 -59037 -16796 -161527 -94378 76163 190236 404395 394990 274423
12208B74423j63304q9474J9544q9378k77463k1284L43382K35826J48912J95997
$$ 274423 111119 21645 41189 -48189 -325652 -346936 -3554 232272 381184 577181
12198E77181p2601j74031p4709n3130L524m635j6435r7380j73703r6418j2853
$$ 577181 504580 330549 255840 202710 206234 201599 185164 87784 -85919 -182337 -195190
12187a95190k8255o2110M8261j6637K7116n0213k02656j26633J86188K94945J25331
$$ -195190 -223445 -285555 -237294 -253931 -226815 -277028 -479684 -606317 -420129 -125184 147
12176A47o4536o9563j62454m3915J51312J17509K2969L8875L8623k9072k02336
$$ 147 -64389 -133952 -296406 -340321 -189009 -71500 -48531 -9656 28967 -105 -202441
12165b02441l5436J61489K35905r431k26483O4191K2006M809j70581j78358q8113
$$ -202441 -237877 -76388 159517 150086 -76397 -12206 9800 14609 -155972 -334330 -422443
12154d22443P4619J65222J1522J06188J08829j78255j32033Q7656o9324M2510
$$ -422443 -347824 -182602 -171080 -64892 43937 -134318 -266351 -178695 -248019 -205509
12144b05509J43329J59569J72517o6380N2673J4789k04574j11103N5734J23944
$$ -205509 -62180 97389 269906 203526 256199 270988 66414 -44689 11045 134989
12134A34989J02589j4805j16489m2962j2610j6704Q3155N9033j44861N5385R5291
$$ 134989 237578 222773 106284 63322 50712 34008 117163 176196 31335 86720 182011
12123A82011l3032N333j50364k21565J2857K15442M204K64257J87435l46252l94872
$$ 182011 148979 154312 3948 -217617 -204760 10682 14886 279143 466578 120326 -274546
12112b74546N3166J54461J40526J95821P2870p0018N3538L143j38688k50325l25602
$$ -274546 -221380 -66919 73607 269428 342298 272280 325818 328961 190273 -60052 -385654
12101c85654k56347r3825K14926L08308J6331J10191L36182K92811J40613L5604
$$ -385654 -642001 -735826 -520900 -212592 -196261 -86070 250112 542923 683536 719140
12091G19140j78534j55066j11307k97918k62243O9148J18052k0662p9929n442
$$ 719140 540606 385540 274233 -23685 -285928 -216780 -98728 -119390 -199319 -204761
12081b04761J7419L6017J20906Q1817Q8998n4325j13290q1316k05483j59451M595
$$ -204761 -187342 -151325 -30419 51398 140396 86071 -27219 -108535 -314018 -473469 -468874
12070d68874P2754M8949n199q5189o0467M907L14252K09892Q7062j37476j13230
$$ -468874 -396120 -347171 -352370 -437559 -498026 -493119 -178867 31025 118087 -19389 -132619
12059a32619M3831O4698J58789J21469M7095P4758J07915L3578P4589j4159j03530
$$ -132619 -88788 -24090 134699 256168 303263 378021 485936 519514 594103 579944 476414
12048D76414k37340M9493o1362m44014k00393P4829K98963L09951P7203l2486
$$ 476414 239074 288567 227205 -216809 -417202 -342373 -43410 266541 343744 311258
12038C11258l8114Q8905J00155N7261Q0108J87656K52164J46947L636j85395l29044
$$ 311258 273144 362049 462204 519465 599573 787229 1039393 1186340 1189976 1004581 675537
12027F75537l76663k53710L5693L0286j5617J38072K07527j0095l15645n5065
$$ 675537 298874 45164 80857 111143 95526 233598 441125 431030 115385 60320
12017F0320K57146M7882n365o2067l5723J56848K11159J79999J96086J05344J69969
$$ 60320 317466 365348 359983 297916 262193 419041 630200 810199 1006285 1111629 1281598
12006A281598R507k6271K2890J83108N80956Q01078O11619O23698R76373O53648
$$ 1281598 1291105 1264834 1287724 1470832 2051788 2852866 3464485 4088183 5064556 5718204
11996E718204m17023j121812j087619p95632p29047n62795l24501l82309l42015
$$ 5718204 5301181 4179369 3091750 2296118 1567071 1004276 679775 297466 -44549
11987d4549k4862K14641K20898K5096J54580J33232j38504j24191q8791q5550
$$ -44549 -69411 145230 366128 391224 545804 679036 540532 416341 327550 242000
11977B42000J3457P8754J11394l412j89121j26436q7520j6079K10740K75937n2620
$$ 242000 255457 334211 445605 442193 253072 126636 39116 23037 233777 509714 457094
11966D57094m00812k51615J3786J13952K87342j1113j83662K9066p7439q1064
$$ 457094 56282 -195333 -181547 -67595 219747 208634 24972 54038 -23401 -104465
11956a04465P3508j123M2081l269O4100q4851k11436m2136m8749N2210L20287
$$ -104465 -30957 -32080 10001 6732 70832 -14019 -225455 -267591 -316340 -264130 56157
11945E6157J45869j11120P7064N1649n4180q4520J8287p2753j8134J61041J73864
$$ 56157 202026 90906 167970 219619 165439 80919 99206 26453 8319 169360 343224
11934C43224k4220j87551j15921j24691k4741j19521J18412K60058r1172Q5017
$$ 343224 319004 131453 15532 -109159 -133900 -253421 -135009 125049 33877 118894
11924A18894L63127K29705J3981P1694R2196K56577L98593M35575O14242N70163
$$ 118894 482021 711726 725707 797401 889597 1146174 1544767 1980342 2594584 3164747
11914C164747J33760R9122K69947J54179K04425N64838O55987J11649p14168o51650
$$ 3164747 3298507 3397629 3667576 3821755 4026180 4591018 5247005 5358654 4644486 3992836
11904C992836n54249o75085n61374m37952m05675l21418Q0623Q6654k73520j80194
$$ 3992836 3438587 2763502 2202128 1764176 1358501 1037083 1117706 1204360 930840 750646
11894G50646q9724p2649l5738O5433J03634j680J10204j26820k52002k51470k58180
$$ 750646 660922 588273 552535 617968 721602 719922 830126 703306 451304 199834 -58346
11883e8346k33335J32844L05087J29377j41342j55778n4175K57447J81530j41068
$$ -58346 -291681 -158837 146250 275627 134285 -21493 -75668 181779 363309 222241
11873B22241j52164k04255j19955P2376J33136L7866O3216J85625R7368L7188
$$ 222241 70077 -134178 -254133 -181757 -48621 -10755 52461 238086 335454 372642
11863C72642m0528k9892l4674j81006j25242j53436Q646K42743Q5666n853N3768
$$ 372642 332114 302222 267548 86542 -38700 -192136 -183490 59253 144919 139066 192834
11852A92834Q9984J33536N5595l0960n2514n6616O0458o5316o5136K24916J51400
$$ 192834 282818 416354 471949 440989 388475 331859 392317 327001 261865 486781 638181
11841F38181k20482l8991J55185N0905j68224k81800j94605O9024J28170J19564
$$ 638181 417699 378708 533893 584798 416574 134774 -59831 9193 137363 256927
11831B56927Q8604J78242J82518R0358k2338j63754k37227L7075J76867Q0201
$$ 256927 345531 523773 706291 796649 774311 610557 373330 410405 587272 667473
11821F67473L0338j7032k06311m0039J36900j12622k45750k8417J48011L42187
$$ 667473 697811 680779 474468 434429 571329 458707 212957 184540 332551 674738
11811F74738J46590j82109j43567j94461j43059r5982l1136L1364J12893l1931
$$ 674738 821328 639219 495652 301191 158132 62150 31014 62378 175271 143340
11801A43340k26537l73246j44858J21270K43165R4209r3137p9799L0603J15749
$$ 143340 -83197 -456443 -601301 -480031 -236866 -142657 -235794 -315593 -284990 -169241
11791a69241P2348j29919J412J01454l1472N0721P2980k1274J28682N8259k46560
$$ -169241 -96893 -226812 -225400 -123946 -155418 -104697 -31717 -52991 75691 133950 -112610
11780a12610j42142J60631K57049J71165j42036k21500O30K05055L58550K16820
$$ -112610 -254752 -94121 162928 334093 192057 -29443 -28813 176242 534792 751612
11770G51612j65455j61179j45966r5817l8800R302P846k41328j55533J26872K9611
$$ 751612 586157 424978 279012 183195 144395 153697 161543 -79785 -235318 -108446 -78835
11759g8835r635j42475N0078M1989j59284O8023Q6005J15399L1728j4629J13219
$$ -78835 -88470 -230945 -180867 -138878 -298162 -230139 -144134 -28735 2993 -11636 101583
11748A01583P7309P2288J74282l0026j87830R4400J62508j37405k75747j4864
$$ 101583 178892 251180 425462 395436 207606 302006 464514 327109 51362 36498
11738C6498r8003k11893O2413J8262P2689J66780L0322R5571P0952r2896j51842
$$ 36498 -61505 -273398 -210985 -192723 -120034 46746 77068 172639 243591 150695 -1147
11727a147o6121p0831J71542K3623k19551k45791J93836L69711o6991m8453n7855
$$ -1147 -67268 -138099 33443 57066 -162485 -408276 -214440 155271 88280 39827 -18028
11716a8028R899J4686n2134q6059k3719M4303O0796M3580k0050j38931J3245p354
$$ -18028 -8129 6557 -45577 -131636 -155355 -111052 -50256 -6676 -26726 -165657 -152412 -159766
11704a59766k77069k14039J4182L57977O4305m5423J9984j8459J70719J64110
$$ -159766 -436835 -650874 -636692 -278715 -214410 -259833 -239849 -258308 -87589 76521
11694G6521M9144M980J35828L6220k11733j94048M6660L0683J0174K5035j60295
$$ 76521 125665 130645 266473 302693 90960 -103088 -56428 -25745 -15571 9464 -150831
11683a50831j23143J01946K07850P5469j22256R767L7633o7952o9279j35105O4983
$$ -150831 -273974 -172028 35822 111291 -10965 -1198 36435 -31517 -100796 -235901 -170918
11672a70918K39903N7047m401n148l8889J19181j2985r0612p4631q4587r2669
$$ -170918 68985 126032 121631 116483 77594 196775 183790 93178 18547 -66040 -158709
11661a58709j87259Q4115M47983P1086l49835k74240P2873j21971k23686K0886
$$ -158709 -345968 -261853 186130 257216 -92619 -366859 -293986 -415957 -639643 -618757
11651f18757o6316J11544K55355K75809j4755p7676K17186J16763m8557k4892
$$ -618757 -685073 -573529 -318174 -42365 -57120 -134796 82390 199153 150596 125704
11641A25704q6386r9457J8226m3226l9712Q7451J01215J95269R7444P4763Q6920
$$ 125704 39318 -60139 -41913 -85139 -124851 -37400 63815 259084 356528 431291 518211
11630E18211j42427j04379j9j27830j42004r9241R1956R5889P1765N7344n5920
$$ 518211 375784 271405 271386 143556 1552 -97689 -5733 90156 161921 219265 163345
11619A63345p5650P378j2473m5735J10054k4174k06672n2598p0968j99775j55699
$$ 163345 87695 95073 82600 36865 146919 122745 -83927 -136525 -207493 -407268 -562967
11608e62967J48028J74947J55772P4156J5648j31242r1861J61414J02314j41012
$$ -562967 -414939 -239992 -84220 -10064 5584 -125658 -217519 -56105 46209 -94803
11598i4803m2924K2494K3521M6763p6360p7296r3157n8322P4139J10698Q1836
$$ -94803 -137727 -115233 -91712 -44949 -121309 -198605 -291762 -350084 -275945 -165247 -83411
11587h3411m891J16953K8268K16417K07576n8249j27187j01980o5155j49790R9397
$$ -83411 -88302 28651 56919 273336 480912 422663 295476 193496 128341 -21449 77948
11576G7948K17128J82169J00064J52248K1761j55909k7489Q3764J49647J28861
$$ 77948 295076 477245 577309 729557 751318 595409 567920 651684 801331 930192
11566I30192J71606K63747L74702N20156O41581O14041O19453M94677J74285k23973
$$ 930192 1101798 1365545 1740247 2260403 2901984 3516025 4135478 4630155 4804440 4580467
11556D580467n93134q08040q69134o40082n20147k57104j7192M3985k6587p9265
$$ 4580467 3987333 3179293 2310159 1670077 1149930 892826 875634 919619 893032 813767
11546H13767k95141l64826r6889l5899q9874O6956J2211j00996r2709j31749P7604
$$ 813767 518626 153800 56911 21012 -68862 -1906 10305 -90691 -183400 -315149 -237545
11535b37545J64722K71016K80194N031o0243k24684k92876m3029J03640M4978
$$ -237545 -72823 198193 478387 483418 423175 198491 -94385 -137414 -33774 11204
11525A1204J30602k346j14041J97965L45159q251j7514J29174q1317r5126J17514
$$ 11204 141806 139460 25419 223384 568543 560292 542778 671952 590635 495509 613023
11514F13023N3708l6866L0330M3901N038m838J24671J71195r66o2920K25396K85044
$$ 613023 666731 629865 660195 704096 709134 704296 828967 1000162 999196 936276 1161672 1446716
11502A446716K79376N04915L03465J33187J91205L34694L78896Q83147J061203
$$ 1446716 1726092 2231007 2534472 2667659 2858864 3193558 3572454 4455601 5516804
11493E516804P81411J15299n86543n31827p19633p58583p55476p96587n17474
$$ 5516804 6298215 6413514 5826971 5295144 4575511 3816928 3061452 2264865 1747391
11484A747391l43416k71235o8346K7091m2176j15853p4283J5072J26161K93240
$$ 1747391 1403975 1132740 1064394 1091485 1049309 933456 859173 874245 1000406 1293646
11474A293646K31579J24052m9313J82216K50024L0406k10404k34743r6966k88983
$$ 1293646 1525225 1649277 1599964 1782180 2032204 2062610 1852206 1617463 1520497 1231514
11464A231514m28710k50567k25285k63970m5319J30901J70501J66437o0405j65169
$$ 1231514 802804 552237 326952 62982 17663 148564 319065 485502 425097 259928
11454B59928j0761p2057j67352k43373r1711J6175K83Q3309J66074k5252n9129
$$ 259928 249167 177110 9758 -233615 -325326 -309151 -308868 -225559 -59485 -84737 -143866
11443a43866n47J98966J28515M5643Q3234p3951k42669j56656O498j32515l5936
$$ -143866 -144413 54553 183068 228711 311945 237994 -4675 -161331 -154833 -287348 -323284
11432c23284Q7370n0567N0519K49075J29313k32576j61660J37902L34559K50456
$$ -323284 -235914 -286481 -235962 13113 142426 -90150 -251810 -113908 220651 471107
11422D71107n2694r3145k13824j50660K69659K45829L8585q2107l11872k52458
$$ 471107 418413 325268 111444 -39216 230443 476272 514857 432750 120878 -131580
11412a31580j20997k34720j63567j61260l659J20126J50436J02786P8526L29396
$$ -131580 -252577 -487297 -650864 -812124 -815783 -695657 -545221 -442435 -363909 -34513
11402c4513K16721j70549k26970j27207j58875J03100J83006J28340j67032l78253
$$ -34513 182208 11659 -215311 -342518 -501393 -398293 -215287 -86947 -253979 -632232
11392f32232k29822J00250L32886R1545j2306J12141K76965J75075n3644r2512
$$ -632232 -862054 -761804 -428918 -337373 -349679 -237538 39427 214502 160858 68346
11382F8346M6931K3409k5216O8161K05558J39834j41284j21912p30o9108j35229
$$ 68346 115277 138686 113470 181631 387189 527023 385739 263827 263097 193989 58760
11371E8760o4662m534L4127p596J79862O2562m1407L07814L58971J38313p3906
$$ 58760 -5902 -10436 23691 16095 195957 258519 217112 524926 883897 1022210 948304
11360I48304m09556m01675m1923K6299J01755r450j97244j83415K508J13395J28556
$$ 948304 538748 137073 95150 121449 223204 213754 16510 -166905 -164397 -51002 77554
11349G7554l694j78372j96969j30158R979N248Q3934O7550o4378q3815j34247
$$ 77554 73860 -104512 -301481 -431639 -421660 -416412 -332478 -264928 -329306 -413121 -547368
11338e47368Q8425k3255q2785J57145K10424K79017J45132r5036q4269j09661
$$ -547368 -458943 -482198 -564983 -407838 -197414 81603 226735 131699 47430 -62231
11328f2231j44746M6544J61928k0114j7828q8400l04449m6016Q1031J04859Q7654
$$ -62231 -206977 -160433 1495 -18619 -36447 -124847 -429296 -475312 -394281 -289422 -201768
11317b01768L3426J8671k0818O0853O9794L924j53026k17258p3870M2270p3659
$$ -201768 -168342 -149671 -170489 -109636 -39842 -35918 -188944 -406202 -480072 -437802 -511461
11306e11461j64205j97730O1330L98044N37852L00685M4300k07670k38243n4464
$$ -511461 -675666 -873396 -812066 -414022 123830 424515 468815 261145 22902 -31562
11296c1562K18208J76550o8479k11841j43678j10384L5784J83765N4496m3644
$$ -31562 186646 363196 294717 82876 -60802 -171186 -135402 48363 102859 59215
11286E9215m5212r9781j54099J41845J08055m1813J03165L33612K47082p9767
$$ 59215 14003 -85778 -239877 -98032 10023 -31790 71375 404987 652069 572302
11276E72302r3552j12638j93058J3742K05052K07539k1328k22274q9989q6422
$$ 572302 478750 366112 173054 186796 391848 599387 578059 355785 265796 179374
11266A79374j95460r4633N3043K35607P9877k75469l90426o144Q5695k05075j18233
$$ 179374 -16086 -110719 -57676 177931 257808 -17661 -408087 -414231 -328536 -533611 -651844
11255f51844N3480J39049L76860K41903J06805J41304l5641j38495l41004k23128
$$ -651844 -598364 -459315 -82455 159448 266253 407557 371916 233421 -107583 -330711
11245c30711J1708N0525P4432o282N9708J71876K12804p6906k31572k23760j65895
$$ -330711 -319003 -268478 -194046 -200328 -140620 31256 244060 167154 -64418 -288178 -454073
11234d54073n4478J25342K03962K19088j6294k27588k33186j35849k8768Q7485
$$ -454073 -508551 -383209 -179247 39841 23547 -204041 -437227 -573076 -601844 -514359
11224e14359J36696J28502j1854k983J69924K54145J18007M428M0915j64611j92851
$$ -514359 -377663 -249161 -261015 -263998 -94074 160071 278078 282506 323421 158810 -34041
11213c4041q4788j44143J3799J16481J57949J39205l5206j5334j20808l14265
$$ -34041 -118829 -262972 -249173 -132692 25257 164462 129256 113922 -6886 -321151
11203c21151j08501J64775J38467Q0420m8106j6792J09900o1946j6998R3059N0666
$$ -321151 -429652 -264877 -126410 -45990 -94096 -110888 -988 -62934 -79932 13127 63793
11192F3793J05284j0784j85733j23701P9984J59939R1029K9756o4201k41895j78180
$$ 63793 169077 158293 -27440 -151141 -71157 88782 179811 209567 145366 -96529 -274709
11181b74709l6004J22091K36721L0791k10976N7409m7806j39566J10929K9074
$$ -274709 -310713 -188622 48099 78890 -132086 -74677 -122483 -262049 -151120 -122046
11171a22046j5687K64862L04368J86015J24182n447j42836j49788j84863r8104
$$ -122046 -137733 127129 431497 617512 741694 736247 593411 443623 258760 160656
11161A60656J8409r4282J10152Q1895j52744j96345N2832K24931p8860j76462
$$ 160656 179065 84783 194935 276830 124086 -72259 -19427 205504 126644 -49818
11151d9818r2443j16604k0542n027R6793J53513J5949p4229J58947K35952J91442
$$ -49818 -142261 -258865 -279407 -284434 -187641 -34128 -18179 -92408 66539 302491 493933
11140D93933K16083r8381m40532k16406j3921j4786L5194J3203q0607r6464l7515
$$ 493933 710016 611635 171103 -45303 -59224 -74010 -38816 -25613 -106220 -202684 -240199
11129b40199J42360K05144j5774k76922j99046J1201K8222k9027p394K91176K97925
$$ -240199 -97839 107305 91531 -185391 -384437 -373236 -345014 -374041 -381435 -90259 207666
11118B07666J00530j55166j19683r2264q5988J06398J896o6442n1547m7141M8608
$$ 207666 308196 153030 33347 -58917 -144905 -38507 -36611 -103053 -154600 -201741 -153133
11107a53133J7035J52358J92467J44479l9745k84789j40661J19376K19884k5890
$$ -153133 -136098 16260 208727 353206 313461 28672 -111989 7387 227271 201381
11097B01381Q7582J74498l276k34814n03962k73677J05887L55230M35696K06607
$$ 201381 288963 463461 460185 225371 -278591 -552268 -446381 -91151 344545 551152
11087E51152l8889j45615k74877j46181J16914K30045M5769r5586k23561j91529
$$ 551152 512263 366648 91771 -54410 62504 292549 338318 242732 19171 -172358
11077a72358j1875O3417n91k4760J44032M5103N1626j48312l50205k07008M6362
$$ -172358 -184233 -120816 -121407 -146167 -2135 42968 94594 -53718 -403923 -610931 -564569
11066e64569K05422K13437P0981j24941j2126J34431O7267Q3268R7907k05818
$$ -564569 -359147 -145710 -74729 -199670 -211796 -77365 -10098 73170 171077 -34741
11056c4741l55912j9616J85220K63588p8164r0222J17339O7706P9164R6616o1261
$$ -34741 -390653 -410269 -225049 38539 -39625 -129847 -12508 55198 134362 230978 169717
11045A69717N4488K98383J46887j77539j61556k05186L5178O5552K6505j93591
$$ 169717 224205 522588 669475 491936 330380 125194 160372 225924 252429 58838
11035E8838l07082j04049m9715M2973Q3700o50J8249R7309O3501M5288J79335
$$ 58838 -248244 -352293 -402008 -359035 -275335 -275985 -257736 -160427 -96926 -51638 127697
11024A27697K96689Q0769j29812j04421p6671o1448r3854p3662J6916n078J09333
$$ 127697 424386 505155 375343 270922 194251 132803 38949 -34713 -17797 -22875 86458
11013H6458n2887m6313Q1292N3857M035m5362k31727j76965M4080r9398j59306
$$ 86458 33571 -12742 68550 122407 126442 81080 -150647 -327612 -283532 -382930 -542236
11002e42236Q1615J98757K12400l645r9319j11710j78058j84715m0606M2196K8749
$$ -542236 -460621 -261864 -49464 -53109 -152428 -264138 -442196 -626911 -667517 -625321 -596572
10991e96572Q2293K98979K05358L5095P0830L55888K90981L3813k45174k46634
$$ -596572 -514279 -215300 -9942 25153 95983 451871 742852 776665 531491 284857
10981B84857j10707p8603N9231r4667j16289j3111Q020Q5726m6239k8274R3007
$$ 284857 174150 95547 154778 60111 -56178 -69289 -61269 24457 -21782 -50056 42951
10970D2951O3808L7533k125k1847J20226k8166r8934p6118j99613l11388j10851
$$ 42951 106759 144292 142167 120320 240546 212380 113446 37328 -162285 -473673 -584524
10959e84524R07r6728j49002o4348K59666M63943K66115K17381J53138j31541
$$ -584524 -583617 -680345 -829347 -893695 -634029 -170086 96029 313410 466548 335007
10949C35007l18779j36666L5650O3656J35329J94837j40262l41888l5432J00767
$$ 335007 16228 -120438 -84788 -21132 114197 309034 168772 -173116 -208548 -107781
10939a07781Q6879K39908L06113R7204k34681k78289p333J7181j53405l6570K11719
$$ -107781 -20902 219006 525119 622323 387642 109353 102020 119201 -34204 -70774 140945
10928A40945J45327J3588j37210j06324j5897J08470K59207J66207k02738o9667
$$ 140945 286272 299860 162650 56326 40429 148899 408106 574313 371575 301908
10918C01908P7150k4774j27853j43500J18454J32923J2191J45461K42233n5464
$$ 301908 379058 354284 226431 82931 201385 334308 346499 491960 734193 678729
10908F78729k27916j93314q506M7631k7068p0292p8511k4517J60718J40780p8499
$$ 678729 450813 257499 248993 296624 269556 199264 120753 96236 256954 397734 319235
10897C19235q2947q1077r3382O5832Q1553l314K1642l4222n3095j06135N6998
$$ 319235 236288 155211 61829 127661 209214 205900 227542 193320 140225 34090 91088
10886I1088J13476j48796k26971j22802j3649k7268P5956L2769m8841l4742Q4204
$$ 91088 204564 55768 -171203 -294005 -307654 -334922 -258966 -226197 -275038 -309780 -225576
10875b25576J06671K45q3451j29746M243K21489N1432l2070o2803j61929k09330
$$ -225576 -118905 -118660 -202111 -331857 -327614 -106125 -54693 -86763 -149566 -311495 -520825
10864e20825j94912p5594M9165J84244K38386J22350J04K4662o8188j40877J62026
$$ -520825 -715737 -791331 -742166 -557922 -319536 -197186 -197082 -172420 -240608 -381485 -219459
10853b19459L35305K14024J3389j45872j41630J9397O6030q2452j16961p868K41399
$$ -219459 115846 329870 343259 197387 55757 75154 141184 58732 -58229 -66097 175302
10842A75302R7085k74805q4506R3062L5035M7868j37734K1773M5947n8193R4125
$$ 175302 272387 -2418 -86924 6138 41173 89041 -48693 -26920 19027 -39166 54959
10831E4959P7602j60562j44947P2455j33080r9165J94012K2972R3062K44238L45107
$$ 54959 132561 -28001 -172948 -100493 -233573 -332738 -138726 -115754 -22692 221546 566653
10820E66653L3403j82339k1055k47452k96517j72784l1751Q3407J46734l3432
$$ 566653 600056 417717 396662 149210 -147307 -320091 -351842 -268435 -121701 -155133
10810a55133j70605J2357J00786o6866j61464J45963L01527J42541j65292r3619
$$ -155133 -325738 -313381 -212595 -279461 -440925 -294962 6565 149106 -16186 -109805
10800a09805Q0967m7891n0624n3196k27023j51050Q3447N4858l5969M4211K93988
$$ -109805 -28838 -76729 -127353 -180549 -407572 -558622 -475175 -420317 -456286 -412075 -118087
10789a18087J34182J7269K4408r1943j13277L995N5536J2024J25990O624q768
$$ -118087 16095 33364 57772 -34171 -147448 -143453 -87917 -75893 50097 56721 47953
10778D7953m6498k01848l2952M14994Q5555k67810m3739K1878m1335J34626J54164
$$ 47953 1455 -200393 -233345 181649 267204 -606 -44345 -22467 -63802 70824 224988
10767B24988n5197j18739q2663l5585J09164j903m2941j50406j49748j0242O9148
$$ 224988 169791 51052 -31611 -67196 41968 40065 -2876 -153282 -303030 -313272 -244124
10756b44124M5652n3926N1637J53486J30577r3499k06385j06961O6732K07989
$$ -244124 -198472 -252398 -200761 -47275 83302 -10197 -216582 -323543 -256811 -48822
10746d8822M8798R5471Q2001O2445J01727K43830o4569j46884j5139j02325P4695
$$ -48822 -24 95447 177448 239893 341620 585450 520881 373997 358858 256533 331228
10735C31228K18655L9815k85717K2287J71595J14742J78943j17376j44857j25016
$$ 331228 549883 589698 303981 326268 497863 612605 791548 674172 529315 404299
10725D04299k15583m7038m3118q3658j2506J2959J02906J34412j81814m46238
$$ 404299 188716 141678 98560 14902 2396 15355 118261 252673 70859 -375379
10715c75379j42987J23984m7419k66277j91027M4647O6180J510J54998J94717
$$ -375379 -518366 -394382 -441801 -708078 -899105 -854458 -788278 -786768 -631770 -437053
10705d37053j1254Q9351J08553k4871L0604j5438L0737N2486l3687J09706K29413
$$ -437053 -448307 -358956 -250403 -275274 -244670 -260108 -229371 -176885 -210572 -100866 128547
10694A28547N6493k03769o5640M7886J06526K40573J6619J8361J11622p4037k11242
$$ 128547 185040 -18729 -84369 -36483 70043 310616 327235 345596 457218 383181 171939
10683A71939j26299j76392k895M9868L6043j47133L416O2482j25243q9731O7019
$$ 171939 45640 -130752 -133647 -83779 -47736 -194869 -191453 -128971 -254214 -343945 -276926
10672b76926K31613K53686M7705Q556j12291l2432M6766P1570J23229j35874j60717
$$ -276926 -45313 208373 256078 264634 152343 119911 166677 238247 361476 225602 64885
10661F4885j8072Q403N8231p1247j22694j4426J4610J26257n7666M1893J87214
$$ 64885 46813 55216 113447 42200 -80494 -94920 -80310 45947 -11719 30174 217388
10650B17388o19j94932q6900o7910J03656L6562N7752J1027m3649J48534L69732
$$ 217388 216769 21837 -65063 -132973 -29317 7245 64997 76024 32375 180909 550641
10639E50641O0497N241o9236j56066j53742m9910p087l0204Q5693k47j16170L2625
$$ 550641 611138 616379 547143 391077 237335 187425 180338 150134 235827 235580 119410 152035
10627A52035J6734k75420l42563j55357j35372k7862J10146J24134R0058K48282
$$ 152035 168769 -106651 -449214 -604571 -739943 -767805 -657659 -533525 -443467 -195185
10617a95185J76852j33001j91926O315R3089p4J5246P1672O6184j1476j25804
$$ -195185 -18333 -151334 -343260 -336945 -243856 -243930 -228684 -157012 -90828 -102304 -228108
10606b28108n5056L3985L9937j10662j25251N9020n7049j70532l9688r7904o5790
$$ -228108 -283164 -249179 -209242 -319904 -445155 -386135 -443184 -613716 -653404 -751308 -817098
10595h17098J58276O8143J00608Q8804R3420J19356m4654o8190o907K8768M342
$$ -817098 -658822 -590679 -490071 -401267 -307847 -188491 -233145 -301335 -308242 -279474 -275132
10584b75132k6717q8516k41195k30424K00823K84994o3485l4220J31249J05701
$$ -275132 -301849 -390365 -631560 -861984 -661161 -376167 -439652 -473872 -342623 -236922
10574b36922J8770J83182j8066k79992o1363K64694K43414K2865k0127O567j7801
$$ -236922 -218152 -34970 -53036 -333028 -394391 -129697 113717 136582 116455 123022 105221
10563A05221p3678J12728K8525k80537k13034J2966k9061J08950O3739Q451J22006
$$ 105221 31543 144271 172796 -107741 -320775 -307809 -336870 -227920 -164181 -155730 -33724
10552c3724J53562q7272j2604J03923O3773m3317q2573L0659J07880P1456k6152
$$ -33724 119838 32566 19962 123885 187658 144341 61768 92427 200307 271763 245611
10541B45611k7352M4136L6924o7065j27875J41299M06591J72144p7302n7218r5168
$$ 245611 218259 262395 299319 232254 104379 245678 652269 824413 747111 689893 594725
10530E94725j8696m6078l37650k68120J01553J14332j22647p2926j6140l1825
$$ 594725 576029 529951 192301 -75819 25734 140066 17419 -55507 -71647 -103472
10520a03472j35211O7907K37390N4467j33352j68094j0010J27753n4194L8641
$$ -103472 -238683 -170776 66614 121081 -12271 -180365 -190375 -62622 -116816 -78175
10510g8175r3779j29367j27669N8376J43030p6149J02030J57696j05654N785K33039
$$ -78175 -171954 -301321 -428990 -370614 -227584 -303733 -201703 -44007 -149661 -143876 89163
10499H9163J29935j50839j72155k5381K32744O0984k03851k54049j37787O6115
$$ 89163 219098 68259 -103896 -129277 103467 164451 -39400 -293449 -431236 -365121
10489c65121M845J69291K61005R6167j25015k84795r0245J44189n6313j9948J32361
$$ -365121 -360276 -190985 70020 166187 41172 -243623 -333868 -189679 -245992 -265940 -133579
10478a33579N7092j63766j40717L7917L9051n2862j82143j67500q0465M2240K06749
$$ -133579 -76487 -240253 -380970 -343053 -304002 -356864 -539007 -706507 -786972 -744732 -537983
10467e37983K48866L8255J0324J6450K9533k59310k63364o14K6610J05059M10263
$$ -537983 -289117 -250862 -240538 -224088 -194555 -453865 -717229 -717843 -691233 -586174 -175911
10456a75911J89732q3982m4284m8698J57309J58959j3861k20648l61594m9332
$$ -175911 13821 -70161 -114445 -163143 -5834 153125 139264 -81384 -442978 -492310
10446d92310J85529J94482K26287r726p9941J39276K4028q6604o5320L3668k2735
$$ -492310 -306781 -112299 113988 104262 24321 163597 187625 101021 35701 69369 46634
10435D6634R3697O1094j29776N5510K7901j60321l85482k20812J38260K73971
$$ 46634 140331 201425 71649 127159 155060 -5261 -390743 -611555 -473295 -199324
10425a99324L6680j35403R4276J32627j40j37714j54239j33131k50229Q184K88658
$$ -199324 -162644 -298047 -203771 -71144 -71284 -208998 -363237 -496368 -746597 -738413 -449755
10414d49755K08524k4973K0462L3184k8806J2117j453j65869j89103p429J71827
$$ -449755 -241231 -266204 -245742 -212558 -241364 -229247 -230700 -396569 -585672 -593101 -421274
10403d21274J78821J04974r5666M8161l7447n8083J32091m2819k89432j51901
$$ -421274 -242453 -137479 -233145 -184984 -222431 -280514 -148423 -191242 -480674 -632575
10393f32575J28826O3237n1394p0442J8170J41656O8348P1611J52224k4671j29426
$$ -632575 -503749 -440512 -491906 -562348 -544178 -402522 -334174 -262563 -110339 -135010 -264436
10382b64436j67281j85477k63525r956L79124J18113r9362J72998L43849K53635
$$ -264436 -431717 -617194 -880719 -890675 -511551 -393438 -492800 -319802 24047 277682
10372B77682p7994m04707j35014J07063N8141R6021L15060K36953r2886q4381
$$ 277682 199688 -205019 -340033 -232970 -174829 -78808 236252 473205 380319 295938
10362B95938n8061p8402N9812J43473K25222M4287o5406o3940k6599l103o1477
$$ 295938 237877 159475 219287 362760 587982 632269 566863 502923 476324 473221 411744
10351D11744k15034j03038J00344P6658n2068j40969j94734j91808j87627J2216
$$ 411744 196710 93672 194016 270674 218606 77637 -117097 -308905 -496532 -484316
10341d84316K78157L68839J68411j72391j48158l1342J69091J01860j98310k31892
$$ -484316 -206159 162680 331091 158700 10542 -20800 148291 250151 51841 -180051
10331a80051j881L6420L3560j21937m2065L7256r2461j10997q0033l4006r847
$$ -180051 -181932 -145512 -111952 -233889 -275954 -238698 -331159 -442156 -522189 -556195 -566042
10320e66042n6963M364K0481n8763N4550P1356j13487j07631J56574L03962K06189
$$ -566042 -623005 -618641 -598160 -656923 -602373 -531017 -644504 -752135 -595561 -291599 -85410
10309h5410O7736j4161P664o9282k71300k15939j0346j111M4474R1406J67770
$$ -85410 -17674 -31835 -24171 -93453 -364753 -580692 -591038 -592149 -547675 -456269 -288499
10298b88499J20088j9521m1171p537n251P5327J49451J58786J24609L3393j49553
$$ -288499 -168411 -187932 -229103 -236640 -241891 -166564 -17113 141673 266282 299675 150122
10287A50122k12530r639m6660j96219j40714N6467K30187J73406J87315o7998
$$ 150122 -62408 -72047 -118707 -314926 -455640 -399173 -168986 4420 191735 123737
10277A23737q1833J36602J0487Q4456L12736L3158j81219j78576j35056j37350
$$ 123737 41904 178506 188993 273449 586185 619343 438124 259548 124492 -12858
10267a2858j20717j13317l2532k719o1602K4913j57031l4488J56928M3292M1130
$$ -12858 -133575 -246892 -279424 -282143 -343745 -318832 -475863 -510351 -353423 -310131 -269001
10256b69001j4219k7641K195Q1647O0696Q7435J92025J79907J39946l0255j72240
$$ -269001 -283220 -310861 -308666 -227019 -166323 -78888 113137 293044 432990 402735 230495
10245B30495r8809j28744r8638l949j41986k9230J42883J69225q2998j52301j7946
$$ 230495 131686 2942 -95696 -99645 -241631 -270861 -127978 41247 -41751 -194052 -211998
10234b11998J74357J38231K03415J64955n6235m5153K7154M3525j82163j73156
$$ -211998 -37641 100590 304005 468960 412725 367572 394726 438251 256088 82932
10224H2932j40484j89043j88543j83599n8312J37909K98364J51992K5272j4564
$$ 82932 -57552 -246595 -435138 -618737 -677049 -539140 -240776 -88784 -63512 -78076
10214g8076j46347p5850P7420J01093N1016q0014n9713j80311k43736j63733m4078
$$ -78076 -224423 -300273 -222853 -121760 -70744 -150758 -210471 -390782 -634518 -798251 -842329
10203h42329J86340L17038L36177O0054j88749o7251K1534Q5553J06627J45624
$$ -842329 -655989 -338951 -2774 57280 -131469 -198720 -177186 -91633 14994 160618
10193A60618J14823j8283j2678q1418O722k3351o5287Q0469P0278r623L2424K4943
$$ 160618 275441 257158 244480 163062 169784 146433 81146 161615 231893 222270 254694 279637
10181B79637j3061j00275k50922k59518k06726R7520J20805J54899J25808O5675
$$ 279637 266576 166301 -84621 -344139 -550865 -453345 -332540 -177641 -51833 13842
10171A3842N3699O1300N8916j27264j24448j02779k9108l6596L8112J18883l4557
$$ 13842 67541 128841 187757 60493 -63955 -166734 -195842 -232438 -194326 -75443 -110000
10160a10000l085J94293M17214J49753k96607p1768p271j06069j29197n065Q1471
$$ -110000 -113085 81208 498422 648175 351568 279800 272529 166460 37263 32198 113669
10149A13669j5513N2073n6169k38885j85222l8906J20173K21595n3590k42292
$$ 113669 98156 150229 94060 -144825 -330047 -368953 -248780 -27185 -80775 -323067
10139c23067j0532K69496K19925o6064k76314j40599J29439J72649r5678j63605
$$ -323067 -333599 -64103 155822 89758 -186556 -327155 -197716 -25067 -120745 -284350
10129b84350p0641K0805J07632k0418n9079K10735L93443L20370K12647O3410
$$ -284350 -354991 -334186 -226554 -246972 -306051 -95316 298127 618497 831144 894554
10119H94554J43255Q2430o342j0108L3406K82478O78949R77706J182850J472953
$$ 894554 1037809 1120239 1113897 1103789 1137195 1419673 2098622 3076328 4259178 5732131
10109E732131J660405J677294Q29279j085179k103140j873588j311883r35885
$$ 5732131 7392536 9069830 9899109 8813930 6710790 4837202 3525319 2589434
10101B589434o95600m38027k38145k85408k39371m9087n4036k19541l0166R1540
$$ 2589434 1893834 1455807 1217662 932254 692883 643796 589760 370219 340053 431593
10091D31593M9271Q322j57762q1760J9374j7742j06010j05544j31225k09204R6103
$$ 431593 480864 489186 331424 249664 269038 251296 145286 39742 -91483 -300687 -204584
10080b04584J67770k2208J1961L4103N7882P382j06786q7258K0399J24224K0668
$$ -204584 -36814 -59022 -47061 -12958 44924 52306 -54480 -141738 -121339 2885 23553
10069B3553P6275J62990R3713j57154j67309j38589r6973K15822R1618L0670j2331
$$ 23553 99828 262818 356531 199377 32068 -106521 -203494 12328 103946 134616 122285
10058A22285M7586K05718J34322o3535j22666k06828q0394j24031O388K24049
$$ 122285 169871 375589 509911 446376 323710 116882 36488 -87543 -81155 142894
10048A42894O9003N5416J1886q9809j76735J4071L2129k2341j1263J18453J01208
$$ 142894 211897 267313 279199 189390 12655 26726 58855 36514 25251 143704 244912
10037B44912Q4025J2683n9742J22714Q866k86937k76779r0987M8809k1688J248
$$ 244912 328937 341620 281878 404592 413458 126521 -150258 -241245 -192436 -214124 -212876
10026b12876P4976J12515J20393j55236R650L43558J86669j13446j55266r5968
$$ -212876 -137900 -25385 95008 -60228 -50578 292980 479649 366203 210937 114969
10016A14969R039O2943k0319K1497J40475O2770j13122k26429j43291j28901r4962
$$ 114969 124008 186951 166632 188129 328604 391374 278252 51823 -91468 -220369 -315331
10005c15331J15173K73299N2343r7368J66218J04947k79030j82572N393J5303
$$ -315331 -200158 73141 125484 28116 194334 299281 20251 -162321 -156928 -141625
9995a41625o47M40J81136J77794k2778M5438K956j71557j94919Q0663K6661j590
$$ -141625 -142272 -141832 39304 217098 194320 239758 242714 71157 -123762 -43099 -16438 -18028
9983a8028J96445O2105k27090j12453o7740j26154K4150J13724j65806k04127
$$ -18028 178417 240522 13432 -99021 -166761 -292915 -268765 -155041 -320847 -524974
9973e24974o8433L0121J81589N5219K2010P6839J16740r568q1445r4030j35536
$$ -524974 -593407 -563286 -381697 -326478 -304468 -227629 -110889 -120457 -201902 -295932 -431468
9962d31468j50247r7814k0551K31029K92367O1070j9560O0377p8527k58054M553
$$ -431468 -581715 -679529 -700080 -469051 -176684 -115614 -135174 -74797 -153324 -411378 -406825
9951d06825P4537j16390m0741j07172j71319k1893O0858L4840K07827K96798J82612
$$ -406825 -332288 -448678 -489419 -596591 -767910 -789803 -728945 -694105 -486278 -189480 -6868
9940f868p1771k1995J17075k0033p4783j59506O9548K13422k11402j31632J30319
$$ -6868 -78639 -100634 16441 -3592 -78375 -237881 -168333 45089 -166313 -297945 -167626
9929a67626N6640R2362J81344j05690j72696J99847K8776k87580k62808k7289
$$ -167626 -110986 -18624 162720 57030 -115666 84181 112957 -174623 -437431 -464720
9919d64720K61249L16042l4817j82591m7616k2688j36718p7831J76015J60522
$$ -464720 -203471 112571 77754 -104837 -152453 -175141 -311859 -389690 -213675 -53153
9909e3153m269j91274k37407k215J102m5935J29292K84418J52956J35567L225
$$ -53153 -57422 -248696 -486103 -488318 -487216 -533151 -403859 -119441 33515 169082 172307
$$ [...]
##END NTUPLES=NMR SPECTRUM
##END=
