##TITLE=C13_SL84-Dau(f9-f7)
 CDCl3, 19800 sc

 28.6.2021
##JCAMPDX= 6.0         $$ Bruker NMR JCAMP-DX V2.0
##DATA TYPE= NMR SPECTRUM
##DATA CLASS= NTUPLES
##ORIGIN= UXNMR, Bruker Analytische Messtechnik GmbH
##OWNER= root
$$ XWIN-NMR		Version 3.5
$$ Tue Jun 29 08:35:53 2021 Russian Standard Time (UT+4h)  she@DPX200
##.OBSERVE FREQUENCY= 50.327896
##.OBSERVE NUCLEUS= ^13C
##.ACQUISITION MODE= SIMULTANEOUS
##.ACQUISITION SCHEME= undefined
##.AVERAGES= 19800
##.DIGITISER RES= 17
##SPECTROMETER/DATA SYSTEM= spect
##.PULSE SEQUENCE= zgpg30
##.SOLVENT NAME= DMSO
##.SHIFT REFERENCE= (INTERNAL, DMSO, 0, 222.653)
##AUDIT TRAIL= $$ (NUMBER, WHEN, WHO, WHERE, WHAT)
$$ ##TITLE= Audit trail, XWIN-NMR		Version 3.5
$$ ##JCAMPDX= 5.01
$$ ##ORIGIN= Bruker BioSpin GmbH
$$ ##OWNER= she
$$ F:/spectra/data/she/nmr/c13/1/pdata/1/auditp.txt
$$ ##AUDIT TRAIL=  $$ (NUMBER, WHEN, WHO, WHERE, WHAT)
(   1,<2021-06-29 08:34:35.18 +0400>,<she>,<DPX200>,
      <created by zg, POWCHK disabled, PULCHK disabled
       terminated by command 'halt'
       configuration hash MD5:
       00 E9 B6 7A A2 85 ED C7 34 08 36 98 17 FE 4E 26
       data hash MD5: 32K
       28 4B 8C 99 74 5A F5 4A 77 3A 2C CB 08 87 1C 56>)
(   2,<2021-06-29 08:34:39.17 +0400>,<she>,<DPX200>,
      <Start of raw data processing
       efp BC_mod = 2 LB = 1 FT_mod = 6 PKNL = 1 PHC0 = -332.9665 PHC1 = 30.36243 SI = 32K 
       data hash MD5: 32K
       A1 23 F1 E1 22 6F 75 55 C7 35 A6 E0 2E 76 0D B4>)
(   3,<2021-06-29 08:34:41.82 +0400>,<she>,<DPX200>,
      <abs ABSG = 5 
       data hash MD5: 32K
       83 99 6B 8C 62 12 1F BA 17 77 30 31 25 46 07 2A>)
(   4,<2021-06-29 08:35:14.90 +0400>,<she>,<DPX200>,
      <pk PHC0 = -0.4809066 PHC1 = 0 
       data hash MD5: 32K
       93 79 03 60 D3 72 DB E5 B5 59 BF 27 AF 34 52 4A>)
(   5,<2021-06-29 08:35:18.37 +0400>,<she>,<DPX200>,
      <abs ABSG = 5 
       data hash MD5: 32K
       14 EC DA A1 61 EC 0D 49 4B 48 B0 A5 68 36 A7 EA>)
$$ ##END=
$$ 
$$ hash MD5
$$ 32 BD EC 43 AF D8 7F F5 05 C2 B0 61 F5 3D 17 C0
##$RELAX= 
##$RELAX= 
##$RELAX= 
##$RELAX= 
##$RELAX= 
##$RELAX= 
##$RELAX= 
##$RELAX= 
$$ Bruker specific parameters
$$ --------------------------
##$DU= <F:/spectra>
##$EXPNO= 1
##$NAME= <c13>
##$PROCNO= 1
##$TYPE= <nmr>
##$USER= <she>
##$AMP= (0..31)
100 100 100 100 100 100 100 100 100 100 100 100 100 100 100 100 100 100 
100 100 100 100 100 100 100 100 100 100 100 100 100 100 
##$AQSEQ= 0
##$AQ_mod= 1
##$AUNM= <au_zg>
##$AUTOPOS= <>
##$BF1= 50.322709
##$BF2= 200.13
##$BF3= 50.322709
##$BF4= 500.13
##$BF5= 500.13
##$BF6= 500.13
##$BF7= 500.13
##$BF8= 500.13
##$BYTORDA= 1
##$CFDGTYP= 0
##$CFRGTYP= 5
##$CHEMSTR= <none>
##$CNST= (0..31)
1 1 145 1 1 1 1 1 1 1 1 1 1 1 1 1 1 1 1 1 1 1 1 1 1 1 1 1 1 1 1 1 
##$CPDPRG= <waltz16>
##$CPDPRG1= <>
##$CPDPRG2= <waltz16>
##$CPDPRG3= <>
##$CPDPRG4= <mlev>
##$CPDPRG5= <mlev>
##$CPDPRG6= <mlev>
##$CPDPRG7= <mlev>
##$CPDPRG8= <mlev>
##$CPDPRGB= <>
##$CPDPRGT= <>
##$D= (0..31)
$$ [...]
##$SUBNAM4= <"">
##$SUBNAM5= <"">
##$SUBNAM6= <"">
##$SUBNAM7= <"">
##$SUBNAM8= <"">
##$SUBNAM9= <"">
##$SW= 239.972175391363
##$SWIBOX= (0..15)
0 1 3 0 0 0 0 0 0 0 0 0 0 0 0 0 
##$SW_h= 12077.2946859903
##$TD= 32768
##$TD0= 1
##$TE= 0
##$TE2= 300
##$TE3= 300
##$TEG= 300
##$TL= (0..7)
120 120 120 120 120 120 120 120 
##$TP= (0..7)
150 150 150 150 150 150 150 150 
##$TP07= 0
##$TPNAME0= <>
##$TPNAME1= <>
##$TPNAME2= <>
##$TPNAME3= <>
##$TPNAME4= <>
##$TPNAME5= <>
##$TPNAME6= <>
##$TPNAME7= <>
##$TPOAL= (0..7)
0.5 0.5 0.5 0.5 0.5 0.5 0.5 0.5 
##$TPOFFS= (0..7)
0 0 0 0 0 0 0 0 
##$TUNHIN= 0
##$TUNHOUT= 0
##$TUNXOUT= 0
##$USERA1= <user>
##$USERA2= <user>
##$USERA3= <user>
##$USERA4= <user>
##$USERA5= <user>
##$V9= 5
##$VALIST= <valist>
##$VCLIST= <CCCCCCCCCCCCCCC>
##$VD= 0
##$VDLIST= <DDDDDDDDDDDDDDD>
##$VPLIST= <PPPPPPPPPPPPPPP>
##$VTLIST= <TTTTTTTTTTTTTTT>
##$WBST= 1024
##$WBSW= 4
##$XGAIN= (0..3)
0 0 0 0 
##$XL= 0
##$YL= 0
##$YMAX_a= 100818288
##$YMIN_a= -25064609
##$ZGOPTNS= <>
##$ZL1= 120
##$ZL2= 120
##$ZL3= 120
##$ZL4= 120
##$ABSF1= 222.6533
##$ABSF2= -17.34351
##$ABSG= 5
##$ABSL= 3
##$ALPHA= 0
##$AQORDER= 0
##$ASSFAC= 0
##$ASSFACI= 0
##$ASSFACX= 0
##$ASSWID= 0
##$AUNMP= <proc_1d>
##$AZFE= 0.1
##$AZFW= 0.5
##$BCFW= 0
##$BC_mod= 2
##$BYTORDP= 0
##$COROFFS= 0
##$CY= -3
##$DATMOD= 1
##$DC= 0
##$DFILT= <>
##$DTYPP= 0
##$F1P= 0
##$F2P= 0
##$FCOR= 0.5
##$FTSIZE= 32768
##$FT_mod= 6
##$GAMMA= 0
##$GB= 0
##$INTBC= 1
##$INTSCL= 4.134877e-10
##$ISEN= 128
##$LB= 1
##$LEV0= 0
##$LPBIN= 0
##$MAXI= 10000
##$MC2= 0
##$MEAN= 0
##$ME_mod= 0
##$MI= 0.1934396
##$NCOEF= 0
##$NC_proc= 2
##$NLEV= 6
##$NOISF1= 120.0001
##$NOISF2= 80.00006
##$NSP= 0
##$NTH_PI= 0
##$NZP= 0
##$OFFSET= 222.6533
##$PC= 1.4
##$PHC0= -333.4474
##$PHC1= 30.36243
##$PH_mod= 1
##$PKNL= yes
##$PPARMOD= 0
##$PSCAL= 0
##$PSIGN= 0
##$REVERSE= no
##$SF= 50.3227301278049
##$SI= 32768
##$SIGF1= 140
##$SIGF2= 120
##$SINO= 11.81781
##$SIOLD= 32768
##$SREGLST= <13C.CDCl3>
##$SSB= 0
##$STSI= 32768
##$STSR= 0
##$SW_p= 12077.2946859903
##$SYMM= 0
##$S_DEV= 0
##$TDeff= 32768
##$TDoff= 0
##$TI= <>
##$TILT= no
##$TM1= 0
##$TM2= 0
##$TOPLEV= 0
##$USERP1= <user>
##$USERP2= <user>
##$USERP3= <user>
##$USERP4= <user>
##$USERP5= <user>
##$WDW= 1
##$XDIM= 32768
##$YMAX_p= 357105745
##$YMIN_p= -3013735
$$ End of Bruker specific parameters
$$ ---------------------------------
##NTUPLES= NMR SPECTRUM
##VAR_NAME=  FREQUENCY,     SPECTRUM/REAL,   SPECTRUM/IMAG
##SYMBOL=    X,             R,               I
##VAR_TYPE=  INDEPENDENT,   DEPENDENT,       DEPENDENT
##VAR_FORM=  AFFN,          ASDF,            ASDF
##VAR_DIM=   32768,         32768,           32768
##UNITS=     HZ,            ARBITRARY UNITS, ARBITRARY UNITS
##FACTOR=    0.368581032318806, 1,           1
##FIRST=     11204.5221822817, 0,            0
##LAST=      -872.772503708586, 0,           0
##MIN=       -872.772503708586, -3013735,    0
##MAX=       11204.5221822817, 357105745,    0
$$ Real data points
##PAGE= N=1
##DATA TABLE= (X++(R..R)), XYDATA
$$ [...]
15832d5833m19193l62812j12432L98194K97587M32846K62536r0212m49323k24457
15822c13099o8064k48563r8540J62054N32851J94362m55618n3047J37497Q5132
15812a25035J74667L12044K83093Q4378l3119k6820m04895m32941L57336K71094
15802D59802l54587l31886j59277o6048J30993K05238K91052k22096j39905L8467
15792a48247J51590K31023p7535j69586P365L13643p244j02263j8216k03307j08291
15781a31068N2101K54939O9695j78624k18157K5312K39363J69153j87412j46103
15771e0801l16879n19982J8547M26735R2813k08405j47936J7583N8642O961L35099
15760b87623L56668j39102q2494k72968n35098j01422k57879j13740N5895K62560
$$ y = [-45833, -465026, -827838, -940270, -542076, -244489, 188357, 450893, 360681, -88642, -313099, -381163, -629726, -728266, -566212, -33361, 161001, -294617, -347664, -210167, -125035, 49632, 361676, 644769, 729147, 696028, 669208, 264313, -168628, 188708, 459802, 105215, -226671, -385948, -451996, -321003, -115765, 175287, -46809, -186714, -148247, 3343, 234366, 156831, -12755, -5390, 308253, 301009, 198746, 180530, -22777, -131068, -78967, 175972, 245667, 67043, -151114, -125802, 113561, 282714, 95302, -50801, -367680, -887662, -869115, -442380, -349567, -557972, -705908, -688325, -629683, -622722, -287623, 69045, -70057, -152551, -425519, -960617, -1062039, -1319918, -1433658, -1377763, -1115203]
15750a115203L05736R8263k55931k24698N86389P38554K90875k89641j80935O7803
15740B1212k10714l1174O7747l2422k97088J04386J79218J32769M13211K56033
15730F03178r8891J28772R2117J7123O0015L37249L95027j47646n09530m85579
15720C91835j44331j95905K31497J88398P217N6845k2290k84943j1189K11913
15710D29047j90567k23277k30575M5567O2968O3040q9826k51103L75490O09555
15700F00319K66107k77246n30383n19033J06723R8871J34907J47439R9379J47137
15690B74220j33453q9704j62551J45276k37054j28664K13214L23305M79687J0260
15680F94536n35446j61354J60042P3525l25446k17283O0568k6302j59762Q7319
$$ y = [-1115203, -809467, -711204, -967135, -1191833, -605444, 133110, 423985, 134344, -46591, 21212, -189502, -220676, -152929, -185351, -482439, -378053, -198835, -66066, 347145, 603178, 504287, 633059, 725176, 742299, 802314, 1139563, 1534590, 1386944, 877414, 391835, 247504, 51599, 283096, 471494, 478711, 535556, 513266, 228323, 217134, 429047, 238480, 15203, -215372, -169805, -106837, -43797, -133623, -384726, -9236, 600319, 866426, 589180, 58797, -460236, -353513, -254642, -119735, 27704, 127083, 274220, 140767, 51063, -111488, 33788, -203266, -331930, -118716, 204589, 684276, 694536, 159090, -2264, 157778, 231303, -94143, -311426, -250858, -277160, -436922, -349603]
15670c49603K82694L0632p654k51877j61402M18044P07581j12295l50670M4345
15660B49795L22283J07758l03922m54029n14093J29563J22508m28209K94451P45545
15650B71650J19271j61351k12493l96725J12473K77378q1141n07344j57879K55781
15640d80380j42913K0365m3079m73506m77090p0148K35639K83572M56125M77014
15630b14401J86887k80501j87573L95265P82696M64679l7661j41417J32095l46247
15620G53822l50204R7508Q0505k53023k54501L9730R3822j61376m0332k37146
15610b31195j84747K85451L62551J60116q5233j51309j98172k59403K03535K83557
15600A85151J49738n1723j24131k81288m79270k79353p442M30315M17929J17016
$$ y = [-349603, -66909, -36277, -43931, -295808, -457210, -39166, 668415, 556120, 205450, 249795, 572078, 679836, 375914, -78115, -592208, -462645, -340137, -768346, -473895, 271650, 390921, 229570, 17077, -379648, -267175, 10203, -70938, -578282, -736161, -480380, -623293, -602928, -646007, -1119513, -1596603, -1666751, -1431112, -1147540, -691415, -214401, -27514, -308015, -495588, -100323, 682373, 1147052, 1109391, 967974, 1100069, 753822, 403618, 501126, 581631, 328608, 74107, 113837, 207659, 46283, 5951, -231195, -415942, -130491, 232060, 392176, 306943, 155634, -42538, -301941, -98406, 185151, 334889, 283166, 159035, -122253, -601523, -880876, -888318, -458003, -40074, 76942]
15590G6942J25218O4759l11979K1950J83915k74307o09965m14106q6406P6216
15580a147763O28003O25358l4595m21738o28097k7511j1763k67124J71306p5810
15570a189734l48558n6534Q9442L48226M98673J07744k55023Q9496K27323L1687
15560d57258L13317J36941k11422k00026K84371K68224M4542K0293L59541J64376
15550G22899k72941k33929k20496j39162K84469K1592m37739j77923J55533N60355
15540B62658L21645m0973L43974P0685o29084m11517r4875p964K5595j37816m9354
15529c47026l16799R1135L47073m7734r889M28778J80140j62084K02956L306j7332
15518C52524j23357p31752o93089j25585L83543L76219L88705N81042J65915j38376
$$ y = [76942, 202160, 266919, -45060, -23110, 160805, -113502, -723467, -1137573, -1223979, -1147763, -519760, 105598, 71003, -350735, -978832, -1006343, -1018106, -1285230, -1113924, -1189734, -1538292, -1594826, -1505384, -1157158, -658485, -550741, -805764, -716268, -488945, -457258, -143941, -7000, -218422, -418448, -134077, 134147, 178689, 198982, 558523, 722899, 449958, 216029, -4467, -143629, 140840, 162432, -275307, -453230, -297697, 262658, 584303, 543330, 887304, 957989, 328905, -82612, -177487, -185451, -159856, -297672, -347026, -663825, -572690, -225617, -273351, -283240, 145538, 325678, 163594, 366550, 369856, 352524, 229167, -502585, -1195674, -1321259, -937716, -561497, -172792, 408250, 574165, 435789]
15508D35789o8669j21373m10105O6689J83352k79135k1882K06063J4472J89503
15498A94704k97695k85717L70717J92479k24944m03398K32839L32343j85972K9026
15488d5618J48851p3533l71913n5790J21286k20601o7214J10689k55369n5405
15478g64617L87764j45146k77090k13661k11628L21601M39230M81559N0054K3291
15468I1357J39978M2649k06989l4601Q6459J17421J50173p2663k97918k91139
15458b75273n6164N5229o1869M1575j30461m549J22023j12398R1255n5327K06394
15447a79565M06759m5064k86544j33450n494K98760M49764m7053k45989l2459
15437A79665J11053J16906l23853p43417m30174j55292J07882j8558K73919K22495
$$ y = [435789, 367120, 245747, -164358, -97669, 85683, -193452, -215334, -9271, 5201, 194704, -102991, -388708, -17991, 174488, -50456, -453854, -221015, 111328, -74644, -45618, 103233, 29700, -342213, -398003, -276717, -497318, -564532, -453843, -709212, -764617, -376853, -521999, -799089, -1012750, -1224378, -902777, -463547, 18012, 68066, 91357, 231335, 273984, 66995, 32394, 118853, 236274, 386447, 313784, 15866, -275273, -331437, -276208, -338077, -296502, -426963, -431512, -309489, -421887, -330632, -385959, -179565, 227194, 182130, -104414, -237864, -243358, 55402, 505166, 458113, 212124, 179665, 290718, 407624, 83771, -659646, -1089820, -1245112, -1137230, -1155788, -881869, -659374]
15427f59374k68297n07762J6912M49317M217l87616j51451K59574J16714j60096
15417a287862p6007M176L28644K6589l28686q1550J49116R8698k0596j0871L25546
15406h72803K03922j14437J7524N6551q5453J91260K42554L68877M36764k02094
15396B42665k10954m8033k78173k94324K443J66072M41418L30026k2623m39893
15386a11376k73803o5812p8205l6848J43076M13567L42549j82792m28578l55224
15376f33446j83171K33397K83417j2779l7345K6143J01180q7041P1447M36860
15366A98662M22046K3601j07254j60573n09452p06072r2768N65477L67691q3223
15356h1865R9504j05296l57786m9759Q4756N0672k22035k6081L00010P9328l28765
$$ y = [-659374, -927671, -1435433, -1418521, -969204, -964987, -1352603, -1504054, -1244480, -1127766, -1287862, -1363869, -1359693, -1031049, -1004460, -1333146, -1414696, -1265580, -1166882, -1187478, -1198349, -872803, -668881, -783318, -765794, -709243, -794696, -603436, -360882, 7995, 444759, 242665, 31711, -16322, -294495, -588819, -586376, -420304, 21114, 351140, 328517, -111376, -385179, -450991, -529196, -566044, -422968, -9401, 333148, 150356, -278222, -633446, -816617, -583220, -299803, -312582, -349927, -323784, -222604, -309645, -238198, 198662, 620708, 644309, 537055, 376482, -132970, -839042, -931810, -366333, 1358, -81865, 17639, -87657, -445443, -495202, -410446, -359774, -581809, -607890, -307880, -228552, -557317]
15345e57317n12270m10465M6274K91182L18343K08316K11549m7562j52997J02454
15335e02493M29838K50252n2041n1855O6767K68740J14431J2376M9823j20360
15325D65478j89174j25050j75704j42563n8886J63740L64303L50218O4011j62828
15315E53545q5395j63427L8738K45084K8036J32684j38199k74851k3905l5764
15305B76546k58632o16266o19783j24473M10053M53638J2953L37285K94543q3931
15295H1933J22235o6184l09313K00381O21259K18884k39258J45012K63406J12373
15285A150728m7940k22715j70414j66483k28352q5567J13738j35188k93516l85997
15275d71706n54078o20601l10014M52075O19898p7726k54404J76402J82738r1472
$$ y = [-557317, -1069587, -1480052, -1433778, -1142596, -824253, -615937, -404388, -451950, -604947, -502493, -72655, 177597, 125556, 73701, 140468, 409208, 523639, 536015, 585838, 465478, 276304, 151254, -24450, -167013, -225899, -62159, 302144, 652362, 716373, 553545, 468150, 304723, 343461, 588545, 616581, 749265, 611066, 336215, 312310, 276546, 17914, -598352, -1218135, -1342608, -932555, -478917, -465964, -128679, 165864, 81933, 204168, 137984, -171329, 29052, 650311, 869195, 629937, 774949, 1038355, 1150728, 1102788, 880073, 709659, 543176, 314824, 229257, 342995, 207807, -85709, -471706, -1025784, -1646385, -1956399, -1504324, -884426, -962152, -1216556, -1040154, -857416, -948888]
15265i48888k4056o1627k35762j45093M05342M17718K16913R5783l02639r9743
15255f82052R8553L20069P9652k83723j7903M1508k18028k79480j98181K08874
15245i30711M59148K06647J26136L62111L53629K86255J38110j97368k42055l66148
15235A95754o84982l74851Q89J59563j06092r3445J08158Q7252J03419J76783
15225d27552k32600n6654n6240j63350R6422o8438K37120K46807M9903Q711L7884
15214c27987n7641Q016j92014P6111K15370j06776J46114J27632q3841l87400
15204e82416k36049L19142Q19759L67744k19681k54540J14766K09165j33313j49745
15194B54832l12717k86391l65907r2451N5940P0700J31777m7144q1455j44267
$$ y = [-948888, -972944, -1034571, -1270333, -1415426, -1010084, -592366, -375453, -279670, -582309, -682052, -583499, -263430, -183778, -467501, -485404, -443896, -661924, -941404, -1139585, -930711, -471563, -264916, -138780, 223331, 576960, 863215, 1001325, 803957, 561902, 195754, -489228, -864079, -863190, -703627, -809719, -903164, -795006, -707754, -604335, -427552, -660152, -716806, -773046, -936396, -839974, -908412, -671292, -424485, -374582, -365871, -327987, -385628, -377612, -569626, -493515, -278145, -384921, -238807, -111175, -195016, -582416, -818465, -499323, 320436, 688180, 468499, 213959, 328725, 537890, 404577, 254832, -57885, -344276, -710183, -802634, -746694, -675994, -544217, -591361, -672816, -817083]
15184h17083j01J37503k81734k89554N99153M34634l62607o08768m62077J95756
15174a454878L57619K16735J43069J72068L13009L99223K74489m7095j21516j74593
15164G8130k87699l38055k57699J07018M35553M09843k12572m04072m67081j10528
15154a047162o8520J96842M47137O82466N87180K24222l9045j30238n2483j55264
15144F45135j1570J58563N8706n19470q72215l56430J82355J82595L45809L35119
15134A48597L5994j26505K4874K4023J57048P2684j29889l51385j46647J62039
15124a29167J20891J54721J28754k13424m71866L2356j7539M7066L44161M97132
15114D93085N20139k8996k1040J38593m0914j61482p4339j70765j94911p027j58849
$$ y = [-817083, -817184, -679681, -961415, -1250969, -651816, -217182, -579789, -1188557, -1650634, -1454878, -1097259, -880524, -737455, -565387, -252378, 146845, 421334, 374239, 252723, 78130, -209569, -547624, -805323, -698305, -262752, 147091, -65481, -469553, -936634, -1047162, -1115682, -918840, -471703, 210763, 797943, 1022165, 983120, 852882, 800399, 645135, 633565, 792128, 850834, 331364, -540851, -897281, -714926, -532331, -186522, 148597, 184591, 58086, 82960, 106983, 264031, 336715, 206826, -144559, -291206, -129167, -8276, 146445, 275199, 61775, -410091, -377735, -395274, -348208, -4047, 493085, 1013224, 984228, 963188, 1101781, 1060867, 899385, 825046, 654281, 459370, 452343, 293494]
15103B93494k74603j54491m20042l17737Q989L00735K87455K77787J09075k63408
15093a52746J21442K38101j9232K3837K702j89071j10743q3892Q9894M31324J45782
15082D97398R9871m11015m47034k61046j22542L02039L50103K35544k06520l5189
15072A609J16635K0499L40114J67747j84052j65011j004n9594K18144K75261j14047
15061F16301l88336q2694j23792o43162m41301J34857K0824k40397l37371q7106
15051a572177L65997M25446K67173K93728L57288j34927n49989m50093J40025
15042h57529J25131J90758M94106L22963j49871l50264n30850p2441K69196K35848
15032c22953r2489l1573L09033J55296N6338j46855n03316l58064j4838J90663
$$ y = [293494, 18891, -135600, -555642, -873379, -864390, -563655, -276200, 1587, 110662, -152746, -31304, 206797, 187565, 211402, 214104, 25033, -85710, -169602, -79708, 351616, 497398, 597269, 186254, -260780, -521826, -644368, -342329, 7774, 243318, 36798, 1609, 118244, 138743, 478857, 646604, 462552, 297541, 296537, 236943, 455087, 730348, 616301, 227965, 145271, 21479, -621683, -1062984, -928127, -907303, -1147700, -1485071, -1572177, -1206180, -780734, -513561, -219833, 137455, 2528, -547461, -997554, -857529, -732398, -541640, -47534, 275429, 125558, -224706, -755556, -827997, -558801, -322953, -415442, -447015, -137982, 17314, 73652, -73203, -576519, -934583, -949421, -758758]
15022g58758M17762M78336J71302j02328l41273j87869J51763K37778K46905N9040
15012C72658l59299l76181Q1287n1301l06176o8093K73463L04958q0982J3715
15002a95951J19311J07917M54314M17237J6880k31113l87114k63477j22445m12044
14992d96485m42037Q6818N15029O46052O99438N59980L85241k73826m79612j32020
14982A068578l78845k46649r2004L6255q1426j55326m55366k67792K17783L18267
14972c6525N4186k76668j70905l7753r2148J27600L68572p7986l15684Q2928K37685
14961a36698k6330k39547r9632J2088Q2767J36461J85092J57821k03122m57849
14951e88949m70998l77543K50934R78548Q31923M03669Q4956j74632r5520L21849
$$ y = [-758758, -340996, 137340, 308642, 206314, -134959, -322828, -171065, 66713, 313618, 372658, 13359, -362822, -281535, -332836, -639012, -707105, -433642, -128684, -209666, -195951, -76640, 31277, 485591, 902828, 919708, 688595, 301481, 38004, -84441, -496485, -938522, -851704, -336675, 309377, 1008815, 1568795, 1954036, 1680210, 1200598, 1068578, 689733, 443084, 351080, 387335, 305909, 150583, -304783, -572575, -354792, -36525, 17661, -259007, -429912, -467665, -559813, -432213, -63641, -141627, -457311, -374383, -136698, -163028, -402575, -502207, -490119, -407352, -270891, -85799, 72022, -131100, -588949, -1059947, -1437490, -1186556, -208008, 623915, 1027584, 1112540, 937908, 842388, 1164237]
14941A164237L7685l271k11698k79845K11195L67626j6389j34576j9134J14394
14931A230224j74282l79108m11281l98868N4310L93749K66550K67612O1027j70037
14921G39896q6886N1842m05111n82368l79679J85364L54085J84599K19495l8144
14911B43093k5392j31235m49594k79058m7787N9787L9699l95162k94846Q7029
14901a193466O16217O86987K33702k125q8203J11432M0306j41831j88670J1668
14891H6017K10467j8635l82716k8921r345o5203k82861k3927J72531j97998k83483
14880h24074J39864K38328K2830j52733R3687L75163K03598q092j7645k00887
14870a29961k36391L29840K46318Q3172k22700k68439n7498k03930k71433L5345
$$ y = [1164237, 1201922, 1198651, 986953, 707108, 918303, 1285929, 1269540, 1134964, 1115830, 1230224, 1055942, 676834, 265553, -133315, -79005, 314744, 581294, 848906, 909933, 739896, 653010, 704852, 299741, -282627, -662306, -476942, -122857, 61742, 281237, 243093, 217701, 86466, -363128, -642186, -689973, -630186, -590487, -985649, -1280495, -1193466, -577249, 109738, 343440, 341315, 253112, 364544, 404850, 263019, 74349, 86017, 296484, 277849, -104867, -133788, -143133, -208336, -491197, -515124, -342593, -540591, -824074, -684210, -445882, -423052, -575785, -482098, -106935, 96663, 88571, 70926, -129961, -366352, -36512, 209806, 292978, 70278, -198161, -255659, -459589, -731022, -695677]
14860f95677Q2371k05351m37536j3733K85954L80084l1192m14361q9643K58858
14850h80226M50237K70415m2679l86810n57522n6393M99230O11466M04559O666
14840C18943K48838J52144l22372l86948k83192j77835n2487J11639L961k48066
14830f35375M7202L40276J06675K52494P4654j14790j36739J09050r6596j95573
14820b48722L41713L01956j3862k4694L05606j69687k95273q5326l8939J13083
14810A85855J53373J04284k9162J21126j16143k54394j40696n7992p3482k48027
14800c55258l7280M17217J02433m6382J24239M68122M63362J2726l85589k60191
14790E03399j65246M9503q8669k09499q7409k09470l92508j76156K16460L73816
$$ y = [-695677, -613306, -818657, -1256193, -1269926, -983972, -603888, -635080, -1049441, -1139084, -880226, -429989, -159574, -202253, -589063, -1146585, -1202978, -703748, -92282, 312277, 318943, 567781, 719925, 397553, 10605, -272587, -450422, -502909, -391270, -387309, -635375, -588173, -247897, -141222, 111272, 185926, 71136, -65603, 43447, -53149, -248722, 92991, 394947, 381085, 356391, 661997, 492310, 197037, 111711, 72772, 185855, 339228, 443512, 414350, 535476, 419333, 164939, 24243, -33749, -107231, -355258, -392538, 24679, 127112, 80730, 204969, 673091, 1136453, 1149179, 763590, 503399, 338153, 387656, 298987, 89488, 2079, -207391, -599899, -776055, -559595, -185779]
14780a85779P11200L37470m0320r3035q2738m3754l88794m94831p8038K95452
14770f3167K21368Q5781m0641Q7033N02453K80498k15404k12820m26419k14372
14760D310K3337q2011N3422k24645j13274j8186k8409K95916L60509L05860l3360
14749E43469o6477j61391j84623l10647j25794R4908q4829J2521L6471K67958
14739B1566N66506j51971o76531l77444K39887L61380L87799K35575m52774m08381
14729b54388q104M65785M69348o4297m59280j05383L12910j05026j97073M9451
14719A03943m9737m70252j82722J84298j48505l44589l32173q0542J28138N36772
14709f55369M20763r8370J31183o469J18415L53529k3897o6590l2171l91292m79918
$$ y = [-185779, 525421, 862891, 822571, 729536, 646798, 603044, 214250, -280581, -358619, -63167, 158201, 243982, 203341, 290374, 792827, 1073325, 857921, 645101, 218682, 4310, 27647, -54364, -942, -225587, -338861, -357047, -385456, -89540, 270969, 576829, 543469, 476992, 315601, 130978, -179669, -305463, -210555, -295384, -282863, -246392, 21566, 588072, 436101, -240430, -617874, -377987, -16607, 371192, 606767, 153993, -254388, -262492, 203293, 672641, 608344, 149064, 43681, 356591, 251565, 54492, 103943, 54206, -416046, -598768, -414470, -562975, -907564, -1239737, -1320279, -1192141, -655369, -234606, -332976, -201793, -208262, -89847, 263682, 239785, 173195, 141024, -250268, -730186]
14698g30186K9205M32313O1548l379O00313N38468j84740l27550k78223p8081
14688E9688K31358k07144l24721k01498K71428O11238j21584m36561j11113K5429
14678b03480K78980J12497k13326k52817k8409K5036j25314j61264n3385j99720
14668h21202j97505L3099M74926N58516M54876K06220N452n81774m83966J38092
14658b13266J68715K47609J73024r9815j8261k22363p29N52790M17506j89624
14648H15586l71301m5851j80243l46526l81803K4351L03947J19291p9709k01085
14638c43343j33747M0055k8531j71634j65543K1019M61791K80959o836r2565j91010
14627c29385o8057j10490k50235j35626J82636J39347L1137N9749O9512l9238
$$ y = [-730186, -700981, -268668, -207120, -210499, 389814, 928282, 743542, 415992, 137769, 59688, 291046, 83902, -240819, -442317, -170889, 440349, 318765, -117796, -228909, -203480, 75500, 187997, -25329, -278146, -306555, -281519, -406833, -568097, -621482, -821202, -1018707, -985608, -510682, 47834, 502710, 708930, 714382, 132608, -351358, -213266, -44551, 203058, 376082, 276267, 258006, 35643, 34914, 587704, 1005210, 815586, 444285, 398434, 218191, -128335, -510138, -485787, -181840, -62549, -142258, -343343, -477090, -437035, -465566, -637200, -802743, -781724, -319933, -38974, -45810, -138375, -329385, -397442, -507932, -758167, -893793, -711157, -571810, -540673, -480924, -411412, -450650]
14617d50650l11562k52581k09811l53198J01319L92527N04543K71165O1719j47437
14607c93966k34283O4066J71028L88953M58190N1731j24947J78974L42196O2855
14597I64797j01543N044j73543k21722j20711l32718k72708p6401P1684M75202
14587B17381K58875j96027j77793l11513j78548M61609N70738j187J48718n5183
14577G37070j12741K41839l89244n66274k98049k18449J67491M21809K39654O6159
14567B89265l31834n28487j13870K55550J04077j1873j14565J06228N47824J38469
14557C40784n85851o71122k13710L05624L68884M66761K32403k3367k00215r5886
14547g5695q6983l93954j06803K22079L28731k2469J1786p6585j22958l26010
$$ y = [-450650, -762212, -1014793, -1224604, -1577802, -1476483, -1083956, -579413, -308248, -246529, -393966, -628249, -564183, -393155, -4202, 453988, 505719, 380772, 559746, 901942, 964797, 863254, 868298, 694755, 473033, 352322, 19604, -253104, -329505, -257821, 217381, 476256, 280229, 102436, -209077, -387625, 73984, 644722, 643535, 792253, 737070, 624329, 866168, 476924, -89350, -387399, -605848, -438357, -16548, 223106, 289265, -42569, -571056, -684926, -429376, -325299, -337172, -451737, -345509, 202315, 340784, -245067, -916189, -1129899, -824275, -455391, 11370, 243773, 220406, 20191, -75695, -162678, -556632, -663435, -441356, -112625, -135094, -123308, -199893, -322851, -648861]
14537f48861m24910j21583j86676J49972K98298k9708k29605M26690N67609N94493
14527C95719J78402j80876j37264R7809K51625J07938l44570o06820m29169l10863
14517i78069j88406K82632K27451k36965Q8963N13209J32566l05961J91415J98178
14507g4987J60401L99905J62151l73423l0682J04512q9127M07339M08586k42891
14497H31784m45571L4167J80383r9915j84961k59538k75790k07453l5962J61207
14487c01649N2864J70172n0590k03775r7216O8648M92735K65837j57613m0225
14477A99188J51723J56167k28285m56058k58308l03797J5499J30978R4474j21514
14467f19933q5321L20364N13001J16921r7369m6287K89062M53125r5627l58515
$$ y = [-648861, -1073771, -1195354, -1382030, -1232058, -933760, -963468, -1193073, -766383, -198774, 395719, 574121, 393245, 255981, 353790, 605415, 713353, 368783, -238037, -667206, -978069, -1166475, -883843, -656392, -893357, -804394, -291185, -158619, -464580, -273165, -74987, 85414, 485319, 647470, 274047, 243365, 347877, 258750, 666089, 1074675, 831784, 386213, 420380, 600763, 500848, 315887, 56349, -219441, -426894, -462856, -301649, -248785, -78613, -129203, -332978, -430194, -361546, 131189, 397026, 239413, 199188, 350911, 507078, 278793, -177265, -435573, -739370, -723871, -592893, -498419, -619933, -705254, -384890, 128111, 245032, 147663, 101376, 390438, 843563, 747936, 389421]
14457C89421l89637j04067K23709K7720j86862N2838M00353K71971j07515j75791
14447D02140o1218q1932K0997K5838k6220m5952n1462J55233K1720k51820n59415
14436d52091k59320q7201j84907J39772J67255J3394k52540n39716K76098N13123
14426f66133L29265O2869j13959N15678J23342l15330k24140k86164j03743L97923
14416b80392M01148K34312J33460k8247k85027n88768j22183J71861J1281J2525
14406c40030l4762J56756m3367m22668l08135K27206O44685j864m36676n70420
14396a129275m1916K56352P2879Q1198J79875L71573L92993j14116k89011M979
14386b14469J03822l14802J7778j94052n96985k15180K72068L98473L76959K85045
$$ y = [389421, -216, -104283, 119426, 147146, -39716, 13122, 413475, 685446, 577931, 402140, 340922, 258990, 279987, 305825, 279605, 233653, 182191, 337424, 359144, 107324, -452091, -711411, -798612, -983519, -843747, -676492, -663098, -915638, -1455354, -1179256, -666133, -336868, -273999, -387958, 127720, 251062, -64268, -288408, -574572, -678315, -280392, 120756, 355068, 488528, 460281, 175254, -413514, -535697, -363836, -352555, -340030, -374792, -218036, -261403, -684071, -992206, -765000, -120315, -122179, -558855, -1129275, -1171191, -914839, -841960, -760762, -580887, -209314, 183679, 69563, -219448, -214469, -110647, -425449, -407671, -601723, -1198708, -1413888, -1141820, -743347, -366388, -81343]
14376h1343j73011L193K64182K74971r2038K12975N41221J06647l03138j16527
14366F37132l84250m77038j32871N22187L03215j97434m27060n34768k81194j68511
14356a140592R5998L10445L55423L76835M63983L73287j75338o46173k90516O4676
14346b11972j57324q9812J67580k3002q1838J83510J19715J31113k04395n46613
14336g13038Q9125N84767K65359j04048k91202m06131k10914K04577M90204N35214
14326D43913k207k21203m58915m88863J18309M2183p1935M12090L64652j89013
14316e0989p25559l84886J34055n815J50968j73716j04362M75266J13132K5987
14306e45919J53675Q6806K59270J56091l75174k36929M11907K65836P5532P3254
$$ y = [-81343, -254354, -251161, 13021, 287992, 195954, 408929, 950150, 1056797, 753659, 637132, 252882, -224156, -357027, 165160, 468375, 270941, -156119, -690887, -972081, -1140592, -1044594, -734149, -378726, -1891, 462092, 835379, 660041, 13868, -276648, -211972, -369296, -459108, -291528, -314530, -396368, -212858, -93143, 37970, -166425, -713038, -623913, -39146, 226213, 122165, -169037, -575168, -786082, -581505, -91301, 443913, 441706, 220503, -238412, -727275, -608966, -566783, -638718, -226628, 138024, -50989, -776548, -1161434, -1027379, -1033194, -882226, -1055942, -1160304, -685038, -571906, -545919, -392244, -305438, -46168, 109923, -265251, -502180, -90273, 175563, 251095, 324349]
14296C24349q0019l99571m45339J4633L18945K00222j17916n09545m14252j16961
14286a225454R8995r9711l96061J84219N46188N7052J29489M521j45127M58100
14276c87789M29120L21385j2196k46889j16890J63360O5519J4254k52842l59972
14266c82940K18088L91263L36251J23970J73939N0542l62489k70308m46032o02411
14256g70127j80472P2627J71959K42944K75372N2290k07987k76601L73157M64268
14246B17430J24811q8901l29270J9334J94332J44969L46197o8233l68771l43745
14236a51847M3659K06757k15560m57686l72697L32403J35556J00903M34048N08726
14226E64262r623n65463j5855K2828p4570j70906j70911Q5151J8479k513K21820
$$ y = [324349, 244330, -155241, -600580, -585947, -267002, -66780, -184696, -694241, -1108493, -1225454, -1126459, -1226170, -1622231, -1438012, -891824, -834772, -705283, -700762, -845889, -387789, 41331, 362716, 350520, 103631, -13259, 150101, 215620, 229874, -22968, -382940, -164852, 226411, 562662, 686632, 860571, 911113, 548624, 278316, -167716, -770127, -950599, -877972, -706013, -463069, -187697, -135407, -343394, -619995, -246838, 217430, 342241, 253340, -75930, -56596, 137736, 282705, 628902, 560669, 191898, -151847, -108188, 98569, -116991, -574677, -947374, -614971, -479415, -378512, 55536, 564262, 554639, -10824, -26679, -3851, -78421, -249327, -420238, -335087, -316608, -319121, -97301]
14215i7301J55043k03736m75965l60734o2209J99985K64317J56387J57564K78745
14205A2096L34972k47367j37180k0898k63485j11011L30484M95982M18759J13932
14195I26284J12161l69144m85292k74562K8250J78002Q9726J52122J11831M584
14185D73962j44276m75968n37137k07315K66512L90928R1837J22409J49445q2750
14175D7647j33291l8960K36833M8857k9964l47372m49523j50265L50601O29845
14165A64408L64016K9847k06198j43671m19823p13705j01331R7166P8176K44070
14155f07045K69635K09478m5785M551P440k60887j02744Q9918K57408j29707k61136
14144e68874r1087k62598j52789J22703K95257J93138k8922J55970K56079m7267
$$ y = [-97301, 57742, -145994, -621959, -982693, -1044902, -844917, -580600, -424213, -266649, 12096, 347068, 99701, -37479, -58377, -321862, -432873, -102389, 393593, 812352, 926284, 1038445, 669301, 184009, -90553, -62303, 115699, 205425, 357547, 469378, 473962, 329686, -146282, -683419, -890734, -624222, -233294, -141457, -19048, 130397, 47647, -85644, -124604, 112229, 161086, 131122, -216250, -665773, -816038, -465437, 164408, 528424, 558271, 352073, 208402, -211421, -925126, -1026457, -929291, -851115, -607045, -337410, -127932, -173717, -169166, -161726, -422613, -525357, -435439, -178031, -307738, -568874, -659961, -922559, -1075348, -952645, -657388, -464250, -493172, -337202, -81123, -128390]
14134a28390L9028P3122M3106j48026j50774j75162r580k25511j70035m8233K76943
14123f23512M13260k4485j63400J9307J93509L43653q8782k25576K76541P8381
14113A98896k71242k08990p6655L39168J1972l89583j71075K48516N98555K59533
14103E39095n0142J00190J13481j46342m38354l34688k86435k80469M5765N52989
14093a84910O28268L15488j9982j63494j93224J16067o36m94732l6867n8979k44882
14082c37883L10885K82664q0288k03576j64665j91498J15027J46890K44911J77629
14072C00096O4175J42825k40429n97338l50428l09341O521J59457O9242K03556
14062e51664J10825N9304J27849J78848K58251O0222J42459j38045j37415k86116
$$ y = [-128390, -89362, -16240, 26866, -121160, -271934, -447096, -456676, -682187, -852222, -900455, -623512, -210252, -234737, -398137, -378830, -185321, 158332, 69550, -156026, 120515, 198896, -72346, -281336, -357991, -18823, -6851, -396434, -567509, -318993, 279562, 539095, 488953, 589143, 702624, 556282, 117928, -216760, -503195, -783664, -737899, -184910, 443358, 758846, 738864, 575370, 382146, 498213, 497577, 2845, -34022, -93001, -337883, -26998, 255666, 175378, -28198, -192863, -384361, -269334, -122444, 122467, 300096, 364271, 507096, 266667, -330671, -681099, -990440, -983919, -824462, -755220, -551664, -440839, -381535, -253686, -74838, 183413, 243635, 386094, 248049, 110634, -175482]
14052a75482l80586K6644K60136O3422l2844L13654j9922m67382l79970l10074
14042a102404k54786l8322J53659m7959M14771O31065K75417K01987P6520j48444
14032A61504k46008n58885l17721L69886l1655j54646K45452M43823Q2828k1248
14022b6670J06540J35963L20364J14307j58494j17662L5749P9950k91621J36359
14012C34785K53278J35236K9713j47845n6022j08438k93690j77395r8300J61010
14002C2332L14896k1266R6914J34525Q932l85598j6830O39581M37248j4927J29826
13991A355633K79770P0014l74688m33088m58994Q6149q0786m60920k30879M0451
13981b07338j26080O4471L89925k3973n28730l544L67705K69298J59186j29705
$$ y = [-175482, -556068, -529424, -269288, -205866, -238710, 74944, 55022, -412360, -792330, -1102404, -1357190, -1395512, -1241853, -1289812, -875041, -243976, 31441, 233428, 309948, 161504, -84504, -643389, -961110, -591224, -622879, -777525, -532073, -88250, -5422, -26670, 79870, 215833, 536197, 650504, 492010, 374348, 410097, 490047, 198426, 334785, 588063, 723299, 753012, 605167, 549145, 440707, 147017, -30378, -128678, 32332, 347228, 325962, 422876, 557401, 566333, 180735, 163905, 803486, 1240734, 1225807, 1355633, 1635403, 1705417, 1330729, 897641, 438647, 524796, 444010, -16910, -247789, -207338, -333418, -268947, 120978, 97005, -431725, -435269, -67564, 201734, 360920, 231215]
13971B31215l02249m37943J84553J82946o6325L0802K7052K68019J17368k92658
13961e7220P093L29629k2451l44130k99484j4532K61452K86992k10377n21838
13951e84866J6437L63485J7404j10110K4260l6048L0542j41837n7796N6870o9716
13940d91375n0458k0172k70272k38933N5499L3088n1685K25465N33291M26290
13930A50738L27278K30243j59767o88454n14466L9834J17183L83683K62750J5053
13920A64075j2395O563K7320J45015O8789L58609N72299J37125l90774j02827
13910I73799M9062o774j32516m49667l42779K65573l566k85736p4840p0982k17769
13899b96195L67345M59553K17039j61490l18786l17511J08684j23944n23192k38803
$$ y = [231215, -71034, -508977, -324424, -141478, -207803, -177001, -149949, 118070, 235438, -57220, -50127, 279502, 257051, -87079, -386563, -401095, -139643, 147349, -63028, -584866, -568429, -204944, -187540, -297650, -273390, -309438, -278896, -420733, -478529, -421659, -491375, -541833, -562005, -832277, -1071210, -1015711, -982623, -1034308, -808843, -275552, 150738, 478016, 708259, 548492, -139962, -654428, -614594, -497411, -113728, 149022, 164075, 151680, 158243, 185563, 330578, 399367, 757976, 1330275, 1467400, 1076626, 973799, 1022861, 1016087, 883571, 433904, 91125, 356698, 353132, 67396, -7444, -78426, -296195, 71150, 530703, 747742, 586252, 267466, -50045, 58639, -65305, -588497, -827300]
13889h27300L01459M53655J61790k46620n3535K24210p2339j35397J70852N78501
13879E55276L27274n139l17921n07340n03500J34888L50007k6175k65254k62582
13869e20466m58927m34744L09155L80459j72405K65350M37210O7297J01514j26646
13859a52203k18689n33786k74795L83384P8766l71134j48280K76290L05941k417
13849f56923J52776M84085J16913j53487k2399K04925r0329l41608r4542j49394
13839e49983k22576K10719L83111k8062j32873K59133K22270P2665k6428k02902
13829a4926l74688k85456P936r010l562K7331L05430N10008k93602p45508l27328
13818a203375L48522O60531l49396n91283P6148J42802K41760j50430n80727j94395
$$ y = [-827300, -525841, -72186, 89604, -157016, -210551, 13659, -58680, -194077, -23225, 555276, 882550, 877411, 559490, 52150, -451350, -316462, 33545, 7370, -257884, -520466, -979393, -1414137, -1104982, -724523, -896928, -631578, -194368, -127071, -25557, -152203, -370892, -904678, -1179473, -796089, -717323, -1088457, -1236737, -960447, -654506, -656923, -504147, -20062, 96851, -56636, -79035, 125890, 35561, -306047, -400589, -549983, -772559, -561840, -178729, -206791, -339664, -80531, 141739, 214404, 187976, -14926, -389614, -675070, -667134, -676144, -679706, -652375, -346945, 163063, -130539, -876047, -1203375, -854853, -194322, -543718, -1135001, -1058853, -916051, -674291, -824721, -1405448, -1599843]
13808a599843N46649R98418O48834n8132o8024J92304O3486k00729m33816k98504
13798b09357r1582R9492L83419J54271J4041q9646L25338L99731l74529p54878
13788a43700k51291N87266O57808M11048j67829o75558k88534K88684P3682l70303
13778A21273j04400j27007m09090k48825r4548m7561k1150K62234K61576J42667
13768b64831k12362o921K64754j25007l17875k44859K96335K83786J40978l2295
13758b18297j80124J99790K57852j82863n99468k36382k7965Q6223l2296o3681
13748i97211J422n77O8651L30196L16244K46642N00777L08709j66595p48171m12078
13737e51991L07744K91269Q8260K00730j01347r9760L5711l8458r6448k43174
$$ y = [-1599843, -1053194, -54776, 594058, 535926, 467902, 660206, 723692, 522963, 89147, -209357, -300939, -201447, 181972, 336243, 350284, 260638, 585976, 985707, 611178, -143700, -394991, 192275, 850083, 1261131, 1093302, 417744, 129210, 417894, 491576, 121273, 16873, -110134, -519224, -768049, -862597, -910158, -931308, -669074, -407498, -264831, -477193, -484114, -219360, -344367, -662242, -907101, -610766, -326980, -186002, -218297, -398421, -198631, 59221, -123642, -723110, -959492, -987457, -901234, -933530, -997211, -995789, -996366, -927715, -597519, -281275, -34633, 466144, 774853, 608258, -139913, -551991, -244247, 47022, 135282, 336012, 234665, 134905, 170616, 132158, 35710, -207464]
13727b07464L9940J01103j36505Q0506L77108Q9936J31409J13533L919K15646
13717H09131o4130m22936k59776j23592n347o0144o9070K17393J26716l45320
13707a97075j47929J74206P4366P4490K80640K78432j2688J9248J04816P7920
13697G26426n55409o22502m6812j28159K11190O00205J96490n7557p7676l03497
13687e7301J7417K40911p620k1825L07001K16732J87047M4536k75432j16998Q208
13676E42676j80395q4822L48491N1036k31077j6347J95371K84302J28321j72402
13666H65154n3366k32111j75203j4706P7526k07804n22364m60174K88524K09404
13656b25120K40702J23570m17080k53477r9227N43772K61581p1771N39872P90952
$$ y = [-207464, -167524, -66421, -202926, -122420, 254688, 344624, 476033, 589566, 593485, 809131, 745001, 322065, 62289, -61303, -66650, -126794, -195864, 21529, 148245, -197075, -345004, -170798, -96432, -21942, 258698, 537130, 524442, 543690, 648506, 726426, 171017, -451485, -498297, -626456, -415266, 184939, 381429, 323872, 246196, -57301, -39884, 201027, 193407, 171582, 478583, 695315, 882362, 926898, 651466, 534468, 542676, 362281, 277459, 625950, 676986, 445909, 429562, 624933, 909235, 1037556, 865154, 811788, 579677, 404474, 389768, 467294, 259490, -262874, -723048, -434524, -225120, 15582, 139152, -277928, -531405, -630632, -86860, 174721, 102950, 642822, 1433774]
13646A433774L52568l87330m78843j36914j37266k00540k30875k66377O3540J53969
13636A65706R5530J97910j10738k61344L814k2219j97303k55540J83177L21379
13626A20372J22080K5149L07315J8314l95016j52867k9505j23406m00027k17372
13616g24963J79950J17285J51314K09973K46254L43318O8509j7641n81972p19194
13606g27167J17307o5931k50236K63546m9930j74882K0995k10884L14795K18214
13596e44173J62832Q0053R8011o599P7031L2408L80434r7621j67235o8146p38162
13585g91167k31000N64158N35217k01669o62369k34056M91592K37142J38119J32521
13575b1512K4790k49014j78682k12812j75272K56366M25979q4809k70024L5677
$$ y = [1433774, 1786342, 1399012, 920169, 783255, 645989, 445449, 214574, -51803, 11737, 165706, 261236, 459146, 348408, 87064, 90878, 68659, -128644, -384184, -201007, 120372, 242452, 267601, 574916, 593230, 198214, 45347, 15842, -107564, -507591, -724963, -545013, -427728, -276414, -66441, 179813, 523131, 591640, 573999, -7973, -727167, -609860, -675791, -926027, -662481, -712411, -887293, -866298, -1077182, -762387, -544173, -381341, -301288, -203277, -209876, -132845, -100437, 279997, 182376, 15141, -53005, -791167, -1022167, -458009, 77208, -124461, -786830, -1020886, -529294, -292152, -154033, -21512, 3278, -245736, -424418, -637230, -812502, -556136, -130157, -214966, -484990, -449313]
13565d49313L7396j70169R9816l7029m2546K53316O14076L50686m59779m81829
13555b85375P1904J60526q6608o6008q8251M1662L44962L63738K79568k06710
13545E29408o01915l45718O9043J09315k59664j20858K38844O6276m51908k03954
13535i71131Q9378J1674K60625O14799N78915J4924l43838j87328Q6165O2767
13525B16950K22170L8873n5014j64683k29224m96412r6644M90116M81755j41184
13515B66703n47403p7139J14520K79629J40424j44777k00966L87666N80037K90513
13505A089207j81862m90268m44690l9094Q6805p5536r8851r0092n6855j79845
13495d81081k49720O8194J11894K40851J24589o5575J17716L30363k54831n46499
$$ y = [-449313, -411917, -582086, -482270, -519299, -561845, -308529, 305547, 656233, 196454, -285375, -213471, -52945, -139553, -205561, -293812, -252150, 92812, 456550, 736118, 529408, -72507, -418225, -349182, -239867, -499531, -620389, -381545, -315269, -767177, -971131, -881753, -870079, -609454, 5345, 584260, 599184, 255346, 68018, 154183, 216950, 439120, 477993, 422979, 258296, 29072, -467340, -563984, -73868, 407887, 266703, -280700, -357839, -243319, 36310, 176734, 31957, -169009, 218657, 798694, 1089207, 907345, 417077, -27613, -66707, 20098, -55438, -154289, -244381, -301236, -481081, -730801, -662607, -550713, -309862, -185273, -250848, -133132, 197231, -57600, -604099]
13485f04099K26515J39402k66160k36664k45814K87639O57925O31774N14252k07705
13475H97065m19367j53997l15391l88010j78259q6143k8037q1257J97634J81723
13465c74039J75568K06707J43128J41842m3752q7682o8040k34780J25783L86377
13455C71112J74723p7732k34969m80797k50966j35053J74474M57010J74247k77600
13445a05551j61152J17914L68287J10986n2326m2443M2385l5723L02219O2183
13435F06779k54579j60935j79402k97310j67324Q046J68317N05652L66360o2753
13425E32851j12774p6934M26172N23106J9912k95237n90096o08638k24149L96433
13415i354L79561J54609j36496l19984p2801M86002Q09288L39449l33387k46938
$$ y = [-604099, -377584, -238182, -504342, -741006, -986820, -699181, -41256, 590518, 1104770, 897065, 477698, 323701, 8310, -379700, -557959, -644102, -672139, -753396, -555762, -374039, -198471, 8236, 151364, 293206, 249454, 161772, 93732, -141048, -15265, 371112, 545835, 468103, 233134, -247663, -498629, -633682, -459208, -2198, 172049, -105551, -266703, -148789, 219498, 330484, 278158, 235715, 278100, 242377, 544596, 606779, 352200, 191265, 11863, -285447, -452771, -444725, -276408, 229244, 595604, 532851, 420077, 343143, 769315, 1292421, 1312333, 1017096, 427000, -181638, -405787, -9354, 370207, 524816, 388320, 68336, -4465, 481537, 1290825, 1630274, 1296887, 1049949]
13405A049949l87661l83400N3125j87708k59785L44128J77976J4231N2670K6574
13395E00099K19822M41113l24478k90694J689q9602l32377k54968J15130L04977
13385B90711j12539m60480o34924l76698L12386O95462N40525Q1699j97641m61668
13375c23167l02985K28300L82117J24835L8084q1283O5438K73668m0318l91328
13365b6639n32804k83201j47863k4814K96123k19086r4753K29183K05506L51864
13355b46484L34281n567R3964K70577O2398M2304J73558n1510n8622J25363j42181
13344E98081j02282K24566O8264j61248r2180M15981L20180l27646l73530J0531
13334E80717O05999J47807n12864o72655k31764j15551k76394j41037J74010M81393
$$ y = [1049949, 662288, 278888, 332013, 144305, -115480, 228648, 406624, 420855, 473525, 500099, 719921, 1161034, 836556, 545862, 547551, 457949, 125572, -129396, -14266, 290711, 178172, -282308, -917232, -1293930, -981544, -286082, 254443, 336142, 138501, -323167, -626152, -397852, -15735, 109100, 147184, 65901, 131339, 405007, 364689, -26639, -559443, -842644, -990507, -1015321, -719198, -938284, -1033037, -803854, -598348, -246484, 87797, 82230, 176194, 446771, 509169, 551473, 725031, 673521, 614899, 740262, 598081, 495799, 720365, 788629, 627381, 535201, 951182, 1271362, 943716, 570186, 580717, 1186716, 1334523, 821659, 149004, -82760, -198311, -474705, -615742, -441732, 39661]
13324C9661K10207r8352j24494J31930L06301N6937k38749l74394L13968P32615
13314I55630M34901j22087l71094j69892J33006O13837P27093L63332k15525m19707
13304A929494p02815m77198J17665J09343k35070n61981l05842M11287N81792
13295H66675j25121n39137l18728J16276M83132L64013j60989J7837L4972j16668
13285F22262j91765l78298J33162M00365P2629j1222j82678o07254m03368M9031
13275d97136M43660R77531L33634l37278k55354j28681j16463k46290j67477N6293
13265F2439J31379L30095O0123m8060J4451j74629l10442j45929J27130L22874
13255C69431J93994L29465q8006m50913R2399k00214n11276l44334J53376K62976
$$ y = [39661, 249868, 151516, 27022, 158952, 465253, 522190, 283441, -90953, 223015, 955630, 1390531, 1268444, 897350, 727458, 860464, 1474301, 2201394, 2564726, 2349201, 1929494, 1226679, 749481, 867146, 976489, 741419, 179438, -126404, 284883, 866675, 741554, 202417, -116311, -35, 483097, 847110, 686121, 703958, 738930, 622262, 430497, 52199, 185361, 585726, 658355, 647133, 464455, -142799, -546167, -497136, -53476, 924055, 1257689, 920411, 665057, 536376, 419913, 173623, 6146, 62439, 193818, 523913, 584036, 535976, 550427, 375798, 65356, -80573, 46557, 369431, 563425, 892890, 804884, 353971, 446370, 246156, -265120, -609454, -456078, -193102]
13245a93102K20978k1040K24724L40758r4675m86108j23601J86164r9393K05845
13235A60550M14094L62430O0881j15133k31288k04302L9317j09634l26477r6703
13225d6265J65971n1748p7264j90257Q9615L21939R7553L0576k1835l73691r3389
13214a48795J36770K31434J81650N09493M57250j8507l64510j61060M20416L19045
13204A563186j30383j67463K57926N99124M19059J03510l77148m72813J52319
13195A947317K56939n76798n22467n8551j94011R4843o87k02572N6797M63094
13185A263904J29034l90001m07352M13375L25544J7099K79426L27610J28586J75810
13175B263035l32025n06041j69242J78641M2141l09447o0052O1364K72329J91203
$$ y = [-193102, 27876, 6836, 231560, 572318, 477643, -8465, -132066, 54098, -45295, 160550, 574644, 937074, 997955, 882822, 651534, 447232, 486549, 376915, 50438, -46265, 119706, 67958, -9306, -199563, -109948, 211991, 309544, 340120, 318285, -55406, -148795, -12025, 219409, 401059, 910552, 1367802, 1349295, 984785, 823725, 1244141, 1563186, 1432803, 1265340, 1523266, 2122390, 2541449, 2644959, 2267811, 1794998, 1947317, 2204256, 1627458, 1104991, 1046440, 852429, 947272, 946585, 744013, 800810, 1263904, 1392938, 1002937, 595585, 1008960, 1334504, 1351603, 1631029, 1958639, 2087225, 2263035, 1931010, 1424969, 1255727, 1434368, 1476509, 1167062, 1107010, 1168374, 1440703, 1631906]
13165A631906J42881n7696l09676p2567K44862l5025j11324L15542L46411j8860
13155B076454K28195K43429k97921m52492m27094k43688P4279J50366J60512j21752
13145A390288k35499R0499K52192J31114L544Q8873j17435k61502j1968J92035
13135A522141J44482j56044N3466J07284K1819J51967J346N5900K73895J28945
13125B305201j48809P6162J23637Q229P8521m15251k50457k95640k38215L11882
13115A555260L02503K58141J37049k54973k22473o7479l35641K76570J89655R7593
13105A936205L28538J91848J41974L77780L1534J52908N45096O40699O42156P30452
13095E719190J082450J104380J524137K067432J516553m21284j662649j521306
$$ y = [1631906, 1774787, 1717091, 1407415, 1334848, 1579710, 1544685, 1433361, 1748903, 2095314, 2076454, 2304649, 2548078, 2250157, 1797665, 1370571, 1126883, 1201162, 1351528, 1512040, 1390288, 1154789, 1245288, 1497480, 1628594, 1632138, 1721011, 1603576, 1342074, 1330106, 1522141, 1666623, 1510579, 1564045, 1671329, 1693148, 1845115, 1846461, 1902361, 2176256, 2305201, 2156392, 2232554, 2356191, 2364420, 2442941, 2027690, 1777233, 1481593, 1243378, 1555260, 1857763, 2115904, 2252953, 1997980, 1775507, 1708028, 1372387, 1648957, 1838612, 1936205, 2264743, 2456591, 2598565, 2976345, 3007879, 3160787, 3705883, 4346582, 4988738, 5719190, 6801640, 7906020, 9430157, 11497589, 13014142, 12592858, 10930209, 9408903]
13087I408903j467438j450538j291073q97915k49201l02093l53645p2693K01237
13078C525544K49616Q5334Q0027K48813L25918M26091J92099J64490N59526M31349
13068F288807J9466o05485q75420n99501j97678k59219J62740o9421o17046k53683
13058B993560j26753K59877L60063K70290J51400n9697N8973K99957Q1914J48616
13048D438200N0353R5480J64686k46105p10896m00941K50463N94608L92453j79877
13038D448424k64624k42039q3209R5651K87448O90943M56144O6882k38375o1255
13028E155990J91799L38740M75630K51314R3634P0535L32828O29554J018458J309815
13018I868297J497313J159945R6873p73051q07913p59127m84000k69277k62474
$$ y = [9408903, 7941465, 6490927, 5199854, 4301939, 4052738, 3750645, 3397000, 3324307, 3525544, 3775160, 3860494, 3940521, 4189334, 4515252, 4941343, 5133442, 5297932, 5857458, 6288807, 6308273, 5702788, 4827368, 4227867, 4030189, 3770970, 3933710, 3864289, 3247243, 2993560, 2866807, 3126684, 3486747, 3757037, 3908437, 3848740, 3907713, 4207670, 4289584, 4438200, 4488553, 4584033, 4748719, 4502614, 3791718, 3390777, 3641240, 4235848, 4628301, 4448424, 4183800, 3941761, 3858552, 3954203, 4241651, 4932594, 5388738, 5455620, 5217245, 5155990, 5347789, 5686529, 6162159, 6413473, 6507107, 6577642, 6910470, 7540024, 8558482, 9868297, 11365610, 12525555, 12622428, 11849377, 11041464, 10282337, 9798337, 9529060, 9266586]
13009I266586L12821M67475j07149j46438j59425l245N25161N62353N66872P46159
12999A2031170P81484R45854J125891J071755R63641J123983J424704K078577
12991B1547059K684930L496330L888430M512600N689990O713736Q024406J0011468
12983F6568949J2592366J5411061K0097724K6825482L5972590M6975709N5164800
12976B79608681N0420395K1794338k0726159m8682955n3035915m5359833l5327976
12969A48690576k6688924k0364260j5717562j2320851r638071p922949o887714
12962D9150245n700538m457695l881277l816022l259994k325507j772791j977746
12954B1958675k315734j707732j270307j368210j022580l47699m04213q61470
$$ y = [9266586, 9579407, 10046882, 9939733, 9793295, 9633870, 9630625, 10155786, 10718139, 11285011, 12031170, 12812654, 13758508, 14884399, 15956154, 16919795, 18043778, 19468482, 21547059, 24231989, 27728319, 31616749, 36129349, 41819339, 48533075, 56557481, 66568949, 79161315, 94572376, 114670100, 141495582, 177468172, 224443881, 279608681, 330029076, 351823414, 331097255, 282414300, 229378385, 184018552, 148690576, 122001652, 101637392, 85919830, 73598979, 63960908, 56037959, 49150245, 43449707, 38992012, 35110735, 31294713, 28034719, 25709212, 23936421, 21958675, 19642941, 17935209, 16664902, 15296692, 14274112, 13926413, 13522200, 12660730]
12946A2660730r49107m97067j16972k79678p08566j17890J27343l68855k96825
12937I453113j20398j60385r9379j6502k52628O9403K50082K50621p3273M51581
12927I752235O67898R2224O8076M85973Q04235J128447J404625J482582K065004
12918A7951299K468329K125603J389613K26076j009478j267826j140501n59246
12910B0183869J2567P30769R34159O39230J277305K223379K680130K908585L542068
12901C5132061M444193N476578O234572P313941R931009J3250049J6623577K1693739
12893A20099719K9036798L8666141N0078027N7845049M8514691J2865320l0690109
12886C26415636n3607542n3424490m3885505l3881310k5656261j9199882j4465699
$$ y = [12660730, 11711623, 11214556, 11097584, 10817906, 10109340, 9991450, 10118793, 9749938, 9453113, 9332715, 9172330, 9072951, 9056449, 8803821, 8873224, 9123306, 9373927, 9300654, 9752235, 10420133, 10512357, 10580433, 11066406, 11870641, 12999088, 14403713, 15886295, 17951299, 20419628, 22545231, 23934844, 24160920, 23151442, 21883616, 20743115, 20183869, 20196436, 20927205, 21861364, 22500594, 23777899, 26001278, 28681408, 31589993, 35132061, 39576254, 45052832, 51287404, 58601345, 68532354, 81782403, 98405980, 120099719, 149136517, 187802658, 237880685, 295725734, 344240425, 357105745, 326415636, 272808094, 219383604, 175498099, 141616789, 115960528, 96760646, 82294947]
12879H2294947j1148534r254881p718245n927240m503749l526928l165529k708186
12871C4341655k685785k094363j161287j96186P91175K192986L705344L247111
12863C8140650J1142j013325J33573l41414k688486m231080l838667k982771k737561
12854B0452061k128748j211310j116621r97532o45651p64677p99584q21972p69923
12845A1196043n78648p17213m65767j81613R6566l0699q1039L81274J79884j08017
12835I690771L03569p5787K0189N66915Q10780M36991M94353J12314p6058K38642
12825A2522679P48061J290675J420814J606770J780659J837832J487659J781906
12817B4477055K270571L262967M139547M958080N882700O837686Q618844J1015457
$$ y = [82294947, 71146413, 61891532, 54173287, 48246047, 43742298, 40215370, 37049841, 34341655, 31655870, 29561507, 28400220, 28204034, 28995209, 31188195, 34893539, 38140650, 38151792, 37138467, 37272040, 36930626, 34242140, 30011060, 26172393, 23189622, 20452061, 18323313, 17112003, 15995382, 14997850, 14352199, 13587522, 12787938, 11965966, 11196043, 10617395, 9900182, 9434415, 9252802, 9349368, 9318669, 9237630, 9618904, 9798788, 9690771, 9994340, 9918553, 9938742, 10505657, 11316437, 11753428, 12247781, 12360095, 12284037, 12522679, 13270740, 14561415, 15982229, 17588999, 19369658, 21207490, 22695149, 24477055, 26747626, 30010593, 34150140, 39108220, 44990920, 51828606, 60447450, 71462907]
12809G1462907J3569048J7320018K3326030L1144328M0731501N1202622N5672390
12802C04428844L9934846J274361l6897503n3346890n0543668m0954667l1123077
12795A32772246k3647964j8046216j4094978j1543578r590892p797642o225561
12788D1825415n112372m119546l498623l165206k868259k635905j936137j491819
12780A6997548j603834j736943j530513q50567j008414j147779m59936l49984
12772H309578m49666o14831o55635m97523m60891m01182N0166R0445r0889m2149
12762E237423n01120n96487m02952l50207j49909o9950j29497m80495n11393k03443
12752A841970r6914K99233L49429J16559j03504j85366k94756j01881j14492P7816
$$ y = [71462907, 85031955, 102351973, 125678003, 156822331, 197553832, 248756454, 304428844, 344363690, 345638051, 308740548, 255393658, 204849990, 163895323, 132772246, 109124282, 91078066, 76983088, 65439510, 55848618, 48050976, 41825415, 36713043, 32593497, 29094874, 25929668, 23061409, 20425504, 18489367, 16997548, 15393714, 13656771, 12126258, 11275691, 10267277, 9119498, 8659562, 8309578, 7859912, 7245081, 6589446, 6091923, 5631032, 5229850, 5280016, 5370461, 5279572, 5237423, 4736303, 4139816, 3736864, 3386657, 3236748, 3166798, 3037301, 2556806, 2045413, 1841970, 1745056, 2044289, 2393718, 2510277, 2406773, 2221407, 1926651, 1824770, 1710278, 1788094]
12742A788094O2325l69685n31345J65157j64319m65379J85006L28141J51990j00239
12732A049746l42577m2967L53846M67560J37783j14966J34075j4624n7509J164
12722A571531q3135L7715n32442n42013j93642Q8832L32872n8753j13745J27036
12712F34256m04152k0017M39328K65586L50897J60850n42394o48957o817K98203
12702E26783J41461J34595O6714P1108k4802r3831J08130J56370L5055j27768
12692I93815l39542k67060j76648j45394K7286j97955N0473K50652K22027m8522
12682C69132l6722M0418P4058K33626J04414r1922k42600P5181k4131k39184k06742
12671E5528o385l899j25154J12108L35028J64130J23247K35786n9885o6128K11154
$$ y = [1788094, 1850419, 1480734, 949389, 1114546, 950227, 484848, 669854, 997995, 1149985, 1049746, 707169, 664202, 1018048, 1485608, 1623391, 1508425, 1642500, 1627876, 1570367, 1571531, 1488396, 1526111, 993669, 451656, 258014, 346846, 679718, 620965, 507220, 634256, 230104, 210087, 649415, 915001, 1265898, 1426748, 884354, 235397, 228580, 526783, 668244, 802839, 869553, 940661, 915859, 822028, 930158, 1086528, 1121583, 993815, 654273, 387213, 210565, 65171, 92457, -105498, -55025, 195627, 417654, 369132, 332410, 372828, 446886, 680512, 784926, 693004, 450404, 525585, 501454, 262270, 55528, 49143, 45244, -79910, 32198, 367226, 531356, 654603, 890389, 830504, 764376, 975530]
12660I75530j7005j93887k65269P8630L8510l8116k64009l0409N9349k39756j85629
12649h2061M6538J90516K54362K57032K14389J05492l31126k52324r3819j51495
12639A57504o1519R7713K4141j83817R6622J99728K49219M25440j5266n38876
12629D50889m40652J18529L51377J36203P760M66359N72462L95716j26751q27837
12619A104055p78878p62338m34150J37236J03845J34006M54171M47548l28683
12610G6812k60404j29727M7819K39387m7811k10358j4611N09121P43681K28068
12600A181977o43920p30638m29691j34048O1828L76729L18217m6371k54743M221
12590b96439J45080j05247J24814L12907J77542k38559j99219j11574J6878J46917
$$ y = [975530, 958525, 764638, 499369, 577999, 616509, 578393, 314384, 283975, 343324, 103568, -82061, -35523, 154993, 409355, 666387, 880776, 986268, 655142, 402818, 308999, 157504, 95985, 193698, 217839, 34022, 130644, 330372, 579591, 1005031, 989765, 450889, 10237, 128766, 480143, 616346, 624106, 1090465, 1662927, 2058643, 1931892, 1104055, 325177, -437161, -871311, -734075, -630230, -496224, -42053, 405495, 76812, -183592, -313319, -265500, -26113, -73924, -284282, -298893, 210228, 953909, 1181977, 538057, -192581, -622272, -756320, -694492, -317763, 454, -45917, -300660, -296439, -151359, -256606, -131792, 181115, 358657, 120098, -79121, -190695, -173817, -26900]
12580b6900j02065N5641K40906J12381p9612j74303P2946j62874K13448J66457
12570C16025m3866J93093j0138M2605J75872j25457j17519k13435r6852K59932
12560C80260K73049M05192R9236l76561l90101n73545k32656k12598k11456n352
12550h44532k30793J64785K70029K00229K27641k23511m06719p2609L16649K77296
12540c21535K4541n5210R7614j7559r8086N1594j11614p143L43386Q7000k03670
12529b10682J00323Q9659k9292J83306M12169J35728m76708k71180k2160p6693
12519a65530L15638K01657j24444m03178r9996P521m37370l13848J38561K38131
12509f42858J94923L13145L65643M9014j49635L62236M14402J6754p8591P698
$$ y = [-26900, -128965, -73324, 167582, 279963, 200351, 26048, 98994, -63880, 149568, 316025, 272159, 465252, 455114, 497719, 673591, 548134, 430615, 217180, 120328, 380260, 653309, 1058501, 1157737, 781176, 391075, -182470, -415126, -627724, -839180, -844532, -1075325, -910540, -640511, -440282, -212641, -436152, -842871, -915480, -598831, -321535, -296994, -352204, -254590, -272149, -370235, -318641, -430255, -437398, -94012, -7012, -210682, -110359, -20700, -49992, 133314, 545483, 681211, 204503, -66677, -88837, -165530, 150108, 351765, 227321, -175857, -275853, -268332, -705702, -1019550, -880989, -642858, -447935, -134790, 230853, 279867, 130232, 492468, 906870, 923624, 845033, 852731]
12499H52731k48533k96540j22010j51260j13624k67671k17316J51673J56297K03192
12489e3061K51183j48771k56227j31246p031J17024K01585P9525k3489o551L91464
12478D14405K41646j43591K0105K97693l29635q46287j69045L09140J03990j23592
12468b25171k04191n7283K28548K23320K92626J53974k610P2573M9642j09855
12458D21573L1766R8186j70730k46584L2616K16891o5244l36479k71363O7268
12448b22100J55668m9245o4287J85274K64425J82002Q9076R5730M11860J75823
12438A224226o06014l07582K38870M4526k98572L0079M46103L67257J88426q5777
12428A241542l03390k06486o30082o46558l0625L70067J72821J22082M13647k3767
$$ y = [852731, 604198, 307658, 185648, 34388, -79236, -346907, -564223, -412550, -256253, -53061, 198122, 49351, -206876, -338122, -345153, -228129, -26544, 52981, 29492, 22941, 414405, 656051, 512460, 532565, 830258, 500623, -345664, -514709, -205569, -101579, -225171, -429362, -486645, -258097, -34777, 257849, 411823, 409213, 481786, 531428, 421573, 453339, 551525, 380795, 134211, 166827, 383718, 318474, -18005, -289368, -222100, -66432, -115677, -179964, 5310, 269735, 451737, 540813, 636543, 1048403, 1224226, 618212, 310630, 549500, 594026, 295454, 325533, 771636, 1138893, 1327319, 1241542, 938152, 731666, 101584, -544974, -575599, -205532, -32711, 89371, 503018, 479251]
12418D79251j07354l03394q8246L11644J1132q6174J01338J55051q022m8010k7958
12407C89258j20941r9684l80030k87661k30448J75658M03020P1365k99696j43452
12397e22611r4617L7418M60528P61798P68869M13687j42991k30215k90590n82338
12387E78938n60014J78046J34053l20174j34066J09972J59632n1515j98815m8207
12377a52150j43973K15176K49209l16119m11304O1786l2379k47404j33867l22273
12367a233298j6974P5074K77679L10787L4337R8852M42551M00009O6366M7712
12357E03095J52350N3995l55923l42149J19917K53990J09187K83406K81648l87909
12347F71607n43199j39652O7385l75798n85949K16539L48882L23702K57133j6633
$$ y = [479251, 371897, 68503, -19743, 291901, 303033, 216859, 318197, 473248, 465226, 417216, 389258, 268317, 168633, -211397, -499058, -729506, -553848, -150828, -79463, -379159, -522611, -617228, -579810, -119282, 642516, 1411385, 1825072, 1682081, 1451866, 1161276, 578938, 18924, 196970, 331023, 10849, -123217, -13245, 146387, 94872, -103943, -152150, -296123, -80947, 168262, -147857, -559161, -497375, -529754, -777158, -911025, -1233298, -1250272, -1175198, -897519, -586732, -552395, -453543, -10992, 389017, 455383, 503095, 655445, 709440, 353517, 11368, 131285, 385275, 494462, 777868, 1059516, 671607, 128408, -11244, 56141, -319657, -905606, -689067, -340185, -16483, 240650, 224017]
12337B24017q5003l56567k69077j73523k07844k2815J46112K34316P5293N53772
12327A18681M03010L08076L20111j28058l18831j71709j2148J27092j35828l5526
12317D74870J51844j45425m08869k02786k10866n3162M17700J48867K01435L50188
12307G23796J58774k21984l76918L716Q0511J05099L64939j66540k82306O9737
12297D58824r3486j44041J59250K33809L27890j33924l85318j76552j42510k59154
12287a55212J94525L26706K44900r0810m45623r4414R2218k9485m8381o1970L84411
12276C16865R4107j5645L40133L20669k44387l74289J67484L08479j90008j30295
12266E93113Q6490p7454m668l58403n81087j71863L891J76124M27323K92539J72364
$$ y = [224017, 139014, -217553, -486630, -660153, -867997, -890812, -744700, -510384, -435091, 118681, 521691, 829767, 1149878, 1021820, 702989, 531280, 519132, 646224, 510396, 474870, 626714, 481289, 72420, -130366, -341232, -394394, 23306, 172173, 373608, 723796, 882570, 660586, 283668, 287384, 367895, 472994, 837933, 671393, 389087, 458824, 365338, 221297, 380547, 614356, 942246, 808322, 423004, 246452, 103942, -155212, 39313, 366019, 610919, 520109, 74486, -19928, 72290, 42805, -5576, -67546, 316865, 410972, 395327, 735460, 1056129, 811742, 437453, 604937, 913416, 723408, 593113, 679603, 602149, 597481, 239078, -342009, -513872, -509981, -333857, 93466, 386005, 558369]
12255E58369J35034J98155J90251q2203k5095m77007q19751l55742j7763K88619
12245d07133N63523M06331K8688k15579k69853r2514L36460L41555J10512j10103
12235F91887j20644J07011R2308j18397r970j40059k05497O4010M10279O37391
12225A408319M05675J35948O03153M78063j3006M94847J398371J766482K297455
12216H975307L281963K616413j384044l580851k816743j873495j417423j110184
12208B690943o70832l12092p3625l40551n37997j52682J55470k65896n27161Q9651
12198E5228M93829K28743K86079j98899l43929L2768R2898K45492K62985Q15604
12188A970798J156149J343938J793840J565770l39924j970540j761935j139365
$$ y = [558369, 693403, 891558, 1081809, 999606, 974511, 497504, -322247, -677989, -695752, -407133, 156390, 562721, 591409, 375830, 105977, 13463, 349923, 691478, 801990, 691887, 571243, 678254, 770562, 652165, 642195, 502136, 296639, 360649, 770928, 1408319, 1813994, 1949942, 2553095, 3031158, 3018152, 3512999, 4911370, 6677852, 8975307, 12257270, 14873683, 13489639, 9908788, 7092045, 5218550, 3801127, 2690943, 2020111, 1708019, 1634394, 1293843, 755846, 603164, 758634, 492738, -34423, 55228, 549057, 777800, 1063879, 864980, 521051, 553819, 646717, 892209, 1155194, 1970798, 3126947, 4470885, 6264725, 7830495, 7490571, 5520031, 3758096, 2618731]
12180B618731m88008j62707l69058m68997k60534j64069j45681J31559j24214
12171E67022r5842L07119J37444o1332L65972l2689p76166l15230Q31059M44761
12161A372118l31644l32493R4230l60244p78034K22234L70101q5989J0687L9283
12151B20249p245n1058k4690p2806l89633l17626J70538L14573K1859k99973m6394
12140d82206K7477q3779J70082J38859L31359m7038k08785j81327J37910M97773
12130C00325N10465N2628k02940l02074j35789j92651k13376R0707K04964M93981
12120F06240K65364m76494j037442o31265K26786K87227k5526J36305L98613N60389
12110C10197N42688J41957p1190j42842l55120m17940k27190j80762K37282K70988
$$ y = [2618731, 2130723, 1968016, 1598958, 1129961, 869427, 705358, 559677, 691236, 567022, 471180, 778299, 915743, 854411, 1220383, 1187694, 411528, 96298, 927357, 1372118, 1040474, 707981, 802211, 441967, -336067, -113833, 256268, 170279, 180966, 220249, 213004, 161946, 137256, 64450, -325183, -642809, -472271, -157698, -135839, -435812, -482206, -454729, -538508, -368426, -229567, 101792, 54754, -154031, -335358, -197448, 300325, 810790, 863418, 660478, 358404, 222615, 29964, -183412, -92705, 112259, 606240, 871604, 395110, -642332, -1273597, -1046811, -759584, -785110, -648805, -250192, 310197, 852885, 994842, 923652, 780810, 425690, 7750, -219440, -400202, -162920, 108068]
12100A08068k23123N343J35756j69554k25830l11826q2323K24141K67505K71663
12090a80J88366m10713k80816k3842K12248N28792Q32621m4952o14494j00382
12080B86648K1647J74073L68125P8600m39336l95987p3635K87138R6689l74864
12070B9098m71722n95787j97230P0282K32419J57973L32074N36264M52046K92169
12060H37586n057k60463k92232j7768M85692N8060k50979j07950j24270Q1833
12050D04452R5529l25999m45401m888K31362j81453k3413J09968j74761M3314
12040b71290M64074K26894N4726n1011l93456l43357o8739L32838M03415L59277
12030G13371j682n16721Q0679L6731q5989K22579K71886J52170J88058J56202
$$ y = [108068, -115055, -109712, 26044, -143510, -369340, -681166, -763489, -539348, -271843, -180, 188186, -222527, -503343, -527185, -314937, 213855, 1046476, 1001524, 387030, 286648, 308295, 482368, 850493, 929093, 489757, 93770, 20135, 307273, 403962, 29098, -442624, -1038411, -1235641, -1165359, -932940, -774967, -442893, 93371, 545417, 837586, 832529, 572066, 279834, 262066, 747758, 805818, 554839, 446889, 322619, 404452, 499981, 173982, -271419, -276307, -44945, -226398, -249811, -139843, -314604, -271290, 192784, 419678, 474404, 423393, 29937, -313420, -382159, -49321, 354094, 713371, 711689, 194968, 275647, 312378, 226389, 448968, 720854, 873024, 1061082, 1217284]
12020A217284q7843n02060n60352j03349m6232l97889l70796K53207L79177L63967
12010A45114K24111N23075N53585J56359j88758p93546o11663l1418L18961N17476
12000H13296K11427K29074J64664L12029J96370p1233Q304L51430N54126L24370
11990C093857N21177N62162L31920j9771m44433n83069m83763o46184m42720k73062
11980A616114n83347m72875k30468q1335N14261N97179K97174N2317j98746l39936
11970A170338o41996p98401j49470J53050p5871R2421L21953L65841L92901l01602
11960E29164m99664j62646k30344J76825l3343l70799K49765Q17110L49434L9628
11950H65130R1421M77281N14674M11519M70798O9530o71569q66366m25744l1062
$$ y = [1217284, 1129441, 627381, 67029, -36320, -82552, -480441, -851237, -598030, -218853, 145114, 369225, 892300, 1445885, 1602244, 1413486, 619940, 8277, -23141, 295820, 813296, 1024723, 1253797, 1418461, 1730490, 1926860, 1855627, 1863931, 2215361, 2769487, 3093857, 3615034, 4177196, 4509116, 4489345, 4044912, 3461843, 2978080, 2331896, 1889176, 1616114, 1032767, 559892, 329424, 248089, 762350, 1359529, 1656703, 1709020, 1510274, 1170338, 528342, -270059, -419529, -266479, -342350, -249929, 72024, 437865, 830766, 529164, 29500, -133146, -363490, -186665, -220008, -590807, -341042, 476068, 825502, 865130, 956551, 1433832, 1948506, 2360025, 2830823, 2900353, 2228784, 1362418, 936674, 905612]
11940I05612M6286P0468K31157J03152K36592K41810k83493m24865k38756k63579
11930F24384j09835J59281L85468Q51961M32814m63703n48184J55379K60394L66852
11920B114811L82872M59220L33296J37020M19316O92353L86947L65567L21572
11911E612974J6690M1381L18549M40336P39258O17326O32305M91400K92952Q67015
11901A0070186P84077K16225J4468n37672r48034q59858q52751j110986j014718
11892E760937o21079m37888n96051m70969j93952r4617j34743j76890K38452N34544
11882C807744K95651O18817O60948K45814N01807P75270O80396P2051n13574j082255
11872F062669j033954j072684j036733k25248J86204j70520J09260L16826j96437
$$ y = [905612, 951898, 1022366, 1253523, 1356675, 1593267, 1835077, 1551584, 1126719, 887963, 624384, 514549, 673830, 1059298, 1911259, 2344073, 1880370, 1332186, 1487565, 1747959, 2114811, 2497683, 2956903, 3290199, 3427219, 3846535, 4538888, 4925835, 5291402, 5612974, 5629664, 5671045, 5989594, 6429930, 7169188, 7786514, 8418819, 8910219, 9203171, 10070186, 10854263, 11070488, 11084956, 10547284, 9599250, 8739392, 7886641, 6775655, 5760937, 5139858, 4701970, 4105919, 3634950, 3440998, 3346381, 3211638, 3034748, 3273200, 3807744, 4103395, 4722212, 5383160, 5628974, 6130781, 6906051, 7586447, 7658498, 7144924, 6062669, 5028715, 3956031, 2919298, 2694050, 2880254, 2709734, 2818994, 3135820, 2939383]
11863B939383l11888k44083l85615q1286J73403J63844j28937p49102q59526j78672
11853C37521O22078M8039o17757k61096J26732L14306N76869J67534l23315l61799
11843F29112j74671j5274J46455K22539J95683P0664j54353P0178J55185O1596
11833A207114k19778m97736j40742J16988L6782k978j863J34384k75766o29930
11823b73525k60503K15703N65054N81641K94612j42147l22503k48753l30410l66250
11813b87081o2739R3854j44098J03809N47501L11306J43153J23999m09992j28930
11803B90782K34967o4792k92489k71244l05508j3191Q976j3428j40285J6164N219
11792e44829M55429M94075M10886M38581j24326l42978l55588k43754J52415j41650
$$ y = [2939383, 2627495, 2383412, 1997797, 1916511, 2089914, 2253758, 2124821, 1375719, 516193, 337521, 959599, 1007638, 389881, 128785, 255517, 569823, 1146692, 1314226, 990911, 629112, 454441, 439167, 585622, 808161, 1003844, 1074508, 920155, 990333, 1145518, 1207114, 987336, 489600, 348858, 465846, 502628, 499650, 497787, 632171, 356405, -273525, -534028, -318325, 246729, 828370, 1122982, 980835, 658332, 409579, 79169, -287081, -349820, -255966, -400064, -296255, 251246, 562552, 705705, 829704, 419712, 290782, 525749, 460957, 168468, -102776, -408284, -421475, -412499, -425927, -566212, -550048, -544829, -89400, 404675, 815561, 1254142, 1129816, 786838, 431250, 187496, 339911, 198261]
11782A98261k42262j56831L90958P48869L12810j92792j46368j83425K88958j72629
11772H45549j549747j329860r79677R62463J635022M63920K12393j97388k08344
11763a45669L24097Q8273K16280K67577L29130M21479K6203k33119n48591l70023
11753C75637m899N5397K13067k07179j92877J19566M01820K57770K71446J45936
11743A435684J57693j926m02196m66170k42078j36065n1189j16746N744j81455
11733A296j89289N0464J49357j291k24743j15940K28169J70969J00973L42325
11723E12290n6807k72608m3254N806L28854J54520l915j31512L3962L17255P6399
11712I20990R2835p3982n16461n80815k72551J05216K84457k5196k52751J74709
$$ y = [198261, -44001, -200832, 190126, 938995, 1251805, 1059013, 912645, 729220, 1018178, 845549, -704198, -2034058, -3013735, -2051272, -416250, 47670, 260063, 62675, -145669, 178428, 266701, 482981, 750558, 1079688, 1501167, 1527370, 1294251, 745660, 375637, 370738, 426135, 639202, 432023, 239146, 358712, 760532, 1018302, 1289748, 1435684, 1593377, 1591451, 1189255, 723085, 481007, 344942, 293753, 177007, 182751, 1296, -187993, -137529, 11828, 10537, -214206, -330146, -101977, 68992, 169965, 512290, 455483, 182875, 139621, 145427, 474281, 628801, 624886, 493374, 527336, 844591, 920990, 1013825, 939843, 423382, -157433, -429984, -324768, -40311, -65507, -318258, -143549]
11702a43549M27049Q3677k00772P4142M18528J34377K49905o7884l40997n0282
11692E84194j9230k4582j41118j56J1463o0726J82426p0129l23574l79799n7350
11681b98581j39792K45358N33007J15982l70784k03789k05499l37100K69990R00393
11671E09185N96435k77886m61165l03754k66804m65494n30463j37418K91370L16100
11661g29894K05873L82761Q7072m15674j51276j69718R2514K21939J96232J55519
11651a24652M854J36077J24314Q9829j38700J81529M46456M82311l1610j78815
11641I91593o09918n52273K36539N64364r9019j34631N8293O6458J7021j82919
11631C55508j66989k75069m20664m31L30172j3474J46515L11225J89717L0670
$$ y = [-143549, 283500, 367177, 166405, 240547, 659075, 793452, 1043357, 975473, 634476, 584194, 564964, 540382, 399264, 399108, 410571, 349845, 532271, 462142, 138568, -241231, -298581, -438373, -193015, 339992, 455974, 85190, -118599, -324098, -661198, -391208, 509185, 1105620, 827734, 366569, 62815, -203989, -669483, -1199946, -1337364, -1045994, -729894, -524021, -141260, -54188, -469862, -621138, -790856, -698342, -476403, -280171, -124652, -119798, 16279, 140593, 230422, 91722, 273251, 719707, 1202018, 1170408, 991593, 381675, -170598, 65941, 630305, 531286, 396655, 454948, 521406, 538427, 355508, 188519, -86550, -507214, -507645, -177473, -190947, -44432, 266793, 456510, 487180]
11621D87180O9317K2343k48944p57512k84650K63899J67507L21047K26785n4201
11611B12771M9970K36499R3184l27718l05942L7019Q6071j02712k12446j84054
11601d17358n06222k77058L12255M46448M63626N05482K18059J40836M34619P2378
11591A393065k00278j6173J86297k7069j12250K51005J37987l35718n5319q3359
11581A138188l13614k256M69612N80883N08006N7746R4925j32106J9919K84854
11571B706157K33111J48744L32178Q08045R80141O72980P49576R92417J187985
11562H811334N44264j71427l17517q31659j111169n27184J41483k36206q63433
11553E438486o39765k49181k97304n10737o59384m0020L41751K55928M0759l31067
$$ y = [487180, 556497, 578840, 329896, -427616, -712266, -448367, -280860, 40187, 266972, 212771, 262741, 499240, 592424, 264706, -41236, -4217, 81854, -20858, -233304, -417358, -923580, -1200638, -888383, -441935, 21691, 527173, 745232, 886068, 1320687, 1393065, 1192787, 1176614, 1362911, 1335842, 1223592, 1474597, 1612584, 1276866, 1221547, 1138188, 824574, 822318, 1291930, 1872813, 2380819, 2438565, 2533490, 2401384, 2421303, 2706157, 2939268, 3088012, 3420190, 4228235, 5208376, 5881356, 6630932, 7623349, 8811334, 9355598, 9184171, 8866654, 8034995, 6923826, 6396642, 6538125, 6301919, 5438486, 4798721, 4549540, 4252236, 3741499, 3082115, 3042095, 3383846, 3639774, 3680533, 3349466]
11543C349466m0182J11764k11184j1416L36564K47516Q0047j68707L49422K85689
11533D328979K05310N17327M53816Q12248J545588J970939J372358O59612M10743
11524A2276920N2742p97744p33429p68826r11637p78162r84438q87335k84742
11515F183349J47460J68665L99859R50347J024062R59500R58312N79039K30954
11506A1601547j21464n17560j35581P41358Q50929Q12134Q88796J009295J107444
11497A6236898R01375Q58709l59506k050352k150915j996386k229761r83844J10781
11488H336999l27196j371794j541070j328405n86932l5240J37459K91731L81240
11479C956792K17892J81658k2609O2443k31556k89202p0953k98913n66684k30318
$$ y = [3349466, 3309284, 3421048, 3209864, 3198448, 3535012, 3782528, 3862575, 3693868, 4043290, 4328979, 4534289, 5051616, 5505432, 6317680, 7863268, 9834207, 11206565, 11866177, 12276920, 12329662, 11531918, 10798489, 10029663, 9118026, 8339864, 7355426, 6468091, 6183349, 6330809, 6499474, 6899333, 7849680, 8873742, 9833242, 10791554, 11370593, 11601547, 11480083, 10962523, 10826942, 11568300, 12419229, 13231363, 14120159, 15129454, 16236898, 17138273, 17996982, 17637476, 15587124, 13436209, 11439823, 9210062, 8226218, 8336999, 8009803, 6638009, 5096939, 3768534, 3181602, 3146362, 3283821, 3575552, 3956792, 4174684, 4356342, 4333733, 4396176, 4164620, 3875418, 3804465, 3505552, 2938868, 2708550]
11469B708550J61394j76174m46028l14747N3817K0175n524r9596l35706l99552
11459A166609j20902j15028l4718j72145m05883l85515J4078M11440L67296L52897
11449A078129l7293o61117j95507M86643O47318P1919l61508p4312K11897m12670
11439G53499n38271j33555j31379O8909j07150l97229m16035K67066J89754R4305
11429c50086K24704J68893K914k68836o75210m31216O9972P22780O20178R0967
11419A75060P4396M77622M23283Q5646k51874m51201n30875l82174n6434R3140
11409c43411J96384L88045K31033l23909k60745j83861J05364O2745j27966j5912
11399b72233o7260r2535j35818k49861J89759J24063N8579L08700J33082J23696
$$ y = [2708550, 2869944, 2693770, 2247742, 1932995, 1986812, 2006987, 2001463, 1901867, 1566161, 1166609, 1045707, 930679, 895961, 723816, 317933, -67582, -53504, 357936, 725232, 1078129, 1040836, 379719, 184212, 670855, 1318173, 1390092, 1028584, 954272, 1166169, 753499, 215228, 81673, -49706, 19203, -87947, -485176, -901211, -634145, -444391, -350086, -125382, 43511, 46425, -222411, -897621, -1328837, -1258865, -536085, 84093, 175060, 249456, 727078, 1150361, 1236007, 984133, 532932, 2057, -380117, -436551, -343411, -147027, 241018, 472051, 148142, -112603, -296464, -191100, -128355, -256321, -272233, -339493, -432028, -567846, -817707, -627948, -503885, -445306, -136606, -3524, 120172]
11389A20172K95210j13818k31979J14363K09854R408j68190n47012l29454J97037
11379d44409K33066M3648N21425M88368m3311l08724P6490L03080p0915j36577
11369F62141k35704j65020M4227L49929M43387r4814l06721J17287K30132j74715
11359H70129o19282m87369k71263j00934K22789M8468l16409r4134P4301P7285
11349e96419j00146J30625K17351L12483K66839R3180j61795J07577J64125L7060
11339D70880j06402j75933k09701k67696k96317j28621K71978M70007L98582K84762
11329G11539k67605k60940l19465l96077K32768L76898K65148N7702m19951m07725
11319d27708n7128p2304q6155L58068L45262q0005j73746J71623K99054J5326
$$ y = [120172, 415382, 301564, 69585, 183948, 393802, 403210, 235020, -311992, -641446, -444409, -211343, -167695, 353730, 842098, 798787, 490063, 566553, 869633, 798718, 662141, 426437, 261417, 305644, 655573, 1098960, 1004146, 697425, 814712, 1044844, 870129, 250847, -236522, -507785, -608719, -385930, -337462, -653871, -748005, -673704, -596419, -696565, -565940, -348589, -36106, 230733, 323913, 162118, 269695, 433820, 470880, 364478, 188545, -21156, -288852, -585169, -713790, -441812, 28195, 426777, 711539, 443934, 182994, -136471, -532548, -299780, 77118, 342266, 399968, -19983, -427708, -484836, -557140, -643295, -285227, 60035, -19970, -193716, -22093, 276961, 292287]
11309B92287j40495Q0243L00239J54321j85578m77103m40583l20852J01153K54327
11299c82041J87154J30725M32286J76120n9691m9906p9128l50516m18211j21249
11289e34457M59826p0978o5193n2841L52282M94720j18472o10719n05629n181
11279f56642O04647J13091l57986p1072M44064J01015l92928m9548P1640L13563
11269A19844K59709j4227p0906R9264l4083K7120J28199K7107k29702k48023j12797
11258d8495j73367l3740j6552m0893j20584K49325L64227l7147o8425r942j03593
11247c9186K17169K80998o84820n31434K82211K72205Q6759N938j60942K48962
11237b2140K28937j72588l60879n57693l45427M34037P37510M99272o1860l13144
$$ y = [292287, 151792, 232035, 532274, 686595, 501017, 23914, -416669, -737521, -636368, -382041, -194887, -64162, 368124, 544244, 484553, 434647, 355519, 5003, -413208, -534457, -74631, -145609, -210802, -263643, 88639, 583359, 464887, -145832, -651461, -656642, -51995, 61096, -296890, -367962, 76102, 177117, -215811, -265359, -193719, 119844, 379553, 365326, 294420, 393684, 359601, 386721, 514920, 542027, 312325, 64302, -48495, -221862, -255602, -272154, -313047, -433631, -184306, 179921, 142774, 74349, 64407, -39186, 177983, 458981, -225839, -757273, -475062, -202857, -116098, -110160, -271102, -22140, 206797, 34209, -326670, -884363, -1229790, -795753, -58243, 441029, 379169, 66025]
11227F6025j17460N5797N6677q7461l8356j84465J16717L8051L9136j54149l05261
11216e14749n5619M80755M46753L58393K45766p0381m3274k66390n14740n55433
11206d88919l95065J37753N24686K26406k87625l93976L537J28284M11738J78584
11196D5403j75090j14727J69233K94278k93609k98550O4386j48928P6448K69853
11186a11303j56307j90802l81498K36948L84376j8210q8141L53698K92873k26655
11176I4979q4094L09097J3240j74756j17965j79905p1114o80j9273J81749M69043
11165D20321K71324J8752j34887J670K72479M88949M62398N3689k93604l04653
11155A256438j27989l33887n39079l24626l2786K44548j26018j27067M4012K51074
$$ y = [66025, -51435, 4362, 61039, -26422, -64778, -249243, -132526, -94475, -55339, -209488, -514749, -570368, -89613, 357140, 715533, 961299, 890918, 847644, 581254, 66514, -488919, -883984, -746231, -221545, 4861, -282764, -676740, -673203, -544919, -133181, 45403, -129687, -244414, -75181, 219097, -74512, -373062, -308676, -457604, -381156, -111303, -267610, -458412, -839910, -602962, -218586, -236796, -324937, 28761, 321634, 94979, 10885, 319982, 333222, 158466, 40501, -139404, -210518, -211198, -230471, -48722, 420321, 691645, 710397, 575510, 577180, 849659, 1338608, 1801006, 1854695, 1561091, 1256438, 1128449, 794562, 255483, -69143, -101929, 142619, 16601, -110466, -66454, 184620]
11145A84620K28304O167k30705k44939m31167l91375j65848J74633J52239j10641
11135h28712J2681K10612L5056J74934L10309j6623o62958k55598J74754K51881
11125e93664P46649M93982p9591Q9024j76394m27991m0446o2592J7686r7838k9161
11114a60336J21122q9816j00171j20534j1031n4988j4122j93698J19176M23347
11104h1051O590m05602r4837M03823j51890l28821m5072J13874P5927l57213j08429
11093i72701L67989L76079K62619L05994O3150n54493m26082n0799J26346J9074
11083d82824j34030K30942L84360K52491o2063m80743n59657k28694r3401L29778
11073h43841J25290J5105J67884J11892j07346m62631J3514L81994K02952N785
$$ y = [184620, 412924, 419091, 188386, -56553, -487720, -879095, -1044943, -870310, -718071, -828712, -816031, -605419, -570363, -395429, -85120, -101743, -764701, -1020299, -845545, -593664, 152985, 646967, 567376, 656400, 480006, 52015, 11569, -51023, -33337, -131175, -160336, -39214, -129030, -229201, -349735, -360766, -415754, -429876, -623574, -504398, -81051, -74461, -480063, -574900, -171077, -322967, -651788, -696860, -582986, -507059, -864272, -972701, -604712, -228633, 33986, 339980, 403130, -151363, -577445, -628244, -501898, -482824, -616854, -385912, -1552, 250939, 188876, -291867, -851524, -1080218, -1173619, -843841, -718551, -703446, -535562, -423670, -531016, -993647, -980133, -598139, -395187, -389402]
11063c89402K32961K76256j6842J56870J39644K7459o1539k57798j68223j77790
11053b38404k85659k26614j40722P381j07771n1164K07835o2087k84690N83M17079
11042g64233L77520J24554N8052l88769m26480j45937J18662O84811K42837m24506
11032e43489k37478J93425J91623J84050l44053m51814k22798j52321J02816J53997
11022a126042J00393K1867J05054L48611L20882k8738J49955L44555R8678l10556
11012B4659m4795Q4096L7427L3670j65580q1915J33017P1528l62040m77007m06168
11001a153108m5944K86467K63924P9276o5113k48029k34624k24828k43071m8283
10991a633333K19933J57073L04648L85352J99650J03023o36427q08668m5827N39649
$$ y = [-389402, -156441, 119815, 102973, 259843, 399487, 426946, 365407, 107609, -60614, -238404, -524063, -750677, -891399, -884018, -991789, -1042953, -835118, -897205, -1181895, -1181312, -764233, -386713, -262159, -204107, -592876, -1019356, -1165293, -1046631, -361820, -118983, -543489, -780967, -587542, -395919, -211869, -555922, -1007736, -1230534, -1382855, -1280039, -1126042, -1025649, -1003782, -898728, -550117, -229235, -257973, -108018, 236537, 335215, 24659, -20136, 63960, 101387, 135057, -30523, -112438, 20579, 92107, -269933, -746940, -1153108, -1199052, -912585, -648661, -569385, -634498, -882527, -1117151, -1341979, -1585050, -1633333, -1413400, -1256327, -951679, -566327, -366677, -263654, -900081, -1708749, -1754576, -1214927]
10981a214927O26747L36988K71375J27365k87193m18079k8694N8330j60171O1029
10971f27230L64259K57855M28538K10147k27065k07729j38789M13792J31448n92422
10961A2804n30008L49882M22474j21122j46189O2695K91383J71181k00067l81033
10951f8000m72169Q100K07073J00295o16032o56410j65204O026K47803J59440
10941a249078K05614L40728K90273J32455q9508l23091m9782J31298k6915k79379
10931i17385L78500P54886J68148k06423k37262k10225k49366m93542n67754l47250
10921a927673K76801Q01893K65075L11542R849m65253k37861K26832J89229n8791
10911f08357L08959Q1365k54247J84842K39817j02825J6669O11085K29162l87596
$$ y = [-1214927, -588180, -251192, 20183, 147548, -139645, -557724, -586418, -528088, -688259, -627230, -262971, -5116, 423422, 633569, 406504, 198775, 59986, 473778, 605226, 12804, -517204, -167322, 255152, 134030, -12159, 50536, 341919, 513100, 313033, -68000, -540169, -532069, -324996, -224701, -840733, -1497143, -1662347, -1656321, -1408518, -1249078, -1043464, -702736, -412463, -280008, -369516, -692607, -742389, -611091, -638006, -917385, -538885, 216001, 384149, 177726, -59536, -269761, -519127, -1012669, -1580423, -1927673, -1650872, -848979, -583904, -272362, -262513, -727766, -965627, -738795, -549566, -608357, -299398, -218033, -472280, -287438, -47621, -150446, -133777, 477308, 706470, 318874]
10901C18874l57600j12235L782K49998j31347K271L43595P7893R1095j37404m54673
10890a05751n45465J12491K23263j46183J21282K88076L04690J56074L267J16363
10880E28107J06507j27701j41731K4613j2086j66107n15154l07229k4529J71037
10870d64273K70647J66063k35288m17275j72339J6079k0211P1474K89670J67861
10860c27592K47305J24237Q933K21660o6329l14649M1569L02811l36863m47005
10850e45923k56342l9616J68892K43093N15830M38702J57693Q1005j61858k58400
10840C43076j86954J04170J13067j6396m0793j44167l01137j20577J31283P8088
10830d0340l67781j18375J18761J70490p0639M24368O17709N54097L8401l64369
$$ y = [318874, -38726, -150961, -147179, 102819, -28528, -26257, 317338, 395231, 486326, 348922, -105751, -651216, -538725, -315462, -461645, -340363, -52287, 252403, 408477, 411744, 528107, 634614, 506913, 365182, 389795, 377709, 211602, -303552, -610781, -635310, -464273, -193626, -27563, -262851, -680126, -852465, -836386, -856597, -785123, -495453, -327592, -80287, 43950, 52883, 274543, 208214, -106435, -64866, 237945, -98918, -545923, -802265, -841881, -672989, -429896, 85934, 524636, 682329, 763334, 601476, 343076, 156122, 260292, 373359, 356963, 316170, 172003, -129134, -249711, -118428, -40340, -408121, -526496, -407735, -237245, -307884, 116484, 734193, 1288290, 1326691, 962322]
10820I62322l26382k75175l55445j57521j34301k23823K22885L79900K65741O7218
10810D25419m82053l78924l21957J61417K69421J87027L47226L73441J30061l53094
10800C57984o60008k99424P7461J47960q0823m92904l7302M34542M88582K8015
10790c5917q6549l18666m13159k22249l8147j06752K08003K54082P0974k02105
10780h90485m53312j17494K24935K10908l763L32464M37829K00992J53728k08385
10770a12583k00466R8106K47582J87648r3576j76212P9382O3j78330k14201j06303
10759d68890m3197l6584L27354L79289J51063j81788j65018j0518o7888J03003
10749a3174J1041l1817p8475j19181l84092k36597j4349L7518k47398j33563K16696
$$ y = [962322, 635940, 360765, 5320, -152201, -286502, -510325, -287440, 92460, 358201, 425419, -56634, -435558, -757515, -596098, -326677, -139650, 207576, 581017, 711078, 357984, -302024, -601448, -523987, -376027, -456850, -949754, -987056, -552514, -63932, -35917, -122466, -441132, -854291, -1076540, -1114687, -1221439, -1013436, -759354, -688380, -890485, -1343797, -1461291, -1236356, -1025448, -1029211, -696747, -258918, -57926, 95802, -112583, -313049, -214943, 32639, 220287, 126711, -49501, 29881, 29944, -148386, -362587, -468890, -512087, -548671, -221317, 157972, 309035, 127247, -37771, -48289, -116177, -13174, -2133, -33950, -112425, -231606, -615698, -852295, -866644, -829126, -1076524, -1210087, -993391]
10738i93391L80763M78847M51800J79637j58430m8849M3355K61712J54381l32193
10728D17632k45009l13981j27680M04210J64517j13638j92199j75571l86962k36690
10718h05371R7874J45046K6938L1774M68445L22583m37865k58063L93821N77855
10708E63037k97447o85030M5371J43061J76051K18472K45908n569l22534K63643
10698C44963K99799k66917j49705l22579j12930j60650l21845j68999k31060r2622
10688a182545m5416j16441J93455P91802Q57967O28455k17696k89698k77285m61562
10678a18964j87628q8477p3343J34702K01541k08240n82922m89016J54516K83491
10668i74340J62949r5436K28181K95540J950p9508J28421J21873j17400k6308
$$ y = [-993391, -612628, -133781, 318019, 497656, 339226, 290377, 333732, 595444, 749825, 417632, 172623, -141358, -269038, 135172, 299689, 186051, -6148, -181719, -568681, -805371, -707497, -562451, -535513, -503739, -35294, 287289, -150576, -408639, -14818, 563037, 265590, -419440, -374069, -231008, -54957, 163515, 409423, 403854, 81320, 344963, 644762, 377845, 228140, -94439, -207369, -368019, -689864, -858863, -1089923, -1182545, -1227961, -1344402, -1150947, -359145, 498822, 1127277, 909581, 619883, 342598, -118964, -306592, -395069, -468412, -333710, -132169, -340409, -923331, -1412347, -1257831, -974340, -811391, -906827, -678646, -383106, -381156, -460664, -332243, -210370, -327770, -354078]
10658c54078Q5857K52078K59295k65306o32821k87836M65017K25988l37503k86883
10648h76192k1745p4456j16734R5868J84314k0383J54062R117m23160k47202Q4619
10637a251892L8755M58351M89603M48906J37610k77608k69038j4179J75502M24854
10627C60864L30996o334J74954K97755J69911j35232k41427k25777j32629P6406
10617F69487o6813j01644J18149R8441r5226J59158N22463O7817o8387j40527
10607A162918l96042m71308o10582m86397m1762L40208L71384Q4298j42043k08104
10597c97430j93350m43893k12034J55441J22469N1308k09119l10232J97157M16406
10587h23277J07441j92995m9827J80366p43j17710l35149Q1198M67992K30131
$$ y = [-354078, -268221, -16143, 243152, -22154, -654975, -942811, -477794, -251806, -589309, -876192, -897937, -972393, -1089127, -993259, -808945, -829328, -675266, -666149, -1089309, -1336511, -1251892, -1213137, -754786, -265183, 183723, 321333, 43725, -225313, -239492, -63990, 360864, 691860, 685526, 860480, 1158235, 1328146, 1192914, 951487, 725710, 593081, 669487, 602674, 501030, 619179, 717620, 622394, 781552, 1304015, 1371832, 1303445, 1162918, 766876, 295568, -315014, -801411, -843173, -502965, -131581, -47283, -189326, -397430, -590780, -1034673, -1246707, -1091266, -968797, -917489, -1126608, -1436840, -1239683, -823277, -715836, -908831, -958658, -778292, -779035, -896745, -1231894, -1150696, -682704, -452573]
10577d52573L97220M09675J16294r0179r9397j69271j32286j17398J1659J6739
10567a09517k92657k64277J27283L32614p7717m69300L7497R1592k41715K38489
10557f27708L44718k44288j76847p1120l84573j06902J89720K44704P2318Q2961
10547f77017J98915K13866M1772k15077K9406K27151K58789J35280J17774p4130
10537B56729l41060k98388l17338j21775j0904J41646j44919j43613j81319k95912
10527a456853K18831L91621L74657O1027j62572J05919P9351K68995K96773J69082
10517C46831l91903k95667n5978j60980K15489J57106M98521M12883j6012l42874
10507C67416k10486n0117j20305j98480m62368o47824k39156K41048L57864N57925
$$ y = [-452573, -55353, 354322, 470616, 380437, 281040, 111769, -20517, -137915, -126256, -109517, -402174, -666451, -539168, -206554, -284271, -753571, -716074, -624482, -866197, -627708, -282990, -527278, -704125, -775245, -1159818, -1266720, -1077000, -832296, -759978, -677017, -478102, -264236, -222464, -437541, -408135, -180984, 77805, 213085, 330859, 256729, -84331, -382719, -700057, -821832, -832736, -691090, -836009, -979622, -1160941, -1456853, -1238022, -846401, -471744, -410717, -573289, -467370, -388019, -119024, 177749, 346831, -45072, -340739, -396717, -557697, -342208, -185102, 313419, 726302, 710290, 367416, 156930, 106813, -13492, -211972, -674340, -1322164, -1561320, -1320272, -962408, -404483]
10497d04483L22165k02890k34293J2504J48298R1169q9138m8907M59329L41531
10487C95285K2043k60978n12364l24384l41197R8061M40379l50964l26084P2922
10477a087281K24075K8055p2199M7687j2582j54237J65651K79348L12715J90600
10467g8168k03025k35886j91866k9635K44004P05516J87579m7246p9991o34098
10457c62816o57932j92449K02227J97078L30457N8219j31599j39649m13381m50606
10447a560451j95123J60566N82231K90310k2451p8186l57926l96989j67665L00784
10437a444900O75651P78319j34056l94649L81432O48500K26999k65828j46799
10428C24669n95390j042521n04956R8576N42218O92137P12561K71854j42477l56844
$$ y = [-404483, -82318, -285208, -519501, -506997, -358699, -267530, -356668, -405575, 53754, 395285, 417328, 156350, -356014, -680398, -1021595, -923534, -483155, -834119, -1160203, -1087281, -863206, -835151, -907350, -859663, -872245, -1026482, -860831, -581483, -268768, -78168, -281193, -517079, -708945, -738580, -494576, 210940, 398519, 351273, 271282, -362816, -1020748, -1213197, -1010970, -813892, -483435, -425216, -556815, -696464, -1109845, -1560451, -1755574, -1595008, -1012777, -722467, -744918, -823104, -1181030, -1578019, -1745684, -1444900, -769249, 9070, -124986, -519635, -138203, 510297, 737296, 471468, 324669, -270721, -1313242, -1818198, -1719622, -1177404, -485267, 227294, 499148, 356671, -173]
10418a73n2254l2772l58508j84084M8959K79892M02534O10996R938o7212k6340
10407F30976n0406k92857j5205L36887M3442m76428o15677M74730K29556j8800
10397B46218L24296P0275j64851l25304o14008l51046J14800P1292K70974M04033
10387D6679K01142k53319l20076J97532j0591j43400N7808J08607K3042k50644
10377c43220l50623J2448O43556N67465J97113J26082J24424j17548o67205o49235
10367d56743k86002J64076M15372M34765L45393J53918m01509o66558j08970N566
10357d00692L0906J74478J07005L55261L08049j45949m46417j70681k96942r6977
10347e81959J89981J58391j31471m28707j53574K93046L59886K45594J41164m8064
$$ y = [-173, -52427, -85199, -443707, -627791, -578832, -298940, 103594, 714590, 724528, 657316, 630976, 580570, 287713, 272508, 609395, 652837, 176409, -439268, 35462, 265018, 246218, 570514, 640789, 475938, 150634, -463374, -814420, -699620, -628328, -357354, 46679, 247821, -5498, -325574, -128042, -138633, -282033, -224225, -115618, -92576, -343220, -693843, -681395, -37839, 529626, 726739, 852821, 977245, 859697, 192492, -456743, -742745, -578669, -163297, 271468, 616861, 770779, 369270, -297288, -406258, -400692, -369786, -195308, -88303, 266958, 575007, 429058, -17359, -188040, -484982, -581959, -391978, -233587, -365058, -793765, -947339, -654293, -294407, -48813, 92351, 44287]
10337D4287r5108q4362j40547j05082J74860J07751P516K90341L17995J36212
10327F53863m6029P1077K33921O2600n22065m45454K6642j41523l42105M4256
10317d04817l720l40863p7587R9874j38730j90381J83001J72174m53625m34711
10307a589385J94992M16376L06190l3131j21196j50299l9377K1995J90213K993
10297h00629k33706q2538K38421K25141M26936M09290K62638j4147o03835o31909
10287h04338o11270m91714j68642K14486J96592l7802L86823K68655M15958O03365
10277b7887J33253j36433n5165j5881P5042j13146l48618R277l4471l01762j51260
10266i67051J56374L36805o3759p9281O2193K21915J15420K07587J27917K02425
$$ y = [44287, -50821, -135183, -275730, -380812, -205952, -98201, -90685, 199656, 517651, 653863, 607834, 678911, 912832, 975432, 453367, 7913, 34555, -106968, -449073, -404817, -408537, -749400, -826987, -727113, -865843, -1056224, -873223, -701049, -1154674, -1589385, -1394393, -978017, -671827, -704958, -826154, -976453, -1015830, -993835, -803622, -800629, -1034335, -1116873, -878452, -653311, -226375, 182915, 445553, 431406, -172429, -804338, -1415608, -1907322, -2075964, -1861478, -1664886, -1702688, -1315865, -1047210, -631252, -27887, 105366, -31067, -86232, -102113, -27071, -140217, -488835, -479558, -514029, -815791, -967051, -810677, -473872, -537631, -616912, -554719, -332804, -217384, -9797, 118120, 320545]
10256C20545K06289l25691Q9650L4402l34776r8172k8132m7842q5874q4260K0854
10245c33007r0397q3207L93415K13562m08890j87131N4041j78186J2705L65516
10235b41579K56607O8616j12868l70339j48305k6680j25522j6631L21572K83884
10225a11245j58492j05109j25718k03704l14831M426J4371j93411L43819P8916
10215g70978j19292L9553M9429j55652O9693Q9569j05110m36339j37471J24579
10205a352019M3994K26855P06085N90593J14264j83264k30954p8562j75794j01750
10195d40552k45421l97001k87900K31401M67003K66260L9715M5918K76296K71402
10185B27121m60814k58494L77635L43048J71450l87928m35884J73833J21263j52001
$$ y = [320545, 526834, 201143, 290793, 325195, -9581, -107753, -135885, -183727, -269601, -353861, -333007, -423404, -506611, -113196, 100366, -308524, -495655, -441614, -619800, -607095, -241579, 15028, 83644, -29224, -399563, -547868, -574548, -700070, -716701, -395129, -111245, -269737, -374846, -500564, -704268, -1019099, -1014673, -1000302, -1193713, -849894, -770978, -890270, -850717, -801288, -956940, -887247, -797678, -902788, -1339127, -1476598, -1352019, -1308025, -1081170, -375085, 215508, 329772, 146508, -84446, -163008, -338802, -440552, -685973, -1082974, -1370874, -1139473, -672470, -406210, -366495, -320577, -44281, 227121, -233693, -492187, -114552, 228496, 399946, 12018, -423866, -250033, -128770, -280771]
10175b80771j22696n2209M4163J44680j3935J7044N0808k15648m45534n4381p4362
10164a002841K27954M81768J14097m26245j28221L5003j64381m3197M9065L18904
10154e38094L30689J85385K85375K52425k49009m64649k20357J33238M34448J72393
10144C21844j04337J62657p482L1606K00823K71402L44770j13358k99966Q9217
10134H97176L61979Q0363j92338j47576J17459k47510m09867O8804m2795k87745
10124A97950J87520K32351K01064J70951J81703J25814N1878K00985j6699j38649
10114A394868K05531P05495J305250J056624N90687N41651R06388J920107K551246
10105A1177847L279793M039212M914470O063685O901815M783834j385691o048382
$$ y = [-280771, -403467, -455676, -411513, -266833, -280768, -263724, -212916, -428564, -874098, -928479, -1002841, -774887, -293119, -179022, -605267, -733488, -698485, -862866, -906063, -856998, -538094, -207405, -22020, 263355, 515780, 266771, -197878, -418235, -284997, 149451, 321844, 217507, 380164, 372682, 404288, 605111, 876513, 1221283, 1107925, 807959, 897176, 1259155, 1339518, 1147180, 999604, 1117063, 869553, 459686, 528490, 485695, 197950, 385470, 617821, 818885, 989836, 1171539, 1297353, 1349231, 1550216, 1533517, 1394868, 1600399, 2305894, 3611144, 4667768, 5258455, 5800106, 6706494, 8626601, 11177847, 14457640, 18496852, 23411322, 29475007, 36376822, 41160656, 39774965, 33726583]
10097C3726583o695545n793957m558738l057879k092025j610650j234068q00232
10089G883489o71562q32536r17010q33555q00489o11632j28571k37287m14869
10080B435978j33173k34972j60140l0478k51241j48008L16629J42520m03022r03219
10070F30874o75852j9591L90220L15929j84784K5488k5060l96166j97067J03639
10060c2370J37151N10356O70987J90988r7283m10045l13763j03079l2978k7081
10050D92883l4327l6585m9495k89088k65820M351K03921K93794P760L7121n2056
10039C12459m30358n05852j43618p4235O2267K30312L47417J64616j95026M8944
10029a83074J71427j36338j30822P2129J09895k33786P874Q5550j52440j11159
$$ y = [33726583, 27031038, 21237081, 16678343, 13620464, 11528439, 9917789, 8683721, 7883489, 7211927, 6379391, 5462381, 4628826, 3828337, 3216705, 3088134, 2850847, 2435978, 2302805, 2067833, 1907693, 1877215, 1625974, 1477966, 1794595, 1937115, 1534093, 630874, -44978, -64569, 325651, 641580, 456796, 482284, 457224, 61058, -136009, -32370, 104781, 615137, 1286124, 1477112, 1379829, 969784, 656021, 552942, 519964, 492883, 458556, 421971, 372476, 83388, -182432, -178081, 25840, 319634, 327394, 364515, 312459, -117899, -623751, -767369, -841604, -779337, -549025, -201608, -36992, -232018, -183074, -11647, -147985, -278807, -206678, -96783, -330569, -322695, -237145, -389585, -500744]
10019e00744L40041K73849O5119M7582k19583l63000j55453j0207m26569j90898
10009a139863J62313K20092K50144j01934k13306Q348j04654k35945K20600O52076
9999b82129L91587m24742m62207J29688m1648p3066J13847K76198N63719K63873
9989D55120n42164m05072Q1526j86226q0225J29134M15283J4490m07401L7727
9979d87808K58906P30169M31322l20323o99137m92456l42078Q789K78441M16208
9969b17967M42882j48999j2687j2168j98269m6681j02427l5292Q7734M03948Q792
9958A68866j55475j7859r7791J44751J78422k72239j66398K28550p5279m94557
9948e59009o10712k04803K60843L39853L43851O989p8016J18503K58745L41604
$$ y = [-500744, -160703, 113146, 178265, 225847, 6264, -356736, -512189, -522396, -948965, -1139863, -977550, -757458, -507314, -609248, -822554, -814206, -918860, -1154805, -934205, -282129, 109458, -315284, -777491, -647803, -689451, -762517, -648670, -372472, 191247, 455120, -87044, -492116, -410590, -596816, -677041, -547907, -132624, -118134, -525535, -487808, -228902, 501267, 932589, 612266, -86871, -579327, -921405, -912616, -634175, -217967, 224915, 75916, 63229, 51061, -147208, -193889, -296316, -331608, -243874, 160074, 168866, 13391, -4468, -102259, 42492, 220914, -51325, -217723, 10827, -64452, -559009, -1169721, -1374524, -1113681, -773828, -429977, -422988, -501004, -382501, -123756, 217848]
$$ [...]
##END NTUPLES=NMR SPECTRUM
##END=
