##TITLE=C13_SL84-Dau(f6)
 CDCl3, 20710 sc

 1.6.2021
##JCAMPDX= 6.0         $$ Bruker NMR JCAMP-DX V2.0
##DATA TYPE= NMR SPECTRUM
##DATA CLASS= NTUPLES
##ORIGIN= UXNMR, Bruker Analytische Messtechnik GmbH
##OWNER= root
$$ XWIN-NMR		Version 3.5
$$ Wed Jun  2 09:24:42 2021 Russian Standard Time (UT+4h)  she@DPX200
##.OBSERVE FREQUENCY= 50.327896
##.OBSERVE NUCLEUS= ^13C
##.ACQUISITION MODE= SIMULTANEOUS
##.ACQUISITION SCHEME= undefined
##.AVERAGES= 20710
##.DIGITISER RES= 17
##SPECTROMETER/DATA SYSTEM= spect
##.PULSE SEQUENCE= zgpg30
##.SOLVENT NAME= DMSO
##.SHIFT REFERENCE= (INTERNAL, DMSO, 0, 222.653)
##AUDIT TRAIL= $$ (NUMBER, WHEN, WHO, WHERE, WHAT)
$$ ##TITLE= Audit trail, XWIN-NMR		Version 3.5
$$ ##JCAMPDX= 5.01
$$ ##ORIGIN= Bruker BioSpin GmbH
$$ ##OWNER= she
$$ F:/spectra/data/she/nmr/c13/1/pdata/1/auditp.txt
$$ ##AUDIT TRAIL=  $$ (NUMBER, WHEN, WHO, WHERE, WHAT)
(   1,<2021-06-02 09:22:06.89 +0400>,<she>,<DPX200>,
      <created by zg, POWCHK disabled, PULCHK disabled
       terminated by command 'halt'
       configuration hash MD5:
       00 E9 B6 7A A2 85 ED C7 34 08 36 98 17 FE 4E 26
       data hash MD5: 32K
       3C 3F 50 B5 72 7E 40 AE 8F 71 12 EF F7 DC 04 96>)
(   2,<2021-06-02 09:22:35.00 +0400>,<she>,<DPX200>,
      <Start of raw data processing
       efp BC_mod = 2 LB = 1 FT_mod = 6 PKNL = 1 PHC0 = -273.7456 PHC1 = 32.96243 SI = 32K 
       data hash MD5: 32K
       96 64 47 62 48 C4 0B 64 44 33 2E BE 38 51 48 58>)
(   3,<2021-06-02 09:22:55.40 +0400>,<she>,<DPX200>,
      <pk PHC0 = -4.757887 PHC1 = 0 
       data hash MD5: 32K
       58 90 3B B1 F9 44 36 31 F1 39 70 96 1B A3 60 D2>)
(   4,<2021-06-02 09:22:58.85 +0400>,<she>,<DPX200>,
      <abs ABSG = 5 
       data hash MD5: 32K
       57 A6 08 78 5C 9D A7 B8 28 94 46 45 83 06 31 A4>)
$$ ##END=
$$ 
$$ hash MD5
$$ 63 D5 8A C9 DA AF 3E 4F CB B9 78 20 AD 48 62 1F
##$RELAX= 
##$RELAX= 
##$RELAX= 
##$RELAX= 
##$RELAX= 
##$RELAX= 
##$RELAX= 
##$RELAX= 
$$ Bruker specific parameters
$$ --------------------------
##$DU= <F:/spectra>
##$EXPNO= 1
##$NAME= <c13>
##$PROCNO= 1
##$TYPE= <nmr>
##$USER= <she>
##$AMP= (0..31)
100 100 100 100 100 100 100 100 100 100 100 100 100 100 100 100 100 100 
100 100 100 100 100 100 100 100 100 100 100 100 100 100 
##$AQSEQ= 0
##$AQ_mod= 1
##$AUNM= <au_zg>
##$AUTOPOS= <>
##$BF1= 50.322709
##$BF2= 200.13
##$BF3= 50.322709
##$BF4= 500.13
##$BF5= 500.13
##$BF6= 500.13
##$BF7= 500.13
##$BF8= 500.13
##$BYTORDA= 1
##$CFDGTYP= 0
##$CFRGTYP= 5
##$CHEMSTR= <none>
##$CNST= (0..31)
1 1 145 1 1 1 1 1 1 1 1 1 1 1 1 1 1 1 1 1 1 1 1 1 1 1 1 1 1 1 1 1 
##$CPDPRG= <waltz16>
##$CPDPRG1= <>
##$CPDPRG2= <waltz16>
##$CPDPRG3= <>
##$CPDPRG4= <mlev>
##$CPDPRG5= <mlev>
##$CPDPRG6= <mlev>
##$CPDPRG7= <mlev>
##$CPDPRG8= <mlev>
##$CPDPRGB= <>
##$CPDPRGT= <>
##$D= (0..31)
0 2 0.00345 0 0 0 0 0 0 0 0 0.03 2e-05 3e-06 0 0 0 0 0 0 0 0 0 0 0 0 0 
0 0 0 0 0 
##$DATE= 1622540576
##$DBL= (0..7)
120 120 120 120 120 120 120 120 
##$DBP= (0..7)
150 150 150 150 150 150 150 150 
$$ [...]
##$SUBNAM4= <"">
##$SUBNAM5= <"">
##$SUBNAM6= <"">
##$SUBNAM7= <"">
##$SUBNAM8= <"">
##$SUBNAM9= <"">
##$SW= 239.972175391363
##$SWIBOX= (0..15)
0 1 3 0 0 0 0 0 0 0 0 0 0 0 0 0 
##$SW_h= 12077.2946859903
##$TD= 32768
##$TD0= 1
##$TE= 0
##$TE2= 300
##$TE3= 300
##$TEG= 300
##$TL= (0..7)
120 120 120 120 120 120 120 120 
##$TP= (0..7)
150 150 150 150 150 150 150 150 
##$TP07= 0
##$TPNAME0= <>
##$TPNAME1= <>
##$TPNAME2= <>
##$TPNAME3= <>
##$TPNAME4= <>
##$TPNAME5= <>
##$TPNAME6= <>
##$TPNAME7= <>
##$TPOAL= (0..7)
0.5 0.5 0.5 0.5 0.5 0.5 0.5 0.5 
##$TPOFFS= (0..7)
0 0 0 0 0 0 0 0 
##$TUNHIN= 0
##$TUNHOUT= 0
##$TUNXOUT= 0
##$USERA1= <user>
##$USERA2= <user>
##$USERA3= <user>
##$USERA4= <user>
##$USERA5= <user>
##$V9= 5
##$VALIST= <valist>
##$VCLIST= <CCCCCCCCCCCCCCC>
##$VD= 0
##$VDLIST= <DDDDDDDDDDDDDDD>
##$VPLIST= <PPPPPPPPPPPPPPP>
##$VTLIST= <TTTTTTTTTTTTTTT>
##$WBST= 1024
##$WBSW= 4
##$XGAIN= (0..3)
0 0 0 0 
##$XL= 0
##$YL= 0
##$YMAX_a= 127686128
##$YMIN_a= -32892792
##$ZGOPTNS= <>
##$ZL1= 120
##$ZL2= 120
##$ZL3= 120
##$ZL4= 120
##$ABSF1= 222.6533
##$ABSF2= -17.34351
##$ABSG= 5
##$ABSL= 3
##$ALPHA= 0
##$AQORDER= 0
##$ASSFAC= 0
##$ASSFACI= 0
##$ASSFACX= 0
##$ASSWID= 0
##$AUNMP= <proc_1d>
##$AZFE= 0.1
##$AZFW= 0.5
##$BCFW= 0
##$BC_mod= 2
##$BYTORDP= 0
##$COROFFS= 0
##$CY= -3
##$DATMOD= 1
##$DC= 0
##$DFILT= <>
##$DTYPP= 0
##$F1P= 0
##$F2P= 0
##$FCOR= 0.5
##$FTSIZE= 32768
##$FT_mod= 6
##$GAMMA= 0
##$GB= 0
##$INTBC= 1
##$INTSCL= 4.134877e-10
##$ISEN= 128
##$LB= 1
##$LEV0= 0
##$LPBIN= 0
##$MAXI= 10000
##$MC2= 0
##$MEAN= 0
##$ME_mod= 0
##$MI= 0.1934396
##$NCOEF= 0
##$NC_proc= 2
##$NLEV= 6
##$NOISF1= 120.0001
##$NOISF2= 80.00006
##$NSP= 0
##$NTH_PI= 0
##$NZP= 0
##$OFFSET= 222.6533
##$PC= 1.4
##$PHC0= -278.5035
##$PHC1= 32.96243
##$PH_mod= 1
##$PKNL= yes
##$PPARMOD= 0
##$PSCAL= 0
##$PSIGN= 0
##$REVERSE= no
##$SF= 50.3227301278049
##$SI= 32768
##$SIGF1= 140
##$SIGF2= 120
##$SINO= 11.81781
##$SIOLD= 32768
##$SREGLST= <13C.CDCl3>
##$SSB= 0
##$STSI= 32768
##$STSR= 0
##$SW_p= 12077.2946859903
##$SYMM= 0
##$S_DEV= 0
##$TDeff= 32768
##$TDoff= 0
##$TI= <>
##$TILT= no
##$TM1= 0
##$TM2= 0
##$TOPLEV= 0
##$USERP1= <user>
##$USERP2= <user>
##$USERP3= <user>
##$USERP4= <user>
##$USERP5= <user>
##$WDW= 1
##$XDIM= 32768
##$YMAX_p= 512485454
##$YMIN_p= -2976199
$$ End of Bruker specific parameters
$$ ---------------------------------
##NTUPLES= NMR SPECTRUM
##VAR_NAME=  FREQUENCY,     SPECTRUM/REAL,   SPECTRUM/IMAG
##SYMBOL=    X,             R,               I
##VAR_TYPE=  INDEPENDENT,   DEPENDENT,       DEPENDENT
##VAR_FORM=  AFFN,          ASDF,            ASDF
##VAR_DIM=   32768,         32768,           32768
##UNITS=     HZ,            ARBITRARY UNITS, ARBITRARY UNITS
##FACTOR=    0.368581032318806, 1,           1
##FIRST=     11204.5221822817, 0,            0
##LAST=      -872.772503708586, 0,           0
##MIN=       -872.772503708586, -2976199,    0
##MAX=       11204.5221822817, 512485454,    0
$$ Real data points
##PAGE= N=1
##DATA TABLE= (X++(R..R)), XYDATA
$$ [...]
15950h78357M1872Q20821P85522N74613m305n34K14947p370l65478m41501m06253
15939C33977L3860j0550m34622l60952j58865K00089J38665m07944k25233L7861
15929h53714K27045L36538M45902O25248K28623j78779k05370j23635m04291J6893
15919A14460q3250k09888J43643J67038j78513m35044k78939p6804R8917N30820
15909b07560M95433N8401k86817j29621J10242M05279L28365k40696k2438L41070
15899H51658j3888k30109j48648j69562o30592r9749K43933N79930N5471l77200
15889F1244k8658l01090m96750k9035M27083K80552L13263J25107j03360j73711
15879G4645j39180j94573n9386k09404n9318r073J19451M70739L35211K71123
$$ y = [-878357, -836485, -15664, 769858, 1344471, 1340166, 1339632, 1554579, 1547209, 1181731, 740230, 333977, 367837, 357287, -77335, -438287, -597152, -397063, -258398, -666342, -891575, -853714, -626669, -290131, 155771, 781019, 1009642, 830863, 625493, 501858, 97567, 114460, 31210, -178678, -35035, 132003, -46510, -481554, -760493, -837297, -738380, -207560, 287873, 346274, 59457, -70164, 40078, 445357, 773722, 533026, 510588, 851658, 837770, 607661, 459013, 289451, -341141, -440890, -196957, 382973, 438444, 61244, 32586, -268504, -765254, -794289, -367206, -86654, 226609, 351716, 248356, 74645, -64535, -259108, -318494, -527898, -587216, -596289, -476838, -6099, 329112, 600235]
15869F00235r0106k5320K11214m0854m35733m54464l17802K57188K49500k63173
15859c09315j37459N7163R5901Q4225J225m01320m65582K1649N99103M05718J10952
15848F2260L01676j08851p30537n3755J30839K8302J70529J91082J68979j88779
15838b8255k07704p6422J91309L12607J85833M49705M3709l89044o42538l66621
15828e27421J55021M1613m9076k30848k45136q2371M23561P02177K72147q6139
15818C73528j42038k20755j78019n53399k50368m233J17545J42704K70230L74918
15808f9887K46556R1522J79727j53809j90380J24804J58295k30409l16842P8999
15798h1424q3425k31737O5177M54209K14913n77172n90807k11341L6867K58268
$$ y = [600235, 510129, 484809, 696023, 655169, 219436, -235028, -552830, -295642, -46142, -309315, -446774, -389611, -293710, -209485, -208260, -609580, -1075162, -1053513, -454410, -48692, 62260, 363936, 255085, -475452, -529207, -398368, -370066, -199537, -8455, 160524, -28255, -235959, -312381, -121072, 191535, 377368, 827073, 870782, 481738, -160800, -527421, -372400, -330787, -379863, -610711, -855847, -938218, -514657, 187520, 459667, 373528, 231490, 10735, -167284, -720683, -971051, -975284, -857739, -715035, -444805, -69887, 176669, 268191, 447918, 294109, 103729, 228533, 386828, 156419, -160423, -81424, -164849, -396586, -331409, 122800, 337713, -239459, -830266, -1041607, -1004740, -746472]
15788g46472J00670K85730L30546K76220K4258k99395j80400J80188J17266o9018
15778A9593k63208l1216J00231O88677K62243n60013k13852J76126R1131N0240
15768C19952j36927m10901J2895J33824R1937K76238n953j71730m24734j37368
15758d52767J43132l44051m11564k13862K65914L43731L87595N79165M4284o0736
15748B80841l72954q21732l09886n3489K95671r1061k84788Q4215M77334O09831
15738a86018J34190m03328j26480L72249l1870J36576N49002M22645k92361n42237
15728C2368r4578K26689j66001N8563N92104J67710l15287l8466J97866K00946
15718H61914k14630m13455n0463J71540M7674J0000J66486r0115k31666J88961
$$ y = [-746472, -645802, -360072, -29526, 246694, 270952, -28443, -208843, -28655, 88611, 19593, -243615, -274831, -174600, 514077, 776320, 216307, 2455, 178581, 269712, 319952, 183025, -227876, -214981, -81157, 10780, 287018, 281065, 109335, -315399, -452767, -309635, -653686, -1065250, -1279112, -1013198, -669467, -281872, 297293, 341577, 280841, -92113, -913845, -1223731, -1277220, -981549, -1072610, -1357398, -1273183, -795849, -186018, -51828, -455156, -581636, -209387, -241257, -104681, 444321, 866966, 574605, 32368, -62210, 164479, -1522, 57041, 649145, 816855, 501568, 463102, 660968, 861914, 647284, 233829, 183366, 354906, 402580, 412580, 579066, 488951, 257285, 446246]
15708D46246O0939j40173l32415l89763M957j38257m35566L04984O29257J43889
15698A54098k62613l33773k83633K16742N51819M02822O9708O1967Q0127k7316
15688F29948m2454p1024j98699n80714j59531L81217R5140j33617L7019j03043
15678a45758j23221M4631k38642l62091j70265Q2321J29057m8914L51061M85874
15668D053J77012K431m5576K01754L74409M52430M9333j02350r7632J993k53812
15657G64045l42090K24062J26399n16098m07166k21079j31120l74546m08570L8168
15647a247995L48616J35300J63029L22194k27099j7303J59090L20683r8325l02774
15637d44584K52610L21153J1546N64711Q10898J21010o03437m47369j08296r1820
$$ y = [446246, 507185, 367012, 34597, -355166, -350209, -488466, -924032, -619048, 10209, 154098, -108515, -442288, -725921, -509179, 42640, 445462, 515170, 577137, 657264, 629948, 587494, 516470, 317771, -262943, -422474, -41257, 53883, -79734, -42715, -145758, -268979, -224348, -462990, -825081, -995346, -913025, -783968, -832882, -481821, 4053, 181065, 183496, 137920, 339674, 714083, 1166513, 1215846, 1113496, 1015864, 1017857, 764045, 421955, 646017, 772416, 256318, -150848, -371927, -503047, -877593, -1286163, -1247995, -899379, -764079, -601050, -278856, -505955, -523258, -364168, -43485, -141810, -444584, -191974, 129179, 140725, 705436, 1516334, 1637344, 1033907, 586538, 478242, 386422]
15627C86422r4234j78519O8252o2851l7910j10955O1734L7564j42340j35425j15179
15616c23441J38707K14594J82445K9592n29402m00460m859M15163M45049k7942
15606A39446j70472j62932K26163K00026j70161j84273L6046q2015J16383K78850
15596B27061R1500j59687l35953j49294K26882J61882J58374J28632j83241l19021
15586a52865m12801k96922j92770Q0029K61983J38184Q6121J89322J73717J1819
15576a14183l25964j44974m951J48628K81773J36680q209l00448l71622J15785
15566e87485L43344K88019K87098O6512j13258N5233J39897K7461J16897L30911
15556I54629M58875L3403j81593m58934l78838p0083M1581j97859l82784l14579
$$ y = [386422, 292188, 113669, 181921, 119070, 81160, -29795, 31939, 69503, -72837, -208262, -323441, -184734, 29860, 212305, 241897, -287505, -687965, -692824, -277661, 167388, 139446, -31026, -193958, 32205, 232231, 62070, -122203, -86157, -168172, -51789, 227061, 318561, 158874, -177079, -326373, -99491, 62391, 220765, 349397, 166156, -152865, -565666, -862588, -1055358, -975329, -713346, -575162, -489041, -299719, -126002, -114183, -440147, -585121, -590072, -441444, -159671, -22991, -31200, -331648, -703270, -587485, -244141, 43878, 330976, 397488, 284230, 339463, 479360, 506821, 623718, 954629, 1413504, 1446907, 1265314, 806380, 427542, 357459, 399040, 201181, -181603, -496182]
15546d96182j55147K10101K61719K79288J74643r4912m468r4626J09588J47557
15536C37561J23333j39089o7845j46714k08832k75258R1357J34411J57319K20141
15526B26384j83666k35267k52572J93735J70374O6358K4405l87714n27469j50215
15516a055647J52747O8112Q2340J53184J15009L14685L85220K73898j60462l86688
15506e7602k17101o5747j4414K18310L18710K02215J61763J29999L48497L04501
15496A329131k29788n59369m83059k62473K93077L62704Q3008J1356q8224p1374
15486C84989k26862j00680j63905k14079k11447J50334M87797N05037J55371l33147
15476D33408j78143Q263r9552j06721L829M0752q2614j31986k26340m0175n0417
$$ y = [-496182, -651329, -441228, -179509, 99779, 274422, 179510, 175042, 80416, 190004, 337561, 460894, 321805, 253960, 107246, -101586, -376844, -285487, -151076, 6243, 226384, 42718, -192549, -445121, -251386, -81012, -14654, 9751, -377963, -905432, -1055647, -902900, -834788, -752448, -599264, -484255, -169570, 215650, 489548, 329086, -57602, -274703, -340450, -354864, -136554, 182156, 384371, 546134, 676133, 1024630, 1329131, 1099343, 539974, 56915, -205558, 87519, 450223, 533231, 544587, 456363, 384989, 158127, 57447, -106458, -320537, -531984, -381650, 106147, 611184, 766555, 433408, 255265, 263528, 163976, 57255, 61084, 101836, 19222, -112764, -339104, -379279, -429696]
15465d29696J63640L93193M11414j82805k75479L19355k43k60585l44319k36763
15455d42288K09121M21976k23127n52906m32632j48371N8087P54629N43256K1320
15445B09065j39811m30082p3669M30366O4805m91815m69691k35521j50173P1025
15435a215501M11437N55281L78536K45070m1129k26711m0909k71472j48031J153
15425c52276K07895j14564k9670M15886j38492l88273J32388L05471J42972j15037
15415F6300k56832J93245M56289L56977j55763n05237l55140K24426j67432j87729
15405c30896j74843j11954J05456M02627J2287k72289j00737K10605J68202q1755
15395a73297j2227L5656J79783J56519K22437k32362m01907n4187p1356K2721
$$ y = [-429696, -266056, 127137, 538551, 355746, 80267, 399622, 399379, 138794, -205525, -442288, -233167, 188809, -34318, -587224, -1019856, -1168227, -1110140, -355511, 187745, 209065, 69254, -360828, -434497, -4131, 60674, -431141, -900832, -1136353, -1286526, -1215501, -804064, -248783, 129753, 374823, 333694, 106983, 66074, -205398, -353429, -352276, -144381, -258945, -288615, 127271, -11221, -399494, -267106, 38365, 181337, 66300, -190532, 2713, 459002, 815979, 660216, 154979, -200161, 24265, -143167, -330896, -505739, -617693, -512237, -109610, -97323, -369612, -470349, -259744, -91542, -173297, -185524, -149868, 29915, 186434, 408871, 176509, -225398, -279585, -350941, -328220]
15385c28220k39668j96277n436l9124k5796k965M26307M66815p5234J4784J18793
15374A13979q095J73112J48572m7109k76476k15573J87784k26417q12700q5749
15364a048672L62724K41610K83349J75331J45964K17512J37371n6217P6715J38191
15354F73878K9510J01752k99198o9144j48467k28137j68726m49202l57100r3258
15344a008092M81371N08527K76578O1087o2213j2857q9919j29994L27857J53261
15334E05606l0529P6767O6005J6249q5936j65556l08091j17303J58241L16951
15324D32404K677P1599N2034l25709j41339K25529j7463j95550J6147j34232k93956
15313c07859j42605l27345n07K57175L16967M97770K76497n47m25863o11440j39549
$$ y = [-328220, -567888, -764165, -769601, -808725, -834521, -837486, -411179, 55636, -19598, -4814, 113979, 105884, 278996, 427568, 380459, 103983, -111590, 76194, -150223, -962923, -1048672, -685948, -444338, -160989, 14342, 160306, 377818, 515189, 458972, 535687, 673878, 703388, 805140, 505942, 436798, 288331, 60194, -108532, -557734, -914834, -1008092, -526721, -18194, 258384, 319471, 257258, 244401, 154482, 24488, 352345, 505606, 475077, 551844, 617849, 634098, 548162, 382606, 74515, -42788, 115453, 432404, 435081, 506680, 558714, 233005, 91666, 317195, 299732, 104182, 120329, -13903, -307859, -450464, -777809, -778316, -521141, -204174, 293596, 570093, 569546, 143683, -467757, -607306]
15302f07306r3293p1770o4080o8041J02877K43624J79368k0796j01731O8666R7678
15291c34804M45085J10653j19656Q4209j33237k22112l35940L7774L12056Q8159
15281f7813J1398j95674k01113k14716m02761j18258M1701M31027Q61029M11090
15271E55910j42902k67175j0444k0509J44066L60432p2113j10878J6379k35977
15261B16789o17679m84320J48433N22967N35510L90187K88063n9966j62579j06338
15251F71067m49335n02694k18912k44687J27130K66831j30152L7351J28257r2104
15241d07248l4475N01968K41954k84607j03688J410k00680J39385j2018R756j65712
15230c13955j77306q41M6654K03274J98340L50495P2643l26207l64338j74162
$$ y = [-607306, -700599, -772369, -836449, -904490, -801613, -557989, -378621, -399417, -501148, -432482, -334804, 110281, 220934, 101278, 185487, 52250, -169862, -505802, -468028, -155972, -67813, -56415, -252089, -453202, -667918, -1070679, -1188937, -1147236, -716209, 144820, 555910, 413008, 145833, 135389, 114880, 258946, 619378, 547265, 436387, 452766, 216789, -400890, -885210, -736777, -213810, 321700, 711887, 999950, 939984, 777405, 671067, 221732, -280962, -499874, -744561, -617431, -350600, -480752, -443401, -315144, -407248, -441723, 60245, 302199, 17592, -86096, -84686, -285366, -145981, -157999, -148243, -313955, -491261, -492102, -445448, -242174, -43834, 306661, 379304, 53097, -311241, -485403]
15220d85403j34644J30377K38553J8071J78820R3111k47872l15695j29846j22321
15210g76849j20561P3231k28236l3579L66119K41275R3438L63014m781j30407
15200a57336l50258K1285L50394j09480l56287j96301j23237J13567N8373K2133
15190g27147J72171L91340M55189L01664L8093j15169O5128L10029Q8339k72039
15180G07598m46135k44887k58901o1542M2767J82838k55482l34848R533L4140
15170f24919K97063M46497K68440J41250l35009n39861m25196k42666O13979O60659
15160B60237L74200J79708N2347m75780p22334n86972k41414l4179n66806k21778
15150a982771L82708N76579N19761l1343k81228J21807P2326j58578K18298M12589
$$ y = [-485403, -620047, -489670, -251117, -233046, -54226, 38885, -208987, -524682, -654528, -776849, -897410, -824179, -1052415, -1085994, -719875, -478600, -385162, -22148, -26929, -157336, -507594, -486309, -135915, -245395, -601682, -797983, -921220, -807653, -749280, -727147, -554976, -163636, 291553, 593217, 631310, 516141, 581269, 891298, 979637, 707598, 261463, 16576, -242325, -303867, -261100, -78262, -333744, -668592, -659059, -624919, -327856, 118641, 387081, 528331, 193322, -346539, -771735, -1014401, -400422, 260237, 634437, 814145, 866492, 390712, -331622, -918594, -1160008, -1194187, -1760993, -1982771, -1600063, -1023484, -503723, -535066, -816294, -694487, -622161, -780739, -562441, -149852]
15140a49852K05866j34403j45499j47018M8946n5623l01171j2416j93188m791
15130h89149K80551K46891l12844o26577k11560R1779M44084M86204l4991n90991
15120a116603j23124O96832P86904L17838K4276j69558j36514m8952J33900k2463
15110C42536j24365j26934K97225K53622J98171K92695P9661n77766p52287k26383
15100c43825L4365p4399k46456k85447K88589P12744M17192k89776o31303p9189
15090d97505K52906P0042R683P3985j84480k04306M7322K8427n6659r0154m6986
15079e97725q5093k9839M95608P81239K41847k00497l76781k84700j96434k15105
15069d67480K37523J24615J97342O6417l49430l18590k68122j20238M4449j98908
$$ y = [-149852, 56014, -78389, -223888, -370906, -321960, -377583, -678754, -691170, -884358, -889149, -608598, -361707, -674551, -1301128, -1512688, -1420909, -976825, -490621, -525612, -1116603, -1239727, -542895, 244009, 561847, 586123, 416565, 280051, 231099, 364999, 342536, 218171, 91237, 388462, 642084, 840255, 1132950, 1212611, 634845, -117442, -343825, -309460, -383859, -630315, -915762, -627173, 85571, 502763, 212987, -418316, -497505, -244599, -174557, -164874, -90889, -275369, -479675, -432353, -403926, -460585, -550739, -597725, -682818, -712657, -217049, 564190, 806037, 605540, 228759, -55941, -252375, -467480, -229957, -105342, 92000, 158417, -191013, -509603, -777725, -897963, -853514, -1052422]
15059a052422J45030K22712L2145K7716j48753K90945M47601m4291k5165M9382
15049e5100j42066k23849j46392j7214J80526Q0759J40527Q5090j42307k14634
15039d54660k50844M9271K03587J82391J85703L13277M29512M248n96749k95493
15029b29757L04440K28290J77978J90894l36919n32007j78519k8885L52952K35145
15019A83612p6677K65323m2362k59204j44905l22627n11931k47922J23987J27903
15009i04803J54543K59739J28811J303o6218l7402j19868J61794L0587j86688
14999e78202Q5676L17690L73777L50916n7408j19815n4929O7151k71711n20960
14989d07815n87930m05877m52028k7133L82651M63577L53073l6358l2162J46365
$$ y = [-1052422, -907392, -684680, -652535, -624819, -773572, -482627, -35026, -79317, -104482, -55100, -197166, -421015, -567407, -584621, -404095, -323336, -182809, -97719, -240026, -454660, -705504, -656233, -452646, -270255, -84552, 228725, 658237, 662485, 65736, -229757, 74683, 302973, 480951, 671845, 334926, -197081, -375600, -404485, -51533, 183612, 106935, 372258, 329896, 70692, -74213, -396840, -908771, -1156693, -1032706, -904803, -750260, -490521, -361710, -360407, -426625, -464027, -583895, -422101, -391514, -578202, -492526, -174836, 198941, 549857, 492449, 372634, 317705, 384856, 113145, -407815, -995745, -1401622, -1853650, -1880783, -1498132, -1034555, -681482, -717840, -750002, -603637]
14979f03637M66213K35532J08522M8861P7708j19649j70163j92331l57674J08079
14969c98539J80675q2420O6031L34474L64883j00225m8477l00326m59786k35050
14959f78760l43039R672K5234N2487J10636j81965k94711L31908N75222M6538
14949c46778p48860k80091R0770L282l92582j69788L22849L36063J45549j80019
14939a219605K14605M16325J22782j65725l77918m37221l3995l30266l40213J45551
14929b005680M25229K16868M29013Q82472N35598R15l20132n51930j84548M89598
14919h2597L66679j3985l17401k08760l05537J25044L26795J49214K25818L13877
14909E79147j3285m53137m32208L7351K22058J8138m04752m45425r9045K73787
$$ y = [-603637, -137424, 98108, 206630, 255491, 333199, 213550, 43387, -148944, -506618, -398539, -217864, -300284, -234253, 100221, 465104, 364879, 316402, 16076, -443710, -678760, -1021799, -1012127, -986893, -934406, -823770, -1005735, -1300446, -968538, -393316, -346778, -1095638, -1375729, -1284959, -1281677, -1674259, -1844047, -1521198, -1185135, -1039586, -1219605, -1005000, -588675, -465893, -631618, -1009536, -1446757, -1480752, -1811018, -2151231, -2005680, -1580451, -1363583, -934570, -52098, 483500, 484415, 164283, -387647, -572195, -82597, 284082, 270097, -47304, -256064, -561601, -436557, -109762, 39452, 265270, 579147, 565862, 112725, -319483, -282132, -60074, -41936, -446688, -892113, -991158, -717371]
14899g17371J72639k91848o0532K32742N2029m00964l17642L50431P97778L84401
14889B01663j23272j03919k60249n21095l48032j45181J59572K23382j77867l50998
14879a445996j11503L29913N18504J85001P4542L1067l3448Q0043j68850O5999
14869d74728j21667k37246J14622M49914j10334m26795J39410M32848K50667J00670
14859A17361J27901k98607l84240l47226q0860K24274K10227k18966k6167P9887
14849e96416j03887j42110q4350J1217K80952j53837k4441M02419M18168q6j40964
14838a33335j24678l3263J58913J23269j60051R9047l46090p25205j77487J85591
14828a133289J65249j08946K47683O01843K86416M9938J01545J12787o2643l10790
$$ y = [-717371, -544732, -836580, -897112, -664370, -612341, -1013305, -1330947, -980516, -182738, 201663, 78391, -25528, -285777, -806872, -1154904, -1300085, -1140513, -917131, -1094998, -1445996, -1557499, -1227586, -709082, -524081, -449539, -418472, -451920, -371877, -540727, -474728, -596395, -833641, -719019, -269105, -379439, -806234, -666824, -233976, 16691, 117361, 245262, -53345, -437585, -784811, -865671, -641397, -431170, -650136, -676303, -596416, -700303, -842413, -926763, -915546, -634594, -788431, -812872, -410453, 7715, 7629, -133335, -258013, -291276, -132363, -9094, -169145, -70098, -416188, -1141393, -1318880, -1133289, -968040, -1076986, -829303, -227460, 58956, 108894, 210439, 323226, 260583, -50207]
14818e0207n91858q3049K07411j46158o7852L34627K41466k37164l18873j6602
14808g28259j95898m63224j3145K16746K36657J6714l7612J48921L12529J80256
14798c26315j21113m5023Q9552o2648J43948O0225K48411j9997k21813K1823l56931
14787e89881n28232q3802O6624K3609K53857J62344M045l01220m27895M56637
14777i63914Q28616K82718K27096K59479j15145r1819J50329p0896m84564m2493
14767b0593K14377M0384j13849J37341M06419R053P2254J05065N0193j03675k45472
14756E51497n27000l47108k0164J63113J19138O9684L31986J88551r3484j87140
14746B49073K87306L12460n5835j43100k06370j22697P6353j38634l54253j12505
$$ y = [-50207, -642065, -725114, -517703, -663861, -731713, -397086, -155620, -392784, -711657, -728259, -924157, -1387381, -1400526, -1183780, -947123, -930409, -968021, -819100, -506571, -326315, -447428, -492451, -402899, -465547, -321599, -261374, -12963, -32960, -254773, -232950, -589881, -1118113, -1201915, -1135291, -1111682, -857825, -695481, -691436, -992656, -1420551, -963914, -135298, 147420, 374516, 633995, 518850, 427031, 577360, 506464, 21900, -20593, 193784, 234168, 120319, 257660, 664079, 673132, 745386, 850451, 900644, 796969, 551497, 24497, -322611, -342775, -179662, -60524, 9160, 341146, 529697, 436213, 249073, 536379, 848839, 793004, 649904, 443534, 320837, 397190, 258556, -95697, -208202]
14736b08202o9286N0205M49827M50985L67896k6959k80047j56819k66473J38258
14726D49385K89374l1j82275p5775K26431k35153l88753m08453n12638J9880L45070
14715d72938J66936j7408K21306N03434N54186J02670K2084L0151j5279j96012
14705H99130j78097l62992j96394j39971l62066m30131o0966L07737J17735j92431
14695e98446q1759j00013J3427L41656L56379J2719j77780j39478j53740R0502
14685d36533K12891K92409K11922J32233J62084k74853k17275k17765l03268K34882
14675b03273N86303M74144P3740Q0358K08233L5486R977k4932m58931o29115k57953
14664a05963j48065P1173j3613p9418k2221N7835j01831j91236J05530K25166
$$ y = [-208202, -277488, -227283, 222544, 673529, 1041425, 1014466, 734419, 577600, 311127, 449385, 738759, 738728, 556453, 480678, 707109, 471956, 83203, -325250, -837888, -818008, -472938, -306002, -323410, -102104, 401330, 955516, 1058186, 1080270, 1110421, 1095142, 899130, 721033, 358041, 161647, 21676, -340390, -770521, -831487, -523750, -406015, -598446, -680205, -780218, -766791, -425135, -68756, -56037, -233817, -373295, -527035, -436533, -223642, 68767, 280689, 412922, 575006, 300153, 82878, -134887, -438155, -203273, 383030, 857174, 930914, 1011272, 1219505, 1254991, 1264968, 1240036, 781105, 151990, -105963, -254028, -182855, -196468, -275886, -298107, -240272, -342103, -533339, -427809, -202643]
14654b02643j06230k17597Q6392n4711J51898J35952k32155l01535j06454J83711
14644f63372L88818L96448j50946j20307j85433j28519l35095l98137K29510N14824
14634d52209J66684J49567L30808K92593L62567J44459l13483m14992j83226R2969
14624A75737J34372j77387l44918l15511k34982k18510P9702M04228L49222K65994
14614A17947k897m61431m23257k1129L92886K89312Q1983k37800j57618o2052
14604d84056p868k07049J759k9838K50087N26376M50107K75116J52323J04208
14594A031165j36392k02387J5229m9788k12386o9355Q2957M52745J75376m20781
14584F66383n97710k81030L72897L68218J51611L9300k9191j84898l90064m48426
$$ y = [-202643, -308873, -526470, -440078, -494789, -342891, -206939, -439094, -740629, -847083, -663372, -274554, 121894, -29052, -149359, -334792, -463311, -798406, -1196543, -967033, -452209, -285525, -135958, 194850, 487443, 850010, 994469, 680986, 265994, 82768, 175737, 310109, 132722, -212196, -527707, -762689, -981199, -901497, -497269, -148047, 117947, 115050, -346381, -769638, -790767, -397881, -108569, -26586, -264386, -422004, -484056, -491924, -698973, -697214, -727052, -476965, 49411, 499518, 774634, 926957, 1031165, 894773, 692386, 707615, 657827, 445441, 376086, 459043, 911788, 1087164, 666383, 68673, -212357, 160540, 528758, 680369, 719669, 690478, 505580, 115516, -332910]
14574c32910m51144j49411K52055L25887J23739K20214P0902L1041k57566n53777
14564g20970k96311k8535K74208L68560N12755L39521M56530L69563p3979n07285
14554F94057j65970j43321k41368N97362O01522k02067m69116k03782k8633K62053
14544G00737J12311K00209j35795l59629k6931j28510j08005k79751l77195n06389
14534i08948m6848J57353j45517n9335J45487R9595K19598K77844l924k15939
14524d80634J42317R2051j48836k91669L3752M0057o6937J73669k41037k01427
14514i48694K99030M42931n523p05977n74836r817K67565K03018N2879M88864
14504d90560M33662J6472O1995J88397K61959K41385k15237m87201k43757L02586
$$ y = [-332910, -784054, -933465, -681410, -355523, -231784, -11570, 59332, 90373, -167193, -720970, -1017281, -1045816, -771608, -403048, 109707, 449228, 905758, 1275321, 1201342, 694057, 528087, 384766, 143398, 740760, 1342282, 1140215, 671099, 467317, 438684, 700737, 813048, 1013257, 877462, 517833, 490902, 362392, 254387, -25364, -402559, -908948, -955796, -798443, -943960, -1003295, -857808, -758213, -538615, -260771, -264695, -480634, -338317, -246266, -395102, -686771, -653019, -612962, -679899, -506230, -747267, -948694, -649664, -206733, -212256, -918233, -1493069, -1502886, -1235321, -1032303, -979424, -490560, -56898, -40426, 21569, 209966, 471925, 713310, 498073, 10872, -232885, 69701]
14494F9701J63089l55088j65924J08746m14361m94272P4154M50588N92127N4211
14484H2971k77470k35662j39562j30562k61019N0429L05081q6221J20258l871
14474e75628Q7513K50986K95658K26979J81500K36375l46780n49621k01953k39572
14464f34543j27885K49402L06360K9992q4503L6931p718N1802k92330l09084j9484
14453h01060o1632L1934m9031m38601j11735N79524K28174O8766M73559M66824
14443C86722N34838K19173l45647J7827L8871m40210o00593m29956J04003r0339
14433f05311K1340N39194L22100k20019k75773J19457R3019l1524R0470J41288
14423A94241R6233n2910k56289j9454L77823L76333m61358p79787l56251L96317
$$ y = [69701, 232790, -122298, -288222, -179476, -593837, -1088109, -1013955, -563367, 28760, 82971, -194499, -430161, -569723, -700285, -961304, -910875, -605794, -692015, -571757, -575628, -488115, -237129, 58529, 285508, 467008, 703383, 356603, -193018, -394971, -634543, -762428, -513026, -206666, -176674, -261177, -224246, -231964, -180162, -472492, -781576, -801060, -862692, -830758, -879789, -1318390, -1430125, -850601, -622427, -553661, -80102, 386722, 921560, 1140733, 795086, 812913, 851784, 411574, -189019, -618975, -514972, -605311, -583971, -44777, 277323, 57304, -218469, -99012, -5993, -37517, 52953, 194241, 290474, 237564, -18725, -38179, 339644, 715977, 254619, -525168, -881419, -485102]
14413d85102Q66344K11208k18300m9532j83524k51074j31493m6783j01346M55818
14403F6216M99535K28626j04211j68680l0663j41782p09139m45283K54008M27360
14393a24013L44009k6097J57867J61441L96555k0315l40422j34458k7226L5208
14383D22549m43023j45089L72515p4143l69426M2511M15770k05908m72994k18542
14373f75780J62843K72440M79614M69328R564l95616o4234j63268m49540n28451
14363h83100j86155j4126K07561N15502M40740J47937r6430P2026P54606P79621
14353A738182l41634m03295j80059j98989k04598k24360O8531n3266k53585j35267
14343a88340k1686K71327L75297n7697j60738j76610r9497l6063k07750k93481
$$ y = [-485102, 381242, 592450, 374150, 324618, 141094, -109980, -241473, -288256, -389602, 66216, 565751, 794377, 690166, 521486, 490823, 349041, -360098, -805381, -551373, -124013, 219996, 193899, 351766, 513207, 909762, 889447, 549025, 414567, 387341, 422549, -20474, -165563, 206952, 132809, -236617, -194106, 221664, 15756, -457238, -675780, -512937, -240497, 239117, 708445, 718009, 322393, 258159, 94891, -354649, -883100, -1069255, -1083381, -875820, -360318, 80422, 228359, 131929, 203955, 958561, 1738182, 1396548, 993253, 813194, 614205, 409607, 185247, 253778, 200512, -53073, -188340, -210026, 61301, 436598, 378901, 218163, 41553, -57944, -94007, -301757, -595238]
14333e95238J0189K14342K08030L21788J31216J39963K5701j29077j28226l16372
14323a17684J90349J93544j45590k99876j76277k02934l39214K31501L73484J0708
14313b81989J13136L79860K43752j37853l83071j58512Q9430j05601o9218j9684
14303c29750l48791K65070N72171K23908l30047l70383j14921q7173J49806K78133
14293i1977L19451Q752k27505J15059J6420l7133J44173j13447J2649R0245j96390
14282D0297n93490n62142q3340L26931N17974Q02481M50842k68322o05481n39956
14272e14206k83181j60252m71486m49963j71620L97653K61698q9279o1938R3266
14262a449308L24751L47791N24675K17219m01439j2517M12333l4973j32066J17588
$$ y = [-595238, -585049, -370707, -162677, 159111, 290327, 430290, 455991, 326914, 198688, -117684, 72665, 266209, 120619, -179257, -355534, -558468, -897682, -666181, -292697, -281989, -168853, 211007, 454759, 316906, -66165, -224677, -135247, -240848, -310066, -329750, -678541, -413471, 158700, 382608, 52561, -317822, -432743, -519916, -370110, -91977, 227474, 236226, 8721, 123780, 140200, 103067, 247240, 133793, 146442, 236687, 40297, -553193, -1115335, -1198675, -871744, -353770, 448711, 899553, 631231, 25750, -514206, -797387, -957639, -1429125, -1879088, -2050708, -1653055, -1391357, -1480636, -1542574, -1449308, -1124557, -776766, -252091, -34872, -436311, -448828, -36495, -71468, -203534, -85946]
14252h5946j94043n52076j05216K86539K70888Q1514k83948k86082j12370k8573
14242a009313K52116M82488J77443l26714m53700j04690J8063l6816K26331Q9934
14232f84858O0332L72783L48144o8910k88371j01685L0747J62411K26174M4061
14222A00828J867K49166K06457J732J9878k2684N9544K57616j71203n14908k99560
14211a11267q6142J41989K60141L2282k23003l71720l37963k32773N5946J61389
14201g11121J07556n2326n9398K62680L05293j89322m79134L5087L83633L58553
14191c8499R4774P338m05376n18288K50008M83081K50096M9906j25276o7385M56216
14180D36595N26750k25754o55571p07982j25644L44692J20395j48478l8148j00222
$$ y = [-85946, -279989, -832065, -937281, -650742, -379854, -298340, -582288, -868370, -980740, -1009313, -757197, -274709, -97266, -423980, -877680, -982370, -964307, -1001123, -774792, -684858, -624526, -251743, 96401, 27491, -260880, -362565, -331818, -169407, 56767, 100828, 102695, 351861, 558318, 560050, 579928, 557244, 616788, 874404, 703201, 188293, -111267, -197409, -55420, 204721, 237003, 14000, -357720, -695683, -928456, -872510, -711121, -603565, -655891, -715289, -452609, -147316, -336638, -815772, -780685, -397052, -38499, 56275, 63613, -341763, -860051, -610043, -126962, 123134, 173040, 47764, -19621, 436595, 963345, 737591, 82020, -625962, -751606, -406914, -286519, -434997, -473145, -573367]
14170e73367n5457M71680O29230j45307n31983k2031J04014K09922K2522L1607
14160A40830J32996j32221j9458N3472r5123j37425J58582J64370k5237J3493
14150B54279L24208K26036j42721r9471j78601l06935k88509Q7750N10277m1879
14140C44434l72698O0436L50424K85624Q0842l54438l81109Q6583n0935j65511
14130a16348k6021J03787K22459L4093l96539o78092l94223j49294L26353M05469
14120f68356K64198L14852j19581j82642k60644j59344J07584j60027J54787M91510
14110b17663N06683K23691k55293J88198J35475l22872j49831k27250l6995j79977
14100c35834k18774J95139L94531K82468J43746M68125K12334k60259j76409l183
$$ y = [-573367, -628824, -157144, 472086, 326779, -205204, -227235, -123221, 86701, 109223, 140830, 273826, 141605, 122147, 175619, 80496, -56929, 101653, 266023, 240786, 254279, 578487, 804523, 661802, 562331, 383730, 76795, -211714, -123964, 386313, 344434, -28264, 32172, 382596, 668220, 749062, 394624, 13515, 100098, 49163, -116348, -142369, -38582, 183877, 217970, -178569, -856661, -1250884, -1400178, -1073825, -668356, -404158, -89306, -208887, -391529, -652173, -811517, -703933, -863960, -709173, -217663, 289020, 512711, 257418, 445616, 581091, 258219, 108388, -118862, -155857, -335834, -554608, -359469, 35062, 317530, 461276, 929401, 1141735, 881476, 705067, 701884]
14090G01884j01856j71237j26539l1466J56966l99884L2975M0807r1028J6867
14080B7489M7586J09944r3522j62654l2131Q4380K72746J93379q3502J70719N5410
14069E89844l19499l1696o4478j40038K20946j45985m78971j48175j89856j04444
14059h12352N28827M09358K50696J78220o3477l56974m90310m89067P5888K65158
14049e04033L59211K78493l13531n17825k80675K93947O33983L31094m3154j02466
14039A35044n9666j83676j82977j54366k5467r7954o2393R3207l4913j51583J36797
14028e87947n8360j99886q0853J43745L55072J37669J19398l6393k12973j43995
14018e64523O6055k72736M5963L05103M34984K46823j79167j78336k08950k23951
$$ y = [701884, 600028, 428791, 302252, 270786, 427752, 27868, 60843, 101650, 10622, 27489, 75075, 185019, 91497, -71157, -103288, -18908, 253838, 447217, 363715, 534434, 589844, 270345, 238649, 174171, 34133, 255079, 109094, -369877, -518052, -707908, -812352, -283525, 125833, 376529, 554749, 491272, 134298, -356012, -845079, -769191, -504033, -144822, 133671, -179860, -697685, -978360, -684413, -50430, 280664, 237510, 135044, 75378, -108298, -291275, -445641, -471108, -569062, -631455, -538248, -573161, -724744, -587947, -646307, -846193, -927046, -783301, -428229, -290560, -171162, -207555, -420528, -564523, -498468, -771204, -725241, -420138, 14846, 261669, 82502, -95834, -304784, -528735]
14008e28735j06725K0992k18403k92573L5950k6057K7612J82038K79635k96658
13998i22924m60875k06085J71517M94787M21476K43612K13319l2692k46100J13153
13988b10812n4743l30145l16439N1390Q0688M36875R6561r1379K0378k4475j0465
13977c52566O3137l80951p7232M14596J0637o3895o7118K59764J40819k61850
13967c14659j77072k03831n2544J27664J92985m3838q5062P9913l5081k2435J85774
13956c48186j09653p7854L27367K73473K7559j43261n14310m54555l72715r3831
13946a485966M42445P1577j72893Q9272K42376L92946K67911j336K02055Q7950
13936A36337l5485n36980n34841k89820K1243j5189Q5997j73669k30652K6420
$$ y = [-528735, -635460, -614468, -832871, -1125444, -1089494, -1115551, -1087939, -905901, -626266, -922924, -1383799, -1589884, -1418367, -923580, -502104, -258492, -45173, -77865, -323965, -210812, -265555, -595700, -912139, -860749, -780061, -343186, -246625, -338004, -317626, -342101, -352566, -289429, -670380, -747612, -333016, -322379, -386274, -453392, -193628, -52809, -314659, -491731, -695562, -748106, -620442, -427457, -471295, -556357, -476444, -511525, -533960, -348186, -457839, -535693, -208326, 65147, 92706, -50555, -564865, -1019420, -1392135, -1485966, -1043521, -971944, -1144837, -1055565, -813189, -420243, -152332, -153668, 48387, 136337, 100852, -436128, -970969, -1260789, -1239546, -1254735, -1168738, -1342407, -1573059, -1546639]
13926a546639j95647j14278M4604N5909P7969L04742L83458L73162L95524K5283
13916a95913K53686Q7932l91792m82560n15098j18279J08935M4418J36901L04978
13906g66792K39842L15820J99296K17939K15036M8827k74244j71782K65093J57112
13896D46147j02856K83379k9502l70526n8775m3534k64699p4717l28490n3708
13886e97281N48770L74155J64802K46386J27078k56878l51939k10066k03240n8377
13876b16590r3969l71998n82629m15387J01690J88520n6930J68845N01980L83923
13866c92545J25211K82871M83165Q6682k8252j43167q0090n6182q1390j74917
13856B1386J1406K43780j09784j61358R3108M85036L40406k33358n53547j63498
$$ y = [-1546639, -1742286, -1856564, -1811960, -1756051, -1678082, -1373340, -989882, -616720, -221196, -195913, 57773, 145705, -246087, -728647, -1243745, -1362024, -1253089, -1208671, -1071770, -766792, -526950, -211130, -11834, 206105, 421141, 469968, 195724, 23942, 289035, 446147, 343291, 626670, 597168, 226642, 167867, 124333, -140366, -215083, -543573, -597281, -48511, 325644, 490446, 736832, 863910, 607032, 255093, 45027, -158213, -216590, -310559, -682557, -1265186, -1680573, -1578883, -1390363, -1447293, -1278448, -776468, -392545, -267334, 15537, 498702, 585384, 557132, 413965, 333875, 277693, 196303, 21386, 32792, 276572, 166788, 5430, 98538, 583574, 923980, 690622, 137075, -26423]
13846b6423k28247m48941J2441P24763N15551k9417q0257p3417k68176j86743
13836h8866j55929l6798J69874M48797L15331k89512m90962l40168n0027l56989
13826h75249k96999k0708K47079K87661J02458l24518l56044P9228L19661M39731
13816c97700J38711k61713k82809j14768j48383Q8382K3377k6313K53166P7399
13806f50651q6840O4697n422j12983K37031J27505j04726L3645n6836k46199k02210
13795a002989J14620M38294K04842n0218K10028L48919M24946k12408j77619k43010
13785E5405k16843P6793R083k55248k29299L67759M40033J11428k62863q5372
13775A0876P4953j50941j55458J76484N142l10570j22964J73300K65704K30080
$$ y = [-26423, -254670, -703611, -691170, 33593, 549144, 519727, 439470, 366053, 97877, -88866, -244795, -281593, -111719, 337078, 652409, 362897, -128065, -468233, -518260, -875249, -1172248, -1192956, -945877, -658216, -555758, -880276, -1236320, -1157092, -837431, -397700, -258989, -520702, -803511, -918279, -1066662, -978280, -954903, -981216, -728050, -650651, -737491, -672794, -678216, -791199, -554168, -426663, -531389, -497744, -554580, -800779, -1002989, -888369, -450075, -245233, -295451, -85423, 263496, 688442, 476034, 298415, 55405, -161438, -84645, -75562, -330810, -560109, -192350, 247683, 359111, 96248, 10876, 85829, -65112, -220570, -44086, -38944, -349514, -472478, -299178, -33474, 196606]
13765A96606k54063l14179l62477k35676J86093J29450K65846K84275K67893K98427
13755D62195J68368j26337j77849p7221k9666j01773m12687n37620j66010J07382
13745h91218J29140K25888J32202L28713K40684J17641O5882k0137m27651l22285
13735d21141k07976K72178O24751L07653q591j17089k97352o81284k65528M61750
13725c32629L53646j60997j66967L67317O10338K72990k10652k14643o81814m41781
13715f05192J52924O7085k63137J93268K15816k86087l56530j36363R4936K78468
13705f44812N30873L58405P9415m01569l81096J92888P3466p0036k47092l53850
13695h63408m0920L6754R0828K35665L3113k59746r0061M21448J90141k4912j37215
$$ y = [196606, -57457, -371636, -734113, -969789, -783696, -654246, -388400, -104125, 163768, 462195, 630563, 504226, 326377, 249156, 219490, 117717, -294970, -832590, -998600, -891218, -762078, -536190, -403988, -75275, 165409, 283050, 348932, 328795, -98856, -421141, -629117, -356939, 267812, 575465, 566874, 449785, 152433, -528851, -794379, -332629, 21017, -139980, -306947, 60370, 670708, 943698, 733046, 518403, -163411, -605192, -452268, -385183, -648320, -455052, -239236, -525323, -881853, -1018216, -923280, -644812, -113939, 244466, 323881, -77688, -458784, -265896, -192430, -262466, -509558, -863408, -904328, -867574, -776746, -541081, -507968, -767714, -857775, -436327, -246186, -271098, -408313]
13684d08313N30048M54721m26875l80479o6171r8067L3872P5824M1009j31676
13674c76107k78495j33688R2641j31106l67048P9744L67228K79953L48598L93980
13664B75700J22002J04512o8935J75607K53707J20901k32317m66657j81190M76050
13654E79380L77038l72296n25241m11661J5825M84149K46873n5637j15127J51525
13644C74828O5399J55980n1510J54999L4203Q3834k26783m18931j43886P2282
13634A00415k18947k09485N7162L4711M11131j2860m48812m96103j88821m0965
13624a012574M27255J63627J49969M15834J78321K02702M6008j14043m33269j80088
13614a56258M73094N00065K63589l12614p27718j0434K27285L40369k07783o78615
$$ y = [-408313, 121735, 576456, 149581, -230898, -297069, -395136, -361264, -285440, -244431, -376107, -654602, -788290, -695649, -826755, -1193803, -1114059, -746831, -466878, -118280, 275700, 397702, 502214, 433279, 608886, 862593, 983494, 751177, 284520, 103330, 579380, 956418, 584122, 58881, -352780, -336955, 147194, 394067, 338430, 223303, 374828, 440227, 596207, 544697, 699696, 733899, 817733, 590950, 172019, 28133, 100415, -118532, -328017, -270855, -236144, 174987, 162127, -286685, -782788, -971609, -1012574, -585319, -421692, -271723, 144111, 322432, 525134, 571142, 457099, 23830, -156258, 316836, 816901, 1080490, 767876, 40158, 29724, 257009, 597378, 389595, -289020]
13604b89020m07830k84191K00340M91268K91250L2349m4592l78289j12444K15581
13594b85578K60695J29515l14962k38915N7417L72360K86664J80315J08796o2106
13584D94201j25846k84303k44576l43017l24480j44327j17085k50213N69895Q01056
13574C1305J85233j61928m20133m23991p4682N3280K13003O14695N71892K81167
13564H69841j21583j48229l48220N4369K84256q2148k99081k45675j22944j85321
13554c44735O3660K66635J76152q4585q8463n4064k04649k23868j55190J14093
13544e35014J77337K27815L51310J29697j22066L30532L82199n4896l95276m62461
13534B9177m04500j21141J06440K86007R570K02642J78233n6356l04706j88165
$$ y = [-289020, -696850, -981041, -780701, -289433, 1817, 34166, -10426, -388715, -501159, -285578, -24883, 104632, -210330, -449245, -391828, -19468, 267196, 447511, 556307, 494201, 368355, 84052, -160524, -503541, -828021, -972348, -1089433, -1339646, -769751, 31305, 216538, 54610, -365523, -789514, -864196, -810916, -597913, 16782, 588674, 869841, 748258, 600029, 251809, 306178, 590434, 508286, 209205, -36470, -159414, -344735, -281075, -14440, 161712, 77127, -11336, -65400, -270049, -493917, -649107, -535014, -357677, -129862, 221448, 351145, 229079, 559611, 941810, 886914, 491638, 29177, -375323, -496464, -390024, -104017, -94447, 108195, 286428, 230072, -74634, -262799]
13524b62799p1556k80060K8225K11802o7646j74872J38034L57374K36836k5093
13514I0245l1627j62507r7540J55607K67396J5095m72338k83358L69880M61790
13504C12643m7666n64129m93769j72401p7356M25024N91011J1799k07130k77626
13494d99600o5976K44866J34934j5691j23381l26066k2419M08922K3396k84852
13484e25867k2825L92579r329n64715k59673l0304J19595J17848Q9886K06372
13474d86433K27958L54596J00655j72087L09949J35670j81216m83902k81757L43043
13464a33524L600n49077N0477K72637K93753L2571K74535K13657m09995l52422
13454c03788K60801K13764K37481j46980l13168q7266L57413P18355J26060l67402
$$ y = [-262799, -334355, -614415, -586190, -374388, -442034, -616906, -478872, -121498, 115338, 90245, 58618, -103889, -201429, -45822, 221574, 236669, -235669, -519027, -149147, 312643, 264977, -299152, -792921, -965322, -1042678, -617654, -26643, -14844, -221974, -499600, -565576, -320710, -185776, -201467, -324848, -650914, -673333, -264411, -241015, -525867, -548692, -156113, -165442, -730157, -989830, -1020134, -900539, -782691, -692805, -486433, -258475, 96121, 196776, 24689, 334638, 470308, 289092, -194810, -476567, -133524, -129924, -679001, -628524, -355887, -62134, -29563, 244972, 458629, 48634, -303788, -42987, 170777, 408258, 261278, -51890, -139156, 218257, 936612, 1062672, 695270]
13444F95270j27340M41678K32378O7215n36619m14135n8311K90242K47274k87409
13434E50243m03098q0963r7316l2877K71786K67891J18213l16286l07430R2399
13424F2562M15897K43143l91916l34456n2660J76653J18979O3810k02073j83486
13414h3547l22061m90946K67886K88831k09956M6053J22194J14966M3850j83606
13404d06336k36637m36908n9380J63172L36033N40128M04128L50962k46695n12
13394D07955J48870L1777m9753m9587k29163j96781j89970k58012j0873J56535
13384b39002j65403j62300J55634K09219K06095L29991J02365k93173k55149k9161
13374a40884j25188j50219j37616l3641L64855K73458J72186J32540J47967k40598
$$ y = [695270, 567930, 1009608, 1241986, 1309201, 772582, 358447, 300136, 590378, 837652, 550243, 147145, 66182, -31134, -64011, 207775, 475666, 593879, 277593, -29837, 62562, 478459, 721602, 329686, -4770, -57430, 119223, 238202, 302012, 99939, -83547, -405608, -896554, -628668, -339837, -549793, -503740, -381546, -266580, -222730, -406336, -642973, -1079881, -1139261, -976089, -640056, -99928, 304200, 655162, 408467, 407955, 556825, 588602, 538849, 489262, 260099, 63318, -126652, -384664, -395537, -239002, -404405, -566705, -411071, -201852, 4243, 334234, 436599, 143426, -111723, -140884, -266072, -416291, -553907, -587548, -222693, 50765, 222951, 355491, 503458, 262860]
13364B62860m32005k86379j73697K18173M35161L19458J31929j14428k60588k95946
13354a95462k43087j80511m2834R2665k70839j79091M48778N73733M32736p5862
13344C60226k99871j29038J4739L06366K72218k52079m06070L8175P996k05839
13334b93177j13305o5856j67927O5745J83186J54736M09965K21900J3733k65876
13324A43124k02900l01818q5145n1469j71911K46471M86973L28034j38725k95684
13314d3050m5020M02084K96012n5809j88874l45765k03465j1601n9612j98871
13304d53971L96523J42731j3039L22122m6524l98230j5527K67114j06523o6661
13294B8015q8992l8709p560r4915J10255j04845j24181p7032K03404J81982Q156
$$ y = [262860, -169145, -455524, -629221, -411048, 24113, 343571, 475500, 361072, 100484, -195462, -438549, -619060, -661894, -569229, -840068, -1019159, -570381, 3352, 436088, 360226, 60355, -68683, -53944, 252422, 524640, 272561, -133509, -95334, -87338, -293177, -406482, -472338, -640265, -574520, -391334, -236598, 173367, 395267, 409000, 143124, -59776, -361594, -446739, -498208, -670119, -423648, 63325, 391359, 252634, -43050, -88070, 314014, 610026, 554217, 365343, 19578, -183887, -195488, -255100, -453971, -57448, 85283, 72244, 394366, 347842, -50388, -65915, 201199, 94676, 28015, -60977, -99686, -107246, -202161, -91906, -196751, -320932, -397964, -194560, -12578, -4422]
13283d422Q9803k18919l11560J96124K84821O151j12919k67447j52923K77981
13273b13310K61520k71865l7040M07268k15958K424L31955O43407N25045k92461
13263A140985J1724J70228k89254k90622k73660l74641k04460M44837M01040o0498
13253F75679j47805J956J18669k19735l74434l36321O3775K73495K53276k02429
13243A06126m77966J21935N08287K62563j87757p9195k7525K67719J45465j56172
13233D83480K35714J73049R2289j7528l85687p8986J22114l51844l45732K16570
13223A43439P4540j54725L8903j67055j40943L56699J77004j79159k46849j11758
13213b09904j29896L48878M03136K25606O8561j31877j3662m6770k64913N3537
$$ y = [-4422, 85381, -133538, -445098, -248974, 35847, 41998, -70921, -338368, -491291, -213310, 48210, -223655, -260695, 146573, -69385, -66961, 264994, 908401, 1433446, 1140985, 1152709, 1322937, 1033683, 743061, 469401, 94760, -109700, 335137, 736177, 675679, 527874, 529830, 648499, 428764, 54330, -281991, -218216, 55279, 308555, 106126, -371840, -249905, 258382, 520945, 333188, 253993, 226468, 494187, 639652, 483480, 719194, 892243, 984532, 967004, 581317, 502331, 624445, 272601, -73131, 143439, 217979, 63254, 102157, -64898, -205841, 150858, 327862, 148703, -98146, -209904, -339800, 9078, 412214, 637820, 706381, 574504, 560842, 514072, 249159, 302696]
13203C02696j33472j57425m709L05224N00804J19872j03102k38430k94678j97069
13193I9711k50647j84652M0669k7463N241J69973M45247K23259K24644L47120
13183A093102r9151r9138j10739j16315o4228L45J42184P3192k35196j33680K0634
13172D71010K49825J02340j3331J37992k96420l47811O5187J46574J02208K77204
13162H94778N27459R3604l13327j93698k70717Q4344Q6230K63441m2163p9413
13152A050538K31061m1418N9434K92775J59673k72490p42920l64977L53951K93043
13142A018670p3208j73537l3758Q0198k15208j60154M51826K52190N8572P1949
13132A277540J03243N3897n07724m23280J10825J73347j02045q5344J0426K18813
$$ y = [302696, 169224, 11799, 7090, 312314, 813118, 932990, 829888, 591458, 296780, 99711, -150936, -335588, -294919, -322382, -317141, -147168, 298079, 521338, 745982, 1093102, 993951, 894813, 784074, 667759, 603531, 603876, 746060, 819252, 584056, 450376, 471010, 720835, 823175, 809844, 947836, 651416, 303605, 368792, 515366, 617574, 894778, 1422237, 1515841, 1202514, 1008816, 738099, 822443, 908673, 1172114, 1129951, 1050538, 1281599, 1240181, 1299615, 1592390, 1752063, 1479573, 736653, 371676, 725627, 1018670, 945462, 771925, 738167, 818365, 603157, 443003, 894829, 1147019, 1205591, 1277540, 1380783, 1434680, 926956, 503676, 614501, 787848, 685803, 600459, 610885, 829698]
13122H29698K57965P3642J24494j29209l96467N1101j52318k40660J55758J61323
13112G35327l14578k74800o371K63810K60548q0688k29943J22587o0347l55276
13102F0269k72350M0411N5304K41097L71209L65278L65714M7831k28695M34764
13092A480832N20828M57798J96122l94896m95540K1450K80828L7618J60718L81885
13082B647643J73560K0481j56704j58181J4939J12359l14533k02430l37331l79832
13072A419971M30816N47421n5459l51583l32019j29841R0965L42252M25298M04297
13062B792118J17211k67585K6463K71872J60037J63382Q8861k92063K08268L25268
13052C593832K4117j02701n9336N6946N0044P716l7623m18737p45693r6637K36171
$$ y = [829698, 1087663, 1161305, 1285799, 1156590, 760123, 811224, 658906, 418246, 574004, 735327, 420749, 145949, 139578, 403388, 663936, 583248, 353305, 475892, 415545, 60269, -212081, -171670, -116366, 124731, 495940, 861218, 1226932, 1274763, 1046068, 1480832, 2001660, 2459458, 2655580, 2260684, 1765144, 1786594, 2067422, 2105040, 2265758, 2647643, 2821203, 2841684, 2684980, 2526799, 2541738, 2654097, 2339564, 2137134, 1799803, 1419971, 1850787, 2398208, 2342749, 1991166, 1659147, 1529306, 1620271, 1962523, 2387821, 2792118, 2909329, 2641744, 2668207, 2940079, 3100116, 3263498, 3352359, 3060296, 3268564, 3593832, 3617949, 3515248, 3455912, 3512858, 3562902, 3570618, 3532995, 3114258, 2368565, 2271928, 2508099]
13041B508099K20082L10728L05626K62624P56M5383J79587m60810j53961L57138
13031C575252L6492m3435L58385J84254R6981N28712N39412K57127k47000j71462
13021E114718J50502J0932J17367M11669L91140L62225Q31167P99260J038734
13012I227714Q32234j51709n80221m61012o53987j74869P00986M37596k81776
13003H894956J13800P08083R02909R24292N57455P88543N54549M23252Q57394
12994A4725233J184166J868629K078901K177737K696070K648596K987830M053390
12986C4420552M992744O097503P738751R562083J1332136J4042118J7834758K2693096
12978A28713741K9023330L8424711N1106068O5586648P8337141P4662300L7209589
$$ y = [2508099, 2728181, 3038909, 3344535, 3607159, 3607915, 3653298, 3832885, 3372075, 3218114, 3575252, 3611744, 3568309, 3926694, 4110948, 4207929, 4736641, 5276053, 5533180, 5286180, 5114718, 5265220, 5276152, 5393519, 5805188, 6196328, 6558553, 7389720, 8188980, 9227714, 10059948, 9908239, 9328018, 8867006, 8213019, 8038150, 8739136, 9176732, 8894956, 9008756, 9716839, 10619748, 11544040, 12101495, 12890038, 13444587, 13867839, 14725233, 15909399, 17778028, 19856929, 22034666, 24730736, 27379332, 30367162, 34420552, 39413296, 45510799, 53249550, 62811633, 74143769, 88185887, 106020645, 128713741, 157737071, 196161782, 247267850, 312854498, 391191639, 465853939, 503063528]
12971E03063528k4110576o8905361p8482324o7766495n3294361m1016539l1196087
12964A38291785k3831392j8354417j4649261j1741488r438376p848730o089476
12957D6338645n023775m516498l562399k480367k115172k448176k631486k205340
12949B1355432j501694j252639j428693r34812n33091n17194n89764n40573n07076
12940A3549896n68188o44812o38677k91876J43068K63088l5376o02582l98860
12931A0775681J5000K06589K32693K55256K87742K31869l2218J9258L32381K89418
12921A2613669M82367O33579P79673J268107J574960K178331K687551K324893
12913B4543130J326013j10873j226363j137919o10049n87337j11946Q05867R23470
$$ y = [503063528, 478952952, 410047591, 331565267, 263798772, 210504411, 169487872, 138291785, 114460393, 96105976, 81456715, 69715227, 60276851, 52428121, 46338645, 41314870, 36798372, 33235973, 30755606, 28640434, 26192258, 23560772, 21355432, 19853738, 18601099, 17172406, 16237594, 15704503, 15187309, 14597545, 14056972, 13549896, 12981708, 12336896, 11698219, 11406343, 11549411, 11812499, 11777123, 11174541, 10775681, 10790681, 10997270, 11229963, 11485219, 11772961, 12004830, 11972612, 11991870, 12324251, 12613669, 13096036, 13729615, 14509288, 15777395, 17352355, 19530686, 22218237, 24543130, 25869143, 25758270, 24531907, 23393988, 22783939, 22196602, 22084656, 22890523, 23813993]
12904B3813993J461983K233920L003313L630671M133816M909529O201745P940254
12896E7329224R925782J2021916J5117172J9171312K4439595L1465726M1945457
12889B11416184N5912473P1620858Q2439497P0329401K0767041m2886665p8140075
12882C91458714p8850998o4816121m9701552l7248381k8071189k1374802j6312618
12875I5083053j2840181j0368976q087680n710994m292430m376024m136107l900595
12867D1370066m910512m600626l286260k387695j627577j546969j892175j556364
12859A9561888q63351p30373r28003j021136o11181n29504r64813o68490l48881
12850A2896156j72504k54189j044933p80272p8359k79362J15034K18899r9504
$$ y = [23813993, 25275976, 27509896, 30513209, 34143880, 38277696, 43187225, 49388970, 57329224, 67255006, 79276922, 94394094, 113565406, 138005001, 169470727, 211416184, 267328657, 338949515, 421389012, 491718413, 512485454, 469598789, 391458714, 312607716, 247791595, 198090043, 160841662, 132770473, 111395671, 95083053, 82242872, 71873896, 63786216, 58075222, 53782792, 49406768, 45270661, 41370066, 36459554, 31858928, 28572668, 26184973, 24557396, 23010427, 21118252, 19561888, 18698537, 17968164, 17040161, 16019025, 15407844, 14878340, 13913527, 13245037, 12896156, 12723652, 12469463, 11424530, 10644258, 10565899, 10286537, 10401571, 10620470, 10520966]
12841A0520966k1841K53680j8969J53585N39375L4623p5181J31915K13075J65014
12831A1896242j18741L4077M49294M07911M56853L06751N25055O79244J020526
12822A5657212J241038Q64729J084162J348399J776626K105712K247248L099549
12814B9424675L973892M897935N645203O828030Q746227J0777911J2851496J6308927
12806I9454296K0796449K6151727L4199680M5409572N9832894P4718177P9604669
12799D40167464N6469703L19713n5705908p9020069p4268949n9449412m5351084
12792A83161458l4415677k6377530k0142791j6077461j3194963j0466187p951608
12785E4535241o603443n683443m903856m253864l281877k540795k030152j660729
$$ y = [10520966, 10499125, 10752805, 10733836, 10887421, 11426796, 11461419, 11386238, 11518153, 11731228, 11896242, 11777501, 11811578, 12260872, 12668783, 13125636, 13432387, 13957442, 14636686, 15657212, 16898250, 17762979, 18847141, 20195540, 21972166, 24077878, 26325126, 29424675, 33398567, 38296502, 43941705, 50769735, 59515962, 70293873, 83145369, 99454296, 120250745, 146402472, 180602152, 226011724, 285844618, 360562795, 440167464, 496637167, 496956880, 441250972, 362230903, 287961954, 228512542, 183161458, 148745781, 122368251, 102225460, 86147999, 72953036, 62486849, 54535241, 47931798, 42248355, 37344499, 33090635, 29808758, 27267963, 25237811, 23577082]
12777B3577082j844437k066054j641902j522120j466520j426421j093113n37019
12769A1979496o66170j035680p81152l78372l56527l15260k41133k8127k54328
12760G922747k70926j60756m21793j013326q82306o84531j74348L65297J05521
12751D785579R5628L30711M72543K44715J96068L0611k75363n09930n56038o99053
12741D115471p45983m58712l94998l44927k14928J17981K25735P2876O2982L0474
12731B465971K02535K4629j5585j83691n19232l137O57799O93772K27019l18039
12721C232041k78942j34682j37904K07740J03217n05030p08699k53612L93800
12712A917929M45952Q2619k23905L5655K82102j35995k24150o6603p6110K8096
$$ y = [23577082, 21732645, 19666591, 18024689, 16502569, 15036049, 13609628, 12516515, 11979496, 11313326, 10277646, 9496494, 9118122, 8761595, 8446335, 8205202, 8177075, 7922747, 7651821, 7491065, 7069272, 6055946, 5173640, 4489109, 4314761, 4680058, 4785579, 4881207, 5211918, 5684461, 5929176, 6125244, 6155855, 5880492, 5370562, 4814524, 4115471, 3369488, 2910776, 2515778, 2170851, 1955923, 2073904, 2299639, 2372515, 2435497, 2465971, 2668506, 2693135, 2677550, 2493859, 1974627, 1971490, 2629289, 3323061, 3550080, 3232041, 2953099, 2818417, 2680513, 2888253, 2991470, 2486440, 1777741, 1524129, 1917929, 2363881, 2446500, 2222595, 2258250, 2540352, 2404357, 2180207, 2113604, 2037494, 2065590]
12702B065590l43728m89749l45976P4818K06622L31743N6195n26447j97437L55501
12692A187132K05115l10312l54374l0823K35883j58271k21332J55091J58112L4257
12682I00478J70093M4330J18930J91245P47240L08805j86178l85426j05021q0758
12672A723738m72233l86639j00030M8841Q911K24249J93132O6426J76585L98476
12662A881456O5083k03519j02640J98383l28888p03779n43118m20904L97926N26909
12652G66909J25255L2020K70777J02983k09396l56034l51251l47674j0349L00100
12642C23340L17717K33508O8859N7157k04889l38664J20431L64247K81417J61567
12632A384690m26853l80039J631j36890q9469K25940J49172K00207j37126j28317
$$ y = [2065590, 1721862, 1232113, 886137, 960955, 1167577, 1499320, 1555515, 1029068, 831631, 1187132, 1392247, 1081935, 727561, 696738, 932621, 774350, 553018, 708109, 866221, 900478, 1070571, 1114901, 1233831, 1425076, 2172316, 2481121, 2294943, 1909517, 1804496, 1723738, 1251505, 864866, 764836, 813677, 822588, 1046837, 1239969, 1306395, 1482980, 1881456, 1946539, 1743020, 1640380, 1838763, 1509875, 806096, 262978, -157926, 240000, 766909, 892164, 924184, 1194961, 1297944, 1088548, 732514, 381263, 33589, 23240, 323340, 641057, 874565, 943424, 1000581, 795692, 457028, 577459, 941706, 1223123, 1384690, 957837, 577798, 579429, 442539, 353070, 579010, 728182, 928389, 791263, 662946]
12622F62946q4828k89702J33902M38709K40199O8386j88498m43878m43643M7503
12612A41096K46053k24230k57723J53503r6133K05760J43981K4031Q970K17844
12602E63152L07405K73397m21104o08234L3890J86867p8009P7911l1888k8066
12592B75321j22428l15014N4472K39712r7997k73093p9788j62239l83747J4885
12582h49916M55315k0992J25440N27047J60143j8073k47129r2637Q8309J19811
12572B47318j67462m14736p5186K93233m795J26989K4127j92860j69269j81104
12562e13745l47956J24706K63901J24612J85016J62795J95821O4518J85193J6902
12552D61763R4349M58223q3726n98737l97898O748J67669Q0898j26239o1063J89087
$$ y = [662946, 578118, 288416, 422318, 861027, 1101226, 1169612, 981114, 537236, 93593, 141096, 387149, 162919, -94804, 58699, -37434, 168326, 312307, 336338, 345308, 563152, 870557, 1143954, 722850, 114616, 148506, 335373, 257364, 335275, 303387, 275321, 152893, -162121, -107649, 132063, 34066, -239027, -318815, -481054, -864801, -849916, -394601, -415593, -290153, 236894, 397037, 378964, 131835, 39198, 127507, 247318, 79856, -334880, -410066, -116833, -121628, 5361, 29488, -163372, -332641, -513745, -861701, -736995, -473094, -348482, -163466, -671, 195150, 259668, 444861, 461763, 556112, 1014335, 930609, 331872, -66026, -59278, 108391, 189289, 63050, 1987, 191074]
12541A91074k21197k05359j6163J72404K13189L74776Q1203P6842J7925j85192
12531D99502m7080l591J92213k39873k67577k41684k87754j4617J28319M94398
12521B12256K97535k87992j06303O4566j66807j70067k03475k05637k1514J16392
12511d71046J58467L59342l3849K07805P66299J48674m10777l64562K11295M82402
12501A054050L05160L44382M62588L32922K20871M33714O48291L4194r10365j018264
12491A907543o89808p77845o30161k87954j12419N1240J59469L38852K77553K85719
12481E22189k3159j8116M4895K4181j01923j62374n7198o1576k17715J4155J11664
12470G5023K01980J07189P635j41419l78830m00237K07339N60636M58837N41038
$$ y = [191074, -30123, -235482, -251645, -79241, 133948, 508724, 589927, 666769, 684694, 499502, 452422, 448831, 641044, 401171, 133594, -108090, -395844, -410461, -282142, 212256, 509791, 221799, 115496, 180062, 13255, -156812, -360287, -565924, -587438, -471046, -312579, 46763, 12914, 220719, 987018, 1135692, 724915, 360353, 571648, 1054050, 1359210, 1703592, 2166180, 2499102, 2719973, 3153687, 3801978, 3836172, 2925807, 1907543, 1217735, 439890, -190271, -478225, -590644, -539404, -379935, -41083, 236470, 522189, 499030, 480914, 525809, 549990, 448067, 285693, 228495, 166919, -50796, -36641, 75023, 277003, 384192, 391827, 250408, -128422, -528659, -321320, 239316, 698153, 1239191]
12460A239191J32151L65851L4890m80018r3228k98311m35080m87482P9595M04011
12450D61570j07429j21145L55786M79031j72501m44188k3631J68026N93206J95529
12440A384254L5679n8072j61471m0780m9973j77736k68242k09184J89936O46643
12430A291054J50323k62745k11225k33087j16405J03650J70601K3282k48333l54941
12420C12174m90281o30338m23904j25599R804M65705O69488N62143K56211m97451
12410A07952n68673j22607L04507K57714k74916q9398k78955K31320L36565j65457
12400b61948o1669O2932J82375K79241J92222R0503r4723k52134j3535K89670
12390D12934K61208K24604N5308j83130l64881m00898j21582O4386J09159J70626
$$ y = [1239191, 1371342, 1737193, 1772083, 1292065, 1198837, 900526, 465446, -22036, 57559, 461570, 354141, 232996, 588782, 1067813, 895312, 451124, 427493, 595519, 1188725, 1384254, 1419933, 1361861, 1200390, 1159610, 1109637, 931901, 663659, 454475, 644411, 1291054, 1441377, 1178632, 967407, 734320, 617915, 721565, 892166, 915448, 667115, 312174, -178107, -808445, -1232349, -1357948, -1348144, -882439, -212951, 349192, 605403, 107952, -460721, -583328, -278821, -21107, -296023, -385421, -664376, -433056, -96491, -261948, -323617, -260685, -78310, 200931, 393153, 483656, 388933, 136799, 123264, 412934, 674142, 898746, 954054, 770924, 406043, 5145, -116437, -52051, 57108, 227734]
12380B27734k26978m09862k15021J36005L11949P450j95619N4768N46196J08538
12370C45160l44893p3697J82507j42887m0194O5060K92899J09807j52340J0128
12360B51550J75369j11934l84704j94496j7525K45079K43974J50188J03613j88369
12350B72745o65957M2588L94864K6039J23874q211j83901m54471j60358K23562
12340c89226M73321J34950K4779L14682q1889k19516k0115k6938J26158K75770
12330F11976L2438J37731K1205l91284m21662l87050o2862K1301J30977m9049
12320c56279K31431L46744L90864R9265r8079Q2525k82392l52374k83502l34731
12310e56528m7436N68122M99419k929p6054l86296n07541k3751K85963J12656
$$ y = [227734, 756, -409106, -624127, -488122, -176173, -168723, -364342, -309574, 236622, 345160, 267, -73430, 109077, -33810, -74004, -8944, 283955, 393762, 241422, 251550, 426919, 314985, -69719, -264215, -281740, -36661, 207313, 357501, 461114, 272745, -393212, -350624, 44240, 70279, 194153, 185942, 2041, -452430, -612788, -389226, 84095, 219045, 243824, 558506, 476617, 257101, 236986, 210048, 336206, 611976, 644414, 782145, 803350, 412066, -9596, -396646, -459508, -438207, -307230, -356279, -124848, 221896, 612760, 712025, 613946, 696471, 414079, 61705, -221797, -556528, -603964, -35842, 463577, 460648, 384594, -1702, -509243, -532994, -247031, -134375]
12300a34375o8177J15086K63549J69087O9505J92078j73018k73113j47493K17050
12290B30179K55510n4586n95032M2241M20489N6456k10590j40957l59706k57970
12280f13966L36788M90150k72229l23542j49074K2951N0247k85097j41971L83141
12270e02602K96466n7166j27596k21392J88815L79476L72548K48394N5578Q9057
12260G21578K595n61548O982O81088N99187k6022m00481k16998j01031j56705
12250E48645P2759J01738K09243l59304o74101k67771M64593L27202n9674J2000
12240C75330n8189l72863J79417L60436J76961N75476l7468l77407k17591l48388
12230B55714J45123J47064k03908O1908j7211O2328K84125K63115J61113J30466
$$ y = [-134375, -202552, -87466, 176083, 345170, 414675, 606753, 433735, 160622, 13129, 230179, 485689, 431103, -163929, -121688, 298801, 355257, 144667, 3710, -355996, -613966, -277178, 212972, -59257, -382799, -531873, -508922, -458675, -743772, -885743, -502602, -206136, -263302, -390898, -612290, -423475, -43999, 328549, 576943, 632521, 721578, 724173, 162625, 169607, 850695, 1449882, 1423860, 1023379, 806381, 705350, 548645, 621404, 723142, 932385, 573081, -101020, -368791, 95802, 423004, 363330, 375330, 317141, -55722, 123695, 484131, 661092, 1236568, 1199100, 821693, 604102, 255714, 400837, 547901, 343993, 405901, 388690, 451018, 735143, 998258, 1159371, 1289837]
12220A289837j26241n15889j83705J84915j1747l44239J1651J76829j33469k53803
12210I4139l11555n17172j36276K06247K51561J24831r4531L6630K99411N12555
12200D65840N28546Q27770N30428k8271l61284k33446N22316J046645J018315
12191D316859P4273q01067r20564m35574J43608l51292m04032l92218m95150m37327
12181B97516j13605l3169J03892K29229K30975n0369j27703j14467j20393k30493
12171G1413l40116l98020j77233L68666M67845J01839R9011J5170N7446N72995
12161H39016P1102o19573m55124J51997M60113J99601m20272k18396l43365j93908
12151e28809L62346M85952K19485k9655j10846k97061j29205q6973R280n7669
$$ y = [1289837, 1163596, 647707, 464002, 648917, 637170, 292931, 304582, 481411, 347942, 94139, -217416, -734588, -870864, -664617, -413056, -288225, -382756, -346126, -46715, 465840, 994386, 1822156, 2352584, 2324313, 1963029, 1729583, 2251899, 3298544, 4316859, 4391132, 3590065, 2669501, 2233927, 2377535, 2026243, 1622211, 1229993, 734843, 297516, 183911, 150742, 254634, 483863, 714838, 664469, 536766, 422299, 301906, 71413, -268703, -666723, -843956, -475290, -7445, 94394, 193405, 208575, 266021, 839016, 910118, 290545, -164579, -12582, 447531, 647132, 226860, 8464, -334901, -528809, -166463, 319489, 538974, 509319, 398473, 101412, -27793, -114766, -105486, -163155]
12141a63155k20177j25459j5711j54956k67825l48836K38446J56538k77276K11349
12131i67062N98314M86196O5600l67816J39442O43201L55642n8606n05681m66248
12121g7018m71572m90684r6508K69554M98194N82271K6036j43378N2068K99875
12111D48838o4992l44137k00620K49833L09665m17158n01346k24692J69098K13715
12101c61796L27519K00167j52671k7247j78483j89979P2422O7415M30540L94897
12091E82784l09825j36589J65697K86572L23985o2907m45353r5089p4048o436
12081B28791J05253K75987k29819m5143M55721j10072l46033l93255j69055j37275
12071c64900j75524r7153j30072r5956K8529M63143N47146K02437j5646l34904
$$ y = [-163155, -383332, -508791, -524502, -679458, -947283, -1296119, -1057673, -901135, -1178411, -967062, -368748, 117448, 183048, -184768, -45326, 597875, 953517, 894911, 389230, -77018, -548590, -1039274, -1135782, -866228, -368034, 214237, 240273, 96895, 148963, 448838, 383846, 39709, -160911, 88922, 398587, -18571, -519917, -744609, -575511, -361796, -34277, 165890, 13219, -14028, -192511, -382490, -310068, -242653, 187887, 582784, 272959, 136370, 302067, 588639, 912624, 849717, 404364, 309275, 235227, 228791, 334044, 610031, 380212, 335069, 790790, 680718, 334685, -58570, -227625, -364900, -540424, -637577, -767649, -863605, -835076, -371933, 175213, 377650, 362004, 27100]
12061B7100p37946k66872K41741M35310L63848r7233L35188K83802n10414m29375
12051c54851L8724K30514N93135M27779j49535j62035Q378j57771J09873J19736
12041G03947M8198J99604j2821m22684m24469j22691l3507n20702o05460n90582
12031a781167j7872M30901M50655N37059J72534N680N811k00054J8214L2192q1273
12020d27320l9790K89081j0192q2849K57231K97468j16745o20531l87331p8303
12010i19281k25207r5238K92544K13190K51811L75795K66432K16660L52758J72956
12000I02420J0509k2709n7641l33799k41248j21980Q4907K62575J51012j33388
11990E00658P2722L49024R5856k11902r9104k79286j59160N95359M33526J17980
$$ y = [27100, -710846, -977718, -735977, -300667, 63181, -34052, 301136, 584938, 74524, -354851, -316127, -85613, 507522, 935301, 785766, 623731, 632109, 474338, 584211, 703947, 752145, 951749, 938928, 516244, 91775, -30916, -64423, -585125, -1190585, -1781167, -1799039, -1368138, -917483, -380424, -207890, -202210, -196399, -396453, -378239, -346047, -427320, -467110, -178029, -188221, -271070, -13839, 283629, 166884, -453647, -840978, -919281, -1144488, -1239726, -947182, -733992, -482181, -106386, 160046, 376706, 729464, 902420, 912929, 890220, 832579, 498780, 257532, 135552, 220459, 483034, 634046, 500658, 573380, 922404, 1018260, 806358, 707254, 427968, 268808, 864167, 1297693, 1415673]
11980A415673n52530m07194k23325J33447M12710l0623k90752l42506l25000r2873
11970c02973J49450J50928j7030O8036J13685j88824j55829K70622M53017L49234
11960H90316P7526p851j16268J62218j30680n28408m03554j05591J00782K39292
11950A77782M01222N84938k7110l12816k10666n30362k86565M8480K11879k33806
11940a77024m38950M39545Q79222J55230j92943j41031m11895l95881n5487J54498
11930a84716m702k45845j21972L18107O19567L26510K260J77378K47365K96268
11920A430220j48874n74792j07874K68710k32374n55551n11086k25679l63K11643
11910d46020M12705L52080N10608L20536l11545k27330P0705J48624p9961k25237
$$ y = [1415673, 863143, 455949, 232624, 366071, 778781, 748158, 457406, 114900, -210100, -302973, -153523, -2595, -19625, 48411, 162096, -26728, -182557, 88065, 541082, 890316, 967842, 959991, 843723, 1005941, 875261, 346853, -56701, -162292, -61510, 177782, 579004, 1163942, 1136832, 824016, 613350, 82988, -203577, -155097, 56782, -177024, -615974, -176429, 702793, 858023, 665080, 524049, 112154, -283727, -339214, -184716, -189418, -435263, -557235, -239128, 380439, 706949, 709209, 886587, 1133952, 1430220, 1281346, 706554, 598680, 867390, 635016, 79465, -431621, -657300, -657663, -446020, -33315, 318765, 829373, 1149909, 838364, 611034, 681739, 830363, 750402, 525165]
11900E25165p8701m8224r2091j48244l35062k06352J26985J21937L03712N4622
11890B23747l78368k84530L21951L41680L40099K73603K10993L6306M02430J064952
11880B552863R40324J14263l00890k21715o39000q77578o21228l4454K89076J76081
11870A377742j82793p48342o78405m05736K04918L75456L53977J07052J20764
11861E24633J91038K03070J88641M90544K59834l13503P8811J61484m2110L79076
11851B121518L91652j75211n62673k99592m37899j89014N03451P6610n70800m73251
11841C84791k60237N8375j87107m06740j3196N0750L13280O28945K16637j61520
11831F23978j95572J04876J36976l88826q6769J65444j33052k55574m82373k27237
$$ y = [525165, 446464, 398240, 306149, 157905, -177157, -383509, -256524, -134587, 169125, 223747, -154621, -439151, -117200, 224480, 564579, 838182, 1049175, 1085481, 1487911, 2552863, 3493187, 3607450, 3306560, 3084845, 2445845, 1568267, 947039, 912585, 1201661, 1377742, 1194949, 446607, -231798, -637534, -432616, -57160, 296817, 403869, 524633, 715671, 918741, 1107382, 1597926, 1857760, 1544257, 1623068, 1784552, 1742442, 2121518, 2513170, 2337959, 1775286, 1475694, 1037795, 848781, 1352232, 1428842, 858042, 384791, 124554, 182929, -4178, -410918, -424114, -373364, -60084, 568861, 785498, 623978, 428406, 533282, 670258, 281432, 194663, 360107, 227055, -28519, -510892, -738129]
11821g38129M5085N97385L50761l6299m0981k63949j12097O3057J76493L49346
11811C90672L42304p8850k87598k06642Q7543q8558m22378j98370O3803L38805
11801e9269P1364q5242p3998k34800k17280J22818N50749P5143j65330P0139P5733
11790A30027j07059l19558m02692k38623k15116K06033K97374O2362j2225J6652
11780e82825p758J14216K15094L9422j09609K7995p3582M5279K41754p4162k17817
11769c81993j95784J26706P9279j32269l10396O0681K83970J56561J6723M9714
11759b46808J04886j07345l33698r6412L93121k96664j91130J80643O9206k29068
11749g53269k67820L95662L95116K09925J79281J1422n6584K9729q8567m26246
$$ y = [-738129, -693044, -95659, 255102, 218803, 177822, -86127, -198224, -135167, 41326, 390672, 732976, 654126, 366528, 159886, 247429, 158871, -263507, -461877, -398074, -59269, 12095, -73147, -147145, -381945, -599225, -476407, 74342, 149485, -15845, 54294, 130027, 22968, -296590, -699282, -937905, -1153021, -946988, -649614, -587252, -599477, -582825, -590583, -476367, -261273, -221851, -331460, -303465, -377047, -331768, -90014, -164176, -381993, -577777, -451071, -371792, -504061, -814457, -753776, -469806, -313245, -296522, -246808, -141922, -249267, -582965, -679377, -286256, -582920, -774050, -593407, -524201, -753269, -1021089, -625427, -230311, -20386, 158895, 170317, 113733, 143462, 54895, -371351]
11739c71351n99240j95244J15682L22064K76807l555L75184M61593l1810j45835
11729B04295J89693J35925J18872k02130j28049r8264l27477P5895R7834k10836
11719a44242k27132J20826M46906M794R8510P558N4076K31716K64964l45558o09437
11708i7019m53620k58223M79858j59696n49716k31560m3095R8093K88831K18130
11698g08017L93252L92826r9628l70185p3527j18027q675k4801R8942k00358k2570
11687g40768M55763j8108m27969Q7839K74903K58816j00740k09236o4732K35720
11677b48512J81080Q6616j76199j16187p9241m2757j07626j2722L3888j37825
11667f19485j76463Q2700K07328J42775j91551n06975m64412l481J87749K96598
$$ y = [-371351, -970591, -1165835, -1050153, -728089, -451282, -454837, -79653, 381940, 350130, 204295, 393988, 529913, 648785, 446655, 318606, 220342, -107135, -31240, 66594, -144242, -371374, -250548, 196358, 201152, 299662, 307220, 361296, 593012, 857976, 512418, -97019, -550639, -808862, -329004, -488700, -1038416, -1269976, -1313071, -1214978, -926147, -708017, -314765, 78061, -21567, -391752, -465279, -583306, -591981, -616782, -517840, -718198, -740768, -285005, -303113, -731082, -643243, -368340, -109524, -210264, -419500, -484232, -248512, -67432, 19184, -157015, -273202, -352443, -395200, -502826, -515548, -481660, -619485, -795948, -713248, -505920, -363145, -554696, -1061671, -1526083, -1529564, -1341815, -1045217]
11657a045217M01201K27864J37575J55742k01647k51374M40689K09675j45919
11648g1411j72528j17666j38427l0896J5785R9342J00868J57546K32228K63808
11638C38649M2425m55531l18315J52665J71386R3699r8945L58533L53358l63085
11628B74839j23567M25002K30774J2529j88185l6265Q2978j5218l28118m52652
11618a17883m98683r9092L87904O67371K63624J72234j05754k5582q8236m55512
11608A00391k56167k34846j09733j78377k00070K02233J85755L51531J23167l43129
11598c59245J8325L85034L09846Q9555J7256j3561m81622o16617K6527J15946
11588e08556k16866k31157j14470L30347L74771R9043J29550m8073k59788J12344
$$ y = [-1045217, -644016, -416152, -278577, -122835, -324482, -575856, -135167, 74508, -71411, -243939, -361605, -500032, -530928, -515143, -415801, -314933, -157387, 74841, 338649, 381074, -74457, -392772, -240107, -68721, 24978, -73967, 284566, 637924, 274839, 151272, 576274, 807048, 819577, 631392, 595127, 678105, 662887, 334769, -117883, -616566, -715658, -327754, 339617, 603241, 775475, 669721, 644139, 555903, 100391, -155776, -390622, -500355, -678732, -878802, -676569, -490814, -139283, -16116, -359245, -340920, 44114, 353960, 443515, 460771, 447210, -34412, -651029, -624502, -508556, -725422, -956579, -1071049, -740702, -365931, -266888, -137338, -185411, -445199, -332855]
11578c32855N3089P1572L54223K09742K2379j08507o0157M85394M35646L45356
11568A475882O60396O28303M16107L37861l04989n67989l98929m85832m54415
11559A306395k73741j24495n8610l43833l94770J42988q8504k22276j39688l5274
11549b31808J50768K02436J94694P4650J88559K74289L6128k02253k03390k00029
11539B84044n30833p7169N00100J78320j98912k76887j59069n2145r0887Q8073
11529c35365N71184N14292L24091K23381j3013p9452j31639n0227K71163J43629
11519A438044q4014n4812l51020j92766r9412J42596J48369n7139O1172M3108
11509I94126Q5575K41658N75963N64737P95761M57073K35324J63734j48247j35070
$$ y = [-332855, -279766, -208194, 146029, 355771, 378150, 269643, 209486, 694880, 1130526, 1475882, 2136278, 2764581, 3180688, 3518549, 3213560, 2645571, 2246642, 1760810, 1306395, 1032654, 908159, 849549, 505716, 110946, 253934, 165430, -56846, -196534, -231808, -81040, 121396, 316090, 390740, 579299, 853588, 889716, 687463, 484073, 284044, -246789, -323958, 176142, 354462, 155550, -121337, -280406, -332551, -423438, -335365, 235819, 750111, 1074202, 1297583, 1284570, 1205118, 1073479, 1023252, 1294415, 1438044, 1354030, 1299218, 948198, 755432, 656020, 798616, 946985, 889846, 951018, 994126, 1079701, 1321359, 1897322, 2462059, 3257820, 3714893, 3950217, 4113951, 3965704, 3830634]
11499C830634m74302q78348m42058k27405r2094L38878P9917J2955J47713L46180
11489B642070J09914J8090K51206M9964K82191J60342o2506n3565p7896j85723
11479C134087l08745j23066j64707l51089j8179L78367L88795J12693m46693k85248
11469B316215N25703N75859l1288l55526n21505j95263k9805j55563n36733p28717
11459H63377o3654j52644m69718o14472m21761j17476M54526M82404K30508p1617
11449A19473j7608J57759K01897L2436j174J16040m5355q84588m85595L52599
11439d54116K40401l53910m15694r5465J46459p4373j20952L9471M3325r5510
11429a140364m2948N97110P18612L41826O9282l00174l32229J14233K83719j37116
$$ y = [3830634, 3356332, 2477984, 2035926, 1808521, 1716427, 2055305, 2135222, 2148177, 2295890, 2642070, 2751984, 2770074, 3021280, 3071244, 3353435, 3513777, 3451271, 3397706, 3319810, 3134087, 2825342, 2702276, 2537569, 2186480, 2168301, 2546668, 2935463, 3048156, 2601463, 2316215, 2841918, 3417777, 3386489, 3030963, 2509458, 2314195, 2284390, 2128827, 1592094, 863377, 799723, 647079, 177361, -437111, -858872, -976348, -521822, -39418, 191090, 119473, 101865, 259624, 461521, 493957, 492783, 608823, 563468, -321120, -806715, -454116, -213715, -567625, -983319, -1078784, -932325, -1006698, -1127650, -1088179, -1044854, -1140364, -1183312, -586202, 132410, 474236, 543518, 243344, -88885, 25348, 309067, 171951]
11419A71951o87384l45185N9184J74043m1728k06572j10261M14537L24220o4628
11409c11823N10531K45691J79798M47863K53589O00549m63337p53532k68086j15117
11399C26126J34636k7143m16996m32366j33178M23674M58296L76687M777j48157
11389E66356K69836O24513k795k52541l43655l09854j53993O4198M8467k16099
11379B94433l39075k92025p9705J02649j03958J54285K44489k9793q6962j92545
11369c28207k30987L4393q3997J43014N19031J81720j77960r8279j44878j26477
11359c12627J76215m07007o38345l3645k49676k91957O43138O24355j53908j0110
11349f53567p3804K78854O35939K47273K12937Q8885j6234M7649k22657l31060
$$ y = [171951, -515433, -860618, -801434, -627391, -669119, -875691, -985952, -571415, -247195, -311823, 198708, 444399, 624197, 1072060, 1325649, 1926198, 1462861, 709329, 441243, 326126, 460762, 433619, 16623, -415743, -548921, -125247, 333049, 709736, 714513, 566356, 836192, 1460705, 1457910, 1205369, 861714, 551860, 397867, 462065, 510532, 294433, -44642, -336667, -416372, -313723, -417681, -263396, -18907, -48700, -135662, -328207, -559194, -524801, -608798, -465784, 53247, 234967, 57007, -41272, -186150, -312627, -136412, -543419, -1181764, -1215409, -1465085, -1757042, -1113904, -489549, -643457, -653567, -727371, -448517, 187422, 434695, 647632, 736517, 720283, 767932, 545275, 214215]
11339B14215k21588J5211M00600J22791M7012J47059N389j10363n59118j38887
11329g7679N23958K38950p1996l01442n72139k23272m88613l46225J565K8935
11319a287958Q2561j04368P0910M6489M58184M67140K1414k48929J18507K11167
11309a64883j66312l6218L70837L3754J73463K81721J27543K97433L51680K2424
11299A291442o30228o58851j64605J31253K71940L01984J8422j94232o32785n37880
11289h03540j41482L6613n8913q9017K12538J87474K45055L14788R7716N1043
11279E2275j27680J10509L18050j26320n06389l57313J84463J76223J08298K09787
11269D1903O7361j63842j81105k98807n88560n38715J88165K67039L79293L43156
$$ y = [214215, -7373, 7838, 408438, 531229, 578241, 725300, 730689, 620326, 61208, -77679, 446279, 685229, 613233, 311791, -260348, -483620, -972233, -1318458, -1316893, -1287958, -1205397, -1309765, -1238855, -1192366, -734182, -267042, -245628, -494557, -376050, -164883, -331195, -367413, 3424, 37178, 210641, 492362, 619905, 917338, 1269018, 1291442, 661214, 2363, -162242, -30989, 240951, 542935, 561357, 367125, -265660, -803540, -945022, -908409, -967322, -1056339, -843801, -656327, -411272, -96484, 1232, 52275, -75405, 35104, 353154, 226834, -279555, -636868, -452405, -276182, -167884, 41903, 109264, -54578, -235683, -534490, -1123050, -1661765, -1473600, -1206561, -827268, -484112]
11259d84112L46752j36177j79570K03227m8785k74024k24870k36438j33373L33809
11249h33561M32151N2385k19794l44743k73485J64455M65404J07390K16785O62492
11239D29479K17591K76853K97109j43278p04127m21959j4157k0031o4206k37927
11229c84653l58925m23939J10227K38861k50909L3854M87713M34613j03659Q5213
11219a31604L37687K4456r7044J94554j3339k19009k74021l75862j26848j25717
11209h06747K11135O62029J54497o3046K25713p8366j94282J51747J64221J47304
11199E74205q9042j98383j1577l65011k83799K62526K30230L2840k5858m1N7061
11188A83151K02890q8208j80315r403j777j19750k60982K83971l9429m06385j03452
$$ y = [-484112, -137360, -273537, -453107, -249880, -298665, -572689, -797559, -1033997, -1167370, -833561, -401410, -349025, -568819, -913562, -1187047, -1022592, -557188, -449798, -233013, 429479, 647070, 923923, 1221032, 1077754, 373627, -48332, -62489, -82520, -146726, -384653, -743578, -1167517, -1057290, -818429, -1069338, -1035484, -547771, -113158, -216817, -131604, 206083, 230539, 133495, 328049, 314710, 95701, -178320, -554182, -681030, -806747, -595612, 66417, 220914, 157868, 383581, 305215, 110933, 262680, 426901, 574205, 485163, 286780, 275203, -89808, -373607, -111081, 119149, 151989, 126131, 126090, 183151, 386041, 297833, 117518, 108115, 106338, -13412, -274394, 9577, -29852, -436237, -539689]
11177e39689J33565J32935j6973R1681k25623l22475L77127N10055K04115k60710
11167H4008k69280r0895k94392P0264K16897J72662N3334K61889L99879K1142
11157F25508l32049n05203o15007l66944j4474K90613N5096J17791M77127J60718
11147a06824j09967k11708M5845M76749K62813K05073N84392j21464j95061j53904
11137F75944o81605l23871j42276J47968O74891O01692J48315m84340m27445j05830
11127H3443j20254j09412J21291J02641L01915L1936n7350J98632j50842k82347
11117A19653m10382k31875K15392N25652K46943J57554J71911J48201l11336p75152
11107a43439r50133l33395K69077O2555J17592N66816O72861O84235L84959J15539
$$ y = [-539689, -406124, -273189, -290162, -198481, -424104, -746579, -369452, 140603, 344718, 84008, -185272, -276167, -570559, -500295, -283398, -110736, -57402, 204487, 604366, 625508, 293459, -211744, -826751, -1193695, -1208169, -917556, -862460, -744669, -267542, -106824, -216791, -428499, -382654, 94095, 356908, 561981, 1146373, 1024909, 829848, 675944, -5661, -329532, -471808, -323840, 351051, 952743, 1101058, 616718, 189273, 83443, -36811, -146223, -24932, 77709, 379624, 411560, 354210, 552842, 402000, 119653, -290729, -522604, -307212, 218440, 465383, 622937, 794848, 943049, 631713, -143439, -1093572, -1426967, -1157890, -1095335, -977743, -410927, 261934, 946169, 1331128, 1446667]
11097A446667q2833j14792k01091k06269J00649m5535k45200N331j26932j94434
11087C35561p5560k24294J65897L33882R5421l4018J96705J80624N8530o132k67762
11076G58854l94461Q1579J24187j26721k95770j36472q1506k86675j71055J75954
11066c52086L46587K11557j06187k47443L0522M00571K10108L39941N13241j34415
11056A212396j61251k01092k12754j66544m40074j75021L10280L43074j36466
11047C72548o1321J09457O6747O14683K21050k49498j35970l97100k18236j45037
11037A77323J44377o9886k83532j32188r6739j68051K51622N99076P98006K01760
11027A421768k42645k46321l25496l21576l08344p3746J47945r2338m88108l05154
$$ y = [1446667, 1363834, 1249042, 1047951, 841682, 942331, 896796, 651596, 656927, 529995, 335561, 260001, 35707, 201604, 535486, 630907, 596889, 793594, 974218, 1032748, 1026616, 758854, 364393, 445972, 570159, 443438, 147668, 11196, -70310, -356985, -528040, -352086, -5499, 206058, 99871, -147572, -117050, 283521, 493629, 833570, 1346811, 1212396, 1051145, 850053, 637299, 470755, 30681, -144340, 165940, 509014, 372548, 311227, 420684, 487431, 1102114, 1323164, 1073666, 937696, 540596, 322360, 177323, 321700, 251814, -31718, -163906, -260645, -428696, -177074, 422002, 1220008, 1421768, 1179123, 932802, 607306, 285730, -22614, -96360, 51585, -40753, -528861, -834015]
11017h34015J56408l1802J04369N39890K55841J78172J66180K70168J07625J41918
11007A054754J56529j7942K71280M18072r2026k0712K0373l97805k78675m15554
10997F98294o72581j53043K76277J57145j03617j48726K2068r3012N2350M88451
10987E23606L73386k71697l87583l24027N426j1602L2018J61560J08155J16566
10977C25808j6180l37412L4981J50496k66879l54064l32061N6621K16782L1015
10967d90893K65095Q1621K9488J75497L58679P70042L38955k36355L8461J96434
10957A527024o02661n09529J352j18652j43277J22830j04494n382k99949l72917
10947e05655j31637M3280K99082L19140R5582j32819l44934l5428M9986M2031
$$ y = [-834015, -677607, -709409, -605040, -65150, 190691, 368863, 535043, 805211, 912836, 1054754, 1211283, 1193341, 1464621, 1882693, 1790667, 1769955, 1790328, 1392523, 1113848, 698294, 25713, -127330, 148947, 306092, 202475, 53749, 75817, -17195, 35155, 523606, 896992, 625295, 237712, -86315, -80889, -92491, -60473, 101087, 209242, 325808, 309628, -27784, 7197, 157693, -109186, -463250, -795311, -738690, -521908, -490893, -225798, -144177, -114689, 60808, 419487, 1189529, 1528484, 1292129, 1330590, 1527024, 924363, 414834, 416186, 297534, 154257, 277087, 172593, 167211, -132738, -505655, -637292, -594012, -294930, 24210, 119792, -13027, -357961, -393389, -343403, -301372]
10937c01372M78207J57971J44899N08161N27497J59861k52911k72446J9957l23443
10927H46381m29512j37521j09279j17236k1613j01150l28593K07780O52672J39229
10917F01158l54279k23146K544j32294m49030J27445J19140l94681m3908J61487
10907e85564K05865L65048M30196k2937j61321j70292q5282j40418k8109l33972
10897e26786o24904k204M90275M80036J50500M0399K16914J16868j89653l59577
10887b08132j90413K02778M04375L43411l2806J6748K38575j13303j0239l37012
10877C13982o46562L746L90036k5671k55631R8358K24697j01523M4212J73583
10867B19227K49935K13519j86455j02383j79238o5099m591k65841o3475J37920
$$ y = [-301372, 176835, 334806, 479705, 987866, 1515363, 1675224, 1422313, 1149867, 1169824, 846381, 416869, 279348, 170069, 52833, 31220, -69930, -398523, -190743, 461929, 601158, 246879, 23733, 26277, -106017, -555047, -427602, -308462, -703143, -747051, -585564, -379699, -14651, 415545, 392608, 231287, 60995, -24287, -164705, -192814, -526786, -1151690, -1153894, -663619, -183583, -33083, 7316, 224230, 341098, 151445, -208132, -398545, -195767, 208608, 552019, 519213, 535961, 774536, 661233, 650994, 313982, -332580, -328834, 61202, 35531, -220100, -121742, 102955, 1432, 45644, 219227, 469162, 682681, 496226, 393843, 214605, 149506, 144915, -120926, -184401, -46481]
10857d6481J15370K599j02303m6897J68448J63450O9809J59580N39251L92749
10847A415575k67937m36955n4258J65062l02966m66383k27503j66163K8527L1982
10837b81019N2128K87805L24582j32847n75871j20307M2736l25101p6239K21794
10827e82339L24372M32743M79812K61284k46887K3680L46051l24033n83048l65532
10817b33897j00690J28076j77515l75683K60854N94452l84938n04312L17103N71280
10807I4730O56061J98118k03343k68108l89744l57454l1016J53476K34078L65311
10797D52109j91238p35819n00065K89492M51220J53523K8745j46629J48258J13859
10787F3455q3030J31976K31256J12933j43971j47395l89619j09662K04306J47093
$$ y = [-46481, 68889, 71488, -30815, -77712, 90736, 254186, 323995, 483575, 1022826, 1415575, 1147638, 710683, 656425, 821487, 518521, 52138, -175365, -341528, -313001, -281019, -228891, 58914, 383496, 250649, -325222, -445529, -402793, -727894, -804133, -582339, -257967, 174776, 654588, 915872, 668985, 692665, 1038716, 714683, 131635, -233897, -334587, -206511, -384026, -759709, -498855, 95597, -289341, -793653, -476550, 94730, 750791, 948909, 745566, 477458, 87714, -269740, -300756, -147280, 86798, 452109, 260871, -474948, -975013, -685521, -234301, -80778, -52033, -198662, -50404, 63455, -19575, 112401, 343657, 456590, 312619, 165224, -224395, -334057, -129751, 17342]
10777A7342L7289N5940J21655m43056k53856j88874q3960L67279r079k98324J19935
10766e57709L70802L19491J58972q8767J47137L19414j08532k94131N8367n2552
10756B72492k20747j20131r9858l56014K3377J41064n5701j57506K45482O41973
10746C14431L02998j01478l48109k11271N7992J93341L22461k60744j58792L00573
10736D11402K7909j15708N3187j06005m5996k01825J08313O7087l30821J6401
10726a16056Q8985l65164j92314J85138K8186j08305J05207K2827p0586r689J95176
10715b36595K07074l92024k94885K96050L04506n2896Q3843q8490j48505p260
10705c29182j94966L7162L3824j21411J28654L7904j9941J06960K7140J06956
$$ y = [17342, 54631, 110571, 232226, -210830, -464686, -653560, -737520, -370241, -379320, -677644, -557709, -186907, 132584, 291556, 202789, 349926, 669340, 560808, 266677, 325044, 272492, 51745, -68386, -168244, -524258, -500881, -359817, -415518, -573024, -327542, 314431, 617429, 515951, 167842, -43429, 14563, 207904, 530365, 269621, 110829, 411402, 439311, 323603, 376790, 270785, 224789, 22964, 131277, 198364, -132457, -116056, -27071, -392235, -584549, -399411, -371225, -479530, -374323, -351496, -422082, -431771, -236595, -29521, -421545, -716430, -420380, -115874, -168770, -84927, -173417, -321922, -329182, -524148, -486986, -453162, -574573, -445919, -408015, -427956, -320996, -293856, -186900]
10695a86900o8238j50101j51341k63849J30088M20693J41012l07909J30830M67834
10685A62119j07320k64526L00033J28255l61182k50429K26784J7012n86506l53967
10675a089727J25916R8601K77065J11960o9244m5447R5182K78778k55976r2212
10665e65104J16360J68423q46j4236k29219O2877J84305l49292k51107J38158
10655g39681J38849J00296k53440k35289N6854J15255M5511K21339J70296Q2322
10645b97688K86302Q52737N37406J88213K411q4381j47939J55018p7892m23226
10635I90961k94307k02417m08514n83082K66820N62954K10794K0640q9307k27724
10625B46818m42559j19151J66841j55714K3941M55400M60616j35141m14020k69169
$$ y = [-186900, -255138, -405239, -556580, -820429, -690341, -269648, -128636, -436545, -305715, 162119, 54799, -209727, 90306, 218561, -142621, -393050, -166266, -149254, -735760, -1089727, -963811, -865210, -588145, -476185, -545429, -590876, -495694, -216916, -472892, -565104, -448744, -280321, -281167, -295403, -524622, -461745, -277440, -626732, -877839, -739681, -600832, -500536, -753976, -989265, -932411, -817156, -771645, -550306, -380010, -297688, -11386, 841351, 1378757, 1566970, 1569381, 1485000, 1337061, 1492079, 1414187, 990961, 696654, 494237, 85723, -497359, -230539, 332415, 543209, 563849, 474542, 246818, -195741, -314892, -148051, -303765, -279824, 175576, 636192, 501051, 87031, -182138]
10615a82138m997R4456l6889j45271l91801m72217L21795N14585J49441K02618
10605D9582j07705l97409l38345P9754J21959K2598L6541l42143j88966R3140
10595i70994O5630L32215O23884N20334k57033m57156m18022j89539k01471J3706
10585i38446L78834j52949o2207J84738K57162Q0018j89274l30184P148L60556
10575d04604K51798l78325j83785P2770l9485L94161N15871M27174J62507l88834
10565D29248l15227R4486k0271L200K2376j22108P2078O3767k58487l4006n3260
10554a18204j83502m7604j63025K73099M66059l9551j68556k38688J11938Q4275
10544b3759j97154K18841K19377J53019p7220l32770n51943j52314n2910k65228
$$ y = [-182138, -187135, -92679, -129568, -274839, -666640, -1138857, -817062, -302477, -153036, 49582, -58123, -455532, -793877, -714123, -592164, -569566, -533025, -875168, -1064134, -970994, -905364, -573149, 50735, 571069, 314036, -143120, -561142, -750681, -952152, -938446, -559612, -712561, -774768, -590030, -332868, -252850, -442124, -772308, -765160, -404604, -152806, -531131, -714916, -642146, -681631, -287470, 228401, 655575, 818082, 429248, 114021, 208507, 188236, 191436, 213812, 91704, 163782, 227549, -30938, -64944, -118204, -301706, -349310, -512335, -239236, 226823, 187272, 18716, -219972, -108034, -23759, -220913, -2072, 217305, 370324, 293104, -39666, -591609, -743923, -796833, -1062061]
10534a062061J65394P23123k06703o93131m93263k4874M66886L76007K38033j58554
10524f69143r9626M96533L21127L17586K66557j59686l07167l77148m48399j47375
10514h06741L56910N79249O7847L7520K82526N3725N7278n27213n73540K53479
10504b18960M92184m4255m61789l90973l8809R4650L9202M59950R1199k51054
10494b28655K13129J37275j04300J5180k18533j32861K04306m17882m46556K42844
10484g36053K50085l12347l49185N4248R6899J76498R8714J73700k09188m59165
10474a215794M03461P15609J72271k7500k91203k86307k80525K2401l22485k36924
10464a346996j62162K50127K87123J06349k66088M4976J32267j54298L39359P55877
$$ y = [-1062061, -896667, -173544, -380247, -1073378, -1566641, -1591515, -1124629, -748622, -510589, -669143, -768769, -272236, 48891, 366477, 633034, 473348, 166181, -210967, -659366, -806741, -449831, 129418, 197265, 234785, 517311, 571036, 628314, 101101, -472439, -218960, 273224, 228969, -232820, -623793, -662602, -567952, -528750, -68800, 22399, -228655, -15526, 121749, 17449, 32629, -185904, -318765, -114459, -532341, -978897, -736053, -485968, -798315, -1147500, -1093252, -996353, -819855, -721141, -547441, -756629, -1215794, -812333, -96724, 75547, 48047, -243156, -529463, -809988, -787587, -1110072, -1346996, -1509158, -1259031, -971908, -865559, -1131647, -1086671, -954404, -1108702, -769343, -13466]
10454a3466K01816j5284j568k19249k31100l40929k66091J75356o9964p3927L46619
10443e07787K73270j75381l97539K32834L88572N4419p5823j23141J56876J0889
10433a62811j29722K90108K76045j66690l05135J23114m8622N4690J97498m3027
10423H5448J33043q5296j8397m2525k64526l60013j46513L17021L96602j92583
10413a77739p50687k94885J91495J25186R6494K35295J24109l45863r8512L90894
10403e04213L40480J35037M88968M70124j3880k39410J56320J71261l35933l48703
10393C20051o7066J7690R0574L0572j69416K7403m1847j85387k66157O1695K23073
10382D1185N10894J22816m8603J44855J31659k18383p95173n49414K29398L37863
$$ y = [-13466, 188350, 173066, 171498, -47751, -278851, -619780, -885871, -710515, -780479, -854406, -507787, -234517, -409898, -807437, -574603, -186031, -131612, -207435, -330576, -173700, -162811, -292533, -2425, 273620, 106930, -198205, -75091, -123713, -69023, 128475, 85448, 218491, 133195, 114798, 72273, -192253, -552266, -698779, -381758, 14844, -177739, -928426, -1223311, -1031816, -906630, -810136, -574841, -450732, -796595, -895107, -504213, -163733, -28696, 460272, 930396, 916516, 677106, 833426, 1004687, 668754, 320051, 252985, 270675, 361249, 391821, 222405, 249808, 207961, 22574, -243583, -181888, 41185, 552079, 674895, 626292, 771147, 902806, 684423, -110750, -660164, -430766, -92903]
10372i2903L39538k6644l08220q9342j67039j80039k03912k32808N1580J44696
10362g65093K81779M8370p4723j11597k33651K18822L59183R0178j20939Q013
10352b99658j8211k45636j17759j42808j33695P0671J20685M0944R4720M95274
10342a35473M69886J91964k36544k33114j64605l35360P747n5704J22887j33547
10332e01863q9610m2198j5394J66760L73725K42155j92042j22386k62130m41988
10322h84971k17732P5582J49242L93014K18235j53443k38451j76171J63802K09393
10312d61500K38296L87172L56749k18325k33923m04874k31610j96062J90549K52172
10302c21356k1560k0668K29246j95315k31127L56531L04062L7383j43775j09162
$$ y = [-92903, 246635, 219991, -88229, -177571, -344610, -524649, -728561, -961369, -909789, -765093, -483314, -434944, -509667, -621264, -854915, -636093, -276910, -186732, -307671, -299658, -317869, -563505, -681264, -824072, -957767, -887096, -766411, -725467, -630747, -135473, 334413, 526377, 289833, 56719, -107886, -443246, -435499, -491203, -368316, -501863, -591473, -633671, -649065, -482305, -108580, 133575, -58467, -180853, -442983, -884971, -1102703, -1027121, -877879, -484865, -266630, -420073, -658524, -834695, -670893, -461500, -223204, 163968, 520717, 302392, 68469, -336405, -568015, -764077, -573528, -321356, -342916, -363584, -134338, -329653, -560780, -204249, 99813, 137196, -6579, -115741]
10292a15741k43706k45082j86267k29017r9090K59821J26697J62590K34362m1178
10282c76611J67441M8487P4943J0049L59179J07165k95276m3804j26541q2276
10272a57244k36738l572P16464O58820K04756n6365J8558M9661j12361M5541j17622
10261A009898l15046l97606j90370l1455Q0016L05929k89056l55782J28682K07508
10251A52718l38740m70296k74429j12671K86725J75055J4336J54140J43551M571
10241b65040J21490L79997K54301j85106j90145R0261M3057j61620j37516M2168
10231h153p145J88320N86464N9067o26311n42147j15894J55017K93162N61808
10221E44188L43648M5358k92793k66397o9675M7480L31448N62563j43130n86001
$$ y = [-115741, -359447, -604529, -790796, -1019813, -1118903, -859082, -732385, -569795, -335433, -376611, -209170, -160683, -85740, -75691, 283488, 390653, 95377, 51573, -74968, -157244, -393982, -397554, 318910, 977730, 1182486, 1126121, 1144679, 1194340, 1081979, 1127520, 1009898, 694852, 297246, 106876, 75421, 155437, 461366, 172310, -183472, -54790, 152718, -186022, -656318, -930747, -1043418, -756693, -581638, -567302, -413162, -269611, -265040, -143550, 236447, 490748, 305642, 115497, 205758, 248815, 87195, -50321, -8153, -15298, 173022, 759486, 818553, 192242, -349905, -465799, -310782, -17620, 544188, 887836, 933194, 640401, 374004, 304329, 351809, 683257, 1245820, 1102690, 516689]
10211E16689m27347l5215j20780j45318L3934N0020O4805k62401j90035L3952
10201d81696r8921L87103K58853J40373N71768Q7779L4039K07113k78106l58162
10191D70143k16848j51008j61914j12252l00798J03330K37399J57713K33403k59407
10181b39m9786J41817k39245k59823p3778K9056o9308J62332K43864J29843M8406
10170F3139j81962k06066n1243j99955k88651J11676J78430L22130J61253J19104
10160B7855O3274J17489K49794K13160q3443l50211j34156K08639J32001P0682
10150E15084j9394n2405L63366K69137p3892k72242r9178k42301l61897q2126
10140e5848L7388J87245q4854j12071J69179K06238J50094K63317K80218j18564
$$ y = [516689, 89342, 54127, -66653, -211971, -178037, -128017, -63212, -325613, -515648, -481696, -580617, -193514, 65339, 205712, 777480, 865259, 899298, 1106411, 828305, 470143, 253295, 102287, -59627, -171879, -472677, -369347, -131948, 25765, 259168, -239, -50025, 91792, -147453, -407276, -481054, -451998, -521306, -358974, -115110, 14733, 63139, -118823, -324889, -376132, -576087, -864738, -753062, -574632, -252502, -91249, 27855, 91129, 208618, 458412, 671572, 588129, 237918, 103762, 312401, 444402, 515084, 495690, 443285, 806651, 1075788, 1001896, 729654, 630476, 388175, 26278, -55848, -18460, 168785, 83931, -28140, 141039, 347277, 497371, 760688, 1040906, 922342]
10130I22342n53802J02174L22418k68952k35930O7076J85389J00015r696L12989
10120I44023M69501K42191K11544K42486J25791K81109O29276R90142J060313
10111E196376J105652J944841K204781Q39627q68591j939471j930521j608017
10103D944677j322545q24425l54339k14216k85107r6077k73573o33537n54357
10094C86501j13574J96783L95740k5479l02937m2539k81378n17350m65476l08627
10084a078336L334N37165J69637N0574J87409K04676J37620O709j49459J31107
10074B00436P29926N63328k61925j93356l75783m68584m47131n57862l4333J46804
10064f98480j31888j74538l71519K01271Q67967O34100k04982l78653j37249J99738
$$ y = [922342, 368540, 470714, 793132, 524180, 288250, 355326, 540715, 640730, 631034, 944023, 1413524, 1655715, 1867259, 2109745, 2235536, 2516645, 3145921, 4136063, 5196376, 6302028, 8246869, 10451650, 11291277, 10422686, 8483215, 6552694, 4944677, 3622132, 2797707, 2443368, 2229152, 1944045, 1847968, 1574395, 940858, 386501, 272927, 469710, 865450, 839971, 537034, 494495, 213117, -304233, -769709, -1078336, -1075002, -537837, -368200, -317626, -130217, 74459, 212079, 218788, 69329, 200436, 930362, 1493690, 1231765, 1038409, 662626, 194042, -253089, -810951, -845284, -698480, -830368, -1004906, -1376425, -1175154, -307187, 326913, 121931, -256722, -393971, -194233]
10054a94233M87631K01878m3441J3228k64364k37214l55033j31153J55434n2975
$$ y = [-194233, 293398, 495276, 451835, 465063, 200699, -36515, -391548, -522701, -367267, -420242]
$$ [...]
##END NTUPLES=NMR SPECTRUM
##END=
