##TITLE=C13_SL82-Dau(rechrom)
 CDcl3, 24000 sc

 25.7.2022
##JCAMPDX= 6.0         $$ Bruker NMR JCAMP-DX V2.0
##DATA TYPE= NMR SPECTRUM
##DATA CLASS= NTUPLES
##ORIGIN= UXNMR, Bruker Analytische Messtechnik GmbH
##OWNER= root
$$ XWIN-NMR		Version 3.5
$$ Tue Jul 26 15:24:57 2022 Russian Standard Time (UT+4h)  she@DPX200
##.OBSERVE FREQUENCY= 50.327896
##.OBSERVE NUCLEUS= ^13C
##.ACQUISITION MODE= SIMULTANEOUS
##.ACQUISITION SCHEME= undefined
##.AVERAGES= 24001
##.DIGITISER RES= 17
##SPECTROMETER/DATA SYSTEM= spect
##.PULSE SEQUENCE= zgpg30
##.SOLVENT NAME= CDCl3
##.SHIFT REFERENCE= (INTERNAL, CDCl3, 0, 222.653)
##AUDIT TRAIL= $$ (NUMBER, WHEN, WHO, WHERE, WHAT)
$$ ##TITLE= Audit trail, XWIN-NMR		Version 3.5
$$ ##JCAMPDX= 5.01
$$ ##ORIGIN= Bruker BioSpin GmbH
$$ ##OWNER= she
$$ F:/spectra/data/she/nmr/c13/1/pdata/1/auditp.txt
$$ ##AUDIT TRAIL=  $$ (NUMBER, WHEN, WHO, WHERE, WHAT)
(   1,<2022-07-26 15:23:38.67 +0400>,<she>,<DPX200>,
      <created by zg, POWCHK disabled, PULCHK disabled
       terminated by command 'halt'
       configuration hash MD5:
       00 E9 B6 7A A2 85 ED C7 34 08 36 98 17 FE 4E 26
       data hash MD5: 32K
       A0 72 B9 44 FB 68 EF 79 81 B7 6B 09 FC 88 C4 40>)
(   2,<2022-07-26 15:23:44.81 +0400>,<she>,<DPX200>,
      <Start of raw data processing
       efp BC_mod = 2 LB = 1 FT_mod = 6 PKNL = 1 PHC0 = -340.8639 PHC1 = 80.68469 SI = 32K 
       data hash MD5: 32K
       87 71 93 11 EF A9 3D FF 31 71 82 48 BF 56 E9 A8>)
(   3,<2022-07-26 15:23:47.53 +0400>,<she>,<DPX200>,
      <abs ABSG = 5 
       data hash MD5: 32K
       C5 F7 A1 74 F5 4E 5D 02 B4 48 55 9C D3 CE 58 F4>)
(   4,<2022-07-26 15:24:15.70 +0400>,<she>,<DPX200>,
      <pk PHC0 = 4.170798 PHC1 = -6.599999 
       data hash MD5: 32K
       90 7F 58 DC 51 39 E2 95 77 58 19 17 1D 05 63 9C>)
(   5,<2022-07-26 15:24:19.20 +0400>,<she>,<DPX200>,
      <abs ABSG = 5 
       data hash MD5: 32K
       85 2F 32 2D 15 6B D7 A5 37 14 CB BD A9 AC A4 43>)
$$ ##END=
$$ 
$$ hash MD5
$$ BB 47 3C 78 ED BC 11 A5 29 E7 4E 99 B1 6F 63 96
##$RELAX= 
##$RELAX= 
##$RELAX= 
##$RELAX= 
##$RELAX= 
##$RELAX= 
##$RELAX= 
##$RELAX= 
$$ Bruker specific parameters
$$ --------------------------
##$DU= <F:/spectra>
##$EXPNO= 1
##$NAME= <c13>
##$PROCNO= 1
##$TYPE= <nmr>
##$USER= <she>
##$AMP= (0..31)
100 100 100 100 100 100 100 100 100 100 100 100 100 100 100 100 100 100 
100 100 100 100 100 100 100 100 100 100 100 100 100 100 
##$AQSEQ= 0
##$AQ_mod= 1
##$AUNM= <au_zg>
##$AUTOPOS= <>
##$BF1= 50.322709
##$BF2= 200.13
##$BF3= 50.322709
##$BF4= 500.13
##$BF5= 500.13
##$BF6= 500.13
##$BF7= 500.13
##$BF8= 500.13
##$BYTORDA= 1
##$CFDGTYP= 0
##$CFRGTYP= 5
##$CHEMSTR= <none>
##$CNST= (0..31)
1 1 145 1 1 1 1 1 1 1 1 1 1 1 1 1 1 1 1 1 1 1 1 1 1 1 1 1 1 1 1 1 
##$CPDPRG= <waltz16>
##$CPDPRG1= <>
##$CPDPRG2= <waltz16>
##$CPDPRG3= <>
##$CPDPRG4= <mlev>
##$CPDPRG5= <mlev>
##$CPDPRG6= <mlev>
##$CPDPRG7= <mlev>
##$CPDPRG8= <mlev>
##$CPDPRGB= <>
##$CPDPRGT= <>
##$D= (0..31)
$$ [...]
##$SUBNAM4= <"">
##$SUBNAM5= <"">
##$SUBNAM6= <"">
##$SUBNAM7= <"">
##$SUBNAM8= <"">
##$SUBNAM9= <"">
##$SW= 239.972175391363
##$SWIBOX= (0..15)
0 1 3 0 0 0 0 0 0 0 0 0 0 0 0 0 
##$SW_h= 12077.2946859903
##$TD= 32768
##$TD0= 1
##$TE= 0
##$TE2= 300
##$TE3= 300
##$TEG= 300
##$TL= (0..7)
120 120 120 120 120 120 120 120 
##$TP= (0..7)
150 150 150 150 150 150 150 150 
##$TP07= 0
##$TPNAME0= <>
##$TPNAME1= <>
##$TPNAME2= <>
##$TPNAME3= <>
##$TPNAME4= <>
##$TPNAME5= <>
##$TPNAME6= <>
##$TPNAME7= <>
##$TPOAL= (0..7)
0.5 0.5 0.5 0.5 0.5 0.5 0.5 0.5 
##$TPOFFS= (0..7)
0 0 0 0 0 0 0 0 
##$TUNHIN= 0
##$TUNHOUT= 0
##$TUNXOUT= 0
##$USERA1= <user>
##$USERA2= <user>
##$USERA3= <user>
##$USERA4= <user>
##$USERA5= <user>
##$V9= 5
##$VALIST= <valist>
##$VCLIST= <CCCCCCCCCCCCCCC>
##$VD= 0
##$VDLIST= <DDDDDDDDDDDDDDD>
##$VPLIST= <PPPPPPPPPPPPPPP>
##$VTLIST= <TTTTTTTTTTTTTTT>
##$WBST= 1024
##$WBSW= 4
##$XGAIN= (0..3)
0 0 0 0 
##$XL= 0
##$YL= 0
##$YMAX_a= 142026929
##$YMIN_a= -34232212
##$ZGOPTNS= <>
##$ZL1= 120
##$ZL2= 120
##$ZL3= 120
##$ZL4= 120
##$ABSF1= 222.6533
##$ABSF2= -17.34351
##$ABSG= 5
##$ABSL= 3
##$ALPHA= 0
##$AQORDER= 0
##$ASSFAC= 0
##$ASSFACI= 0
##$ASSFACX= 0
##$ASSWID= 0
##$AUNMP= <proc_1d>
##$AZFE= 0.1
##$AZFW= 0.5
##$BCFW= 0
##$BC_mod= 2
##$BYTORDP= 0
##$COROFFS= 0
##$CY= -3
##$DATMOD= 1
##$DC= 0
##$DFILT= <>
##$DTYPP= 0
##$F1P= 0
##$F2P= 0
##$FCOR= 0.5
##$FTSIZE= 32768
##$FT_mod= 6
##$GAMMA= 0
##$GB= 0
##$INTBC= 1
##$INTSCL= 4.134877e-10
##$ISEN= 128
##$LB= 1
##$LEV0= 0
##$LPBIN= 0
##$MAXI= 10000
##$MC2= 0
##$MEAN= 0
##$ME_mod= 0
##$MI= 0.1934396
##$NCOEF= 0
##$NC_proc= 3
##$NLEV= 6
##$NOISF1= 120.0001
##$NOISF2= 80.00006
##$NSP= 0
##$NTH_PI= 0
##$NZP= 0
##$OFFSET= 222.6533
##$PC= 1.4
##$PHC0= -336.6931
##$PHC1= 74.08469
##$PH_mod= 1
##$PKNL= yes
##$PPARMOD= 0
##$PSCAL= 0
##$PSIGN= 0
##$REVERSE= no
##$SF= 50.322730123286
##$SI= 32768
##$SIGF1= 140
##$SIGF2= 120
##$SINO= 11.81781
##$SIOLD= 32768
##$SREGLST= <13C.CDCl3>
##$SSB= 0
##$STSI= 32768
##$STSR= 0
##$SW_p= 12077.2946859903
##$SYMM= 0
##$S_DEV= 0
##$TDeff= 32768
##$TDoff= 0
##$TI= <>
##$TILT= no
##$TM1= 0
##$TM2= 0
##$TOPLEV= 0
##$USERP1= <user>
##$USERP2= <user>
##$USERP3= <user>
##$USERP4= <user>
##$USERP5= <user>
##$WDW= 1
##$XDIM= 32768
##$YMAX_p= 273290554
##$YMIN_p= -1443961
$$ End of Bruker specific parameters
$$ ---------------------------------
##NTUPLES= NMR SPECTRUM
##VAR_NAME=  FREQUENCY,     SPECTRUM/REAL,   SPECTRUM/IMAG
##SYMBOL=    X,             R,               I
##VAR_TYPE=  INDEPENDENT,   DEPENDENT,       DEPENDENT
##VAR_FORM=  AFFN,          ASDF,            ASDF
##VAR_DIM=   32768,         32768,           32768
##UNITS=     HZ,            ARBITRARY UNITS, ARBITRARY UNITS
##FACTOR=    0.368581032318806, 1,           1
##FIRST=     11204.5221812756, 0,            0
##LAST=      -872.772504714734, 0,           0
##MIN=       -872.772504714734, -1443961,    0
##MAX=       11204.5221812756, 273290554,    0
$$ Real data points
##PAGE= N=1
##DATA TABLE= (X++(R..R)), XYDATA
$$ [...]
$$ plain form
15836 -376451 -270170 -84816 -76874 85083 255262 244599 252283 262302 139652 -3445 25128
15825 25128 84735 156446 286748 315451 182498 33063 -90055 -195968 -339185 -393439
15815 -393439 -470379 -341691 40729 373426 440216 377535 531916 539654 294974 47546
15805 47546 78214 162185 37768 -57633 11949 -80674 -167523 -109963 -32840 60015 365805
15794 365805 592117 481190 23609 36239 287531 329806 260281 238923 339765 276121
15784 276121 2305 -209504 -80158 340909 612852 369820 -63855 -171798 -55636 237450
15774 237450 332566 353283 394970 266976 304367 255545 98508 122652 141916 -39409 -222959
15763 -222959 -3421 564657 826254 753549 497866 319087 208272 -27992 -391320 -559719
$$ packed form
15836c76451J06281J85354P942J61957J70179j0663P684J0019j22650j43097K8573
15825B5128N9607P1711J30302K8703j32953j49435j23118j05913j43217n4254
15815c93439p6940J28688L82420L32697O6790o2681J54381P738k44680k47428
15805D7546L0668Q3971j24417r5401O9582r2623q6849N7560P7123R2855L05790
15794C65805K26312j10927m57581J2630K51292M2275o9525k1358J00842o3644
15784B76121k73816k11809J29346M21067K71943k43032m33675j07943J16162K93086
15774B37450R5116K0717M1687j27994L7391m8822j57037K4144J9264j81325j83550
15763b22959K19538N68078K61597p2705k55683j78779j10815k36264l63328j68399
$$ plain form
15753 -559719 -544404 -421902 -143627 192030 369731 232686 -43676 -44613 -65224 -246893
15743 -246893 -187818 11986 140028 331796 369025 219364 171136 172735 132075 162524 236153
15732 236153 207790 -33129 -147568 -159325 10649 213331 85192 12026 124969 266738
15722 266738 80009 -180286 -236476 -118200 -84657 -141906 -246007 -427863 -449175 -343069
15712 -343069 -188817 -150128 -166565 -277044 -352369 -464342 -624683 -677157 -658435 -634791 -451248
15701 -451248 -206412 41593 146261 139404 -14178 -157603 -140981 -25237 43263 -50299
15691 -50299 -112816 -191470 -255515 -173322 -331904 -545670 -710369 -723745 -500829 -115195 190846
15680 190846 183343 197658 71201 -143709 -246378 -378178 -340647 -176446 -27752 9225
$$ packed form
15753e59719J5315J22502K78275L35657J77701j37045k76362r37k0611j81669
15743b46893N9075J99804J28042J91768L7229j49661m8228J599m0660L0449P3629
15732B36153k8363k40919j14439j1757J69974K02682j28139p3166J12943J41769
15722B66738j86729k60295n6190J18276L3543n7249j04101j81856k1312J06106
15712c43069J54252L8689j6437j10479p5325j11973j60341n2474J8722K3644J83543
15701d51248K44836K48005J04668o857j53582j43425J6622J15744O8500r3562
15691e0299o2517p8654o4045Q2193j58582k13766j64699j3376K22916L85634L06041
15680A90846p503J4315j26457k14910j02669j31800L7531J64201J48694L6977
$$ plain form
15670 9225 -7964 123200 308303 86628 -380002 -494293 -451756 -275907 -51128 286125
15660 286125 508484 411603 267821 367515 245113 -18367 -154539 -189835 -81304 115319
15650 115319 191362 338352 566755 730815 663651 445051 317005 115617 -303371 -500252
15640 -500252 -330585 -137958 -127860 -199158 -127267 -175340 -419304 -558049 -469873 -289415
15630 -289415 -117839 -1979 52479 57016 -208701 -457531 -564879 -581549 -506510 -342221
15620 -342221 -244026 -78748 111554 -8392 -150758 -123075 -171887 -216708 -52370 -2260
15610 -2260 4319 -93668 -173124 -64081 -44986 -132097 -193263 -415597 -655478 -534369 -296846
15599 -296846 -207081 -130900 -124259 -297011 -547459 -546395 -407617 -98918 -37695 -142068 -213076
$$ packed form
15670I225j7189J31164J85103k21675m66630j14291M2537J75849K24779L37253
15660B86125K22359r6881j43782R9694j22402k63480j36172l5296J08531J96623
15650A15319P6043J46990K28403J64060o7164k18600j28046k01388m18988j96881
15640e00252J69667J92627J0098p1298P1891m8073k43964j38745Q8176J80458
15630b89415J71576J15860N4458M537k65717k48830j07348j6670P5039J64289
15620c42221R8195J65278J90302j19946j42366K7683m8812m4821J64338N0110
15610b260O579r7987p9456J09043J9095q7111o1166k22334k39881J21109K37523
15599b96846Q9765P6181O641j72752k50448J064J38778L08699O1223j04373p1008
$$ plain form
15588 -213076 -220191 -107134 -63494 -234990 -234958 -151194 -137747 -101924 27339 192650 216924
15577 216924 83023 -132608 -336929 -241007 82292 237013 193840 111239 -4068 -29627
15567 -29627 -119721 -107288 -190774 -255051 -309183 -145404 45452 -161221 -522725 -768448 -562371
15556 -562371 -307669 -226926 -208116 -217954 -648420 -1022147 -836565 -580713 -518406 -300729
15546 -300729 -161062 -285288 -450375 -603258 -700187 -739780 -697200 -586090 -500491 -337413
15536 -337413 -187310 -62596 -150383 -362166 -505802 -532653 -747123 -788177 -705492 -634380
15526 -634380 -562149 -505762 -401979 -344517 -404804 -263832 -196842 -324990 -317971 -269154 -218745
15515 -218745 -114822 3381 61854 -7089 -112982 -113763 76507 80177 169333 331281 339514
$$ packed form
15588b13076p115J13057M3640j71496L2Q3764J3447L5823J29263J65311K4274
15577B16924j33901k15631k04321R5922L23299J54721m3173q2601j15307k5559
15567b9627r0094J2433q3486o4277n4132J63779J90856k06673l61504k45723K06077
15556e62371K54702Q0743J8810r838m30466l73727J85582K55852O2307K17677
15546c00729J39667j24226j65087j52883r6929l9593M2580J11110Q5599J63078
15536c37413J50103J24714q7787k11783j43636k6851k14470m1054Q2685P1112
15526f34380P2231N6387J03783N7462o0287J40972O6990j28148P019M8817N0409
15515b18745J03923J18203N8473o8943j05893p81J90270L670Q9156J61948Q233
$$ plain form
15504 339514 168745 -68471 -145668 -102675 -62027 -37083 -15869 -43375 -16653 -6984 263866
15493 263866 437107 338656 385300 614629 814006 764152 760646 776617 644318 367100 95898
15482 95898 47285 85258 103602 140952 224458 433057 404912 358887 339986 507334 726085
15471 726085 457501 86968 25080 84096 -44858 -134813 -87417 -74722 -207720 -195863 28445
15460 28445 175674 44042 106464 165139 81480 -113834 -180379 -41250 -78885 -141980 -144889
15449 -144889 -199203 -211388 -236260 -467534 -467701 -293889 -245350 -296083 -420940 -533558 -451367
15438 -451367 -350892 -422299 -408451 -198883 -58046 -73832 -8193 36133 147534 316059
15428 316059 413763 350127 110846 28372 -68385 -211370 -367306 -390973 -252277 -238898 -186329
$$ packed form
15504C39514j70769k37216p7197M2993M0648K4944K1214k7506K6722R669K70850
15493B63866J73241r8451M6644K29329J99377m9854l506J5971j32299k77218k71202
15482I5898m8613L7973J8344L7350Q3506K08599k8145m6025j8901J67348K18751
15471G26085k68584l70533o1888N9016j28954q9955M7396J2695j32998J1857K24308
15460B8445J47229j31632O2422N8675q3659j95314o6545J39129l7635o3095k909
15449a44889n4314j2185k4872k31274j67J73812M8539n0733j24857j12618Q2191
15438d51367J00475p1407J3848K09568J40837j5786O5639M4326J11401J68525
15428C16059R7704o3636k39281q2474r6757j42985j55936k3667J38696J3379N2569
$$ plain form
15417 -186329 -41996 103529 153628 372785 534403 636253 292439 -228027 -294378 -211575
15407 -211575 -346720 -770741 -844569 -717610 -636321 -470963 -338391 -49237 239325 551782
15397 551782 483070 31711 -186404 55096 217889 154199 307684 466875 617933 561799
15387 561799 306156 4382 130923 310067 373647 484874 405559 350308 294876 141219
15377 141219 -35708 -103671 -159169 -250749 -299615 -402356 -461334 -157867 63036 51357 110552
15366 110552 212596 43526 -161639 -45451 -32417 -78681 54440 23128 -274511 -613259
15356 -613259 -639638 -301250 -55493 138445 130104 22423 -7596 -85264 -186984 -171678 -99923
15345 -99923 52219 113092 93572 74247 126268 289609 376577 150406 -13021 -47121 -49214
$$ packed form
15417a86329J44333J45525N0099K19157J61618J01850l43814n20466o6351Q2803
15407b11575j35145m24021p3828J26959Q1289J65358J32572K89154K88562L12457
15397E51782o8712m51359k18115K41500J62793o3690J53485J59191J51058n6134
15387E61799k55643l01774J26541J79144O3580J11227p9315n5251n5432j53657
15377A41219j76927o7963n5498r1580m8866j02741n8978L03467K20903j1679N9195
15366A10552J02044j69070k05165J16188J3034m6264J33121l1312k97639l38748
15356f13259k6379L38388K45757J93938q341j07681l0019p7668j01720J5306P1755
15345i9923J52142O0873j9520j9325N2021J63341Q6968k26171j63427l4100k093
$$ plain form
15334 -49214 -260250 -424916 -409923 -458425 -522154 -475712 -185123 -289117 -517175 -301088
15324 -301088 11843 242198 262512 72416 -42990 -56399 -191388 -342651 -361109 -307652
15314 -307652 -406115 -466226 -552912 -488026 -118684 264617 324757 171236 93706 86809 19012
15303 19012 -278013 -360085 -394061 -394231 -294735 -156730 -172076 -157250 -95437 -45776 -161972
15292 -161972 -241385 -259828 -214541 -41760 116569 170035 277885 303682 189021 18519
15282 18519 -35976 71232 152321 39175 -10700 -50193 -43910 33257 155824 44070 -184683
15271 -184683 -232301 -179983 -137815 -73484 -88255 -232370 -231233 -215816 -274351 -191571 46369
15260 46369 248418 241309 263882 309423 360903 650444 701520 430578 130526 -114158 -58853
$$ packed form
15334d9214k11036j64666J4993m8502o3729M6442K90589j03994k28058K16087
15324c01088L12931K30355K0314j90096j15406j3409j34989j51263j8458N3457
15314c07652r8463o0111q6686O4886L69342L83301O0140j53521p7530o897o7797
15303A9012k97025q2072l3976j70R9496J38005j5346J4826O1813M9661j16196
15292a61972p9413j8443M5287J72781J58329N3466J07850K5797j14661j70502
15282A8519n4495J07208Q1089j13146m9875l9493O283P7167J22567j11754k28753
15271a84683m7618N2318M2168O4331j4771j44115J137J5417n8535Q2780K37940
15260D6369K02049p109K2573M5541N1480K89541N1076k70942l00052k44684N5305
$$ plain form
15249 -58853 76383 -22788 -95032 99970 350637 365322 20736 -120210 -18001 -21827 -110674
15238 -110674 -103521 -100645 -208303 -349584 -275827 20737 99024 58520 -75590 -94249 -120371
15227 -120371 -233954 -318502 -413013 -506227 -486527 -200592 81351 -86038 -249637 -241657 -47509
15216 -47509 292472 539221 492811 376525 294624 15630 -261020 -430435 -422447 -554931
15206 -554931 -772020 -769160 -572299 -320025 -122996 -184575 -405904 -726452 -812947 -582299
15196 -582299 -253100 -4267 64231 263725 317707 250888 -81829 -358423 -540462 -541438 -324550
15185 -324550 -71447 -16105 -185274 -401448 -674152 -689384 -538724 -283540 -291064 -454457
15175 -454457 -543534 -507416 -232134 -40088 39964 237833 373874 425233 369076 -42637
$$ packed form
15249e8853J35236r9171p2244J95002K50667J4685l44586j40946J02209l826q8847
15238a10674P153K876j07658j41281P3757K96564P8287m0504j34110j8659k6122
15227a20371j13583q4548r4511r3214J9700K85935K81943j67389j63599P980J94148
15216d7509L39981K46749m6410j16286q1901k78994k76650j69415P988j32484
15206e54931k17089K860J96861K52274J97029o1579k21329l20548q6495K30648
15196e82299L29199K48833O8498J99494N3982o6819l32717k76594j82039r76K16888
15185c24550K53103N5342j69169k16174k72704j5232J50660K55184p524j63393
15175d54457q9077L6118K75282J92046Q0052J97869J36041N1359n6157m11713
$$ plain form
15165 -42637 -441857 -608445 -600553 -326011 -47514 -6350 -130431 -63910 116820 158052 195119
15154 195119 283415 344784 163137 -163459 -397137 -350742 -172895 -58750 -208455 -336018
15144 -336018 -264820 -186859 -192737 -173441 -350175 -287317 115464 335550 344188 112716 -50894
15133 -50894 -135911 -235421 -273947 -355116 -312420 -95813 13418 -107882 -27801 240981 446837
15122 446837 560504 492608 460042 449138 181716 -131103 -95357 93419 225147 306077
15112 306077 116656 61194 171865 241968 222504 183489 73608 36139 158539 13876
15102 13876 -67545 157431 363604 477297 433834 443987 561615 591110 361750 155942
15092 155942 85853 47588 -172934 -468908 -305649 -207033 -270093 -268427 -300410 -307804 -313872
$$ packed form
15165d2637l99220j66588P892K74542K78497M1164j24081O6521J80730M1232L7067
15154A95119Q8296O1369j81647l26596k33678M6395J77847J14145j49705j27563
15144c36018P1198P7961n878J9296j76734O2858M02781K20086Q638k31472j63610
15133e0894q5017r9510l8526q1169M2696K16607J09231j21300Q0081K68782K05856
15122D46837J13667o7896l2566j0904k67422l12819L5746J88776J31728Q0930
15112C06077j89421n5462J10671P0103j9464l9015j09881l7469J22400j44663
15102A3876q1421K24976K06173J13693m3463J0153J17628K9495k29360k05808
15092A55942p0089l8265k20522k95974J63259R8616o3060J666l1983p394o068
$$ plain form
15081 -313872 -320793 -282150 -238689 -273476 -383415 -465481 -362255 -296613 -298768 -281993 -315016
15070 -315016 -93518 127426 -88444 -359658 -325446 -120916 -77342 -200548 -533602 -682599
15060 -682599 -533010 -347991 -251696 -19926 179526 35914 42180 91016 73814 59703 274730
15049 274730 369086 324393 174582 46174 -54804 -146980 -153011 -27637 96060 237054
15039 237054 422656 479221 302709 221689 262877 203548 -60344 -223859 -276232 -227009 78339
15028 78339 229445 1615 -161642 -264902 -297572 -10951 245570 285472 158236 -17225
15018 -17225 -4643 -188617 -551511 -741847 -703043 -546700 -239273 -113729 -167535 -459797
15008 -459797 -684280 -508401 -322989 -190345 -71907 142511 370489 438311 443142 455800
$$ packed form
15081c13872o921L8643M3461l4787j09939q2066J03226O5642k155J6775l3023
15070c15016K21498K20944k15870k71214L4212K04530M3574j23206l33054j48997
15060f82599J49589J85019R6295K31770J99452j43612O266M8836j7202j4111K15027
15049B74730R4356m4693j49811j28408j00978r2176o031J25374J23697J40994
15039B37054J85602N6565j76512q1020M1188n9329k63892j63515n2373M9223L05348
15028G8339J51106k27830j63257j03260l2670K86621K56521L9902j27236j75461
15018a7225J2582j83974l62894j90336L8804J56343L07427J25544n3806k92262
15008d59797k24483J75879J85412J32644J18438K14418K27978O7822M831J2658
$$ plain form
14998 455800 424601 404311 182588 -118028 -74502 205464 227203 110885 -150512 -293643
14988 -293643 -258957 -153822 -180648 -201205 -65764 178284 339257 345405 303004 118374 -231638
14977 -231638 -400658 -415282 -237912 49262 280624 451019 694006 860787 734532 420372
14967 420372 110420 -18287 -7577 225495 270866 132686 81864 31474 16903 52657 -72852
14956 -72852 -178900 4122 210427 206276 191517 214500 113580 -147448 -185252 25140 151834
14945 151834 82859 -1007 -235562 -358115 -389576 -349274 -273904 -219818 -261181 -205481 -112219
14934 -112219 -57991 168525 281641 349196 403269 357104 376878 346604 127673 43426 -112219
14923 -112219 -308648 -255432 -111560 -66145 -142424 -185154 -219475 -247362 -89078 -50016 -105302
$$ packed form
14998D55800l1199k0290k21723l00616M3526K79966K1739j16318k61397j43131
14988b93643L4686J05135k6826k0557J35441K44048J60973O148m2401j84630l50012
14977b31638j69020j4624J77370K87174K31362J70395K42987J66781j26255l14160
14967D20372l09952j28707J0710K33072M5371j38180n0822n0390j4571L5754j25509
14956g2852j06048J83022K06305m151j4759K2983j00920k61028l7804K10392J26694
14945A51834o8975q3866k34555j22553l1461M0302P5370N4086m1363N5700R3262
14934a12219N4228K26516J13116O7555N4073m6165J9774l0274k18931q4247j55645
14923a12219j96429N3216J43872M5415p6279m2730l4321k7887J58284L9062n5286
$$ plain form
14912 -105302 -188532 -352283 -608015 -764852 -762681 -589437 -477249 -411298 -304870 -251733
14902 -251733 -204552 -267500 -264337 -168992 -66255 -30674 -89210 -152419 -113033 -124589 -295784
14891 -295784 -318693 7504 271148 216506 161244 -68638 -245070 -417065 -522482 -568180
14881 -568180 -437763 -197051 -53078 28863 67676 37101 -152381 -445926 -695330 -656905
14871 -656905 -294286 -222363 -557002 -413798 -297753 -357149 -426756 -385971 -298021 -228109 -49826
14860 -49826 -11853 -129475 -281819 -148686 -36766 -121011 -213523 -275131 -214135 41986 116590
14849 116590 -22395 -306736 -449943 -399789 -135038 31870 -58606 -184889 -110906 -169820
14839 -169820 -330778 -381923 -616443 -734051 -473777 -36602 307617 451380 505264 406153
$$ packed form
14912a05302q3230j63751k55732j56837K171J73244J12188O5951J06428N3137
14902b51733M7181o2948L163R5345J02737L5581n8536o3209L9386j1556j71195
14891b95784k2909L26197K63644n4642n5262k29882j76432j71995j05417m5698
14881e68180J30417K40712J43973Q1941L8813l0575j89482k93545k49404L8425
14871f56905L62619P1923l34639J43204J16045n9396o9607M0785Q7950O9912J78283
14860d9826L7973j17622j52344J33133J11920q4245r2512o1608O0996K56121P4604
14849A16590j38985k84341j43207N0154K64751J66908r0476j26283P3983n8914
14839a69820j60958n1145k34520j17608K60274M37175L44219J43763N3884r9111
$$ plain form
14829 406153 332337 409037 546273 454065 -8800 -135301 10403 -74129 -86054 4235 121327
14818 121327 143253 90310 39139 119551 241267 192655 203336 17800 66660 273422 468409
14807 468409 572311 518454 384060 185926 274525 403476 217180 194712 292473 307200
14797 307200 325646 221577 7983 -34210 65815 -152968 -556833 -774062 -763090 -786528
14787 -786528 -608498 -240026 38676 215320 204994 247444 287081 272728 237624 290911 252666
14776 252666 155153 140974 214142 302842 264789 332913 200286 -128430 -396498 -390982 -395287
14765 -395287 -425113 -273607 -167341 -335474 -517738 -372290 -297293 -412310 -492673 -437179
14755 -437179 -316782 -220873 -77205 24064 185279 189913 -170357 -503663 -760218 -967434
$$ packed form
14829D06153p3816P6700J37236r2208m62865j26501J45704q4532j1925R0289J17092
14818A21327K1926n2943n1171Q0412J21716m8612J0681j85536M8860K06762J94987
14807D68409J03902n3857j34394j98134Q8599J28951j86296k2468R7761J4727
14797C07200J8446j04069k13594m2193J00025k18783m03865k17229J0972k3438
14787g86528J78030L68472K78702J76644j0326M2450L9637j4353l5104N3287l8245
14776B52666r7513j4179P3168Q8700l8053O8124j32627l28716k68068N516m305
14765c95287k9826J51506J06266j68133j82264J45448P4997j15017q0363N5494
14755d37179J20397R5909J43668J01269J61215M634l60270l33306k56555k07216
$$ plain form
14745 -967434 -1192132 -1155566 -891960 -468089 -104223 -37360 -177548 -396920 -684961 -813703
14735 -813703 -816982 -676474 -606786 -745266 -704291 -523058 -386653 -196109 -63039 -29061
14725 -29061 4593 23509 104775 -11479 -349334 -648073 -680131 -569316 -403149 -19326
14715 -19326 152966 176185 89618 74627 267346 434317 446584 508720 433250 71926 -248272
14704 -248272 -487750 -610619 -460231 -215200 -171456 -316530 -395740 -432634 -613370 -679655
14694 -679655 -442165 -150830 -122264 -155132 -25239 157153 139981 43861 -168478 -274195
14684 -274195 8910 168279 148697 60611 109361 263465 226047 39485 -305113 -273697
14674 -273697 193875 571261 630793 484458 315334 182680 -40644 -379376 -386857 -70681
$$ packed form
14745i67434k24698L6566K63606M23871L63866O6863j40188k19372k88041j28742
14735h13703l279J40508O9688j38480M0975J81233J36405J90544J33070L3978
14725b9061L3654J8916Q1266j16254l37855k98739l2058J10815J66167L83823
14715a9326J72292K3219q6567j4991J92719J66971J2267O2136p5470l61324l20198
14704b48272k39478j22869J50388K45031M3744j45074p9210l6894j80736o6285
14694f79655K37490K91335K8566l2868J29893J82392j7172r6120k12339j05717
14684b74195K83105J59369j9582q8086M8750J54104l7418j86562l44598L1416
14674b73697M67572L77386N9532j46335j69124j32654k23324l38732p481L16176
$$ plain form
14664 -70681 -143095 -398194 -531161 -481792 -162468 189870 154143 -162120 -242497 -180923 -108568
14653 -108568 -229933 -286970 -226689 -1835 98874 38475 195749 247801 272733 279100 195348
14642 195348 9112 -111515 -82589 -57071 -130349 -261346 -369050 -273612 -80174 -131447
14632 -131447 -324634 -487760 -356374 -257922 -279918 -221880 -177968 -258883 -250803 -100375 42350
14621 42350 63603 62596 -59646 -105281 -243766 -209522 97529 420905 350887 212052 313585
14610 313585 386220 389571 291821 72726 -86744 -117569 -146857 -155035 -243491 -20326 260305
14599 260305 232824 218727 333690 235545 -299122 -734811 -618612 -187737 125540 82627
14589 82627 -18107 105023 96953 29933 191381 468809 781823 608037 341492 146465
$$ packed form
14664g0681p2414k55099j32967M9369L19324L52338l5727l16263q0377O1574P2355
14653a08568j21365n7037O0281K24854J00709o0399J57274N2052K4932O367q3752
14642A95348j86236j20627K8926K5518p3278j30997j07704R5438J93438n1273
14632a31447j93187j63126J31386R8452k1996N8038M3912q0915Q080J50428J42725
14621D2350K1253j007j22242m5635j38485L4244L07051L23376p0018j38835J01533
14610C13585P2635L351r7750k19095j59470l0825k9288q178q8456K23165K80631
14599B60305k7481j4097J14963r8145n34667m35689J16199M30875L13277m2913
14589H2627j00734J23130q070o7020J61448K77428L13014j73786k66545j95027
$$ plain form
14579 146465 26164 -191930 -414861 -557032 -762218 -954028 -881957 -722600 -499969 -414684
14569 -414684 -427362 -216316 23577 -26121 -294949 -428042 -339275 -173239 3178 190953
14559 190953 238700 473465 534232 343317 207052 -38358 -117520 55047 310763 403243
14549 403243 286600 -158875 -330647 -105307 181589 361449 273817 28559 -4263 -26349
14539 -26349 -144545 -359742 -564071 -556632 -325773 -173170 -87459 -200697 -288749 -260610 -282995
14528 -282995 -215078 -18985 138748 142810 337854 404914 184790 156011 81295 -100237 -93987
14517 -93987 -158143 -339203 -345154 -122076 -39998 -27305 -147918 -248293 -574775 -769103 -747774
14506 -747774 -653193 -415607 -142398 154104 122722 -44806 -161889 -204404 -320058 -232269
$$ packed form
14579A46465j20301k18094k22931j42171k05186j91810P2071J59357K22631Q5285
14569d14684j2678K11046K39893m9698k68828j33093Q8767J66036J76417J87775
14559A90953M7747K34765O0767j90915j36265k45410p9162J72567K55716R2480
14549D03243j16643m45475j71772K25340K86896J79860q7632k45258l2822k2086
14539b6349j18196k15197k04329P439K30859J52603Q5711j13238q8052K8139k2385
14528b82995O7917J96093J57733M062J95044O7060k20124k8779p4716j81532O250
14517i3987o4156j81060n951K23078Q2078J2693j20613j00375l26482j94328K1329
14506g47774R4581K37586K73209K96502l1382j67528j17083m2515j15654Q7789
$$ plain form
14496 -232269 83757 372258 330315 172786 190442 -19098 -266165 -538852 -683702 -634055
14486 -634055 -578701 -785093 -908997 -843696 -666854 -410845 -135818 120080 179455 101697
14476 101697 36569 -56865 -334087 -582439 -409519 -24936 215782 344943 100410 -169846
14466 -169846 -408117 -629283 -703037 -511397 -183635 -163280 -167181 -88188 73331 117125 11712
14455 11712 19899 201233 181370 -173211 -287841 -240363 -257372 -252400 -209882 -135361 -92691
14444 -92691 -176805 -278530 -547682 -652154 -380182 -29690 229643 221678 46939 -41365
14434 -41365 -61269 18862 42955 -164744 -223191 -141335 -139859 -149953 -65607 35985 156188
14423 156188 130859 20458 -89958 -29209 -40113 -72485 -50622 -100218 -110684 -176337 -175916
$$ packed form
14496b32269L16026K88501m1943j57529J7656k09540k47067k72687j44850M9647
14486f34055N5354k06392j23904O5301J76842K56009K75027K55898N9375p7758
14476A01697o5128r3434k77222k48352J72920L84583K40718J29161k44533k70256
14466a69846k38271k21166p3754J91640L27762K0355l901P8993J61519M3794j05413
14455A1712Q187J81334j9863l54581j14630M7478j7009M972M2518P4521M2670
14444i2691q4114j01725k69152j04472K71972L50492K59333p965j74739q8304
14434d1365j9904Q0131K4093k07699n8447Q1856J476j0094Q4346J01592J20203
14423A56188k5329j10401j10416O0749j0904l2372K1863m9596j0466o5653M21
$$ plain form
14412 -175916 -3769 68849 190102 175413 -61403 -275440 -253735 -18181 140620 10494
14402 10494 -192590 -197781 -101375 -173084 -316453 -396203 -378340 -202620 58908 334033 302643
14391 302643 256266 319730 378956 492114 573765 471827 334021 391089 440706 371475 343668
14380 343668 238087 -11162 -86353 167966 382226 342847 424432 589992 492015 247361
14370 247361 188289 133007 7729 131096 297083 325232 317571 157864 15202 65001 100714
14359 100714 -119028 -416332 -463863 -156542 126409 271256 239400 45911 -52701 -178783
14349 -178783 -413666 -668910 -845978 -655067 -490689 -510651 -408233 -268796 -92470 -69113
14339 -69113 -249735 -319655 -131472 16859 -8649 -198502 -209204 -356891 -369387 -252558
$$ packed form
14412a75916J72147P2618J21253j4689k36816k14037K1705K35554J58801j30126
14402A0494k03084n191R6406p1709j43369p9750J7863J75720K61528K75125l1390
14391C02643m6377O3464N9226J13158Q1651j01938j37806N7068M9617o9231k7807
14380C43668j05581k49249p5191K54319K14260l9379Q1585J65560r7977k44654
14370B47361n9072n5282j25278J23367J65987K8149p661j59707j42662M9799L5713
14359A00714k19742k97304m7531L07321K82951J44847l1856j93489r8612j26082
14349a78783k34883k55244j77068J90911J64378j9962J02418J39437J76326K3357
14339f9113j80622o9920J88183J48331k5508j89853j0702j47687j2496J16829
$$ plain form
14329 -252558 -210182 -122767 -123894 59575 10214 -222505 -186576 103801 353582 455243 478612
14318 478612 158363 -42699 -184601 -296354 -170964 73446 93759 -23163 -339669 -716769
14308 -716769 -975826 -776297 -302972 -72557 52195 262768 319344 161957 -48124 -261742
14298 -261742 -271369 -100506 -48054 -71774 -68884 -124274 -348013 -485320 -397503 -299645 -307877
14287 -307877 -215958 -262200 -466146 -421433 -328705 -254089 -176733 -37266 57124 189191 199893
14276 199893 308752 380979 418804 529387 547306 564816 568249 388463 416635 559945 549625
14265 549625 317435 107252 150847 241479 167332 105569 -106958 -514569 -463703 -91860
14255 -91860 45262 56764 113503 179480 290917 379916 429718 486892 394201 137629 26508
$$ packed form
14329b52558M2376Q7415j127J83469m9361k32719L5929K90377K49781J01661K3369
14318D78612l20249k01062j41902j11753J25390K44410K0313j16922l16506l77100
14308g16769k59057J99529M73325K30415J24752K10573N6576j57387k10081k13618
14298b61742r627J70863N2452k3720K890n5390k23739j37307Q7817R7858q232
14287c07877R1919m6242k03946M4713R2728P4616P7356J39467R4390J32067J0702
14276A99893J08859P2227L7825J10583J7919J7510L433j79786K8172J43310j0320
14265E49625k32190k10183M3595R0632p4147o1763k12527m07611N0866L71843
14255i1860J37122J1502N6739O5977J11437Q8999M9802N7174r2691k56572j11121
$$ plain form
14244 26508 -138600 -424493 -638060 -657050 -582643 -417218 -355933 -424916 -465316 -507487 -368923
14233 -368923 34857 220746 243777 242971 92447 79162 322020 442353 179379 2977
14223 2977 190067 492199 624147 454354 267686 253348 62833 -49076 63802 317107
14213 317107 466317 606270 723698 651925 472371 301582 423663 604847 850662 706655
14203 706655 333437 285707 385055 686932 605620 199532 -90866 -97092 -16616 -176779 -199720
14192 -199720 -150653 -93174 -42265 90862 159369 145344 26921 -37918 -193933 -356275 -373727
14181 -373727 -468972 -384241 -367689 -510743 -494066 -341687 -209115 -67867 -27772 -141008
14171 -141008 -208085 -63042 193433 311833 244257 334456 509408 492764 202259 -186960
$$ packed form
14244B6508j65108k85893k13567j8990P4407J65425O1285o8983m0400m2171J38564
14233c68923M03780J85889K3031q06j50524j3285K42858J20333k62974j76402
14223B977J87090L02132J31948j69793j86668j4338j90515j11909J12878K53305
14213C17107J49210J39953J17428p1773j79554j70789J22081J81184K45815j44007
14203G06655l73218m7730R9348L01877q1312m06088k90398o226Q0476j60163k2941
14192a99720M9067N7479N0909J33127O8507j4025j18423o4839j56015j62342j7452
14181c73727r5245Q4731J6552j43054J6677J52379J32572J41248M0095j13236
14171a41008o7077J45043K56475J18400o7576R0199J74952j6644k90505l89219
$$ plain form
14161 -186960 -556412 -639432 -423867 -186411 85942 498875 805964 1227855 1599814 1805421
14151 1805421 2086512 2228438 2447091 2848189 3256602 3368110 2883107 2275810 1628163
14142 1628163 1226551 1192040 1322763 1311606 1070046 905405 753057 550601 436174 573036
14132 573036 752451 763278 459266 306660 195247 -53802 -109764 20712 16828 -91079
14122 -91079 -69408 -93971 -152115 -229688 -139637 3599 179607 223766 137415 134082 189785
14111 189785 414237 490804 339314 115512 126095 103407 66660 96805 208664 427077
14101 427077 558111 453956 424506 617769 702849 489352 274113 168522 -90363 -343198
14091 -343198 -473738 -442554 -242528 -142047 38990 114106 -5801 6745 63433 144852
$$ packed form
14161a86960l69452q3020K15565K37456K72353M12933L07089M21891L71959K05607
14151A805421K81091J41926K18653M01098M08413J11508m85003o07297o47647
14142A628163m01612l4511J30723j1157k41560j64641j52348k02456j14427J36862
14132E73036J79415J0827l04012j52606j11413k49049n5962J30476l884j07907
14122i1079K1671k4563n8144p7573R0051J43236J76008M4159q6351l333N5703
14111A89785K24452P6567j51490k23802J0583k2688l6747L0145J11859K18413
14101D27077J31034j04155k9450J93263Q5080k13497k15239j05591k58885k52835
14091c43198j30540L1184K00026J00481J81037P5116j19907J2546N6688Q1419
$$ plain form
14081 144852 369777 399000 248354 138304 -68638 -179447 -246706 -142887 36396 131015
14071 131015 55811 60370 139911 248036 337141 350425 327466 349536 270502 213392 149326
14060 149326 52724 19244 129227 286027 206775 142843 272067 564186 627774 259295
14050 259295 -133782 -185570 -90754 70487 202421 477992 675148 757162 743918 525854
14040 525854 441867 440825 410271 377338 197529 15535 -197426 -214243 28078 66189 146470
14029 146470 139855 100893 136037 98770 -10976 -117944 -269707 -296963 -220608 -270101 -274120
14018 -274120 -63709 493 -63949 -174164 -273961 -183912 -276372 -411778 -590248 -459571
14008 -459571 -178172 -121378 -275385 -278112 -115335 -244497 -174514 -17982 113876 101464
$$ packed form
14081A44852K24925K9223j50646j10050k06942j10809o7259J03819J79283R4619
14071A31015p5204M559P9541J08125Q9105J3284k2959K2070p9034n7110o4066
14060A49326r6602l3480J09983J56800p9252o3932J29224K92119O3588l68479
14050B59295l93077n1788R4816J61241J31934K75571J97156Q2014j3244k18064
14040E25854q3987j042l0554l2933j79809j81994k12961j6817K42321L8111Q0281
14029A46470o615l8962L5144l7267j09746j06968j51763k7256P6355m9493m019
14018b74120K10411O4202o4442j10215r9797R0049r2460j35406j78470J30677
14008d59571K81399N6794j54007k727J62777j29162O9983J56532J31858j2412
$$ plain form
13998 101464 -71355 -155062 -161624 -199179 -168369 -110548 -215260 -322227 -242440 -231525 -401325
13987 -401325 -507154 -265089 -119551 -58341 -37691 -117614 -281796 -224887 -108582 80030
13977 80030 295926 313224 401968 474329 623167 873853 958167 776971 419729 200842
13967 200842 259544 299582 334923 381000 375703 176460 30551 -146154 -327152 -330919 -91171
13956 -91171 216452 258281 153692 162788 382640 496821 402481 170512 111481 128624 50373
13945 50373 97233 304082 326727 324542 215327 14055 -25398 38331 204603 256726 388958
13934 388958 720377 835563 438082 58849 -55485 -114649 -40005 175990 212117 224151
13924 224151 241243 -72232 -602895 -761796 -662679 -698221 -741420 -716155 -752288 -626119 -176654
$$ packed form
13998A01464j72819q3707o562l7555L0810N7821j04712j06967P9787J0915j69800
13987d01325j05829K42065J45538O1210K0650p9923j64182N6909J16305J88612
13977H0030K15896J7298Q8744P2361J48838K50686Q4314j81196l57242k18887
13967B00842N8702M0038L5341M6077n297j99243j45909j76705j80998l767K39748
13956i1171L07623M1829j04589R096K19852J14181r4340k31969n9031J7143p8251
13945E0373M6860K06849K2645k185j09215k01272l9453O3729J66272N2123J32232
13934C88958L31419J15186l97481l79233j14334n9164P4644K15995L6127J2034
13924B24151J7092l13475n30663j58901R9117l5542m3199K5265l6133J26169M49465
$$ plain form
13913 -176654 224933 320459 320645 67640 -140117 -85570 -41287 -64384 -312225 -407815 -94266
13902 -94266 51503 65919 14590 82274 217775 197584 7323 -184265 -312364 -345142 -232987
13891 -232987 -307908 -590160 -724675 -539600 -166166 51564 98792 276827 327780 183930
13881 183930 -19970 -291559 -363874 -357482 -262305 -86253 158735 297150 200468 207709 312175
13870 312175 354194 268306 268439 257152 6623 -174623 -98203 -55287 -137707 -120815 -32821
13859 -32821 -136052 -206372 -311929 -437670 -169554 59370 56034 -103945 -179696 -220486 -108019
13848 -108019 111617 196939 -10220 -100263 14171 -16470 -132351 -148489 -152590 -85134 17670
13837 17670 -1229 27938 -141795 -505134 -615354 -403354 -205915 -232302 -216762 -96738
$$ packed form
13913a76654M01587R5526J86k53005k07757N4547M4283k3097k47841r5590L13549
13902i4266J45769J4416n1329O7684J35501k0191j90261j91588j28099l2778J12155
13891b32987p4921k82252j34515J85075L73434K17730M7228J78035N0953j43850
13881A83930k03900k71589p2315O392R5177J76052K44988J38415r6682P241J04466
13870C12175M2019q5888J33j1287k50529j81246P6420M2916q2420J6892Q7994
13859c2821j03231p0320j05557j25741K68116K28924l336j59979p5751m0790J12467
13848a08019K19636Q5322k07159r0043J14434l0641j15881j6138m101O7456J02804
13837A7670j8899K9167j69733l63339j10220K12000J97439k6387J5540J20024
$$ plain form
13827 -96738 -34999 -4885 24747 224973 549414 670794 572514 459686 520009 408171 320909
13816 320909 314289 179164 304436 701425 972112 1067961 805748 323480 85730 65695
13806 65695 -112798 -400193 -482259 -503342 -626321 -734770 -557084 -283578 -270760 -313288
13796 -313288 -258399 -335402 -371771 -241424 34693 246879 162911 28712 -207955 -363396
13786 -363396 -450193 -422614 -437048 -499871 -424001 -268969 -326845 -447627 -606613 -906025 -718823
13775 -718823 -244108 13821 139821 231546 329392 431712 396755 429568 395750 197252
13765 197252 -95848 -250109 -336419 -153014 -36472 -321769 -658106 -675102 -483700 -380563
13755 -380563 -402056 -362967 -327557 -460241 -573315 -584856 -769855 -1109523 -1167583 -743680
$$ packed form
13827i6738O1739L0114K9632K00226L24441J21380r8280j12828O0323j11838q7262
13816C20909o620j35125J25272L96989K70687R5849k62213m82268k37750k0035
13806F5695j78493k87395q2066k1083j22979j08449J77686K73506J2818m2528
13796c13288N4889p7003l6369J30347K76117K12186q3968j34199k36667j55441
13786c63396q6797K7579j4434o2823P5870J55032n7876j20782j58986k99412J87202
13775g18823M74715K57929J26000R1725R7846J02320l4957L2813l3818j98498
13765A97252k93100j54261q6310J83405J16542k85297l36337j6996J91402J03137
13755c80563k1493L9089L5410j32684j13074j1541j84999l39668n8060M23903
$$ plain form
13745 -743680 -309039 -197367 -308924 -496223 -526315 -405557 -300037 -215368 -208092 -290228
13735 -290228 -272680 -91062 -150958 -316350 -217783 -66183 -234249 -344125 -263887 -128695
13725 -128695 -201339 -193728 48851 25789 -65874 -31846 -203173 -332050 -211311 -103946 63470
13714 63470 154154 -29261 -225506 -280337 -219998 -311881 -440920 -449386 -414500 -406198 -421148
13703 -421148 -270351 -226641 -183412 42940 246806 346621 320778 186827 97313 299919
13693 299919 521572 376185 -850 -260663 -304314 -313135 -356897 -371149 -408725 -377009 -275483
13682 -275483 -46146 -6744 135621 350584 319607 225800 133469 94291 132208 156996 166292
13671 166292 36939 -180638 -175621 25558 -165790 -511566 -381191 -215525 -316492 -89659
$$ packed form
13745g43680M34641J11672j11557j87299l0092J20758J05520Q4669P276q2136
13735b90228J7548J81618n9896j65392R8567J51600j68066j09876Q0238J35192
13725a28695p2644P611K42579k3062r1663L4028j71327j28877J20739J07365J67416
13714F3470R0684j83415j96245n4831O0339r1883j29039q466L4886Q302j4950
13703d21148J50797M3710M3229K26352K03866R9815k5843j33951q9514K02606
13693B99919K21653j45387l77035k59813m3651q821m3762j4252l7576L1716J01526
13682b75483K29337L9402J42365K14963l0977r3807r2331l9178L7917K4788R296
13671A66292j29353k17577N017K01179j91348l45776J30375J65666j00967K26833
$$ plain form
13661 -89659 214361 210858 120729 92226 54942 -95680 -192850 -42431 324743 549534 566538
13650 566538 485654 596546 534910 445242 335717 166666 28015 -67359 -103412 -165345 -188396
13639 -188396 -92930 70307 302361 686330 848859 705824 522815 192099 -5414 75139
13629 75139 309289 400483 185831 -55076 -14558 82204 18448 -160791 -236215 -53725 -5591
13618 -5591 -228600 -353001 -179063 -75287 -308268 -396826 -154163 188016 170910 -5557
13608 -5557 -157660 -239227 -121161 -28324 -43615 22372 33715 -192150 -384321 -498112 -529164
13597 -529164 -644077 -588779 -358611 -137257 -85473 -108646 -99872 -167401 -554865 -797687 -502662
13586 -502662 -150548 -22379 -78276 -58245 133874 107118 -143244 -288532 -267761 -89337
$$ packed form
13661h9659L04020l503r0129k8503l7284j50622r7170J50419L67174K24791J7004
13650E66538q0884J10892o1636q9668j09525j69051j38651r5374l6053o1933k3051
13639a88396R5466J63237K32054L83969J62529j43035j83009l30716j97513Q0553
13629G5139K34150R1194k14652k40907M0518R6762o3756j79239p5424J82490M8134
13618e591k23009j24401J73938J03776k32981q8558K42663L42179j7106j76467
13608e557j52103q1567J18066R2837j5291O5987J1343k25865j92171j13791l1052
13597e29164j14913N5298K30168K21354N1784k3173Q774o7529l87464k42822K95025
13586e02662L52114J28169n5897K0031J92119k6756k50362j45288K0771J78424
$$ plain form
13576 -89337 -37367 -126517 -45809 84841 210833 152461 172294 188277 235867 262959 17588
13565 17588 -120890 -164244 -137235 -200406 -160910 18477 91868 -44320 -61574 41455 79351
13554 79351 69655 109391 47116 -282756 -561565 -518015 -267671 -180989 -165828 -128603 -175379
13543 -175379 -291129 -149806 67752 26584 -65456 -306469 -610670 -544399 -207345 -112117
13533 -112117 -315143 -317903 -250171 -281996 -412198 -468344 -480901 -499036 -451265 -453863 -516582
13522 -516582 -378141 -224831 -241705 -517648 -696358 -463833 -218770 -218865 -137076 -136065 -38652
13511 -38652 -340 -18097 214002 152887 -9676 -191960 -247679 -306009 -482492 -526880 -353201
13500 -353201 -199609 -144249 -125407 -61146 67283 110556 51533 -103571 -172854 -103425 -115144
$$ packed form
13576h9337N1970q9150Q0708J30650J25992n8372J9833J5983M7590K7092k45371
13565A7588j38478m3354K7009o3171L9496J79387P3391j36188j7254J03029L7896
13554G9351r696L9736o2275l29872k78809M3550K50344Q6682J5161L7225m6776
13543a75379j15750J41323K17558m1168r2040k41013l04201O6271L37054R5228
13533a12117k03026k760O7732l1825j30202n6146j2557j8135M7771k598o2719
13522e16582J38441J53310j6874k75943j78710K32525K45063r5Q1789J011R7413
13511c8652L8312j7757K32099o1115j62563j82284n5719n8330j76483m4388J73679
13500c53201J53592N5360J8842O4261J28429M3273n9023j55104o9283O9429j1719
$$ plain form
13489 -115144 -183732 -223453 -201424 -95823 -61540 -79661 -42267 -25827 -121890 -347959 -583638
13478 -583638 -406103 -196511 143952 416007 367721 314689 179938 196011 220311 26806
13468 26806 -121557 -62919 205998 341754 349488 236102 -95519 -398986 -597230 -544297
13458 -544297 -299612 23999 134311 164536 -456 -184694 -236542 48259 210390 109759
13448 109759 -80053 -106551 -152369 -358383 -396067 -149481 35927 14093 -250644 -487317
13438 -487317 -464308 -424734 -288103 -205789 -65782 26517 -5722 -75568 -182486 -250448 -144703
13427 -144703 126572 158542 74263 -4123 66219 70356 38770 -27537 34623 173842 430666
13416 430666 516714 414661 348324 327313 169547 -99801 -125106 115629 251490 164587
$$ packed form
13489a15144o8588l9721K2029J05601L4283j8121L7394J6440r6063k26069k35679
13478e83638J77535K09592L40463K72055m8286n3032j34751J6073K4300j93505
13468B6806j48363N8638K68917J35756P734j13386l31621l03467j98244N2933
13458e44297K44685L23611J10312L0225j64992j84238n1848K84801J62131j00631
13448A09759j89812k6498m5818k06014l7684K46586J85408k1834k64737k36673
13438d87317K3009L9574J36631Q2314J40007R2299l2239o9846j06918o7962J05745
13427a44703K71275L1970q4279p8386P0342M137l1586o6307O2160J39219K56824
13416D30666Q6048j02053o6337k1011j57766k69348k5305K40735J35861q6903
$$ plain form
13406 164587 -93823 -272615 -205243 -304255 -453020 -582047 -638836 -457692 -25508 304256
13396 304256 355162 155230 14397 -80761 -161299 -93029 -60581 1329 295074 376931 128234
13385 128234 -96386 -295530 -341271 -161138 -110687 -138605 -251164 -369735 -164089 83884
13375 83884 48954 -5807 40615 70151 208991 224277 109821 18691 113280 120728 8556
13364 8556 -150793 -178851 -115091 -128865 -8016 60272 116610 106695 12475 24317 155040
13353 155040 386964 662087 929058 742744 437420 398714 339775 563034 1013472 1354362
13343 1354362 1904416 2635579 3239938 3993354 4639683 4379547 3408570 2510582 1653162
13334 1653162 1013099 771825 695257 658301 733039 661469 398664 110032 159609 580914
$$ packed form
13406A64587k58410j78792O7372r9012j48765j29027n6789J81144M32184L29764
13396C04256N0906j99932j40833r5158q0538O8270L2448O1910K93745Q1857k48697
13385A28234k24620j99144m5741J80133N0451k7918j12559j18571K05646K47973
13375H3884l4930n4761M6422K9536J38840J5286j14456r1130R4589P448j12172
13364H556j59349k8058O3760j3774J20849O8288N6338r915r4220J1842J30723
13353A55040K31924K75123K66971j86314l05324l8706n8939K23259M50438L40890
13343A354362N50054P31163O04359P53416O46329k60136r70977q97988q57420
13334A653162o40063k41274p6568l6956P4738p1570k62805k88632M9577M21305
$$ plain form
13324 580914 536516 257373 182156 238700 346438 264520 409801 599170 613955 595381 514012
13313 514012 343202 219985 -47186 -304467 -433113 -408442 -222040 -84527 240237 493559
13303 493559 404483 235956 241965 322844 263443 77307 61794 174744 274753 348951 486715
13292 486715 536637 552115 504491 420305 354233 370735 481529 512953 352022 6867 -147161
13281 -147161 -66671 59324 128703 145622 -14628 -99215 186251 463987 347956 349850 250240
13270 250240 -113180 -204035 -216573 -65784 196054 101317 55526 307278 384235 90705
13260 90705 -217946 -428137 -284138 133223 354107 209528 164835 239412 186683 123555
13250 123555 22143 -204435 -290117 -234168 -235262 -255391 -163445 -10476 260371 512402 520408
$$ packed form
13324E80914m4398k79143p5217N6544J07738q1918J45281J89369J4785j8574q1369
13313E14012j70810j23217k67171k57281j28646K4671J86402J37513L24764K53322
13303D93559q9076j68527O009Q0879n9401j86136j5513J12950J00009P4198J37764
13292D86715M9922J5478m7624q4186o6072J6502J10794L1424j60931l45155j54028
13281a47161Q0490J25995O9379J6919j60250q4587K85466K77736j16031J894r9610
13270B50240l63420r0855j2538J50789K61838r4737m5791K51752P6957k93530
13260I0705l08651k10191J43999M17361K20884j44579m4693P4577n2729o3128
13250A23555j01412k26578q5682N5949j094k0129R1946J52969K70847K52031Q006
$$ plain form
13239 520408 448540 189236 84439 366664 510906 391654 121672 -31713 -10024 93250
13229 93250 146157 180036 397570 377518 -40599 -279517 -217353 -197418 -149968 -31619 24711
13218 24711 169561 205807 238953 464889 582401 621855 736794 446210 403169 408059 220981
13207 220981 188682 164208 121674 -56212 -88948 144330 429305 583671 520156 152091
13197 152091 -110273 -116501 -193776 -373204 -327933 -310267 -194653 -6130 53229 1858 -5026
13186 -5026 186392 433877 554939 655979 742891 746396 514689 225559 26531 132300
13176 132300 494021 791060 866493 667674 489819 319206 158915 240386 265209 224119
13166 224119 377503 742109 827716 734227 757394 727249 548792 277315 -42396 -69165
$$ packed form
13239E20408p1868k59304j04797K82225J44242j19252k69982j53385K1689J03274
13229I3250N2907L3879K17534k0052m18117k38918O2164J9935M7450J18349N6330
13218B4711J44850L6246L3146K25936J17512L9454J14939k90584m3041M890j87078
13207B20981l2299k4474m2534j77886l2736K33278K84975J54366o3515l68065
13197A52091k62364o228p7275j79428M5271J7666J15614J88523N9359n1371o884
13186e026J91418K47485J21062J01040Q6912L505k31707k89130j99028J05769
13176A32300L61721K97039P5433j98819j77855j70613j60291Q1471K4823m1090
13166B24119J53384L64606Q5607r3489K3167l0145j78457k71477l19711k6769
$$ plain form
13156 -69165 109069 204173 339236 365785 360960 289897 177204 77966 -139135 -145509 59357
13145 59357 232954 302121 345680 105436 -75568 70922 326704 440714 359979 472755
13135 472755 774489 927785 970526 954743 624589 494163 583365 785259 966508 1058005
13125 1058005 1083978 878217 554379 402549 538443 773822 746470 587147 490570 561721
13115 561721 608015 695989 831447 797262 754892 492731 17874 -74843 63297 142864 212857
13104 212857 310869 328405 260581 216842 59851 12313 92974 270097 539412 820130 1150844
13093 1150844 1088463 967074 1082355 1119740 909178 791253 976134 1120498 969086 885300
13083 885300 851238 844505 838932 784998 693000 528136 484647 692712 967756 978685 976360
$$ packed form
13156f9165J78234R5104J35063K6549m825p1063j12693r9238k17101o374K04866
13145E9357J73597O9167M3559k40244j81004J46490K55782J14010q0735J12776
13135D72755L01734J53296M2741j5783l30154j30426Q9202K01894J81249R1497
13125A058005K5973k05761l23838j51830J35894K35379k7352j59323r6577P1151
13115E61721M6294Q7974J35458l4185m2370k62161m74857r2717J38140P9567O9993
13104B12857R8012J7536o7824m3739j56991m7538Q0661J77123K69315K80718L30714
13093A150844o2381j21389J15281L7385k10562j17925J84881J44364j51412q3786
13083H85300l4062o733n573n3934r1998j64864m3489K08065K75044J0929k325
$$ plain form
13072 976360 1026619 1219614 1325265 1244492 1028106 984929 1148813 1376631 1678465 1729112
13062 1729112 1590929 1617951 1727186 1841940 1862438 1855187 1802517 1709671 1428696 1177311
13052 1177311 1330218 1681965 2044817 2229514 2171919 2189967 2301321 2265995 2158780 2142462
13042 2142462 2114582 2114849 2268160 2374504 2425672 2505355 2312174 2007328 1897185 1932764 2178381
13031 2178381 2552531 2757085 2661251 2541887 2577273 2644732 2871444 3065576 3215575 3281616
13021 3281616 3236846 3344525 3357466 3358518 3369254 3385620 3313824 3446119 3627048 3527577 3613894
13010 3613894 4004573 4478218 4922819 5063565 5026442 5095181 5189833 5332796 5598196 5948307
13000 5948307 6036678 6154296 6820863 7527834 7869047 8198782 8802252 9651615 10649269 11882399
$$ packed form
13072I76360N0259J92995J05651q0773k16386m3177J63884K27818L01834N0647
13062A729112j38183K7022J09235J14754K0498p251n2670r2846k80975k51385
13052A177311J52907L51747L62852J84697n7595J8048J11354l5326j07215j6318
13042B142462k7880K67J53311J06344N1168P9683j93181l04846j10143L5579K45617
13031B178381L74150K04554r5834j19364L5386O7459K26712J94132J49999O6041
13021C281616m4770J07679J2941J052J0736J6366p1796J32295J80929r9471Q6317
13010C613894L90679M73645M44601J40746l7123O8739R4652J42963K65400L50111
13000E948307Q8371J17618O66567P06971L41213L29735O03470Q49363R97654J233130
$$ plain form
12990 11882399 13274550 14622068 16040434 17928464 20573817 23950619 28036499 32941835
12982 32941835 38903688 46149170 55366305 67183105 82518651 102827739 129612716
12975 129612716 164399527 206482276 247401705 268626406 256578787 219515594 176809360
12968 176809360 140035753 111494843 89894761 73725652 61385470 51707514 44189577
12961 44189577 37936340 32996373 29016945 25425027 22524338 20321406 18476378 16793159
12953 16793159 15356936 14240527 13339289 12430437 11453993 10747358 9978223 9121896 8517882
12944 8517882 8139432 7856455 7613473 7286117 6958998 6820167 6617016 6479052 6504976 6452747
12934 6452747 6177798 6040651 6098239 5950923 5765146 5903074 6075944 6196540 6239463 6526744
$$ packed form
12990A1882399J392151J347518J418366J888030K645353L376802M085880M905336
12982C2941835N961853P245482R217135J1816800J5335546K0309088K6784977
12975A29612716L4786811M2082749M0919429K1224701j2047619l7063193m2706234
12968A76809360l6773607k8540910k1600082j6169109j2340182r677956p517937
12961D4189577o253237m939967l979428l591918k900689k202932j845028j683219
12953A6793159j436223j116409r01238r08852r76444p06635p69135q56327o04014
12944H517882l78450k82977k42982l27356l27119j38831k03151j37964K5924n2229
12934F452747k74949j37147N7588j47316j85777J37928J72870J20596M2923K87281
$$ plain form
12924 6526744 6919333 7245438 7723098 8234372 8841639 9417003 10316160 11774890 13703828
12915 13703828 15999726 18380969 19670049 19424923 18222714 16710944 15432335 14517408
12907 14517408 14156016 14314067 14686996 15235139 16081166 17100051 18348924 20139615 22775042
12898 22775042 26205335 30251506 35265293 41591355 49309813 58889760 71450569 88080993
12890 88080993 110075987 139446578 177414631 221815927 260590521 273290554 251371948
12883 251371948 209504163 166712491 131661064 105296432 85330881 70223280 58957291
12876 58957291 50217095 43241330 37842638 33724295 30036089 26859098 24194477 22047883
12868 22047883 20366809 19248324 18627187 18260483 17016459 14740909 12706545 11356209
$$ packed form
12924F526744L92589L26105M77660N11274O07267N75364Q99157J458730J928938
12915A3703828K295898K381243J289080k45126j202209j511770j278609r14927
12907A4517408l61392J58051L72929N48143Q46027J018885J248873J790691K635427
12898B2775042L430293M046171N013787O326062P718458R579947J2560809J6630424
12890H8080993K1994994K9370591L7968053M4401296L8774594J2700033k1918606
12883B51371948m1867785m2791672l5051427k6364632j9965551j5107601j1265989
12876E8957291q740196o975765n398692m118343l688206l176991k664621k146594
12868B2047883j681074j118485o21137l66704j244024k275550k034364j350336
$$ plain form
12860 11356209 10414121 9857769 9377709 8781328 8355104 8067305 7613402 7218588 7079731
12851 7079731 6893276 6614214 6267158 5887487 5503239 5371067 5568945 5707345 5747347 5572100
12841 5572100 5459844 5462757 5527752 5766103 5917075 6027450 6016711 5813973 5700979 5755795
12831 5755795 5651623 5552388 5820599 6300133 6545802 6820206 7258649 7706690 7991989 8336773
12821 8336773 8976348 9939289 10930707 11967691 13101610 14368711 15745679 17536773 19855149
12812 19855149 22749649 26544995 31066888 36524528 43248632 51700941 62424796 75950598
12804 75950598 93884767 118004510 149591183 189048728 231961504 263675918 265630562
12797 265630562 236865735 194726825 154856165 122789780 98384040 79955985 66037560
$$ packed form
12860A1356209r42088n56352m80060n96381m26224k87799m53903l94814j38857
12851G079731j86455k79062l47056l79671l84248j32172J97878J38400M0002j75247
12841E572100j12256K913O4995K38351J50972J10375j0739k02738j12994N4816
12831E755795j04172r9235K68211M79534K45669K74404M38443M48041K85299L44784
12821H336773O39575R62941R91418J036984J133919J267101J376968J791094K318376
12812A9855149K894500L795346M521893N457640O724104Q452309J0723855J3525802
12804G5950598J7934169K4119743L1586673L9457545M2912776L1714414J954644
12797B65630562k8764827m2138910l9870660l2066385k4405740j8428055j3918425
$$ plain form
12790 66037560 55302834 46871462 40127129 34557887 30030082 26184426 23051103 20441716
12782 20441716 18314448 16366629 14688368 13370366 12226809 11131805 10171504 9016584
12774 9016584 7923384 7324333 6919158 6342359 5949964 5640408 5390883 5194310 4813627
12765 4813627 4634997 4399717 4057050 3637770 3259708 2967794 2738597 2693952 2663008 2745556
12755 2745556 2754483 2537223 2409391 2132925 1992889 1790842 1747321 1627624 1395823 1500665
12745 1500665 1703060 1803333 1727692 1605416 1513173 1555893 1717114 1966447 2194126 2188212
12735 2188212 2044376 1890318 1901504 1939349 1597950 1474303 1705554 1836543 1598125 1012108
12725 1012108 707347 646989 510252 430139 638441 679362 694127 950403 976750 927180
$$ packed form
12790F6037560j0734726q431372o744333n569242m527805l845656l133323k609387
12782B0441716k127268j947819j678261j318002j143557j095004r60301j154920
12774I016584j093200n99051m05175n76799l92395l09556k49525j96573l80683
12765D813627j78630k35280l42667m19280l78062k91914k29197m4645l0944Q2548
12755B745556Q927k17260j27832k76466j40036k02047m3521j19697k31801J04842
12745A500665K02395J00273p5641j22276r2243M2720J61221K49333K27679n914
12735B188212j43836j54058J1186L7845l41399j23647K31251J30989k38418n86017
12725A012108l04761o0358j36737q0113K08302M0921J4765K56276K6347m9570
$$ plain form
12715 927180 1075139 1512215 1704567 1533108 1131724 830310 556538 329143 198541 192374
12705 192374 406692 718790 858387 753304 670426 597273 479904 512634 717161 622150
12695 622150 720849 879342 1025585 1190283 1028192 556517 251091 338879 461035 710464
12685 710464 862927 901237 803208 517547 419936 379575 268511 373943 532177 510247
12675 510247 466715 333813 138450 97445 187988 299760 348265 204072 180200 245187 268043
12664 268043 431572 515000 371312 137589 -39122 -77754 -67568 -3235 283744 206684
12654 206684 -70507 -212257 -51873 242896 507357 421202 262575 320987 231446 235035
12644 235035 433353 629279 745855 550746 404965 415054 382729 226339 25714 -149636
$$ packed form
12715I27180J47959M37076J92352j71459m01384l01414k73772k27395j30602o167
12705A92374K14318L12098J39597j05083q2878p3153j17369L2730K04527r5011
12695F22150R8699J58493J46243J64698j62091m71675l05426Q7788J22156K49429
12685G10464J52463L8310r8029k85661r7611m0361j11064J05432J58234k1930
12675E10247m3532j32902j95363m1005R0543J11772M8505j44193k3872O4987K2856
12664B68043J63529Q3428j43688k33723j76711l8632J0186O4333K86979p7060
12654B06684k77191j41750J60384K94769K64461q6155j58627N8412q9541L589
12644B35035J98318J95926J16576j95109j45781J0089l2325j56390k00625j75350
$$ plain form
12634 -149636 45054 485650 873969 884992 765128 801271 736668 468615 242713 160828
12624 160828 142461 272576 370434 370342 398642 490072 665555 755993 774392 812149 725601 459328
12612 459328 300013 181904 19970 130346 177788 -14698 -68842 53420 306574 512899
12602 512899 574633 791779 1023372 1217438 1289996 1321837 1391584 1317445 1055205 978547 1117355
12591 1117355 1076794 1000630 1008170 1107069 1323365 1492331 1681492 1864955 2149054 2650442
12581 2650442 3284875 3645927 3314948 2880664 2528185 2191489 1817759 1393259 1104451
12572 1104451 899124 852654 616917 494107 597688 648330 566442 754679 902169 716096
12562 716096 537653 547855 287342 -41796 -7969 136748 293478 472137 514026 274491
$$ packed form
12634a49636J94690M40596L88319J1023j19864L6143o4603k68053k25902q1885
12624A60828j8367J30115R7858r2K8300R1430J75483R0438J8399L7757q6548k66273
12612D59328j59315j18109j61934J10376M7442j92486n4144J22262K53154K06325
12602E12899O1734K17146K31593J94066P2558L1841O9747p4139k62240p6658J38808
12591A117355m0561p6164P540R8899K16296J68966J89161J83463K84099N01388
12581B650442O34433L61052l30979m34284l52479l36696l73730m24500k88808
12572A104451k05327m6470k35737j22810J03581N0642q1888J88237J47490j86073
12562G16096j78443J0202k60513l29138L3827J44717J56730J78659M1889k39535
$$ plain form
12552 274491 58001 34280 39264 107741 183423 342096 426459 577209 657047 566899 527930
12541 527930 314255 237398 303182 314775 376169 430350 358495 219235 162482 69566 161604
12530 161604 338039 459314 587483 564704 313233 179130 161291 126136 98962 316515
12520 316515 339225 109461 15361 227208 538004 571430 464528 446775 308314 144008
12510 144008 199021 137467 63340 24870 121934 90127 105062 349200 417149 257602 317684
12499 317684 534174 427294 172086 231339 297753 173098 -267095 -561588 -497390 -198458
12489 -198458 -29051 -15828 -21814 -87600 -171300 -294090 -240443 -113431 -73972 -75367 -215563
12478 -215563 -301836 -306726 -299632 -399020 -479705 -496965 -642239 -877053 -909956 -653333 -520826
$$ packed form
12552B74491k16490k3721M984O8477P5682J58673Q4363J50750P9838r0148l8969
12541E27930k13675p6857O5784J1593O1394N4181p1855j39260n6753r2916R2038
12530A61604J76435J21275J28169k2779k51471j34103j7839l5155k7174K17553
12520C16515K2710k29764r4100K11847L10796L3426j06902j7753j38461j64306
12510A44008N5013o1554p4127l8470R7064l1807J4935K44138O7949j59547O0082
12499C17684K16490j06880k55208N9253O6414j24655m40193k94493O4198K98932
12489a98458J69407J3223n986o5786q3700j22790N3647J27012L9459j395j40196
12478b15563q6273m890P094r9388q0685j7260j45274k34814l2903K56623J32507
$$ plain form
12467 -520826 -409998 -133602 317640 562162 707126 787375 550830 222769 -11161 -278305
12457 -278305 -257920 -50385 38438 67209 141481 175922 201464 58926 -190870 -386579 -674183
12446 -674183 -745618 -581786 -269145 137026 202596 360660 676334 745131 579858 330008
12436 330008 371145 338367 500958 696652 504485 228035 136886 175189 256832 170936 213612
12425 213612 451286 733718 969375 1109528 1090056 982916 919143 778962 704318 826685
12415 826685 829824 466892 78914 -124444 -67075 93978 129080 28539 -63474 108431
12405 108431 301605 280094 30224 -226378 -416050 -369958 -308463 -224799 -117034 405
12395 405 142377 17503 -309238 -574751 -449572 -41738 180162 133734 76952 131894 100764
$$ packed form
12467e20826J10828K76396M51242K44522J44964Q0249k36545l28061k33930k67144
12457b78305K0385K07535Q8823K8771P4272L4441K5542j42538k49796j95709k87604
12446f74183p1435J63832L12641M06171O5570J58064L15674O8797j65273k49850
12436C30008M1137l2778J62591J95694j92167k76450r1149L8303Q1643q5896M2676
12425B13612K37674K82432K35657J40153j9472j07140o3773j40181p4644J22367
12415H26685L139l62932l87978k03358N7369J61053L5102j00541r2013J71905
12405A08431J93174k1511k49870k56602j89672M6092O1495Q3664J07765J17439
12395D05J41972j24874l26741k65513J25179M07834K21900m6428n6782N4942l1130
$$ plain form
12384 100764 256593 368801 449223 448285 274485 351052 403698 397755 630532 808156 865734
12373 865734 714106 245684 -46198 -90691 -15069 170571 233056 178825 28458 -170978
12363 -170978 -154174 -146604 -246520 -458864 -543175 -436354 -225725 -31150 295864 502646
12353 502646 410885 171850 85934 143308 292829 247813 158620 70933 257739 362625 222295
12342 222295 87634 216576 468195 543854 376031 242978 88500 -39268 -40668 198040
12332 198040 497020 419448 195328 49159 -47819 -316159 -521303 -461723 -404089 -535062
12322 -535062 -387244 -136174 -34666 114816 169017 212531 182694 -23556 -149900 -311535
12312 -311535 -488327 -511359 -502716 -369942 -253384 -406689 -411737 -332067 -244036 -323112 -419063
$$ packed form
12384A00764J55829J12208Q0422r38j73800P6567N2646n943K32777J77624N7578
12373H65734j51628m68422k91882m4493P5622J85640O2485n4231j50367j99436
12363a70978J6804P570r9916k12344q4311J06821K10629J94575L27014K06782
12353E02646r1761k39035q5916N7374J49521m5016q9193q7687J86806J04886j40330
12342B22295j34661J28942K51619P5659j67823j33053j54478j27768j400K38708
12332A98040K98980p7572k24120j46169r6978k68340k05144N9580N7634j30973
12322e35062J47818K51070J01508J49482N4201M3514k9837k06250j26344j61635
12312c11535j76792k3032Q643J32774J16558j53305n048P9670Q8031p9076r5951
$$ plain form
12301 -419063 -370305 -373390 -142750 -30946 -162814 -179077 -175727 -161488 -147994 -255197 -198018
12290 -198018 -87690 127927 308330 177825 -117896 -251131 -115792 33038 143571 219837
12280 219837 219465 -9273 -364905 -404396 -185425 -98822 -47441 -36264 -10805 -13361 -42921
12269 -42921 -28337 -100947 -196712 -138545 -267085 -481990 -557408 -493132 -294560 -162994 -115189
12258 -115189 -113313 -116302 -106729 -27134 -10405 -2751 -70874 -77469 -200244 -272818 -293185 -328531
12246 -328531 -220818 -175866 -209325 -135517 -165238 -276931 -396117 -573729 -711344 -692713
12236 -692713 -518597 -162855 95436 236391 111097 -157239 -168392 -32761 156316 67137
12226 67137 81463 15280 -58581 -35183 -14259 62802 248840 316332 250850 305056 506537
$$ packed form
12301d19063M8758l085K30640J11804j31868j6263L350J4239J3494j07203N7179
12290a98018J10328K15617J80403j30505k95721j33235J35339J48830J10533P6266
12280B19837l72k28738l55632l9491K18971Q6603N1381J1177K5459k556k9560
12269d2921J4584p2610r5765N8167j28540k14905p5418O4276J98572J31566M7805
12258a15189J876k989R573P9595J6729P654o8123o595j22775p2574k0367l5346
12246c28531J07713M4952l3459P3808k9721j11693j19186j77612j37615J8631
12236f92713J74116L55742K58291J40955j25294k68336j1153J35631J89077q9179
12226F7137J4326o6183p3861K3398K0924P7061J86038O7492o5482N4206K01481
$$ plain form
12215 506537 689989 600434 329045 129744 135282 288442 358468 247626 229676 459246
12205 459246 739865 882104 715161 331719 13086 -149683 -207646 -149658 2616 -67322
12195 -67322 -186354 -30057 69680 21888 131222 71422 31117 25576 -62484 -83101 -49429
12184 -49429 25039 111659 91274 -94462 -172941 -171193 -53664 -70762 -148256 -133894 -116082
12173 -116082 -243427 -261557 -143900 65226 150768 202368 418710 457150 344849 387689
12163 387689 294122 302003 401215 467434 444450 283954 60708 -69734 55332 258995 308473
12152 308473 197889 40953 45563 122734 113946 -5504 -167673 -399188 -590080 -677703 -476557
12141 -476557 -87840 10922 -177620 -166989 -23055 -24375 109138 332615 338611 134159 17060
$$ packed form
12215E06537J83452q9555k71389j99301N538J53160P0026j10842j7950K29570
12205D59246K80619J42239j66943l83442l18633j62769n7963N7988J52274o9938
12195f7322j19032J56297R9737m7792J09334n9800m0305n541q8060k0617L3672
12184d9429P4468Q6620k0385j85736p8479J748J17529j7098p7494J4362J7812
12173a16082j27345j8130J17657K09126Q5542N1600K16342L8440j12301M2840
12163C87689r3567P881R9212O6219k2984j60496k23246j30442J25066K03663M9478
12152C08473j10584j56936M610P7171q788j19450j62169k31515j90892q7623K01146
12141d76557L88717R8762j88542J0631J43934j320J33513K23477N996k04452j17099
$$ plain form
12130 17060 -24874 52114 108423 156775 304754 251158 84305 -32680 -80128 103792 120267
12119 120267 -128977 -470065 -608108 -386670 -169238 73949 185330 66969 37614 33205
12109 33205 26977 108503 -45389 -323914 -419091 -344325 -297213 -401432 -483698 -490207 -453447
12098 -453447 -202648 -118934 -69214 44043 15744 -53338 -63604 -294350 -568739 -484518 -318222
12087 -318222 -5778 310694 239841 120870 178735 175935 254301 351631 417806 303212 161451
12076 161451 106516 177470 235738 3215 -153736 -383536 -580117 -484780 -348552 -85683
12066 -85683 64420 -120897 -246879 -104746 -58608 -72904 -167498 10661 405467 467421
12056 467421 175588 -208207 -329482 -151495 63422 12414 -138647 -342088 -215012 57404
$$ packed form
12130A7060m1934P6988N6309M8352J47979n3596j66853j16985m7448J83920J6475
12119A20267k49244l41088j38043K21438K17432K43187J11381j18361k9355m409
12109C3205o228Q1526j53892k78525r5177P4766M7112j04219q2266o509L6760
12098d53447K50799Q3714M9720J13257k8299o9082j0266k30746k74389Q4221J66296
12087c18222L12444L16472p0853j18971N7865k800P8366R7330O6175j14594j41761
12076A61451n4935P0954N8268k32523j56951k29800j96581R5337J36228K62869
12066h5683J50103j85317j25982J42133M6138j4296r4594J78159L94806O1954
12056D67421k91833l83795j21275J77987K14917n1008j51061k03441J27076K72416
$$ plain form
12046 57404 301772 320316 110991 -3424 -132326 -162226 -203272 -149838 -63641 36914 104543
12035 104543 286756 405289 262289 286442 442767 618294 629342 644433 569891 263772
12025 263772 -4065 -193358 -272372 -173318 -123760 -193449 -514089 -756009 -621366 -393510
12015 -393510 -356918 -364364 -328125 -109205 139517 193037 166418 167821 147081 174548 325816
12004 325816 384442 405288 257655 351440 459390 287961 18614 69173 256093 495654
11994 495654 326910 65925 61782 183176 159104 141046 114384 -63420 -114387 -53977 -167031
11983 -167031 -191611 -182428 -102656 11324 191101 282286 -117948 -539154 -637304 -429510 -267534
11972 -267534 -319159 -413224 -405377 -373018 -288332 -269613 -137114 80002 180257 226545 318406
$$ packed form
12046E7404K44368J8544k09325j14415j28902k9900m1046N3434Q6197J00555O7629
12035A04543J82213J18533j43000K4153J56325J75527J1048J5091p4542l06119
12025B63772k67837j89293p9014R9054M9558o9689l20640k41920J34643K27856
12015c93510L6592p446L6239K18920K48722N3520k6619J403k0740K7467J51268
12004C25816N8626K0846j47633R3785J07950j71429k69347N0559J86920K39561
11994D95654j68744k60985m143J21394k4072j8058k6662j77804n0967O0410j13054
11983a67031k4580R183P9772J13980J79777R1185m00234m21206r8150K07794J61976
11972b67534n1625r4065P847L2359Q4686J8719J32499K17116J00255M6288R1861
$$ plain form
11961 318406 320235 173990 -17828 122744 368913 382908 232957 12032 -144673 -291278
11951 -291278 -461828 -385816 -29368 459556 755183 645484 257445 -102864 -102170 -47078
11941 -47078 -111278 -121029 159395 310257 212654 59147 17639 158962 325444 357556 452090
11930 452090 436050 662186 907900 880414 729919 504517 471630 567508 565488 351799 210856
11919 210856 246324 179432 196371 105235 34084 175080 386558 326467 114663 336448 526213
11908 526213 527412 472240 501016 586975 603833 659918 711109 714967 639208 520286 429010 546494
11896 546494 906455 1174776 1329193 1609729 2227866 2703856 2726429 2345757 2063384 1715975
11886 1715975 1322382 1056176 1028792 1145839 1087114 1012846 930034 832210 788670 535972
$$ packed form
11961C18406J829j46245j91818J40572K46169J3995j49951k20925j56705j46605
11951b91278j70550P6012L56448M88924K95627j09699l88039l60309O94N5092
11941d7078o4200r751K80424J50862r7603j53507m1508J41323J66482L2112R4534
11930D52090j6040K26136K45714k7486j50495k25402l2887R5878k020k13689j40943
11919B10856L5468o6892J6939r1136p1151J40996K11478o0091k11804K21785J89765
11908E26213J199n5172K8776Q5959J6858N6085N1191L858p5759j18922r1276J17484
11896E46494L59961K68321J54417K80536O18137M75990K2573l80672k82373l47409
11886A715975l93593k66206k7384J17047n8725p4268q2812r7824m3540k52698
$$ plain form
11876 535972 311757 402915 398449 396503 297106 93735 60608 217678 336510 337433 221248
11865 221248 41070 24178 -172134 -375502 -411103 -267503 28120 -72187 -152433 70255
11855 70255 183625 266640 509844 622064 585090 679956 631411 391501 176936 230079 347225
11844 347225 535060 767202 838670 907627 1112799 1228543 1087593 893619 690729 392509
11834 392509 141578 16119 43852 207312 200999 197770 135056 131008 70784 -89209 -107032
11823 -107032 -115904 14816 -20798 -219395 -415668 -512781 -464339 -193347 -80537 107381
11813 107381 49588 -201586 -224512 -53537 259001 390588 430292 367897 164984 84174
11803 84174 173232 100859 10397 -30706 30417 277443 328962 322799 326163 252568 367925 313281
$$ packed form
11876E35972k24215R1158m466j946r9397k03371l3127J57070J18832R23j16185
11865B21248j80178j6892j96312k03368l5601J43600K95623j00307q0246K22688
11855G0255J13370Q3015K43204J12220l6974R4866m8545k39910k14565N3143J17146
11844C47225J87835K32142P1468O8957K05172J15744j40950j93974k02890k98220
11834C92509k50931j25459K7733J63460o313l229o2714m048o0224j59993j7823
11823a07032q872J30720l5614j98597j96273r7113M8442K70992J12810J87918
11813A07381n7793k51174k2926J70975L12538J31587L9704o2395k02913q0810
11803H4174Q9058p2373r0462m1103O1123K47026N1519o163L364p3595J15357n4644
$$ plain form
11791 313281 -197189 -622239 -595877 -512903 -413656 -200878 -145830 -111863 -181160 -253656 -467086
11780 -467086 -771522 -822377 -793897 -730206 -488287 -174576 -25651 -78081 -155643 87773
11770 87773 339151 445403 522363 508194 307467 177618 -106598 -423042 -609824 -951978
11760 -951978 -817890 -401392 -176687 308287 456037 138277 -147676 -339543 -151931 -45088
11750 -45088 -48909 9735 3658 -16064 -230041 -442898 -343982 -191179 118544 316029 118971
11739 118971 -36579 85800 297371 279498 104063 13398 -5292 116347 183969 -40688
11729 -40688 -253449 -293125 -212260 -55210 -3211 72126 67366 -31676 -87272 30611 184185
11718 184185 286919 196938 171454 309187 466512 408612 115931 -93420 -72841 -126261
$$ packed form
11791C13281n10470m25050K6362Q2974R9247K12778N5048L3967o9297p2496k13430
11780d67086l04436n0855K8480O3691K41919L13711J48925n2430p7562K43416
11770H7773K51378J06252P6960j4169k00727j29849k84216l16444j86782l42154
11760i51978J34088M16498K24705M84974J47750l17760k85953j91867J87612J06843
11750d5088l821N8644o077j9722k13977k12857R8916J52803L09723J97485j97058
11739A18971j55550J22379K11571j7873j75435r0665j8690J21639O7622k24657
11729d0688k12761l9676Q0865J57050N1999P5337m760r9042n5596J17883J53574
11718A84185J02734q9981k5484J37733J57325n7900k92681k09351K0579n3420
$$ plain form
11708 -126261 -181245 -127419 -338284 -483438 -298187 -297409 -297409 -315551 -108599 261713 302864 1003
11696 1003 -308050 -410834 -256398 101496 548967 861859 945221 725766 326323 176748
11686 176748 98080 -78014 -251350 -260445 -180551 91256 317304 179736 -151427 -454719
11676 -454719 -471077 -234729 -180982 -84961 91136 121918 64248 8330 72322 119021 60556
11665 60556 -77723 -302820 -373007 -352408 -158532 -44652 189037 302109 190673 67418
11655 67418 274546 413210 17923 -440510 -528284 -338524 -39298 135357 310003 386121
11645 386121 367084 351084 509769 707457 896844 753315 301805 64963 152054 321202
11635 321202 470165 410768 251096 256683 361655 284863 321540 413617 352853 487056 545176
$$ packed form
11708a26261n4984N3826k10865j45154J85251P78%j8142K06952L70312M1151l01861
11696A003l09053j02784J54436L57894M47471L12892Q3362k19455l99443j49575
11686A76748p8668j76094j73336r095P9894K71807K26048j37568l31163l03292
11676d54719j6358K36348N3747R6021J76097L0782n7670n5918O3992M6699n8465
11665F0556j38279k25097p0187K0599J93876J13880K33689J13072j11436j23255
11655F7418K07128J38664l95287m58433q7774J89760K99226J74655J74646P6118
11645C86121j9037j6000J58685J97688J89387j43529m51510k36842Q7091J69148
11635C21202J48963n9397j59672N587J04972p6792L6677R2077o0764J34203N8120
$$ plain form
11624 545176 289305 134937 232055 316393 188592 27345 -33812 -70469 -89001 -122000 -124122
11613 -124122 -142061 -345418 -360846 -163277 33440 138465 54897 -170854 -419911 -643417
11603 -643417 -652189 -381799 -275848 -409519 -504510 -554810 -435873 -429099 -613999 -626306 -615359
11592 -615359 -707009 -733280 -551132 -420460 -518403 -578086 -612879 -653595 -593612 -544137 -316634
11581 -316634 -143960 164618 435251 495540 267906 938 106244 204386 -43859 -260463
11571 -260463 -284623 -271508 -256299 -345595 -645359 -787191 -586756 -295656 -68753 111701
11561 111701 258658 210028 -52748 -235923 -159546 -105902 -280009 -427405 -336196 -208175
11551 -208175 -100564 -229230 -370493 -365955 -203558 -105664 -319231 -211847 78163 101629
$$ packed form
11624E45176k55871j54368R7118Q4338j27801j61247o1157l6657j8532l2999k122
11613a24122j7939k03357j5428J97569J96717J05025q3568k25751k49057k23506
11603f43417q772K70390J05951j33671r4991n0300J18937O774j84900j2307J0947
11592f15359r1650k6271J82148J30672r7943n9683l4793m0716N9983M9475K27503
11581c16634J72674L08578K70633O0289k27634k66968J05306R8142k48245k16604
11571b60463k4160J3115J5209q9296k99764j41832K00435K91100K26903J80454
11561A11701J46957m8630k62776j83175P6377N3644j74107j47396R1209J28021
11551b08175J07611j28666j41263M538J62397R7894k13567J07384K90010K3466
$$ plain form
11541 101629 265322 464082 390425 175796 -45434 -102368 142102 395371 398091 489374
11531 489374 713750 942937 1118967 1110316 1243901 1655157 1816883 1879717 2091713 2491246
11521 2491246 2843684 2879641 2892737 2758194 2458674 2132169 1641410 1302501 1176378 1045324
11511 1045324 821248 831285 1044173 1260679 1579160 1913203 2173818 2163045 2193035 2541861
11501 2541861 2868537 2844654 2450976 2120340 1789458 1767600 1648435 1211009 942118 983425
11491 983425 675379 370757 426152 601182 804873 1038091 1047656 704135 539289 165540
11481 165540 -127119 -132290 -115029 134938 153390 96871 141519 114938 -43015 -253632 -265338
11470 -265338 -300262 -220544 -103202 -93306 -28258 133699 172633 146153 205248 7624 -668487
$$ packed form
11541A01629J63693J98760p3657k14629k21230n6934K44470K53269K720R1283
11531D89374K24376K29187J76030q651J33585M11256J61726O2834K11996L99533
11521B491246L52438L5957J3096j34543k99520l26505m90759l38909j26123j31054
11511A045324k24076J0037K12888K16506L18481L34043K60615j0773K9990L48826
11501B541861L26676k3883l93678l30636l30882k1858j19165m37426k68891M1307
11491I83425l08046l04622N5395J75030K03691K33218R565l43521j64846l73749
11481A65540k92659n171J7261K49967J8452n6519M4648k6581j57953k10617j1706
11470b65338l4924P9718J17342R896O5048J61957L8934k6480N9095j97624o76111
$$ plain form
11459 -668487 -1201974 -1130884 -833673 -537422 -427854 -486664 -666178 -825019 -675552 -475145
11449 -475145 -352509 -261779 43851 306150 236897 -94634 -187282 -127670 -10729 146148
11439 146148 285639 337206 303978 144435 133351 292153 256593 203103 239736 235411 187939
11428 187939 354698 537092 688785 619228 209333 -147624 -163665 3435 267324 185089
11418 185089 -45274 -177106 -191412 -15108 151244 210929 228776 241420 220911 52703
11408 52703 -59021 -173390 -303973 -374862 -285823 -157097 -175577 -244344 -376215 -350473 -87968
11397 -87968 248145 556379 592137 405273 377496 397571 405157 169202 12752 84480 -73221
11386 -73221 -57907 142826 152357 196373 153086 61676 -33687 -5226 172439 292795 455940
$$ packed form
11459f68487n33487P1090K97211K96251J09568n8810j79514j58841J49467K00407
11449d75145J22636R0730L05630K62299o9253l31531r2648N9612J16941J56877
11439A46148J39491N1567l3228j59543j1084J58802l5560n3490L6633m325m7472
11428A87939J66759J82394J51693o9557m09895l56957j6041J67100K63889q2235
11418A85089k30363j31832j4306J76304J66352N9685J7847J2644k0509j68208
11408E2703j11724j14369j30583p0889Q9039J28726j8480o8767j31871K5742K62505
11397h7968L36113L08234L5758j86864k7777K0075P586k35955j56450P1728j57701
11386g3221J5314K00733R531M4016m3287r1410r5363K8461J77665J20356J63145
$$ plain form
11375 455940 502674 519709 483335 387502 571413 815578 877975 1014105 975498 839563 850105
11364 850105 897220 891535 786373 584032 575360 559922 479970 418387 574104 680943 622538
11353 622538 499416 478778 606885 474986 143893 149037 444309 522363 327200 59236
11343 59236 81587 179225 132188 -56650 13525 93193 -38479 -223172 -143724 275701 491614
11332 491614 336906 -71011 -217554 118794 127616 40562 -111819 -271817 -389179 -561229
11322 -561229 -697107 -796680 -424953 -96313 69274 284754 375844 259985 253704 437475
11312 437475 523794 424921 152467 152119 172864 294840 368330 225556 -185019 -292145 -12422
11301 -12422 39103 -13423 14565 80418 235345 522505 689459 573333 317244 288715 397155
$$ packed form
11375D55940M6734J7035l6374r5833J83911K44165O2397J36130l8607j35935J0542
11364H50105M7115n685j05162k02341q672j5438p9952o1583J55717J06839n8405
11353F22538j23122k0638J28107j31899l31093N144K95272P8054j95163k67964
11343E9236K2351R7638m7037j88838P0175P9668j31672j84693P9448M19425K15913
11332D91614j54708m07917j46543L36348Q822q7054j52381j59998j17362j72050
11322e61229j35878r9573L71727L28640J65587K15480R1090j15859o281J83771
11312D37475Q6319r8873k72454l48K0745J21976P3490j42774m10575j07126K79723
11301a2422N1525n2526K7988O5853J54927K87160J66954j16126k56089k8529J08440
$$ plain form
11290 397155 613696 625387 368418 74491 -77472 123361 222809 83383 -82163 -142687
11280 -142687 2672 -138183 -277794 -208684 -87612 122679 386152 551911 738235 693123
11270 693123 323922 106804 156373 212868 345897 464793 394022 107177 -71743 8322
11260 8322 -81647 -154875 -90271 101253 45697 15470 180328 224932 145920 -63813 -255400
11249 -255400 -257648 -211946 95079 434805 517310 566306 484302 378178 348821 419753 362325
11238 362325 198008 154078 311135 433556 322413 140872 182280 306431 170190 -212044
11228 -212044 -520564 -421229 -69057 149877 159831 198842 89945 -127650 -241134 -108905
11218 -108905 -50926 -144201 -260138 -397159 -482338 -510878 -515306 -509809 -528154 -543452 -657815
$$ packed form
11290C97155K16541J1691k56969k93927j51963K00833R9448j39426j65546o0524
11280a42687J45359j40855j39611O9110J21072K10291K63473J65759J86324m5112
11270F93123l69201k17118M9569N6495J33029J18896p0771k86845j78920Q0065
11260H322q9969p3228O4604J91524n5556l0227J64858M4604p9012k09733j91587
11249b55400k248M5702L07025L39726Q2505M8996q2004j06124k9357P0932n7428
11238C62325j64317m3930J57057J22421j11143j81541M1408J24151j36241l82234
11228b12044l08520R9335L52172K18934R954L9011j08897k17595j13484J32229
11218a08905N7979r3275j15937j37021q5179k8540m428N497j8345j5298j14363
$$ plain form
11207 -657815 -721159 -494378 -214188 100959 338188 252665 141408 88257 80559 225837
11197 225837 584518 690371 583123 430930 204052 255011 318220 298691 290539 407550
11187 407550 379159 303045 304332 474078 508668 239388 103175 138103 -87258 -203097 -140017
11176 -140017 -163735 3276 2588 191090 526392 698235 619627 393293 12645 -330402
11166 -330402 -368289 -251063 -194863 -193424 -275858 -284016 -107661 38604 117330 -64100 -236490
11155 -236490 -221961 -92163 238120 461605 311178 261269 219521 50224 -102073 -193699
11145 -193699 -265426 -472150 -583663 -597922 -379613 -44567 202386 -22255 -395885 -443107
11135 -443107 -265897 143561 199335 27652 -53357 -46877 -64747 65514 373515 534619
$$ packed form
11207f57815o3344K26781K80190L15147K37229q5523j11257n3151p698J45278
11197B25837L58681J05853j07248j52193k26878N0959O3209j9529q152J17011
11187D07550k8391p6114J287J69746L4590k69280j36213L4928k25361j15839O3080
11176a40017k3718J67011o88J88502L35302J71843p8608k26334l80648l43047
11166c30402l7887J17226N6200J439q2434q158J76355J46265P8726j81430j72390
11155b36490J4529J29798L30283K23485j50427m9909m1748j69297j52297r1626
11145a93699p1727k06724j11513j4259K18309L35046K46953k24641l73630m7222
11135d43107J77210M09458N5774j71683q1009O480j7870J30261L08001J61104
$$ plain form
11125 534619 288086 12915 -100273 -133363 -213842 -37130 99594 -193603 -440863 -600191
11115 -600191 -920433 -875003 -775217 -787563 -641801 -405108 -310872 -390913 -359828 -246693 -304074
11104 -304074 -179296 -76673 71302 343506 236586 21500 -44380 -201113 -429325 -361391
11094 -361391 -118942 15627 -96156 -216722 -149292 -53638 -89103 92435 173154 34280
11084 34280 -198285 -283200 -141892 267183 466425 420357 318901 149768 -133644 -28165
11074 -28165 22832 -184365 -225316 -51134 36343 -121201 -223747 55471 368371 424833
11064 424833 316643 303428 308213 301957 178935 -34033 -41545 -175544 -489407 -600287 -408656
11053 -408656 -312492 -203784 -302676 -605219 -620441 -377580 -205612 -166388 -225187 -266868 -122165
$$ packed form
11125E34619k46533k75171j13188l3090q0479J76712J36724k93197k47260j59328
11115f00191l20242M5430R9786j2346J45762K36693R4236q0041L1085J13135n7381
11104c04074J24778J02623J47975K72204j06920k15086o5880j56733k28212O7934
11094c61391K42449J34569j11783j20566O7430R5654l5465J81538Q0719j38874
11084C4280k32565q4915J41308M09075J99242m6068j01456j69133k83412J05479
11074b8165N0997k07197m0951J74182Q7477j57544j02546K79218L12900N6462
11064D24833j08190j3215M785o256j23022k12968p512j33999l13863j10880J91631
11053d08656R6164J08708r8892l02543j5222K42861J71968L9224n8799m1681J44703
$$ plain form
11042 -122165 -83800 -58600 53876 181534 343352 262524 -87080 -364530 -300445 -146587
11032 -146587 -191378 -253105 -397361 -573370 -494998 -387469 -403393 -345545 -83019 -12831 -285163
11021 -285163 -340362 -58542 128864 -96851 -483372 -576465 -398268 -230549 -105626 52782
11011 52782 233181 172538 157558 170583 194834 308016 356607 275872 227365 181272 79762
11000 79762 -15794 -162388 -228127 -123484 -145999 -317968 -317400 -146798 -162647 -257800 -346752
10989 -346752 -280494 157345 228915 43330 -76544 8250 243678 317941 347081 352611 158663
10978 158663 -111551 -355882 -422002 -213235 143620 329425 376532 295001 146995 231907
10968 231907 409861 391343 186225 29206 169690 243267 518697 746236 733594 700683
$$ packed form
11042a22165L8365K5200J12476J27658J61818q0828l49604k77450O4085J53858
11032a46587m4791o1727j44256j76009P8372J07529j5924N7848K62526P0188k72332
11021b85163n5199K81820J87406k25715l86521r3093J78197J67719J24923J58408
11011E2782J80399o0643j4980J3025K4251J13182M8591q0735m8507m6093j01510
11000G9762r5556j46594o5739J04643k2515j71969N68J70602j5849r5153q8952
10989c46752O6258M37839P1570j85585j19874Q4794K35428P4263K9140N530j93948
10978A58663k70214k44331o6120K08767L56855J85805M7107q1531j48006Q4912
10968B31907J77954j8518k05118j57019J40484P3577K75430K27539j2642l2911
$$ plain form
10958 700683 415095 92447 -77134 -129567 -168117 -53754 184682 360992 244728 -148508
10948 -148508 -364555 -304606 -130339 2391 8740 79461 127462 -16865 -173847 -56413
10938 -56413 77453 -4494 -239336 -426352 -393015 -115102 116671 101902 361664 586227
10928 586227 516159 226736 22897 3262 -62854 -258269 -289467 -97595 -42794 -99425 -272343
10917 -272343 -434063 -278293 -109975 -20396 -47722 -137785 -216060 -126072 -32743 81494 48911
10906 48911 81020 243498 366734 397909 440033 418571 388144 167096 -256187 -508566 -481520
10895 -481520 -371473 -237648 86068 155333 64755 143727 268712 241739 70300 -53501
10885 -53501 -29434 164320 190471 -37561 -234613 -78971 125378 48112 -122704 -268604
$$ packed form
10958G00683k85588l22648j69581n2433l8550J14363K38436J76310j16264l93236
10948a48508k16047N9949J74267J32730O349P0721M8001j44327j56982J17434
10938e6413J33866q1947k34842j87016L3337K77913K31773j4769K59762K24563
10928E86227p0068k89423k03839j9635o6116j95415l1198J91872N4801n6631j72918
10917b72343j61720J55770J68318Q9579k7326r0063p8275Q9988R3329J14237l2583
10906D8911L2109J62478J23236L1175M2124k1462l0427k21048m23283k52379K7046
10895d81520J10047J33825L23716O9265r0578P8972J24985k6973j71439j23801
10885e3501K4067J93754K6151k28032j97052J55642K04349p7266j70816j45900
$$ plain form
10875 -268604 -360491 -564914 -586583 -427197 -225606 -345844 -461174 -533596 -641299 -688714
10865 -688714 -812432 -961117 -901957 -888056 -862503 -527797 -289279 -191738 -301590 -379554
10855 -379554 -433377 -422917 -388999 -306770 -209885 -239792 -389998 -382031 -306129 -149974 -195321
10844 -195321 -154404 190799 491422 704366 704021 406369 171487 159771 -63991 -369254
10834 -369254 -515666 -606137 -611579 -265702 -37425 -93685 -331802 -603651 -692183 -425676
10824 -425676 -119670 78581 73378 -109430 -164624 -297206 -211319 -189085 -319329 -253182 -192129
10813 -192129 -189984 -149511 -168493 29713 287820 449556 519986 469163 240141 25675 328401
10802 328401 711566 654438 391135 40079 -284086 -508073 -666767 -670736 -647967 -588593
$$ packed form
10875b68604r1887k04423k1669J59386K01591j20238j15330p2422j07703m7415
10865f88714j23718j48685N9160J3901K5553L34706K38518R7541j09852p7964
10855c79554n3823J0460L3918Q2229R6885k9907j50206P967P5902J56155m5347
10844a95321M0917L45203L00623K12944l45k97652k34882j1716k23762l05263
10834c69254j46412r0471n442L45877K28277n6260k38117k71849q8532K66507
10824d25676L06006J98251n203j82808n5194j32582Q5887K2234j30244O6147O1053
10813a92129K145M0473j8982J98206K58107J61736P0430n0823k29022k14466L02726
10802C28401L83165n7128k63303l51056l24165k23987j58694l969K2769N9374
$$ plain form
10792 -588593 -568346 -424603 -230756 -140982 -46928 306499 336094 373908 579631 508187 213744
10781 213744 38267 3761 -66977 -198763 -264449 -226544 -179532 -232818 -422608 -580983 -496749
10770 -496749 -205071 -136382 -62585 144313 426668 633300 396203 186252 131611 79890
10760 79890 183241 140266 219820 212894 174768 341980 436831 397268 265821 220547 170115
10749 170115 64569 -160579 -323157 -281367 -374762 -521403 -403986 -330168 -312011 -58743
10739 -58743 121625 173197 359246 498548 354361 50844 -194607 -441745 -604244 -629037
10729 -629037 -437138 -245183 12820 208672 272284 383895 436751 435367 297110 15245
10719 15245 16077 176027 149501 -83422 -240510 -290145 -363316 -496635 -622127 -777555 -845238
$$ packed form
10792e88593K0247J43743J93847Q9774R4054L53427K9595L7814K05723p1444k94443
10781B13744j75477l4506p0738j31786o5686L7905M7012n3286j89790j58375Q4234
10770d96749K91678O8689P3797K06898K82355K06632k37097k09951n4641n1721
10760G9890J03351m2975P9554o926l8126J67212R4851l9563j31447m5274n0432
10749A70115j05546k25148j62578M1790r3395j46641J17417P3818J8157K53268
10739e8743J80368N1572J86049J39302j44187l03517k45451k47138j62499k4793
10729f29037J91899J91955K58003J95852O3612J11611N2856j384j38257k81865
10719A5245Q32J59950k6526k32923j57088m9635p3171j33319j25492j55428o7683
$$ plain form
10708 -845238 -643130 -388300 -192113 -118414 -203803 -204234 123128 414583 247571 -1420
10698 -1420 -135181 -62154 44763 -22711 -12080 101607 146884 120442 73893 107399 160858
10687 160858 243418 222836 220270 65627 42537 30014 -24756 -45357 -89105 -69920 62659
10676 62659 111102 136869 196466 84390 -152206 -355429 -394523 -302696 -284952 -204217 57434
10665 57434 75306 -200408 -160493 968 4220 -62951 -214046 -331430 -353151 -492704 -661321
10654 -661321 -613021 -626199 -775359 -856780 -672931 -532573 -464161 -492545 -565678 -614714 -623789
10643 -623789 -496222 -221515 30354 133081 174912 287054 515381 690356 377179 -96405
10633 -96405 -351368 -319504 -13273 -100549 -24955 320686 292063 77173 -136603 -96885 -10870
$$ packed form
10708h45238K02108K54830J96187P3699q5389m31L27362K91455j67012k48991
10698a420j33761P3027J06917o7474J0631J13687M5277k6442m6549L3506N3459
10687A60858Q2560k0582k566j54643k3090j2523n4770k0601m3748J9185J32579
10676F2659M8443K5767N9597j12076k36596k03223l9094R1827J7744Q0735K61651
10665E7434J7872k75714L9915J61461L252o7171j51095j17384k1721j39553j68617
10654f61321M8300j3178j49160q1421J83849J40358O8412k8384p3133m9036r075
10643f23789J27567K74707K51869J02727M1831J12142K28327J74975l13177m73584
10633i6405k54963L1864L06231q7276P5594L45641k8623k14890k13776L9718Q6015
$$ plain form
10622 -10870 -52643 -106041 -239615 -592770 -546304 -306104 -53897 -3797 -304892 -545806
10612 -545806 -551674 -534809 -450338 -38945 108676 131879 118767 -22844 -202327 -104996 14971
10601 14971 48678 41787 39903 36846 97848 246487 146409 -21082 79582 318833 214942
10590 214942 -92787 -92447 -152428 -347383 -305547 -250834 -312188 -525515 -481971 -348468 -456889
10579 -456889 -498593 -438744 -215570 -35540 17184 174852 233956 235667 431573 572603 411434
10568 411434 132636 -95809 -121490 -349401 -420172 -371758 -239615 -126463 -112322 51427
10558 51427 156043 177476 76330 -165723 -173575 -191446 -327842 -392078 -250607 -104497 -97591
10547 -97591 -193956 -128831 -110798 -26084 266755 469440 633733 693632 632446 582181 650595
$$ packed form
10622a0870m1773n3398j33574l53155M6466K40200K52207N0100l01095k40914
10612e45806n868J6865Q4471M11393J47621K3203j3112j41611j79483R7331J19967
10601A4971L3707o891j884l057O1002J48639j00078j67491J00664K39251j03891
10590B14942l07729L40n9981j94955M1836N4713o1354k13327M3544J33503j08421
10579d56889m1704N9849K23174J80030N2724J57668N9104J711J95906J41030j61169
10568D11434k78798k28445k5681k27911p0771M8414J32143J13152J4141J63749
10558E1427J04616K1433j01146k42053p852j7871j36396o4236J41471J46110O906
10547i7591r6365O5125J8033Q4714K92839K02685J64293N9899o1186n0265O8414
$$ plain form
10536 650595 509267 178176 -35393 -191326 -284797 -347463 -503010 -676378 -734070 -725153
10526 -725153 -667773 -442995 -253826 -302887 -339550 -234870 -73837 -88815 -48368 -64928 -157866
10515 -157866 -142414 -177857 -463698 -665586 -582793 -630912 -595488 -436785 -443084 -580627 -778493
10504 -778493 -739180 -538264 -418094 -444334 -325393 -277268 -333825 -298448 -267020 -377530 -503957
10493 -503957 -640698 -825332 -706167 -436016 -137946 19764 27089 80679 88790 27076 198603
10482 198603 130772 26592 100607 23499 -187807 -237876 -125625 -106634 9139 296071
10472 296071 279331 171229 88419 -132389 -233344 -78323 58602 164866 260520 239679
10462 239679 223492 44680 -76827 -82254 24298 327193 287429 263101 394292 513647
$$ packed form
10536F50595j41328l31091k13569j55933r3471o2666j55547j73368n7692Q917
10526g25153N7380K24778J89169m9061l6663J04680J61033j4978M0447j6560r2938
10515a57866J5452l5443k85841k01888Q2793m8119L5424J58703o299j37543j97866
10504g78493L9313K00916J20170k6240J18941M8125n6557L5377L1428j10510j26427
10493e03957j36741j84634J19165K70151K98070J57710P325N3590Q111o1714J71527
10482A98603o7831j04180P4015p7108k11306n0069J12251J8991J15773K86932
10472B96071j6740j08102q2810k20808j00955J55021J36925J06264R5654k0841
10462B39679j6187j78812j21507n427J06552L02895l9764k4328J31191J19355
$$ plain form
10452 513647 459701 300328 258716 260560 193312 -59754 -300205 -287476 -262306 -502355 -514694
10441 -514694 -389594 -239462 -95715 -201123 -364618 -258264 -128115 -505 136139 52978
10431 52978 -54898 -112703 -223137 -114356 41044 133828 212961 333293 449167 348157
10421 348157 262722 323060 264696 2239 -66467 165517 178823 74302 245364 507351
10411 507351 556844 325558 18446 137673 426202 291325 -25136 -143478 -214260 -264745
10401 -264745 -265901 -214274 -315524 -337024 -85717 137145 -15357 -340103 -488419 -343840
10391 -343840 -191732 -348364 -214607 -86238 -136897 33701 162814 315808 432670 294404
10381 294404 72763 -55667 -172752 -361236 -453764 -308229 -180967 -377006 -624787 -659968
$$ packed form
10452E13647n3946j59373m1612J844o7248k53066k40451J2729K5170k40049j2339
10441e14694J25100J50132J43747j05408j63495J06354J30149J27610J36644q3161
10431E2978j07876n7805j10434J08781J55400R2784P9133J20332J15874j01010
10421C48157q5435O0338n8364k62457o8706K31984J3306j04521J71062K61987
10411E07351M9493k31286l07112J19227K88529j34877l16461j18342p0782n0485
10401b64745j156N1627j01250k1500K51307K22862j52502l24746j48316J44579
10391c43840J52108j56632J33757J28369n0659J70598J29113J52994J16862j38266
10381B94404k21641j28430j17085j88484r2528J45535J27262j96039k47781l5181
$$ plain form
10371 -659968 -502699 -363364 -167127 -180892 -239824 -345042 -408994 -291682 -25094 253311
10361 253311 171392 142705 205226 87951 90285 121537 -81943 -208685 -137709 -229169 -324356
10350 -324356 -97142 67774 70746 131467 137495 250018 513580 540937 458704 270650 40209
10339 40209 47860 150918 227434 367374 478432 390769 345931 300958 250679 105324 -102590
10328 -102590 -178667 -189395 -166388 -164445 -255978 -524770 -707835 -659673 -656512 -614384 -400669
10317 -400669 -198220 -41518 -115221 -208247 -42369 147558 218293 97406 -23055 -113880
10307 -113880 -203099 12290 164054 152700 204855 188486 346147 485215 441965 172186
10297 172186 27782 -24892 -82635 -6685 238794 413010 409206 254814 -65330 -245414
$$ packed form
10371f59968J57269J39335J96237j3765n8932j05218o3952J17312K66588K78405
10361B53311q1919k8687O2521j17275K334L1252k03480j26742P0976r1460r5187
10350c24356K27214J64916K972O0721O028J12523K63562K7357q2233j88054k30441
10339D0209P651J03058P6516J39940J11058q7663m4838m4973n0279j45355k07914
10328a02590p6077j0728K3007J943r1533k68792j83065M8162L161M2128K13715
10317d00669K02449J56702p3703r3026J65878J89927P0735j20887j20461r0825
10307a13880q9219K15389J51764j1354N2155j6369J57661J39068m3250k69779
10297A72186j44404n2674n7743P5950K45479J74216l804j54392l20144j80084
$$ plain form
10287 -245414 -167826 7845 7230 -90161 -203347 -85679 73034 62958 -50063 -141376 -85798
10276 -85798 -58615 14929 -91727 -388280 -351295 -77222 64429 -19162 -7892 54488 -48996
10265 -48996 -97657 31040 -23584 -78204 -234953 -316939 -221642 -205494 -218311 -230516 -8932
10254 -8932 116625 78560 4221 -41660 -52217 -75445 -129630 -178510 -36115 81579 71454
10243 71454 6491 -34479 123325 250422 321591 114551 -251833 -382929 -470414 -486912 -401117
10232 -401117 -222783 -122732 -253726 -305255 -447318 -719816 -892577 -772070 -650679 -648440
10222 -648440 -605223 -468011 -343477 -314588 -262233 -203072 -163064 -224487 -109660 158619 270678
10211 270678 375780 367965 76591 -174774 -405183 -313182 -82838 -52302 -2063 111307
$$ packed form
10287b45414P7588J75671o15r7391j13186J17668J58713j0076j13021r1313N5578
10276h5798K7183P3544j06656k96553L6985K74073J41651q3591J1270O2380j03484
10265d8996m8661J28697n4624n4620j56749q1986R5297J6148j2817j2205K21584
10254h932J25557l8065p4339m5881j0557k3228n4185m8880J42395J17694j0125
10243G1454o4963m0970J57804J27097P1169k07040l66384j31096q7485j6498Q5795
10232d01117J78334J00051j30994n1529j42063k72498j72761J20507J21391K239
10222f48440M3217J37212J24534K8889N2355N9161M0008o1423J14827K68279J12059
10211B70678J05102p815k91374k51365k30409R2001K30344L0536N0239J13370
$$ plain form
10201 111307 134144 79827 -86866 -271622 -318031 -469720 -544631 -414191 -332855 -292711 -269122
10190 -269122 -105200 82837 250328 146332 -179112 -165320 -107979 -141031 -293536 -297234
10180 -297234 -183063 -213248 -176952 -203590 -291071 -299866 -260188 -315043 -401074 -297875 -129884
10169 -129884 -137844 -264284 -578018 -795065 -756608 -664921 -368245 -114549 143850 264936
10159 264936 105166 -145392 -180250 27217 390829 395405 114481 -52701 -54302 -131283 -181916
10148 -181916 78773 127429 198430 156641 57730 142988 74037 -108394 -454487 -606359 -288490
10137 -288490 83945 285405 351067 453923 475982 191715 176144 261540 422717 549041
10127 549041 562258 321477 139165 120371 136779 173081 161026 214105 258380 386265 668945
$$ packed form
10201A11307K2837n4317j66693j84756m6409j51689p4911J30440Q1336M0144K3589
10190b69122J63922J88037J67491j03996l25444J3792N7341l3052j52505l698
10180b97234J14171l0185L6296k6638q7481q795L9678n4855q6031J03199J67991
10169a29884p960j26440l13734k17047L8457R1687K96676K53696K58399J21086
10159B64936j59770k50558l4858K07467L63612M576k80924j67182j601p6981n0633
10148a81916K60689M8656P1001m1789r8911Q5258o8951j82431l46093j51872L17869
10137b88490L72435K01460O5662J02856K2059k84267j5571Q5396J61177J26324
10127E49041J3217k40781j82312j8794J6408L6302j2055N3079M4275J27885K82680
$$ plain form
10116 668945 955980 1222628 1442254 1757662 2195506 2866749 3599049 4396371 5260571 5636204
10106 5636204 4956012 4140738 3480287 2986911 2539574 2084110 1708466 1372292 1268769
10097 1268769 1144551 1024601 1043876 1109903 969766 980012 1114265 913432 421479 376861
10087 376861 372902 313907 490658 499644 125996 -114196 -210087 -148393 74994 169307 2332
10076 2332 -255919 -324525 -284047 -297241 -320082 -77576 318437 513638 515119 165690 -277124
10065 -277124 -363130 -276210 -86768 12747 124316 322081 349623 291478 177662 52692
10055 52692 -103203 -218665 -156787 -105819 -167299 -82772 28553 15683 -142113 -127195 -72284
10044 -72284 -121197 -467238 -556233 -190503 160458 223429 -9152 -233587 -272895 -134292
$$ packed form
10116F68945K87035K66648K19626L15408M37844O71243P32300P97322Q64200L75633
10106E636204o80192q15274o60451m93376m47337m55464l75644l36174j03523
10097A268769j24218j19950J9275O6027j40137J0246J34253k00833m91953m4618
10087C76861l959n8995J76751Q986l73648k40192r5891O1694K23387R4313j66975
10076B332k58251o8606M0478j3194k2841K42506L96013J95201J481l49429m42814
10065b77124q6006Q6920J89442R9515J11569J97765K7542n8145j13816j24970
10055E2692j55895j15462O1878N0968o1480Q4527J11325j2870j57796J4918N4911
10044g2284m8913l46041q8995L65730L50961O2971k32581k24435l9308J38603
$$ plain form
10034 -134292 213463 540829 737505 633045 478319 358226 277335 202632 316180 380037
10024 380037 225315 23111 -110196 -207606 -308534 -344576 -291657 -333302 -473809 -466053 -387146
10013 -387146 -469502 -384233 -137444 47963 43731 82922 131875 153800 126367 -72320 -167452
10002 -167452 -84198 22416 -36956 -72415 132188 447726 690606 781451 775730 824588 669651
9991 669651 500028 266170 -57059 -267739 -113257 -17703 -168863 -267372 -103333 73969
9981 73969 206681 327682 125130 -99806 -96590 -77687 -145934 -55219 151891 116387 1558
9970 1558 -121712 -332277 -348685 -21587 308946 417709 431339 499309 288033 57046 131341
9959 131341 38820 -141019 -7453 108097 -51720 -264864 -331592 -228317 -158798 -209391
$$ packed form
10034a34292L47755L27366J96676j04460j54726j20093q0891p4703J13548O3857
10024C80037j54722k02204j33307r7410j00928l6042N2919m1645j40507P756P8907
10013c87146q2356Q5269K46789J85407m232L9191M8953K1925k7433j98687r5132
10002a67452Q3254J06614n9372l5459K04603L15538K42880R0845n721M8858j54937
9991F69651j69623k33858l23229k10680J54482R5554j51160r8509J64039J77302
9981G3969J32712J21001k02552k24936L216J8903o8247R0715K07110l5504j14829
9970A558j23270k10565j6408L27098L30533J08763J3630O7970k11276k30987P4295
9959A31341r2521j79839J33566J15550j59817k13144o6728J03275O9519n0593
$$ plain form
9949 -209391 -93039 146952 83471 -79750 136311 356446 307537 286806 310555 301877 290389
9938 290389 280984 271654 217457 16110 -347231 -546996 -475315 -271752 -166680 -63807 242132
9927 242132 430986 369799 165913 70006 -93073 -350955 -412424 -349268 -285811 11411 335392
9916 335392 494265 537621 431408 276468 -74159 -262113 -176464 -37840 -103706 -230998
9906 -230998 -313404 -331545 -239883 -226943 -275270 -354393 -352758 -226911 -179149 -291573 -496472
9895 -496472 -455547 -205333 -10013 107748 14223 -380967 -612043 -390139 -138791 20169
9885 20169 200813 452917 535782 524820 754704 922512 891856 629955 276956 -118214
9875 -118214 -382810 -554386 -643452 -611610 -513679 -469222 -596488 -577268 -318860 -65451 -2557
$$ packed form
9949b09391J16352K39991o3481j63221K16061K20135m8909k0731K3749q678j1488
9938B90389r405r330n4197k01347l63341j99765P1681K03563J05072J02873L05939
9927B42132J88854o1187k03886r5907j63079k57882o1469O3156O3457K97222L23981
9916C35392J58873M3356j06213j54940l50627j87954Q5649J38624o5866j27292
9906b30998q2406j8141R1662J2940m8327p9123J635J25847M7762j12424k04899
9895d96472M0925K50214J95320J17761r3525l95190k31076K21904K51348J58960
9885B0169J80644K52104Q2865j0962K29884J67808l0656k61901l52999l95170
9875a18214k64596j71576q9066L1842R7931M4457j27266J9220K58408K53409O2894
$$ plain form
9864 -2557 19402 44861 212479 205246 -64761 -126341 -16525 -56706 66440 246106 297913
9853 297913 325874 209757 16382 44203 229659 409019 148543 -202343 -175648 -26448
9843 -26448 23664 74659 259369 254701 138508 102311 169947 192393 219110 223709 153223 78586
9831 78586 83504 150750 158178 91715 -64717 -97475 -102857 -200056 -280911 -334408 -536652 -579735
9819 -579735 -181545 139387 211486 198334 208951 127657 39571 250134 344044 159731 86915
9808 86915 297130 395884 261992 149369 -42343 -381294 -396409 -313067 -364938 -252513 -264818
9797 -264818 -467292 -460224 -357832 -245520 -228443 -188381 -219094 -278056 -335134 -317208 -247878
9786 -247878 -32009 40590 31197 -230861 -441686 -275608 -96552 -36990 -163941 -54652
$$ packed form
9864b557K1959K5459J67618p233k70007o1580J09816m0181J23146J79666N1807
9853B97913K7961j16117j93375K7821J85456J79360k60476l50886K6695J49200
9843b6448N0112N0995J84710m668j16193l6197O7636K2446K6717M599p0486p4637
9831G8586M918O7246P428o6463j56432l2758n382r7199q0855n3497k02244m3083
9819e79735L98190L20932P2099j3152J0617q1294q8086K10563R3910j84313p2816
9808H6915K10215R8754j33892j12623j91712l38951j5115Q3342n1871J12425j2305
9797b64818k02474P068J02392J12312J7077M0062l0713n8962n7078J7926O9330
9786b47878K15869P2599r393k62058k10825J66078J79056N9562j26951J09289
$$ plain form
9776 -54652 150028 295365 276663 107414 -20014 116878 129580 119371 103633 -60081 -139073
9765 -139073 -130889 -86825 -96509 -61284 -79081 -142172 -93012 -53796 -43253 16628 13940 -107681
9753 -107681 -138993 -75792 14563 -80680 -183106 -182357 -405751 -594011 -710354 -829079 -642754
9742 -642754 -350885 -137444 -25759 163718 204848 73372 -163467 -203699 4251 105292
9732 105292 222525 209113 -50605 -73749 -9853 14368 -155424 -323296 -251190 -124436 -149251
9721 -149251 -293645 -310931 -192089 -49786 -113133 -233570 -48369 301165 655851 554333
9711 554333 287066 125504 2721 74677 115875 136306 95774 -121131 -37805 244019 449363
9700 449363 426811 317230 453874 622672 549988 433597 339020 168907 113153 -3343
$$ packed form
9776e4652K04680J45337j8702j69249j27428J36892J2702j0209j5738j63714p8992
9765a39073Q184M4064r684L5225j7797o3091M9160L9216J0543N9881k688j21621
9753a07681l1312O3201R0355r5243j02426P49k23394j88260j16343j18725J86325
9742f42754K91869K13441J11685J89477M1130j31476k36839m0232K07950J01041
9732A05292J17233j3412k59718k3144O3896K4221j69792j67872P2106J26754k4815
9721a49251j44394j7286J18842J42303o3347j20437J85201L49534L54686j01518
9711E54333k67267j61562j22783P1956M1198K0431m0532k16905Q3326K81824K05344
9700D49363k2552j09581J36644J68798p2684j16391r4577j70113n5754j16496
$$ [...]
##END NTUPLES=NMR SPECTRUM
##END=
