##TITLE=C13_SL78-Dau(f2)
 CDCl3, 22200 sc

 7.6.2021
##JCAMPDX= 6.0         $$ Bruker NMR JCAMP-DX V2.0
##DATA TYPE= NMR SPECTRUM
##DATA CLASS= NTUPLES
##ORIGIN= UXNMR, Bruker Analytische Messtechnik GmbH
##OWNER= root
$$ XWIN-NMR		Version 3.5
$$ Tue Jun  8 10:54:47 2021 Russian Standard Time (UT+4h)  she@DPX200
##.OBSERVE FREQUENCY= 50.327896
##.OBSERVE NUCLEUS= ^13C
##.ACQUISITION MODE= SIMULTANEOUS
##.ACQUISITION SCHEME= undefined
##.AVERAGES= 22201
##.DIGITISER RES= 17
##SPECTROMETER/DATA SYSTEM= spect
##.PULSE SEQUENCE= zgpg30
##.SOLVENT NAME= CDCl3
##.SHIFT REFERENCE= (INTERNAL, CDCl3, 0, 222.653)
##AUDIT TRAIL= $$ (NUMBER, WHEN, WHO, WHERE, WHAT)
$$ ##TITLE= Audit trail, XWIN-NMR		Version 3.5
$$ ##JCAMPDX= 5.01
$$ ##ORIGIN= Bruker BioSpin GmbH
$$ ##OWNER= she
$$ F:/spectra/data/she/nmr/c13/1/pdata/1/auditp.txt
$$ ##AUDIT TRAIL=  $$ (NUMBER, WHEN, WHO, WHERE, WHAT)
(   1,<2021-06-08 10:53:22.37 +0400>,<she>,<DPX200>,
      <created by zg, POWCHK disabled, PULCHK disabled
       terminated by command 'halt'
       configuration hash MD5:
       00 E9 B6 7A A2 85 ED C7 34 08 36 98 17 FE 4E 26
       data hash MD5: 32K
       0D 4F 30 2F 9A FF 59 BA 35 6A A1 C0 7C 4E 3C D8>)
(   2,<2021-06-08 10:53:27.95 +0400>,<she>,<DPX200>,
      <Start of raw data processing
       efp BC_mod = 2 LB = 1 FT_mod = 6 PKNL = 1 PHC0 = -278.5035 PHC1 = 32.96243 SI = 32K 
       data hash MD5: 32K
       8A 58 B9 8F B9 E8 A6 87 9D 53 4F 5E A0 2A 5D 51>)
(   3,<2021-06-08 10:53:30.57 +0400>,<she>,<DPX200>,
      <abs ABSG = 5 
       data hash MD5: 32K
       91 3E 53 92 7B F5 60 D5 26 D2 0A 8B 63 08 90 F1>)
(   4,<2021-06-08 10:53:58.29 +0400>,<she>,<DPX200>,
      <pk PHC0 = 0.3292779 PHC1 = 0 
       data hash MD5: 32K
       B5 E9 F3 34 62 7A D3 23 06 A3 C2 46 64 E0 C9 C0>)
(   5,<2021-06-08 10:54:02.20 +0400>,<she>,<DPX200>,
      <abs ABSG = 5 
       data hash MD5: 32K
       DE 9D C9 E4 2B 91 B1 25 02 CB 12 00 C2 27 40 21>)
$$ ##END=
$$ 
$$ hash MD5
$$ 59 D6 12 17 0B FE C7 7A 52 E3 B5 33 29 B1 E5 C2
##$RELAX= 
##$RELAX= 
##$RELAX= 
##$RELAX= 
##$RELAX= 
##$RELAX= 
##$RELAX= 
##$RELAX= 
$$ Bruker specific parameters
$$ --------------------------
##$DU= <F:/spectra>
##$EXPNO= 1
##$NAME= <c13>
##$PROCNO= 1
##$TYPE= <nmr>
##$USER= <she>
##$AMP= (0..31)
100 100 100 100 100 100 100 100 100 100 100 100 100 100 100 100 100 100 
100 100 100 100 100 100 100 100 100 100 100 100 100 100 
##$AQSEQ= 0
##$AQ_mod= 1
##$AUNM= <au_zg>
##$AUTOPOS= <>
##$BF1= 50.322709
##$BF2= 200.13
##$BF3= 50.322709
##$BF4= 500.13
##$BF5= 500.13
##$BF6= 500.13
##$BF7= 500.13
##$BF8= 500.13
##$BYTORDA= 1
##$CFDGTYP= 0
##$CFRGTYP= 5
##$CHEMSTR= <none>
##$CNST= (0..31)
1 1 145 1 1 1 1 1 1 1 1 1 1 1 1 1 1 1 1 1 1 1 1 1 1 1 1 1 1 1 1 1 
##$CPDPRG= <waltz16>
##$CPDPRG1= <>
##$CPDPRG2= <waltz16>
##$CPDPRG3= <>
##$CPDPRG4= <mlev>
##$CPDPRG5= <mlev>
##$CPDPRG6= <mlev>
##$CPDPRG7= <mlev>
##$CPDPRG8= <mlev>
##$CPDPRGB= <>
##$CPDPRGT= <>
##$D= (0..31)
$$ [...]
##$SUBNAM4= <"">
##$SUBNAM5= <"">
##$SUBNAM6= <"">
##$SUBNAM7= <"">
##$SUBNAM8= <"">
##$SUBNAM9= <"">
##$SW= 239.972175391363
##$SWIBOX= (0..15)
0 1 3 0 0 0 0 0 0 0 0 0 0 0 0 0 
##$SW_h= 12077.2946859903
##$TD= 32768
##$TD0= 1
##$TE= 0
##$TE2= 300
##$TE3= 300
##$TEG= 300
##$TL= (0..7)
120 120 120 120 120 120 120 120 
##$TP= (0..7)
150 150 150 150 150 150 150 150 
##$TP07= 0
##$TPNAME0= <>
##$TPNAME1= <>
##$TPNAME2= <>
##$TPNAME3= <>
##$TPNAME4= <>
##$TPNAME5= <>
##$TPNAME6= <>
##$TPNAME7= <>
##$TPOAL= (0..7)
0.5 0.5 0.5 0.5 0.5 0.5 0.5 0.5 
##$TPOFFS= (0..7)
0 0 0 0 0 0 0 0 
##$TUNHIN= 0
##$TUNHOUT= 0
##$TUNXOUT= 0
##$USERA1= <user>
##$USERA2= <user>
##$USERA3= <user>
##$USERA4= <user>
##$USERA5= <user>
##$V9= 5
##$VALIST= <valist>
##$VCLIST= <CCCCCCCCCCCCCCC>
##$VD= 0
##$VDLIST= <DDDDDDDDDDDDDDD>
##$VPLIST= <PPPPPPPPPPPPPPP>
##$VTLIST= <TTTTTTTTTTTTTTT>
##$WBST= 1024
##$WBSW= 4
##$XGAIN= (0..3)
0 0 0 0 
##$XL= 0
##$YL= 0
##$YMAX_a= 130042594
##$YMIN_a= -49684318
##$ZGOPTNS= <>
##$ZL1= 120
##$ZL2= 120
##$ZL3= 120
##$ZL4= 120
##$ABSF1= 222.6533
##$ABSF2= -17.34351
##$ABSG= 5
##$ABSL= 3
##$ALPHA= 0
##$AQORDER= 0
##$ASSFAC= 0
##$ASSFACI= 0
##$ASSFACX= 0
##$ASSWID= 0
##$AUNMP= <proc_1d>
##$AZFE= 0.1
##$AZFW= 0.5
##$BCFW= 0
##$BC_mod= 2
##$BYTORDP= 0
##$COROFFS= 0
##$CY= -3
##$DATMOD= 1
##$DC= 0
##$DFILT= <>
##$DTYPP= 0
##$F1P= 0
##$F2P= 0
##$FCOR= 0.5
##$FTSIZE= 32768
##$FT_mod= 6
##$GAMMA= 0
##$GB= 0
##$INTBC= 1
##$INTSCL= 4.134877e-10
##$ISEN= 128
##$LB= 1
##$LEV0= 0
##$LPBIN= 0
##$MAXI= 10000
##$MC2= 0
##$MEAN= 0
##$ME_mod= 0
##$MI= 0.1934396
##$NCOEF= 0
##$NC_proc= 2
##$NLEV= 6
##$NOISF1= 120.0001
##$NOISF2= 80.00006
##$NSP= 0
##$NTH_PI= 0
##$NZP= 0
##$OFFSET= 222.6533
##$PC= 1.4
##$PHC0= -278.1742
##$PHC1= 32.96243
##$PH_mod= 1
##$PKNL= yes
##$PPARMOD= 0
##$PSCAL= 0
##$PSIGN= 0
##$REVERSE= no
##$SF= 50.3227301278049
##$SI= 32768
##$SIGF1= 140
##$SIGF2= 120
##$SINO= 11.81781
##$SIOLD= 32768
##$SREGLST= <13C.CDCl3>
##$SSB= 0
##$STSI= 32768
##$STSR= 0
##$SW_p= 12077.2946859903
##$SYMM= 0
##$S_DEV= 0
##$TDeff= 32768
##$TDoff= 0
##$TI= <>
##$TILT= no
##$TM1= 0
##$TM2= 0
##$TOPLEV= 0
##$USERP1= <user>
##$USERP2= <user>
##$USERP3= <user>
##$USERP4= <user>
##$USERP5= <user>
##$WDW= 1
##$XDIM= 32768
##$YMAX_p= 422330370
##$YMIN_p= -5324431
$$ End of Bruker specific parameters
$$ ---------------------------------
##NTUPLES= NMR SPECTRUM
##VAR_NAME=  FREQUENCY,     SPECTRUM/REAL,   SPECTRUM/IMAG
##SYMBOL=    X,             R,               I
##VAR_TYPE=  INDEPENDENT,   DEPENDENT,       DEPENDENT
##VAR_FORM=  AFFN,          ASDF,            ASDF
##VAR_DIM=   32768,         32768,           32768
##UNITS=     HZ,            ARBITRARY UNITS, ARBITRARY UNITS
##FACTOR=    0.368581032318806, 1,           1
##FIRST=     11204.5221822817, 0,            0
##LAST=      -872.772503708586, 0,           0
##MIN=       -872.772503708586, -5324431,    0
##MAX=       11204.5221822817, 422330370,    0
$$ Real data points
##PAGE= N=1
##DATA TABLE= (X++(R..R)), XYDATA
$$ [...]
18111 -486263 -5231 179302 -240172 -788767 -779269 -369238 -176537 227768 790301 820523
18101 820523 537150 272858 122987 214515 -603978 -1153052 -750262 14389 390099 83860
18091 83860 -240154 -128179 150619 129441 27529 -132559 -390571 -233597 31241 119298
18081 119298 -205718 -443301 -115850 -98555 -196122 -69020 221289 292469 453233 629253
18071 629253 825744 815725 346135 99876 -275937 -799324 -1045265 -978469 -1075233 -917285
18061 -917285 -377582 -96644 11567 246298 450079 902425 1292964 960173 588806 502650
18051 502650 782813 1161064 773275 -260125 -720990 -447565 -389777 -566701 -622897 -456290
18041 -456290 175707 619464 560349 435595 358755 349692 749072 828707 417785 185303
18031 185303 198410 188550 -35130 -310936 -555549 -668844 -469821 -353034 -496140 -635447
18021 -635447 -243788 479510 1001470 869855 463303 -176505 -413121 -468210 -680511 -647482
18011 -647482 -406312 124046 555888 708403 427153 68750 -139747 -283755 -129857 151521
18001 151521 -3929 -490783 -541448 -746286 -1010845 -1011273 -1095915 -1470573 -1588817 -1172421
17991 -1172421 -523114 -20727 394978 146858 -336291 -473131 -693471 -955497 -1055666
17982 -1055666 -910643 -714705 -536638 -315918 -56514 -603124 -940406 -561824 -230910
17973 -230910 -70672 -122302 -199161 -384094 -764900 -775553 -485677 -187784 81814 176786
17963 176786 7051 -111768 -86955 -287326 -455881 -279850 7777 -18882 -376973 -398243
17953 -398243 -240892 111285 108861 204087 515990 682378 346940 -250929 -278557 -257760
17943 -257760 -82089 143210 -80534 -252522 65329 278645 228953 378991 515828 192138
17933 192138 -303333 -745713 -860101 -650520 -388482 -394125 -590907 -952798 -1023934 -1083377
17923 -1083377 -1189204 -903096 -761301 -564373 -141206 67538 260828 236152 -117587 -166101
17913 -166101 -214237 -160783 89976 -139065 -327339 -117054 16239 -215704 -485346 -330943
17903 -330943 -168759 -293578 -426601 -446436 -485166 -628599 -645424 -736335 -860001 -827668
17893 -827668 -1134326 -1220243 -947226 -728029 -532789 -448541 -343448 -517147 -696012 -300122
17883 -300122 202918 353350 172085 -132129 -491635 -706448 -637675 -530586 -487564 -235412
17873 -235412 -216741 -415604 -459212 -358820 -78866 125613 95351 -166081 -577739 -796176
17863 -796176 -574203 -274024 -343988 -12120 244394 307104 259878 151458 69923 101764
17853 101764 261620 420795 277601 -109107 -355894 -276309 -242895 -576212 -1119577 -1102865
17843 -1102865 -710410 -332513 -407429 -597530 -525888 -361739 -465698 -976458 -1446775 -846705
17833 -846705 -46760 170118 -93579 -285504 -98738 -302337 -617846 -640444 -248227 105003
17823 105003 398103 735584 831233 727132 470912 20323 -56275 -192545 -568645 -335147
17813 -335147 293831 563599 712509 987974 924207 791121 831790 725573 1025577 1309891
17803 1309891 1557175 1527095 1499095 1304136 799342 196134 -190129 -242165 -250545 -546606
17793 -546606 -734606 -669565 -218812 -68120 -226701 3013 318190 1026689 1195882 1049616
17783 1049616 934795 876102 1211462 1382369 1556155 1459097 1240668 1051555 615392 1099
17773 1099 -200013 -607428 -884024 -749902 -530930 -105298 480166 722950 859516 573377
17763 573377 363453 324918 403174 551510 666354 1083480 1154087 840732 739554 790054
17753 790054 839121 888539 1099652 979036 791394 954502 1093078 1320943 1662263 1161264
17743 1161264 874116 1466779 2488371 3294051 3800639 3832937 3570048 3666046 4123590 5031580
17733 5031580 5785749 6237359 6693983 7055888 7479308 7867692 7643311 7434631 6827471
17724 6827471 5843996 5106625 4509309 4306459 4082855 3610342 3649912 3591402 3061736 2820174
17714 2820174 2842043 2687995 2303574 1814043 1254413 1218510 1471461 1324058 1325276 1272246
17704 1272246 1115464 851510 420305 -83252 251545 940485 1083872 1150803 1050917 993867
17694 993867 1106418 1198752 1115461 931725 820564 728825 999952 1345918 1137857 993455
17684 993455 347375 -390957 -585046 -565490 -579320 -475883 -54366 5706 -175602 -280167
17674 -280167 -243147 -496791 -531597 -432271 -156168 249929 256240 332204 97567 -81531 207284
17663 207284 218479 -1207 -133218 -137232 75662 186639 32189 199546 240993 107687
17653 107687 -92022 -298524 -526597 -31270 424218 344105 293466 206014 -686 287473
17643 287473 848863 1109999 1156006 939188 825976 791151 188570 -104490 146493 -158721
17633 -158721 -753998 -936125 -696621 -436881 -115792 -84841 -258936 -172581 -36385 192463
17623 192463 698475 1301692 1538006 1615272 1661630 1373088 787913 629516 925973 665561
17613 665561 210683 120292 332454 750925 1036606 1436480 1640712 1599036 1059523 162336
17603 162336 -527208 -1050669 -1152897 -1091580 -939202 -797671 -687408 -975408 -1005153 -374665
17593 -374665 159584 465672 707984 592494 258844 701963 1039051 1179463 1123704 924505
17583 924505 813959 967254 916150 666868 622488 849246 1522947 1943651 1875696 2028672
17573 2028672 2338747 3046141 3948914 4343152 4769779 5570255 5979373 6213793 6730680
17564 6730680 7253333 7942926 9306994 10588006 11551220 11937011 11213259 10311312 10059485
17555 10059485 9793494 9412104 9200063 8293156 7134280 6272734 6126476 6485566 6619563
17546 6619563 6544811 6387908 6118771 6048250 6358707 6954948 7591294 8773790 10309735
17537 10309735 11186812 11093962 10300808 9219813 7794555 6816226 6207062 5489505 4877879
17528 4877879 4597713 4086233 3028860 2148950 1324179 982258 1205669 1870579 2387824
17519 2387824 2305157 1683161 799577 213087 113962 86491 -222376 -697309 -609413 96124
17509 96124 477600 188325 7345 100300 11589 157522 530506 598184 161737 -170125
17499 -170125 -310656 -54299 103921 81496 377322 488924 120215 -124078 -400772 -668431
17489 -668431 -391401 44134 386656 472376 423855 324743 200764 65000 -35150 -35984 -140165
17478 -140165 -47975 192024 267171 325023 450774 451485 231436 423422 230844 -172137 -645592
17467 -645592 -764227 -792130 -804232 -486583 -120110 229439 385536 299034 145004 130258
17457 130258 231939 -62369 -126335 42658 -224841 -640465 -459422 63035 309198 552951
17447 552951 556200 -44099 -417399 -36030 269240 275843 595037 720483 673493 711642 926977
17436 926977 1299569 1140848 764651 940675 1193678 1074521 556447 181838 -156558 -584630
17426 -584630 -715781 -428554 -41321 196658 270166 -38664 -297399 -483816 -502801 -251258
17416 -251258 64004 359856 531907 335572 -26147 -324091 -498788 -678014 -1060594 -1108449
17406 -1108449 -838833 -787003 -604779 -566609 -705056 -913598 -1345635 -1492492 -1146634 -676895
17396 -676895 -620478 -730476 -1100295 -1254476 -1176808 -1124268 -1043190 -1113676 -868560 -396396
17386 -396396 -244229 -479750 -755026 -877676 -371778 -133811 15500 196833 333443 532213
17376 532213 572974 784724 735712 282652 -242137 -122576 273585 380715 164732 57700
17366 57700 54268 97825 274768 305544 448053 791316 1105331 963622 521217 94498
17356 94498 -367495 -244013 343398 434453 -15584 -416584 -659673 -522111 -50888 -256146
17346 -256146 -528376 -509583 -365777 -186066 -106967 -87471 50528 124145 249457 377779
17336 377779 353148 173847 213658 277041 55980 -301946 -265917 -29675 190824 194580 81680
17325 81680 208585 286063 729275 1182992 1155718 707221 144827 -311306 -948399 -1076662
17315 -1076662 -782369 -477841 -397381 -441294 -171465 50969 221342 -33786 -701493 -1082715
17305 -1082715 -959395 -583511 -270749 266627 747561 440946 12386 -314933 -576703
17296 -576703 -571780 -591017 -315887 108029 524935 956032 1256158 1090960 907260 810941
17286 810941 737986 679205 142500 -59760 -236238 -493545 -695919 -848782 -457460 322188
17276 322188 635871 528382 330838 329610 193737 164743 154541 63520 -403637 -924314
17266 -924314 -886745 -976024 -1212140 -1204948 -967815 -770153 -837566 -957608 -875130 -627207 -408170
17255 -408170 -355357 -440889 -530420 -307583 -161633 280688 703006 873893 888201 74461
17245 74461 -690460 -758968 -330262 191474 85698 -427952 -684410 -385989 4746 303292
17235 303292 872734 1149240 1045115 860451 464784 224732 -76112 -791219 -1507094 -1828130
17225 -1828130 -1674284 -1405497 -898537 -472674 -546384 -289153 -14415 -167698 -362596 -151647
17215 -151647 130214 -11960 -131927 37880 237423 111120 -221426 -295148 -218631 -166088
17205 -166088 181300 682859 1245005 1102526 413391 -123055 -382794 -456949 -415974 -387912
17195 -387912 108003 415445 510874 698886 607143 162248 -410865 -425430 -59512 366503
17185 366503 896037 1281943 1355795 973972 563397 318783 131852 63408 -369687 -870801
17175 -870801 -548197 -132668 -503354 -559091 -262542 -334269 -396304 -74936 -138211 -269721
17165 -269721 -495924 -320561 -353100 -276172 161538 445015 722374 823131 775030 827993
17155 827993 624595 124382 -178550 -218515 22966 836721 1413652 1367953 1010535 337035
17145 337035 -405496 -645845 -559514 -21995 461625 546069 432938 459499 572902 678931
17135 678931 504160 -209582 -749109 -669638 -651680 -1013299 -1008720 -697476 -467853 -399596
17125 -399596 -345148 -294126 -235581 -173302 -479118 -578324 -317225 -257656 -605808 -789488 -1160610
17114 -1160610 -1610608 -1573777 -1380495 -741147 -122839 202674 510748 795944 1220449 877821
17104 877821 607273 784578 484823 167028 -62022 31428 30307 64264 36677 -196706
17094 -196706 -305831 -132385 131219 91473 -313435 -154002 97319 270451 387243 326737
17084 326737 165820 254901 -210149 -387056 -339859 -319515 -139954 84892 22825 -446778
17074 -446778 -900553 -997837 -932991 -1153259 -1348301 -1489041 -1115803 -146698 394569 474263
17064 474263 175468 -283940 -766342 -1095358 -1148873 -1167038 -1064984 -603910 -215265 -663987
17054 -663987 -1015298 -1047285 -964487 -1002859 -892701 -565559 -313795 -219019 -118259 -62413
17044 -62413 -238859 -254338 121706 71482 -468240 -871115 -1171936 -1306779 -1011236 -714135
17034 -714135 -693571 -958520 -1360743 -1366212 -1207723 -1103860 -929770 -729012 -547723 -563877
17024 -563877 -376105 61989 149327 -404768 -853597 -1090361 -1129827 -1032034 -695490 -313206
17014 -313206 -222202 -71518 -23872 -268047 -417539 -519913 -414128 -16804 334302 427915
17004 427915 516770 474843 114622 -103268 -852988 -1406156 -1467333 -1337009 -998782 -955132
16994 -955132 -817683 -723455 -965286 -811906 -469634 -139228 88561 153195 346302 391349
16984 391349 -77236 -484031 -650310 -450455 -226039 133391 48239 -342953 -461453 -725268
16974 -725268 -839990 -620834 -294198 -140480 -56064 199294 441647 409101 23155 -512160
16964 -512160 -744794 -569862 -253015 16387 -228325 -649946 -724332 -569054 -358478 -584901
16954 -584901 -982766 -929285 -480780 -209130 -38733 -68145 -556287 -1166091 -1273059 -828314
16944 -828314 -426371 -217457 -121284 279823 426535 178526 -142769 -349353 -327144 -239522
16934 -239522 -310663 -361107 -163150 24243 210604 485021 283710 -252833 -671226 -944840
16924 -944840 -1008351 -947342 -729361 -868281 -933490 -613890 -257078 226780 673968 1162919
16914 1162919 1320571 792810 307504 -7013 -207369 -563902 -587366 -514451 -708651 -302307
16904 -302307 206351 208321 -74071 -212817 -278602 -700685 -556936 -142725 42606 -146590
16894 -146590 -391119 -234023 58727 148436 379293 551103 436940 208305 -101816 -182114
16884 -182114 187833 581724 341079 -53920 -310727 -69340 373845 645004 825972 624204
16874 624204 389858 502191 519770 -108343 -783938 -897658 -1083368 -1396084 -1482301 -1101467
16864 -1101467 -220285 503869 414585 231652 538932 501711 65030 -278194 -664713 -937484
16854 -937484 -825839 -842577 -826987 -664285 -547821 -328108 -115175 -124908 -215211 -169629 -194675
16843 -194675 58240 293860 357960 482305 740254 798395 335804 211840 408924 206901
16833 206901 269309 319225 319586 309899 172779 327508 393294 451804 563141 -10909 -229572
16822 -229572 244022 590963 480324 99208 -314541 -225274 388993 478897 120261 14463
16812 14463 -213262 -589903 -496848 133436 549138 190243 -297000 -461741 -486601 -657771
16802 -657771 -686910 -679499 -645451 -601226 -1183667 -1755739 -1678682 -1368593 -643902 -552736 -869767
16791 -869767 -1176836 -878127 -346213 -25506 -178658 -657316 -962899 -521956 -24817 75072
16781 75072 149412 319709 214901 142566 210267 287380 249072 442423 868909 939659 694607
16770 694607 754599 349967 -385659 -1279063 -1724248 -1618259 -1479050 -1309655 -895885 -232767
16760 -232767 5723 -160102 -202109 -94722 -800 312001 483469 427862 362126 204749
16750 204749 43979 97646 474270 581389 165253 -196306 -529197 -822247 -880362 -658796
16740 -658796 -803737 -869047 -621431 -384847 203835 938764 989281 1139214 1157946 1072431
16730 1072431 933441 1030134 884093 523033 378214 437102 457723 549384 722372 488630
16720 488630 174406 -141430 -30584 313082 581294 164426 31544 186345 240715 480509
16710 480509 384444 -36649 -216194 341555 675846 1099658 1265037 962895 286155 -117107
16700 -117107 -133935 -53918 -131369 -501871 -252997 221263 354594 743010 1145279 1033016
16690 1033016 611498 773463 884843 762195 886602 1158175 1131674 1086279 958924 676107
16680 676107 509833 311599 -45981 -211650 -19069 143527 -182165 -671398 -966160 -656226
16670 -656226 -367981 -317452 -138078 217643 382840 368013 281449 -111520 31227 194126
16660 194126 33366 -325483 -764115 -953641 -827983 -496276 -318979 -461898 -444002 -282829
16650 -282829 -369068 -372066 93284 720290 770919 610753 420459 215512 -145541 -324045
16640 -324045 -279055 -184510 -217278 -328905 -522815 -645599 -602930 -634693 -548585 -620486 -774463
16629 -774463 -411596 253814 507778 704191 628942 815901 1031575 764735 552492 680690
16619 680690 980629 1081689 596788 248337 171502 191886 -150735 -339956 -150918 -191595
16609 -191595 -414550 -629088 -763207 -689807 -288516 -348606 -838700 -1018702 -791638 -547643
16599 -547643 -447542 -626664 -941290 -1082140 -974005 -655468 -421583 -374422 -282811 -112043
16589 -112043 -317918 -145420 417071 927732 1146827 1067828 820927 613057 299950 -21460
16579 -21460 -528543 -644236 -524157 -44262 387998 292886 123422 -4164 -245308 -249918
16569 -249918 -241008 -132657 546439 709205 472604 80962 -464075 -695025 -597667 -723114
16559 -723114 -972322 -913012 -668389 -539374 -281030 -194356 -479436 -797772 -828559 -551501
16549 -551501 -29468 60805 -446088 -762735 -825877 -680070 -654716 -736156 -413969 -177263
16539 -177263 -364823 -753680 -865781 -972381 -1014396 -775918 -572985 -286450 -337710 -494677
16529 -494677 -505417 -420382 -359217 -385029 -320431 -724995 -1341332 -1436046 -856208 -348216 88653
16518 88653 506793 692918 497764 457526 410357 3632 -120209 1144 -152616 -786567
16508 -786567 -1272054 -1207780 -1265609 -1268907 -985670 -894900 -1060634 -932971 -585491 -512017 -899084
16497 -899084 -999811 -856688 -960683 -1064358 -1001498 -834477 -741215 -479273 -354699 -495879
16487 -495879 -384460 -372005 -570528 -643013 -461791 -422177 -472766 34752 645697 522656
16477 522656 353023 394274 618501 690628 491201 297794 480431 754643 854009 818868
16467 818868 383574 -78422 28959 187927 284615 -168164 -889078 -1020665 -716819 -185119
16457 -185119 -284741 -626391 -954185 -1070313 -887321 -598816 -258651 119126 215532 -158849
16447 -158849 -310184 -302892 -140889 -123062 -79260 137993 80630 -291173 -378402 -417443 -494135
16436 -494135 -45101 256297 122708 308203 545820 719160 1017898 1084170 829331 519728
16426 519728 457196 136236 -435854 -773206 -709843 -602206 -361422 -523654 -1020763 -1035353
16416 -1035353 -802930 -852245 -447165 -50326 -219567 -283309 143657 460705 552384 614813
16406 614813 451158 31903 401089 996073 1217997 1110823 903573 834423 1063580 1131741
16396 1131741 818692 225921 -620454 -952478 -738383 -647672 -473680 -32245 335540 437841
16386 437841 520938 718804 844955 937755 1054462 1093316 1046208 860916 689517 765196
16376 765196 908398 1227612 1217344 673685 645622 861582 980266 858341 378277 262365
16366 262365 228324 253208 197707 196025 136358 -192679 -369122 -538126 -844596 -870603 -458499
16355 -458499 75250 241417 26591 61704 339890 553332 579651 591581 588909 2680
16345 2680 -918 340549 148842 54805 13150 4425 145435 417957 703890 858668 800776
16334 800776 704955 558210 577561 708041 593284 324718 289019 213951 331094 300407
16324 300407 -120934 -382517 -536300 -429423 -462097 -861101 -929115 -354341 -95756 -200665
16314 -200665 -433309 -268146 307460 585932 333038 313940 757192 1024406 1037783 1004265
16304 1004265 883176 498234 -249872 -633235 -451868 35619 403806 228707 -142160
16295 -142160 -302686 131557 662068 835630 480779 17571 25907 174774 590526 708920
16285 708920 405398 167972 433221 888717 894755 677201 340077 53413 -25419 -151032
16275 -151032 -230193 -119621 -382551 -602587 -594028 -509984 -821597 -966186 -724575 -347609
16265 -347609 -220617 -408601 -451561 -412580 -162227 389054 697864 554609 317078 283076
16255 283076 -196273 -742984 -654813 -513874 -500231 -285424 -298525 -542235 -641791 -571234
16245 -571234 -509670 -597340 -794266 -849726 -657839 -257325 -56083 196804 13004 -404484
16235 -404484 -180967 45708 -122911 -534899 -883169 -1115592 -1032828 -669254 -218937 -239356
16225 -239356 -301036 -328334 -572980 -437843 -202503 138912 -54475 -284730 -417179 -342303
16215 -342303 -346203 24275 431163 217745 -14112 -406012 -945448 -837485 -466200 -45041
16205 -45041 484664 275248 111965 191530 166750 -12858 78865 561103 1110116 1450964
16195 1450964 1811461 1991939 1960907 1888875 1726711 1730143 2095435 2701236 3684644 4192841
16185 4192841 4624102 5269180 6276691 7424919 8391851 9204699 9942907 10430579 10435963
16176 10435963 10065025 9721197 9418577 8966479 8394091 7364502 6371621 5806326 5482592
16167 5482592 5335577 5243304 5322567 5121861 4651596 3820053 3046077 2860483 3319536 3456718
16157 3456718 3652159 3874552 3445517 3227538 3448443 3480447 3065896 2471252 2318263 2756940
16147 2756940 3299440 3658391 4004663 4125005 3759656 2977748 2340890 2075772 1915195
16138 1915195 1955143 1696788 1543773 1806137 1839014 1796448 1491255 1133622 871661 1020657
16128 1020657 1196943 991914 756233 474861 420437 608097 1092702 1571742 1375804 887930
16118 887930 768737 688380 620493 680839 664830 623318 767473 829531 860950 986031 1188381
16107 1188381 868116 209966 90987 301251 -36007 -51392 550267 1180762 1503757 1276326
16097 1276326 1054476 669027 609247 547266 478957 593559 380701 244128 437816 565106
16087 565106 204638 -68384 -51197 -14819 -133918 -220693 -262635 -322373 -243940 -332115 -851037
16076 -851037 -1277642 -775733 -132818 72731 235511 307615 17432 -470861 -572212 -424458
16066 -424458 -243638 -71875 -206330 82492 -222200 -599052 -618689 -326863 -8910 324608
16056 324608 654834 658607 376742 138617 357669 186549 -141550 -223208 -159115 -154918 -522091
16045 -522091 -1082147 -1034332 -792069 -883338 -814116 -310799 -87037 61360 387333 44254
16035 44254 -488704 -468079 -273511 -305866 -66305 -80542 -320675 -415342 -314011 -214675 -74154
16024 -74154 -45063 -161267 61198 404785 1011140 1050124 604103 352433 300092 62631
16014 62631 44525 367632 678679 586968 833562 1018154 644488 358727 475478 430577
16004 430577 285007 111596 -194022 -36254 406920 550868 570044 689732 635060 255869
15994 255869 982 133338 341509 126061 30963 331111 666667 369715 28960 -236320
15984 -236320 -264124 -194479 -426237 -934428 -1078844 -657778 60389 356586 413884 694870
15974 694870 1009889 835182 499347 205926 29108 -141884 -316467 21320 363499 708845
15964 708845 1160499 1046179 453711 174003 175610 349552 511742 344547 -35403 -256908
15954 -256908 -97813 219222 29940 -535088 -662980 -481004 -486104 -414430 -119770 120894
15944 120894 536911 542226 324340 327299 71363 -71762 -19842 235372 595086 465150
15934 465150 254128 223422 203023 319081 344986 145755 472882 821681 674806 462718
15924 462718 459031 594403 642814 384465 154780 106501 131349 192607 221136 506211 593455
15913 593455 642617 402184 139152 68066 424856 518062 392652 58700 -266934 -362681
15903 -362681 -347879 -445087 -915113 -1000074 -698940 -562166 -303104 -334073 -703745 -465161
15893 -465161 -101063 81453 -125244 -122005 -53497 -243514 -438325 -272672 318369 442374
15883 442374 168617 -207626 -243587 -529066 -788366 -794212 -839065 -859714 -494344 121583
15873 121583 760902 1112262 965602 987549 1249843 1250645 1264837 1213580 933877 907069 852565
15862 852565 607012 262062 190750 215367 -96267 -464999 -715740 -482812 -18089 202591
15852 202591 270415 459693 370593 -129492 -476899 -473687 -869749 -1285442 -1504643 -1570256
15842 -1570256 -1359940 -889359 -255464 -20823 24461 -198452 -550690 -449865 -163921 -191591
15832 -191591 -92821 -340872 -463757 -78457 380598 428691 -140384 -256495 -206519 -273178
15822 -273178 -199003 -106843 -144166 -237716 -282217 -532885 -663156 -616798 -624782 -734763 -596795
15811 -596795 -472446 -393376 -29047 387659 449939 152114 212905 -51167 -502389 -676332
15801 -676332 -335485 -98561 -462898 -666400 -504938 -367382 -341863 -302626 -157644 -20621
15791 -20621 238209 458544 494525 259798 220996 557254 562693 293919 -130075 -477756
15781 -477756 -871871 -961090 -795721 -473558 -81115 31857 -224620 -574073 -702442 -735593
15771 -735593 -885629 -858055 -919729 -1107361 -1087485 -1184957 -1058087 -572803 -256176 -443286
15761 -443286 -585823 -189966 -216199 -549124 -667787 -669072 -317416 129468 105220 -317135
15751 -317135 -441374 -685088 -931964 -1044858 -1062813 -1238257 -1290181 -1158034 -1144639 -1075847
15741 -1075847 -1091622 -989936 -380244 185532 396586 339406 -253732 -295089 565011 1181574
15731 1181574 985417 536490 125376 -202840 -229121 98081 569022 553458 -9407 -483325
15721 -483325 -683754 -681892 -667078 -598748 -150397 115116 -193660 -260551 257373 565575
15711 565575 70959 -365701 -408907 -104115 270818 113670 -426395 -453617 -193298 -393133
15701 -393133 -255612 -146820 -499109 -721375 -216098 204494 -133384 -326140 -208798 -147563
15691 -147563 243952 499936 42322 -486015 -525459 -141873 -18209 -206272 -427553 -411402
15681 -411402 -262728 -190890 -383640 -283599 -106407 -174862 -1402 68909 125941 302013
15671 302013 203821 -85644 -368398 -264151 288457 129841 -349065 -217288 363055 546038
15661 546038 -177680 -941618 -891857 -417218 -221380 -460544 -553155 -374852 -194690 -241370
15651 -241370 -549236 -643178 -562876 -405279 -653121 -756978 -25569 104969 -501590 -788757
15641 -788757 -877280 -809826 -560541 -687449 -927680 -924591 -829232 -706735 -765736 -736363 -787986
15630 -787986 -946126 -1038886 -1073466 -889183 -453531 -80754 11116 152975 132746 67514
15620 67514 74988 -8539 -63592 -252137 -228637 6568 -61535 -88352 116535 -129899 -396307
15609 -396307 -776721 -949228 -1072806 -758756 -45423 181221 184131 365040 687848 801513
15599 801513 686661 670208 368118 237170 268035 153220 238576 730854 1132188 1101688
15589 1101688 911198 985607 1173683 1182557 762995 248838 319992 689809 741056 634644
15579 634644 596461 523596 286124 -126074 -759454 -1060008 -846204 -540407 -377446 -505478
15569 -505478 -315638 -97837 222970 562152 643784 288336 161972 563267 197621 -399982
15559 -399982 -456358 -377686 -357719 65838 735114 995810 1631443 1764194 1241557 452902
15549 452902 -210633 -338969 -356741 -234326 -283579 -166559 82673 -21754 -11740 188899
15539 188899 261298 -79445 -391887 -459040 -258661 -158628 -332630 -91142 -54906 -263919
15529 -263919 -504334 -699827 -487433 -716765 -819560 -76111 426946 154259 -308296 -636255
15519 -636255 -675026 -708922 -565428 -173970 71441 61264 -41864 -51696 57927 287992
15509 287992 270147 -33251 -290210 -238554 182895 584079 456870 -17188 23885 -37126
15499 -37126 -17430 -26572 -383136 -406187 30897 297174 15496 -206078 -430033 -668425
15489 -668425 -472756 -294510 -174612 -271893 -544514 -464898 -135536 464819 1034406 847394
15479 847394 608468 402423 376661 592155 683176 834901 661804 600634 568868 625177
15469 625177 208528 -562977 -984449 -982518 -898411 -925698 -1084988 -1086500 -1075695 -1202329 -1428054
15458 -1428054 -1541007 -1238901 -932467 -579145 -362516 -553742 -649131 -790772 -582936 87977
15448 87977 593734 366692 -44008 -537751 -940845 -1176677 -1216778 -1069460 -951055 -1122930
15438 -1122930 -1522861 -1609462 -1474506 -1024605 -885468 -883383 -599356 -891854 -1406943 -1511352
15428 -1511352 -996157 -560558 -454204 -3651 365270 810087 1319080 1265479 895835 674381
15418 674381 293535 -31963 -416105 -724275 -808317 -504581 11896 415002 138258 253740
15408 253740 567024 399633 51378 -401032 -636885 -583604 -356861 72966 77441 -214416
15398 -214416 -231730 -273773 -372006 -418664 -127662 68429 -218579 -549599 -575092 -347448
15388 -347448 -402763 -447378 -390150 -584330 -564570 -385558 -375389 -227113 -25909 -49429 49678
15377 49678 -144562 -272751 -265436 -104064 387764 529191 289294 129481 485041 749398
15367 749398 609021 322969 236381 259859 88297 -60569 9341 -18515 -42314 286683
15357 286683 655863 613055 485719 197965 -175324 -616806 -671036 -660758 -994349 -1169086
15347 -1169086 -1289880 -1108968 -853834 -463550 107920 465236 828687 679379 20205
15338 20205 -198324 -94144 -429014 -1076357 -1075193 -406962 -76878 -305696 -442552 -348451
15328 -348451 -328946 -488171 -715039 -676989 -388459 -257415 -351421 -428855 -636912 -707300
15318 -707300 -582408 -284654 25237 -276825 -725326 -878811 -768389 -512003 -419845 -480573
15308 -480573 -498228 -418421 -647935 -949372 -975258 -840183 -367693 190003 121010 -121381
15298 -121381 149899 205178 -220401 -1150798 -1533454 -1038942 -918303 -830525 -625922 -407028
15288 -407028 -52494 -213296 -640327 -875137 -871449 -600762 -561757 -488999 -299549 -353219
15278 -353219 -149340 61949 -234903 -614613 -976021 -1710480 -2222877 -2172726 -2003968 -1617218
15268 -1617218 -1252390 -1332107 -1223454 -862309 -621017 -388521 19131 234242 390225 635738
15258 635738 555413 30405 -192360 -308594 -441830 -498544 -309198 8926 -182803 -498789
15248 -498789 -104701 112588 -33544 -28248 -50674 -35497 358453 550908 696055 1007338
15238 1007338 1018274 726025 589870 140664 -85237 193627 570064 670072 435773 46340
15228 46340 -39522 -164652 -167139 151553 520380 1050079 1144670 859258 594397 185920
15218 185920 1578 53993 -172351 -573377 -390330 -131871 -136750 -72393 181929 433825
15208 433825 679494 988287 706960 137586 -197667 -262060 -242994 -204376 -314947 -188369
15198 -188369 -56324 -139183 -341418 -321728 161105 730136 1182339 1093921 503176 202489
15188 202489 -18044 -324501 -237792 -58252 262705 594718 696757 792936 826173 1063860
15178 1063860 1221917 880307 525794 255033 15827 72560 270030 223909 95067 160178
15168 160178 513996 857748 1114168 824502 358489 223637 -66546 -298062 -304703 -214823
15158 -214823 3198 -131337 -515358 -727444 -776280 -767571 -804134 -563038 -280678 -222579
15148 -222579 -618491 -1297853 -1620050 -1300927 -509648 279122 112838 -96590 -607266 -1314687
15138 -1314687 -1041195 -542308 -625831 -1109835 -1373995 -725338 -113010 283814 510135 653748
15128 653748 829236 875562 877813 562525 412803 549159 848159 746880 286217 22517
15118 22517 -240815 -157877 -180759 -205004 -192436 -452956 -639754 -451940 -36726 83547
15108 83547 140709 263679 282574 289408 210176 -186009 -419106 -353968 -444234 -859850 -791830
15097 -791830 -415519 -328294 -408025 -502603 -376569 -548064 -878136 -951860 -842049 -712416
15087 -712416 -273334 116582 57358 -166963 -334589 -418538 -634219 -787551 -798027 -728253
15077 -728253 -569152 -434814 -52600 175941 91502 -198969 -246627 -80480 77447 -95215
15067 -95215 -524208 -620425 -495067 -634103 -904750 -1047612 -724511 -35688 480038 335120
15057 335120 -168308 -728279 -919723 -664521 -413154 -91355 539358 452838 -127844 -331856
15047 -331856 -260460 46907 367398 275387 28508 -345748 -517387 -645963 -595561 -558397
15037 -558397 -683449 -596185 -411973 -94248 -71424 -486866 -749661 -641608 -455382 -126284
15027 -126284 -171070 -539526 -926745 -1076143 -673733 50581 5534 -322461 -136003 -301578
15017 -301578 -788524 -1052681 -1019313 -807459 -339190 -407015 -822185 -673190 -431153 -837873
15007 -837873 -1150141 -714369 -352818 -369294 -435176 -513909 -589949 -750452 -1005117 -1177638
14997 -1177638 -1358145 -1448191 -1373432 -1081197 -630532 38599 72425 -254896 -343344 -291007
14987 -291007 -233350 -335599 -501951 -41138 374995 116119 -346106 -775041 -742428 -563411
14977 -563411 -233893 178749 426039 246061 -119300 -183095 -133275 -120281 -113379 77908
14967 77908 504870 585604 369120 297472 10894 -230772 -685637 -995962 -1013639 -1112065
14957 -1112065 -1050524 -721544 -344920 337783 693687 566466 366216 290768 80304 -211715
14947 -211715 -440930 -781294 -1064174 -934416 -677551 -553808 -266346 -159208 -312292 -221433
14937 -221433 -4584 110278 122819 332107 409531 481972 408313 206337 662 -93121
14927 -93121 -113661 -169836 -477588 -949061 -1063154 -1022845 -841102 -672820 -655689 -694594 -750355
14916 -750355 -429063 -193863 -94043 -4293 383488 565423 375218 265838 330758 -8578
14906 -8578 -653946 -888190 -661942 -411348 68542 497964 287753 108726 385368 172505
14896 172505 -607210 -1095723 -571028 114352 192878 -84724 -581332 -675073 -397785 -20736
14886 -20736 48121 3379 -125205 353539 876914 939462 461977 -143933 -536034 -584345
14876 -584345 54733 1015529 1401920 1206348 776829 276991 115530 83299 65739 140506
14866 140506 -22651 157436 560659 245433 -334101 -519057 -459416 -753574 -898719 -664956
14856 -664956 -436663 -473607 -510768 -131858 -206323 -595523 -440333 -185572 25906 203077
14846 203077 321873 378018 155709 -46997 -322560 -845834 -1132541 -820919 -312891 -90753
14836 -90753 -196777 -95373 67892 411348 659445 565192 88893 2485 322558 398961
14826 398961 351020 934900 1327427 1287822 1072033 889563 781761 734165 625791 348257
14816 348257 55854 -86478 -240700 -517006 -804285 -910879 -1212182 -1451108 -1335908 -1232797
14806 -1232797 -747159 -333159 -235864 -139962 -313713 -538866 -183489 -26286 -51813 28251
14796 28251 67841 7486 -495608 -560520 -292402 -285339 -224163 -104928 -169322 -294602 -305514
14785 -305514 218033 941269 1093873 1010636 727143 639430 495605 -24860 -431006 -116053
14775 -116053 105853 -122884 -338842 -522289 -473370 -204760 -354331 -438047 -355337 -370106
14765 -370106 -883626 -1218988 -1073991 -611974 -313917 -74659 313773 118177 -396370 -803431
14755 -803431 -710423 -627120 -771757 -871754 -862607 -665062 -594955 -458251 -198343 44659 -58294
14744 -58294 -415432 -496367 -349928 -87961 124349 439580 538559 576201 389107 -167146
14734 -167146 -454814 -226918 59713 490787 470956 72027 -39573 239027 649895 784806
14724 784806 791477 443191 294621 558326 544271 156571 -198894 -50953 139972 255049
14714 255049 598647 387991 50284 261878 234364 31387 -256492 -470829 -398376 -315565
14704 -315565 -110316 -150439 -268599 -346097 -85900 -78007 -253274 -310619 -299060 -362981 -275635
14693 -275635 -189555 -85669 -253449 -214954 -108138 -196132 209719 476883 279320 244563
14683 244563 631136 1004575 1016029 849258 1207886 1033648 669504 632589 871367 708002
14673 708002 117716 -44394 25665 -182654 -585887 -603155 -178360 -67724 -206536 -449560
14663 -449560 -529820 -245198 -29713 -72176 -768306 -1334847 -1164656 -1008671 -1079257 -935441
14653 -935441 -516682 -170468 -95474 86147 263035 13652 -570244 -894823 -984816 -995150
14643 -995150 -1010802 -892834 -517426 -123231 134232 357294 338778 40546 91921 580275
14633 580275 293759 -339427 -466434 -432731 -430908 -505281 -497833 -354041 62211 134648 194368
14622 194368 287036 195788 116372 -164001 -628032 -731041 -643244 -501174 -46633 474738
14612 474738 274791 -6162 -98321 -443111 -242321 279244 459308 57752 -500205 -599597
14602 -599597 -551232 -838826 -1282962 -1026247 -633266 -417156 -475365 -727307 -675151 -976523
14592 -976523 -1133416 -779159 -657213 -628390 -706392 -836460 -1164606 -1501006 -1413374 -1238406
14582 -1238406 -606727 61662 88132 91908 205169 305189 628877 810058 414953 151446
14572 151446 165879 -11010 92536 424100 414849 304307 29700 -245816 -275287 4714
14562 4714 -53285 -463672 -723147 -588735 -485043 -332856 245353 780499 868492 643355
14552 643355 397659 -274697 -715976 -658369 -393241 -368209 -431732 -401860 -558039 -645329
14542 -645329 -237307 376244 638079 530702 407387 107814 21158 156104 -185153 -596469
14532 -596469 -788327 -1154164 -1301883 -1038911 -319976 -67363 126120 216906 -225049 -716376
14522 -716376 -1134444 -1407750 -1432186 -1406605 -1750517 -2100213 -1872231 -1164558 -825171 -850474
14512 -850474 -879535 -554385 -186082 29575 340610 1083478 1714773 1334507 508934 552463
14502 552463 768445 635662 285101 -215251 -364060 -773507 -1096456 -822510 -348385 7510
14492 7510 155888 87594 130811 239900 271904 49496 -82009 262210 406142 252775
14482 252775 254030 560187 119838 -241583 -172046 -210881 -480272 -502884 -34464 305491
14472 305491 225804 -109383 -522610 -611548 -237964 433699 946205 499474 -259659 -634815
14462 -634815 -653762 -245177 12571 -395519 -579457 -86501 802614 822429 595306 412618
14452 412618 -204145 -648289 -417120 -301463 -247052 43627 54143 244613 805328 1171524
14442 1171524 1123497 881800 743750 743825 616949 616969 327230 248026 -112593 -277238 -23172
14431 -23172 84740 286799 308192 374683 220128 98709 268891 363621 -90204 -739269
14421 -739269 -816048 -455588 151538 343007 268617 179643 -157261 -426052 -339349 322060
14411 322060 529694 -157958 -863463 -756013 -516599 -663386 -1210843 -1232659 -1044573 -751885
14401 -751885 -498144 -304980 -91945 -10153 -275835 -509880 -549722 -466339 -308061 -249389
14391 -249389 -158863 -158403 -149967 -370964 -596909 -734539 -779718 -932678 -994947 -990010 -635440
14380 -635440 9944 297907 98984 -443444 -391576 -271762 -386872 -615914 -662550 -456327
14370 -456327 -468372 -613075 -590582 -491930 -575447 -355399 -123877 -158526 -249503 -183130 -113096
14359 -113096 -300621 -420977 -332019 26951 540071 513687 522265 544867 521919 529495 426048
14348 426048 -98605 -730429 -1036423 -991304 -1298603 -1228200 -1111793 -1049541 -584735 172828
14338 172828 323419 -392533 -777032 -541831 -309210 -478703 -473290 -296807 -341329 -143042
14328 -143042 140176 291357 170580 -112056 135812 505986 423127 213420 288339 865298
14318 865298 768277 197264 188661 -6708 -381050 -536169 -700207 -1099061 -1079631 -942434
14308 -942434 -505328 -604645 -795839 -651794 -177113 146806 -56398 -393126 -447050 -142796
14298 -142796 74056 -77781 -388449 -399670 -421833 -492001 -520268 -339501 -224786 -166359
14288 -166359 -174527 -187301 23823 512977 514085 26710 -271228 -627794 -922977 -538368
14278 -538368 -257002 -319763 -504557 -867047 -992614 -980846 -1086847 -1094031 -824336 -577955
14268 -577955 -540712 -683197 -933937 -1128247 -1523276 -1763371 -1656763 -1455567 -1610909 -1418982
14258 -1418982 -835156 -846924 -851092 -746578 -751259 -934132 -1309354 -1361918 -868059 -639867
14248 -639867 -547928 -597473 -745858 -957734 -979067 -607184 -307213 -397334 -592656 -563363
14238 -563363 -1198235 -1886764 -1951357 -1408922 -657500 -662041 -938382 -803024 -409551 129864
14228 129864 454026 417426 310099 565365 544482 514269 483895 489954 358281 -100150 101409
14217 101409 717785 815927 603825 498362 456118 469911 853993 1301466 1379731 1116501
14207 1116501 878194 684436 664438 778631 784417 692219 493168 186665 -135062 -185731
14197 -185731 85100 732188 1424634 1393199 308322 -501314 -998380 -1308480 -1450511 -1593492
14187 -1593492 -1320761 -689004 -71105 240825 207657 145772 264749 396356 209116 -116699
14177 -116699 -419835 -499551 -32817 70398 231319 365073 209216 340 -126336 -227343
14167 -227343 -149184 313474 484812 338226 -79003 -251763 -348488 -803580 -957563 -790370
14157 -790370 -634859 -468884 -505643 -859084 -998886 -391675 98652 119591 30944 216708
14147 216708 90854 -527968 -584439 -366290 -248428 -151683 -47015 4071 -22099 -226487
14137 -226487 -345591 170685 584801 445492 -71035 -156880 48112 65764 -346965 -976083
14127 -976083 -958603 -642301 -658962 -525858 -252602 -185335 -106652 -220558 -480224 -515608
14117 -515608 -258913 -207419 -583796 -620071 -326055 -43292 185023 129084 -271887 -361738
14107 -361738 -129103 126859 116187 19153 -6395 -86873 -367178 -134508 -60223 -372806
14097 -372806 -411858 90460 419838 53662 -280406 32519 151067 -55478 118205 441029
14087 441029 346668 235162 58958 142457 613189 795091 613469 674980 884942 773718
14077 773718 938958 919021 375671 30170 12126 -43308 31803 103223 -231029 -245241 -286282
14066 -286282 -694193 -1045024 -1106161 -595423 -115146 -149721 -599433 -1087880 -1091626 -801651
14056 -801651 -437870 -466792 -710678 -327840 -4856 83498 93327 311033 643476 694558
14046 694558 530415 381960 325326 168761 103858 265367 160366 9288 -63150 -3863
14036 -3863 15588 -53560 114385 98281 -73177 -25094 -105499 -404459 -706828 -691518 -405686
14025 -405686 -71189 57357 336697 519629 -47080 -408447 7436 298923 120540 -260942
14015 -260942 -202426 -150798 -106026 291121 491695 146464 -279830 -895593 -1411107 -1317143
14005 -1317143 -769692 -63915 156647 207684 330554 457498 418383 141294 207725 165274
13995 165274 -200784 -368361 -428435 -597318 -700217 -393250 -222755 -414839 -487557 -307303
13985 -307303 -304258 -411802 -158298 205741 -39466 -489070 -640242 -741301 -705740 -535060
13975 -535060 -485131 -301960 111838 319298 571946 309192 -279903 -538168 -556552 -289590
13965 -289590 101212 245394 431048 670574 678003 330206 -70532 -299990 -352021 -496199
13955 -496199 -740091 -927367 -1299768 -1566379 -1270432 -661202 -415089 -490600 -234639 -33695
13945 -33695 -66172 -36968 91890 -110409 -457483 -508718 57894 209121 -173836 -219218
13935 -219218 -208042 -189469 -292447 -373317 -312963 -564171 -797147 -853456 -945262 -817014 -546752
13924 -546752 -539692 -627381 -800683 -906163 -834468 -979183 -1252013 -1244820 -971037 -444781 155416
13913 155416 593793 565922 9047 -496075 -670783 -505302 -442621 -267069 -50083 -80481
13903 -80481 -227182 -414508 -412460 -244322 -386715 -626931 -913425 -1050446 -968616 -1017429
13893 -1017429 -1111227 -991245 -1036262 -788477 -215311 114929 157513 130027 -81992 -239399
13883 -239399 -319512 -43129 310843 560339 732031 498729 368264 598412 887797 1117078
13873 1117078 1303689 1365040 1144281 711410 628006 821726 644439 -11908 -446512 -911617
13863 -911617 -813185 -437211 -492817 -646475 -552412 -503290 -649387 -807584 -760084 -358051
13853 -358051 -93281 26484 156555 200910 151610 -45927 -501703 -979435 -1043823 -1219548
13843 -1219548 -1310142 -923515 -635232 -433160 -319155 -26560 178208 115546 -133294 -649744
13833 -649744 -939384 -835881 -672343 -457946 -201443 48000 433438 637974 502963 437535
13823 437535 249555 -194732 -470402 -173305 -165700 -677029 -1226603 -1224882 -669885 -352723
13813 -352723 77214 183566 -61968 -422896 -730222 -835314 -541291 -282607 -230272 -319425
13803 -319425 -625278 -534930 -308958 -504199 -540659 -425930 -286097 -53343 -277504 -594402
13793 -594402 -621892 -870053 -853616 -804964 -554023 -42111 135290 -74226 -78492 -288798
13783 -288798 -552074 -474936 -214183 -210438 -220984 158219 164482 -100928 -322377 -449143 -682798
13772 -682798 -491295 48115 81189 -278297 -797334 -1043642 -855578 -377928 196397 503985
13762 503985 393315 -165797 -436883 -397683 -453008 -450014 305297 1092039 1077158 835250
13752 835250 1000440 1113400 1193860 1465474 1213660 890203 411086 -150551 -237124 -127289
13742 -127289 -225718 -394209 -223520 85718 112122 -359370 -467979 -217933 109936 249469
13732 249469 171376 81071 265111 303845 -6045 -268200 -82197 356080 408063 106935
13722 106935 -82667 149583 334592 32262 -76935 -231984 -507914 -627172 -422365 -192155
13712 -192155 -50466 -86260 -523571 -669790 -509267 -500706 -563322 -525951 -303609 -343366 -268661
13701 -268661 -68794 128711 143492 79193 -171237 -346174 -251010 9284 325228 324439 -110928
13690 -110928 -283024 -177406 65436 189581 252338 293518 -20045 -302471 -126748 -6964
13680 -6964 -219245 153366 502221 485215 261837 400518 293807 -105994 -222778 75551
13670 75551 547727 820564 709307 460973 301686 160125 297782 696851 303523 33163
13660 33163 495282 703353 675732 803139 984501 1176385 1215922 1110736 770945 355991
13650 355991 259244 512206 615193 350444 -155561 -691417 -1092777 -1443392 -1240624 -918856
13640 -918856 -505174 -329424 -88416 259038 364593 436575 516510 197356 3105 -177359
13630 -177359 -459421 -628892 -324518 -295237 -589559 -493732 238853 374499 46819 -63027
13620 -63027 -202233 -5007 52091 16103 110120 168142 84448 -20022 89284 199815 211578
13609 211578 120109 104016 -24642 -385188 -440911 -170489 -12688 334609 476137 344765
13599 344765 594244 744778 450374 363413 444560 436355 260118 -212235 -457466 -88823
13589 -88823 336787 259974 -297418 -1112925 -1716921 -1723184 -1541465 -1224561 -956159 -758822
13579 -758822 -739309 -1069535 -1027336 -729819 -561635 -343743 -161778 6246 17784 -257462
13569 -257462 -282677 -505739 -838749 -610335 -231954 -272091 -262690 10575 186448 89229
13559 89229 -70120 -413545 -930247 -1262253 -903056 -346968 363035 811298 870571 632285
13549 632285 146547 -340602 -598952 -367801 426201 720958 702027 480972 588645 949425
13539 949425 903123 631279 590436 693708 1097340 1354694 1101889 744424 848457 1034202
13529 1034202 714567 226912 302545 315264 452057 495520 806112 1193761 936703 515406
13519 515406 506624 867362 995743 1018680 566138 -144832 -70618 145885 -74368 -55485
13509 -55485 -189739 -634398 -650361 -496384 -373970 -325142 -456480 -143847 -89339 -349164
13499 -349164 -276794 -153533 -255303 -301894 -53267 128504 90913 232058 604825 1147930
13489 1147930 1160349 644296 463585 230569 -156552 -249670 -276510 -474724 -357328 -26222
13479 -26222 -272198 -528382 -567058 -506263 -336255 -170100 29723 -34310 -351029 -860170
13469 -860170 -700489 -220787 -213950 -550342 -762371 -902931 -943216 -856221 -600226 -449188
13459 -449188 -624701 -877452 -1024744 -571659 -235027 -225928 -289744 -451763 -113161 555429
13449 555429 659543 567357 368502 410730 475522 615277 462108 122201 26134 -232496
13439 -232496 -1010439 -1239254 -1070713 -912770 -873793 -763528 -524554 -302805 -451502 -852689
13429 -852689 -1221625 -722517 -81934 420691 830368 508864 134354 -32344 -97741 -513017
13419 -513017 -672755 -341929 37429 126309 -198408 -212327 71079 14415 -439560 -711904
13409 -711904 -997509 -863366 -302459 -123430 171358 378396 249722 201444 161160 196675
13399 196675 439130 570684 549854 490115 388970 -104969 -385058 -532788 -1090876 -1302921
13389 -1302921 -646443 -346825 -43482 170508 38211 -113164 408141 926200 899124 843100
13379 843100 741382 528537 735341 560693 -151714 -526877 -101379 267873 363441 352467
13369 352467 243511 206051 188118 -138127 -392920 -301530 -315646 -614699 -724432 -318904
13359 -318904 142880 333273 -40112 -66174 -58110 -38537 -320517 -408256 -308354 -400976 -158930
13348 -158930 111126 184032 -237482 -508998 -191250 255700 392615 375785 194847 133813
13338 133813 272788 301723 254690 -50232 -241386 -227443 227794 1096136 1405733 1261685
13328 1261685 1387440 1480756 1240511 865039 1073647 1319100 1343449 1069350 378561 -91444
13318 -91444 131881 543930 729587 548777 592055 503735 616302 730153 407051 463661
13308 463661 531081 497010 316421 339463 247035 28693 -185259 -394461 -575014 -651648
13298 -651648 -519865 -406584 -251416 -71388 96710 7632 -138454 -297275 -622384 -703271
13288 -703271 -77392 546427 520857 440392 586870 782732 851343 899163 1025366 968639
13278 968639 1062985 1015378 499699 289403 -7089 -343210 -460459 -125330 576042 1119120
13268 1119120 1431331 1634011 1671199 1445376 1174240 625667 384538 531211 735533 709771
13258 709771 300420 44063 -44553 -320137 -664910 -651786 -227360 222045 566524 1084764
13248 1084764 1529379 1743125 1523049 1251803 1123874 869037 455634 -202283 -263592 106292
13238 106292 424049 532953 548948 451008 230245 401248 847366 909305 703288 252714
13228 252714 -330630 -471833 -187706 428875 1131090 1425937 1132721 643369 465758 584941
13218 584941 346537 -199244 -159469 -29954 242983 668346 699696 846083 1217634 1453792
13208 1453792 1037657 854639 1202327 1402748 1421617 1244666 869109 920539 1197379 1312124
13198 1312124 1432239 1316503 1411520 1657473 1699257 1872720 2156273 2237316 2093491 1980168
13188 1980168 2089027 2448186 2584348 2110874 1819827 1679265 1536743 1596698 1735795 1788240
13178 1788240 1955332 1881769 1760908 2023055 2433073 2466240 2115466 2088439 2263534 2231965
13168 2231965 2157312 2058327 1705157 1700617 2049130 2222783 2129157 2086526 1913551 1342265
13158 1342265 952924 623156 745254 1570856 1868164 1487059 1035224 912932 1225550
13149 1225550 1751308 2218091 2254040 2359702 2564754 2719018 2995136 2883544 2507320 2147008
13139 2147008 2106041 2432773 2089301 1647739 1920232 1761015 1552411 1681693 2013509 2425569
13129 2425569 2740458 3206678 3493381 3398248 2955028 2805161 2720697 2622746 2951495 3074023
13119 3074023 3096084 3279731 3429519 3175089 2611292 2213392 2075159 2180213 2273183 2553036
13109 2553036 2566602 2568686 3157665 3544861 3576185 3802412 4124369 4357986 4779312 5289646
13099 5289646 5727106 5984607 6414916 7085983 8187522 9048195 9727946 10769098 12220829
13090 12220829 14026702 15338697 16057968 16291832 15897268 15396717 14473411 12808644 10952932
13081 10952932 9489710 8625114 7992561 7381223 6746192 6243365 5560277 4952956 4441489
13072 4441489 4431139 4983928 5052867 5003113 5302212 5844661 6210218 6416434 6234252 5449331
13062 5449331 4642002 4729049 5309271 5509290 5684774 5877552 5754993 5511704 5398451 5083319
13052 5083319 5106808 5279208 5371065 5208393 5063100 5021117 5151562 5670113 6270711 7279042
13042 7279042 7857353 7680116 7449139 7296364 7097185 7423273 7676012 7251051 6911144
13033 6911144 6978187 6888956 6982317 7183996 7291901 7594039 7855983 8027531 7815514 7672219
13023 7672219 7883503 7986507 8098395 8325762 8571317 8992070 9553651 10043681 10127289 10236196
13013 10236196 10684290 11406640 12212422 12790067 12828594 12803305 12629131 12683810 13203157 14088602
13003 14088602 15174069 16320138 17485894 18634382 19709180 21202580 22908797 24655685
12995 24655685 26538718 28653761 31462627 34776350 38573132 43038508 48367460 54817239
12987 54817239 62878798 72724726 85305660 101158651 121890968 148643542 183060319
12980 183060319 227323960 280927049 338418911 387034223 413041399 413420482 395306368
12973 395306368 367209944 334235700 297482026 257827526 218373827 182946160 153516540
12966 153516540 129834995 110722911 95522203 83349569 73358638 65299810 58538271
12959 58538271 52351503 46424242 41433516 37674638 34226995 30906345 28195941 25879947
12951 25879947 23984838 22913165 22027598 20679003 19477096 18750687 18710231 18518364 17788451
12942 17788451 17351133 16864787 16049491 15331330 15007791 15074055 15393779 15452253 15336966 15484123
12932 15484123 15578688 15718746 15840258 15945517 15942437 16125673 16565843 17180798 17776321 18703854
12922 18703854 19612626 20471420 22156396 24331169 26427447 28122268 29033647 29883871 30594985
12913 30594985 30840883 30889138 31193067 31567411 31936738 33213726 35170145 37523521 40327126
12904 40327126 43353352 47234820 52303091 58868421 67067363 77352992 90144099 106528681
12896 106528681 128044807 156119896 193027507 240672260 297400939 355773566 401632095
12889 401632095 422330370 417501357 395825226 365430355 330251085 291566599 250946603
12882 250946603 212238636 177923001 149224036 125926053 107613582 93132705 81186969
12875 81186969 71344270 63468181 57075435 51537657 46403411 42180367 39008153 36533472
12867 36533472 34404687 32498344 31087711 30593786 30839487 31680358 33439666 35908783
12859 35908783 37507999 37571391 36272242 34582314 32542011 30441335 28226949 25718722
12851 25718722 23303953 21239436 19850194 18852746 17775179 16759244 15920760 15544904
12843 15544904 15631995 15301735 15139503 15387616 15309453 14826804 14539136 14894331 15957448
12834 15957448 17019410 17495681 17568456 17874772 18221389 18492152 18906396 20006551 21366672
12825 21366672 22978724 24662664 26114423 27703837 28890292 30423920 33184707 36503455
12817 36503455 40558592 45601732 51098639 57910758 66940489 78086974 92508144 110615646
12809 110615646 133521830 163469449 202058817 250559183 307066477 362083946 401517758
12802 401517758 415325644 405872252 382462104 351651003 316328324 277726951 237841255
12795 237841255 200134037 167331490 139966210 117774262 100058309 85533804 73768787
12788 73768787 64555691 57086146 50880844 45213305 40027697 35530668 31883713 28777382
12780 28777382 25656907 22989832 20810430 18930612 17403312 16004736 14591897 13609068
12772 13609068 12628346 11445634 10255896 9605358 9269035 8855944 8080665 7116112 6720360
12763 6720360 6621047 6500956 6507442 6536350 6579861 6224388 5872969 5575734 5208255 5125664
12753 5125664 5084787 5113112 4789630 4307705 3950077 3702087 3361385 3175814 2999099 2958552
12743 2958552 3170579 3250270 3015036 2947026 3116025 3057287 2772243 1951192 1678219 1805256
12733 1805256 1730733 2018743 2215657 2156979 2171082 1916851 1309867 1078423 1344666 1716199
12723 1716199 1785928 1689125 1570636 1724523 2219073 2502969 2222883 1743640 1381326 1346416
12713 1346416 1154668 828433 717576 1337990 1660085 1461672 1146823 1060909 1138590 1258711
12703 1258711 1537540 1115586 643361 864407 1191404 1309886 990410 548981 688205
12694 688205 1137935 1276145 825836 516653 745764 1047991 961253 1185472 1603994 1378266
12684 1378266 1082235 880189 1104459 1540353 1809281 1578568 1121933 1079284 1639402 2068090
12674 2068090 1746264 911395 659478 895043 908990 873061 1013635 1093569 726018 594933
12664 594933 834074 1051058 1236237 1384744 1467046 1671881 2041947 2359495 2458879 2864044
12654 2864044 3792934 4445632 4689064 5112940 6177243 7800147 9732066 11766472 14479832
12645 14479832 16611355 16402873 15059654 13944226 12936761 11680047 10029368 8164346
12637 8164346 6795373 5728146 4939879 4868933 4664062 4479568 4491024 4457895 4213122 3630464
12627 3630464 2995796 2754087 2684427 2520174 2695237 2616383 2440639 2236873 1604035 1072360
12617 1072360 795107 657570 538977 529864 961805 1314861 1147021 1135873 981826 562047
12607 562047 283614 274380 697405 1108237 1605252 2374541 2664466 2890873 3745363 4465644
12597 4465644 4717056 5420466 6985475 8818588 10571082 11755172 12452338 12555570 11824322
12588 11824322 10863889 10110797 9155209 7752836 6338288 5456536 5049129 4689425 3895419
12579 3895419 3091915 2395527 1827592 1529907 1515576 1313394 1027435 980829 941466 1375805
12569 1375805 1405499 960336 726475 587132 610253 706337 641952 644648 624603 372892 238729
12558 238729 98702 -201539 -558927 -679950 -328046 -102587 80519 620990 1054175 1068939
12548 1068939 1184464 1388724 1614763 1439170 629924 -276254 -497035 -126774 80197
12539 80197 322523 522456 1057675 1164727 1016721 1013420 627965 -93251 -708419 -937997
12529 -937997 -757207 -740205 -1089972 -1146092 -572249 -64442 -142517 -590000 -585513 13425
12519 13425 828501 1230588 1309701 1354277 1213783 1205071 1140583 999826 1181491 1622475 1608326
12508 1608326 1195917 1150215 1203219 998739 709634 371443 -158027 -389963 -401595 -261346
12498 -261346 39399 -288484 -621799 -562424 -369639 -127895 125443 115248 260620 375965
12488 375965 358845 278968 225815 421481 199149 -301210 -397835 -215515 -159171 -278591
12478 -278591 -319408 -320862 -635828 -1147944 -1322585 -1065668 -511895 -159265 -233673 -61135
12468 -61135 404783 757627 841277 812562 144347 -459840 -644151 -615466 -798275 -966986
12458 -966986 -630969 -416669 -442592 -308986 -359291 -399610 -115411 200976 146712 -87630
12448 -87630 -120235 -117652 -396815 -573818 -946778 -1231040 -832553 -984343 -1072079 -622554
12438 -622554 -557928 -570572 -473738 27620 370692 110515 27652 262978 301561 352854 163312
12427 163312 -395716 -712132 -674987 -502991 -231766 76450 156292 389053 629768 913225
12417 913225 1196923 1052933 1007444 1092567 759836 537670 382636 137054 64730 120135
12407 120135 142644 -135192 -644263 -736187 -650355 -683855 -415286 -182096 60155 370332
12397 370332 639237 689646 665254 587340 279584 240084 237331 -43264 -379551 -312910 -103268
12386 -103268 34220 353397 901963 1362362 1917087 1863065 1436817 1172304 1276133 1442744
12376 1442744 1006546 460483 469411 728066 552038 436243 552812 267361 -111871 -142744
12366 -142744 374110 547494 305333 148027 457664 657908 642373 776377 955725 519134
12356 519134 290555 177144 98648 -48750 -381167 -86919 114769 27292 -207537 -84211
12346 -84211 -72204 188635 336182 -101197 -408651 -368344 -213495 -33124 199630 712543
12336 712543 982411 946531 1001768 1105636 371625 -154058 -327938 -520867 -473400 -603406
12326 -603406 -260444 111534 332395 481808 430782 125051 -36700 153862 311751 855992
12316 855992 1039458 869118 1267923 1526902 1092539 491705 171754 346622 640628 851350
12306 851350 659904 517268 268385 -21117 101613 160643 200008 521420 425275 -145240
12296 -145240 -585984 -564957 -326146 -328226 -571687 -369258 -58247 36253 -138999 -130684 88978
12285 88978 -9566 -392703 -577740 -499043 -296850 51931 499954 678104 881394 1060688
12275 1060688 993379 513753 1738 -595346 -1150500 -1432763 -1492069 -1368486 -1007567 -457538
12265 -457538 -338426 -311658 -278314 -341206 -90414 -340213 -699455 -517066 -452606 -303832
12255 -303832 -184292 -444518 -690656 -778639 -1264291 -1187885 -829347 -594571 -261799 -358362
12245 -358362 -545160 -144986 64247 281495 485769 454960 177827 -379883 -560757 -500585
12235 -500585 -487912 -62980 -57258 -234831 -179975 -370696 -619270 -587497 -383395 -51975
12225 -51975 126116 301356 729552 1006800 1018052 723386 336116 213276 -339027 -935274
12215 -935274 -1452668 -1849172 -1762039 -1294561 -779906 -435075 -173314 529118 998250 703343
12205 703343 90469 -470668 -1003155 -1271845 -1428055 -1387026 -1199407 -986573 -682894 -600524
12195 -600524 -555554 -119749 -287463 -719538 -680583 -253852 -226641 -356147 -323624 -203934
12185 -203934 -60073 89644 -112259 -379900 -195824 161764 201912 161923 319127 460656
12175 460656 236079 279191 710606 910131 1057050 686321 70718 -21611 145515 355758
12165 355758 443703 374286 116291 -110923 51523 199820 459721 673524 369391 -22895
12155 -22895 -298039 -611884 -726025 -817127 -507280 -102872 -68243 319653 420159 199465
12145 199465 -231028 -373005 -297281 -551010 -690308 -863875 -990674 -1101216 -898137 -513705
12135 -513705 -160013 -260866 -562023 -835714 -1070610 -1164743 -793897 -519374 -509835 -506119
12125 -506119 -668645 -798181 -507413 -326605 -447371 -350721 -276703 -325208 -327989 -913329
12115 -913329 -1288192 -1367333 -1248646 -1137228 -895875 -525105 -493788 -325443 -122442 -270833
12105 -270833 -460261 -295196 -162081 -113859 176856 297961 -3033 -486107 -838285 -944575
12095 -944575 -835166 -441215 -334682 -721069 -1212432 -1550688 -1820996 -1872116 -1322547 -743399
12085 -743399 -652451 -638343 -460278 -168353 -118128 -294338 -372541 -587825 -861978 -1053299
12075 -1053299 -1176200 -1148170 -867222 -550883 -164636 353594 775497 673629 666211 790168
12065 790168 918505 784062 189600 -571259 -1026544 -1231994 -1196190 -601088 -249291 -176991
12055 -176991 -132091 -246137 167243 768638 1137026 748532 155060 -148080 -64020 219420
12045 219420 177484 -30143 -176710 -102729 -14009 -220522 -497402 -519287 -525754 -447346 -502055
12034 -502055 -528454 -543285 -638588 -781970 -1109787 -1206773 -1209634 -908087 -147448 342171 299895
12023 299895 140461 -300790 -525267 11140 388342 699620 929787 912234 781420 585678
12013 585678 557088 437578 -137911 -541843 -478496 -244001 81543 487210 844518 1139925
12003 1139925 1136815 613534 136187 -68118 -214764 -249406 -90992 113877 -37577 -199701
11993 -199701 -16926 -274851 -946603 -1084600 -708009 -293254 -155747 -148877 -21833 554671
11983 554671 814714 380163 -8339 -148033 123491 167312 185847 768087 1156270 929043
11973 929043 787612 782500 793330 674040 572141 665217 357968 268900 467556 392548 451505
11962 451505 819554 1287897 1172564 517073 258993 725399 1292564 1485536 1605527 1300462
11952 1300462 838779 859383 893934 847758 974011 895016 503629 -109458 -581670 -720370
11942 -720370 -372604 97817 456656 696922 865686 1409597 2106943 2291167 2324758 2392619
11932 2392619 2744589 3413840 4484451 5292761 5627423 6550659 7636827 8816402 9943157
11923 9943157 10832756 11061447 10916285 11007401 10964819 10443380 9551236 8667608 8137906 7625224
11913 7625224 7394364 7409864 6915683 6041033 5268816 4917828 4638532 4356137 3837595 3574409
11903 3574409 3759553 4107508 4568072 4492969 4121765 3880244 3944220 3966372 3421848 3220910
11893 3220910 3213412 3032998 2864977 2335758 1640276 1148457 842705 887087 1024869 881107
11883 881107 329429 -351879 -378814 -270993 -193061 354606 935252 1136446 1008991 1194933
11873 1194933 1923004 2353872 2002854 2045624 2428264 2850266 2910691 2157566 1555424 1410307
11863 1410307 1393703 1064027 723887 510926 345026 194720 -125035 -421529 -150442 14456
11853 14456 19276 271900 691458 792704 966915 1102536 637322 583060 422024 482711
11843 482711 679524 782191 728316 161474 -569666 -727819 -546341 13937 513399 770186
11833 770186 1300685 1820608 2430461 2731415 2371437 1875915 1352576 472507 -218942 -233201
11823 -233201 381040 712367 572319 472089 879721 1272330 1067178 563632 480361 -4986
11813 -4986 -535953 -842678 -998365 -717766 -366695 146790 425971 186169 -260458 -372383
11803 -372383 -466045 -560993 -312507 163117 82671 -129099 -96428 113124 135645 -12413
11793 -12413 372351 788694 740952 669990 230028 -571697 -639233 34413 529880 293429
11783 293429 -247970 -459698 -309090 -291034 -421587 -375719 -190912 -69883 -83625 -142620
11773 -142620 -237257 -393432 -528025 -514204 -345097 -343598 -165523 319777 683484 757095
11763 757095 894754 1193709 1510025 1844455 1538940 783866 500808 475197 91778 -265143
11753 -265143 -76232 377647 438181 305134 354986 384952 426798 355914 537389 724423
11743 724423 723994 848239 777288 641853 451185 46410 -336294 -484948 -216361 -157204
11733 -157204 -368502 -66411 68389 -24751 -23826 -241234 -358927 -193976 178625 93678
11723 93678 571000 1326106 1292856 782224 495081 302732 -199903 -458776 -343911 -177915
11713 -177915 -29474 114183 65832 72141 575952 1088793 1191793 937907 685466 716745
11703 716745 948976 616029 69557 -220594 -241304 -294008 -54393 193633 346987 578599
11693 578599 647188 606536 122005 -155601 -416005 -475852 -247500 -324990 -428777 -755175
11683 -755175 -1261006 -1195712 -925130 -740463 -535954 -370882 30637 256300 155520 69647
11673 69647 -49556 -94374 -508389 -1081519 -871347 11791 178881 -97644 -108197 -239636
11663 -239636 -572625 -926436 -944255 -722498 -575210 -285025 260881 605179 486263 -106530
11653 -106530 -884235 -939951 -277208 126450 126256 -218726 -321411 -317138 -235186 -377364 -583512
11642 -583512 -643565 -828835 -878357 -636773 -456282 -131290 -1110 -309996 -179039 46831
11632 46831 113100 46854 49064 -69780 74710 -49469 -78058 -57810 -257001 -168632 -5963
11621 -5963 128426 -104209 -201054 513607 1080866 1094509 996591 968659 986051 684402 121547
11610 121547 -223818 -452432 -618942 -609433 -590402 -589493 -756888 -1276693 -1289378 -1002624 -708932
11599 -708932 -356499 -82709 -173156 -477632 -544331 -121692 452720 321441 468622 1145690
11589 1145690 1352107 971255 600384 541382 526542 893970 1494991 1979890 1858898 1484588
11579 1484588 1429758 1529460 1717952 1963317 2022428 2005427 1680039 1541227 1879725 2283445
11569 2283445 2631845 2789856 2976017 2874704 2226066 1803431 1799331 1813801 1832390 1999370
11559 1999370 1811881 1296869 969123 1260477 1603085 2023742 2620734 2985381 2918506 2743587
11549 2743587 2371484 2378996 2378159 2308807 2653269 2823713 2805213 2560764 2239826 2351907 2483608
11538 2483608 2622654 3002529 3387219 4078069 4401621 4640381 4830368 4857504 5430002 6648811
11528 6648811 7858803 8645546 9556071 11015261 12292620 13583831 14749923 15447339 16083215
11519 16083215 16668657 16900236 16894890 17322062 17997312 18852417 19628494 19601883 19053370 18161125
11509 18161125 16837714 15973227 14685150 12885729 11763514 10657054 9464375 8656423
11501 8656423 8128477 7249437 6259454 5502634 5297984 5146100 4907790 4471229 3763530
11492 3763530 3455769 3597137 4014817 4108095 3531117 2888812 3034854 3166768 2813459 2465233
11482 2465233 2249478 2046610 1801608 2079279 2484288 2660737 2509797 2059300 2285784
11473 2285784 2568346 1983673 1125257 544886 240184 53988 421973 553449 491420 790969
11463 790969 764933 449465 500309 775849 834466 829257 910327 1039800 741513 225643 261045
11452 261045 445369 282643 561712 727719 596007 711844 590892 249190 -173472 -701656
11442 -701656 -758621 -419470 -283713 -327279 -520684 -519727 -404637 78563 323984 149656
11432 149656 -16283 22767 -242297 -750085 -764305 -702509 -360418 -36564 162531 -71121
11422 -71121 -309932 -173523 -118931 -526019 -854031 -798328 -507927 -264673 -471030 -1000854
11412 -1000854 -1569767 -1522823 -1249497 -1126778 -774478 -201866 406083 907341 893104 480612
11402 480612 119417 -61825 -123273 218851 397293 289629 158753 -101146 -160798 -116979
11392 -116979 81342 3511 -6215 -108668 -599441 -924548 -616739 237008 995688 1284452
11382 1284452 1097022 679627 272603 261286 485063 642004 634739 458735 101400 314923
11372 314923 891713 1577230 1550516 1209200 639107 640002 882145 1136238 1267234 1523541
11362 1523541 1876847 2453711 2888875 2389504 1945757 1758000 1428665 1061919 831762
11353 831762 779279 760521 784164 595113 588634 786401 1115779 1054322 978499 722741 550270
11342 550270 427883 171945 98193 295145 766160 743238 472322 671804 1051007 842884
11332 842884 258125 -208878 -504453 -921643 -1343670 -1393923 -1021460 -646601 -143100 461139
11322 461139 827584 663357 348473 185318 58623 -78291 -332013 -732465 -1117857 -1448865
11312 -1448865 -1373190 -891395 -570660 -635206 -287968 290097 659741 441354 243057 381200
11302 381200 524793 544133 1001868 1239987 720076 189851 225899 576628 550067 517812
11292 517812 840496 1178340 758711 -4351 -158701 -48108 -118555 -203420 -448719 -703756
11282 -703756 -434301 -5779 -139877 -671807 -1184565 -1263060 -1005439 -658618 -372571 -338616
11272 -338616 -494785 -375944 106380 402717 351745 98117 -343873 -604265 -118151 589018
11262 589018 643984 140796 -151635 -29932 -39320 -178389 -395289 -632535 -944263 -1076953
11252 -1076953 -677991 -225795 -386068 -564930 -776878 -864032 -891634 -923318 -834235 -646270
11242 -646270 -505622 -516237 -633688 -753839 -819023 -655766 -662271 -854536 -499545 46401
11232 46401 325751 254162 183035 -180464 -326762 -476398 -800142 -1052771 -1229452 -1214071
11222 -1214071 -905016 -478883 -575308 -888528 -762722 -575807 -455025 -503188 -651834 -723407
11212 -723407 -719602 -784049 -961642 -808244 -827099 -806599 -747414 -662657 -419272 -287728 -520313
11201 -520313 -672530 -418888 -632144 -749638 -717884 -189163 130381 84594 -234599 -482225
11191 -482225 -348912 -265969 -157054 -373394 -464780 -343786 -27730 310659 187165 -221314
11181 -221314 -852068 -1164756 -1272432 -975391 -856928 -482568 96133 376407 385568 340129
11171 340129 -318428 -729192 -484899 -291092 -225425 -427602 -603879 -560302 -492430 -438024
11161 -438024 -407544 -142632 318106 429895 400794 523039 119073 -180460 16839 443850
11151 443850 505141 -238191 -909659 -941151 -398959 191511 577354 502045 393537 554526
11141 554526 413359 -189264 -707475 -708458 -270678 4440 -128779 -339824 -556585 -531105
11131 -531105 -793243 -770382 -321999 -321939 -193567 190412 98957 -51941 3369 -111342 -422381
11120 -422381 -702219 -850792 -647461 -366881 -363385 -303177 -108215 -362110 -388905 -100065
11110 -100065 -62719 11226 218499 297217 644831 744272 238882 -275479 -586349 -935284
11100 -935284 -1261586 -1402690 -1487560 -931292 -395106 -337218 -582482 -989719 -1015070 -716981
11090 -716981 -548795 -526876 -697495 -856168 -578572 -419091 -405390 -512582 -613023 -437295
11080 -437295 -408101 -344900 -315498 -160787 91389 266229 3546 -764626 -1412490 -1683484
11070 -1683484 -1773265 -1554187 -1238141 -648438 -164284 -2057 -19403 82675 -41475 -300076
11060 -300076 -334338 -198441 -299710 -322217 -64926 24080 28205 -212384 -595615 -726404
11050 -726404 -605294 -643205 -855705 -937575 -964102 -966414 -867905 -1006436 -1119471 -729565 -451625
11039 -451625 -154064 278004 478088 164750 -393737 -505044 -472395 -409355 -77823 114806
11029 114806 163507 94217 -331808 -513148 -324882 -524766 -679329 -431481 -426347 -507419
11019 -507419 -439116 -395131 -404803 -363317 -20916 166089 642569 1204913 1330055 810561
11009 810561 249769 63972 28389 167607 448913 308305 -31480 -284689 -527806 -929969
10999 -929969 -872465 -332877 -84433 -268293 -428802 -196068 139602 -88870 -361104 -338989
10989 -338989 172756 445912 360821 -194301 -486864 -753268 -744510 -409504 -469235 -671652
10979 -671652 -874744 -938979 -1031678 -934848 -497696 -151046 -54728 -172017 -389876 -518473
10969 -518473 -216390 192958 403923 173714 -111560 -219931 -491726 -702049 -651407 117500
10959 117500 630339 789122 1026743 1242515 1121362 336999 -454904 -820610 -933671 -596825
10949 -596825 -303669 -373180 -625490 -997116 -1355677 -1109149 -834031 -167753 417424 112166
10939 112166 -131364 147822 170624 198450 235486 199621 621891 1124765 1452208 1613224
10929 1613224 1492239 1283699 983951 1121880 972889 393669 550636 1031331 967482 793874
10919 793874 782519 1000105 1131769 927360 930665 1026917 942331 918194 909938 590077 381201
10908 381201 685086 796218 365544 20426 81013 34928 90444 638531 723972 519927
10898 519927 406492 187116 -204323 -392611 -428229 -367303 173239 379176 140017 -184712
10888 -184712 -241153 -454341 -579621 -96993 369026 688057 496408 361310 450157 592842
10878 592842 504692 278673 -144329 -572355 -459325 -271430 -329914 -425563 -626472 -886318
10868 -886318 -1057171 -1144280 -1066075 -1171869 -1206035 -1021676 -879828 -744401 -557010 -95153
10858 -95153 284539 443033 495078 240998 -380967 -882357 -936992 -837055 -795343 -432577
10848 -432577 88672 237621 216757 98939 98343 -40250 -209194 -553570 -997165 -870971
10838 -870971 -214467 323004 702260 673731 197962 -15911 -299212 -512657 -456863 41247
10828 41247 410193 506472 128999 -137524 77851 342159 316021 325897 416645 144202 163421
10817 163421 331093 484232 183742 -277958 -256824 129888 217724 427717 696859 977363
10807 977363 1239561 1222065 803051 521944 175732 47972 184916 187207 395889 595661
10797 595661 352650 16722 179219 753879 1111280 953096 595393 280343 104552 424253
10787 424253 498991 280649 251714 370778 240574 -147312 -372752 -306554 -676415 -1067203
10777 -1067203 -859335 -422048 -301343 -227704 -165866 -226646 -290813 -601176 -511252 -547855
10767 -547855 -584183 -602412 -444485 -163320 -128372 28565 484936 653113 441661 150217
10757 150217 -66010 -117985 -185342 -321073 67263 713606 766859 819469 501797 -714
10747 -714 -235151 -286053 -246602 -469451 -706748 -639445 -617145 -1150516 -1525453 -1428020 -1248997
10736 -1248997 -1262367 -1267180 -1204018 -1025020 -1011424 -1301282 -1648883 -1859613 -1506163 -1159039
10726 -1159039 -1406249 -1518730 -1014189 -21040 137046 -119048 -260907 -110955 25423
10717 25423 184278 206538 27775 -111301 -97713 -417105 -930207 -950588 -1012254 -1373371
10707 -1373371 -1354764 -1306258 -1503663 -1336344 -1122395 -960527 -743164 -271731 -70254 -452304
10697 -452304 -868481 -885607 -617372 -311075 235215 410639 84940 -205037 -405166 62569
10687 62569 702991 932225 694686 51428 -350493 -319297 -336884 -479578 -440789 -212509
10677 -212509 -218967 17298 745339 1235253 800023 142926 -170619 -302880 -407451 -109004
10667 -109004 -116228 -418820 -311846 17358 -58063 -542084 -1043020 -1166013 -1036246 -1157217
10657 -1157217 -1252360 -1009125 -829002 -761871 -787839 -539484 -38127 -265470 -826757 -956450
10647 -956450 -514202 -414786 -503115 -652765 -983118 -564653 44678 -7845 -70089 -178070
10637 -178070 -234076 159392 186739 -208501 -142760 97464 261866 71795 102630 250872
10627 250872 169329 162642 212771 514561 603538 657662 861707 472318 -100604 -67459 354122
10616 354122 452206 87728 -271987 -449382 -494413 -588084 -56739 323730 -20399 -348888
10606 -348888 -308108 -309403 -433972 -692700 -990387 -1175923 -1219912 -639453 112519 311749
10596 311749 -11349 -522778 -1057864 -1482230 -1354468 -915398 -761911 -881757 -816122 -530831
10586 -530831 -499740 -529855 -141977 126122 278605 329250 233518 181215 -240041 -594992
10576 -594992 -421060 55638 -70768 -341044 -430604 -637702 -551431 -160586 -106354 -481104
10566 -481104 -644000 -208689 80691 -90881 -210592 -236723 -67746 164062 359313 430297
10556 430297 127587 -172882 209380 780869 856517 867779 659021 435552 336986 571131
10546 571131 589671 618998 1132030 1374286 721261 -232117 -334616 -164866 185477 879899
10536 879899 1037770 801106 537542 474076 462454 403311 120704 -444625 -720375 -285227
10526 -285227 131011 -19398 -273753 -10603 460301 726199 511264 -146937 -682505 -727075
10516 -727075 -447624 -244348 -147717 -247021 -223638 -119454 -126683 -137398 -187787 -8960 230252
10505 230252 287558 333171 89618 -340534 -724471 -677276 -381865 177258 286973 145859
10495 145859 291182 145936 -288886 -122850 71516 -261263 -489850 -817274 -922133 -823337
10485 -823337 -949089 -700774 -440533 -97612 117039 -113377 -546473 -765488 -1016608 -789181
10475 -789181 -553104 -1020161 -1179400 -770628 -799061 -990580 -1083859 -1182507 -1126187 -1030988
10465 -1030988 -1381036 -1637775 -1392209 -1039347 -441545 -38862 27259 -199877 -573750 -979109
10455 -979109 -1268310 -1166346 -1273249 -1446144 -1454559 -1104483 -555276 -131205 -240712 -437292
10445 -437292 -638034 -467545 -174738 -344044 -681128 -944126 -982336 -1015119 -1217066 -1547072
10435 -1547072 -1467795 -1368822 -1513672 -1639206 -1497405 -1102444 -572916 -548404 -463720 -72356
10425 -72356 221788 400405 449212 119317 -340559 -470827 -460038 -465790 -454741 -702830 -927759
10414 -927759 -738928 -354411 -455081 -352905 89131 647498 917143 809812 574123 577299
10404 577299 735256 670158 153048 -207888 -296977 -333468 -67490 474294 546372 40306
10394 40306 -382582 -458410 -186295 -104222 -124328 95723 454591 593249 675383 699996 780947
10383 780947 1026957 1086579 895358 245479 -354286 -551911 -846694 -1201279 -1437610 -1540607
10373 -1540607 -1636482 -1526017 -1077605 -874406 -1041035 -919643 -415434 -229367 -448124 -293472
10363 -293472 -323807 -322914 -23713 -32669 48879 358536 198166 -43405 -115559 -238945 -178203
10352 -178203 116307 105731 348443 1062811 1612694 1479735 1001815 865495 590727 317945
10342 317945 267316 291082 155670 1810 -75144 455364 833406 626204 259286 -529072
10332 -529072 -945513 -698237 -127753 460079 543389 498496 660904 585251 -46623 -920901
10322 -920901 -1363908 -868718 -262743 -13919 -172274 -269743 -409110 -695572 -874220 -613139
10312 -613139 -86317 -148331 -495166 -460103 -102881 -52913 -108846 -149333 -179335 -128591 -16480
10301 -16480 17012 97872 286468 90975 -2850 -9144 -219965 -609390 -1163560 -1062986 -640534
10290 -640534 -872724 -975542 -795967 -794830 -1067325 -1035381 -607064 -300954 -719905 -993595
10280 -993595 -579101 -231614 -293936 -282454 -45773 58698 -202692 -615400 -655016 -420335
10270 -420335 -348019 -343703 -347737 -474928 -490467 -736665 -915362 -715955 -393751 -129063 -110670
10259 -110670 -210288 101757 288498 335856 393827 436719 337376 -122003 -28193 31888 -126758
10248 -126758 124676 -15492 -249093 -91313 334810 737198 802092 322704 -335552 -532630
10238 -532630 -104996 618748 612951 536131 1002329 905161 108017 -343693 -432637 -478875 -848973
10227 -848973 -1174427 -1045291 -929865 -1027605 -953374 -999964 -1006188 -982162 -864706 -676467 -90753
10216 -90753 441074 278144 -216486 -388399 -419928 -382427 21150 335309 213854 -584568
10206 -584568 -590735 41632 245830 229560 357395 188025 -95396 -236533 -130246 113591
10196 113591 231700 97018 -38112 -32146 111866 149974 140180 232421 191932 512098 1026238
10185 1026238 538385 -413740 -694711 -749963 -314564 -186068 -471268 -200473 188542 174424
10175 174424 -74955 -109310 -59744 -116100 -282083 -585804 -430699 -216413 161812 806992
10165 806992 1123091 1020628 424070 49356 1899 16386 95528 -48891 -37645 42385
10155 42385 -295646 -648764 -534403 517792 1284459 1239301 998402 671554 296209 -62693
10145 -62693 -343169 -369466 -339816 -512041 -538281 -422719 -354129 -50877 280824 332763 495522
10134 495522 645689 1147755 1400008 1356830 1468072 1294268 705187 12719 -28412 50119
10124 50119 150278 493137 781956 926997 1033861 1643291 1850345 1461938 1477679 1647321
10114 1647321 1964593 1851141 2155686 3059474 4356266 5476556 6725819 7957836 8839513
10105 8839513 10166769 11711031 13148226 14939871 17044345 19538051 21639426 22733503
10097 22733503 22707782 21532572 19880361 18291786 16446657 14566265 12282886 10010184
10089 10010184 8218648 6860579 5688563 4021720 2902894 2523455 2055319 1620290
10081 1620290 1723260 1771055 1601597 1352994 1168924 1302802 782277 5427 -241119 -327515
10071 -327515 -433369 -358627 -341734 -495636 -381655 -383502 -255203 -191972 -134427 254880 878445
10060 878445 1272125 1369938 1095209 399412 -104390 -113416 -299798 -565556 -475044 -320088
10050 -320088 -113659 -394351 -543057 -179200 440727 1025445 946713 309176 212037 213073
10040 213073 131552 100439 235765 119996 -157870 218238 467926 170429 -138246 -220784
10030 -220784 -389237 -580582 -194511 337715 693834 529016 450873 593330 570710 480125
10020 480125 41204 -469578 -349885 56342 367552 761217 1261279 1393754 1300719 937483
10010 937483 226337 -264019 -60274 426896 553255 683622 406072 -33403 -89557 35596
10000 35596 201617 370358 199841 54176 -169762 -469069 -541155 -514827 -357857 -180013
9990 -180013 -356114 -682116 -1103550 -903203 -821143 -1086340 -1083816 -1000506 -997093 -577026 -109261
9979 -109261 -202950 -521976 -456110 -241972 -327860 -471870 -511479 -599230 -810441 -712294 -593354
9968 -593354 -591510 -733177 -556156 -466959 -606149 -465592 -153358 310597 675565 703033
9958 703033 314998 -516918 -1307033 -1514677 -1365342 -1067536 -768020 -485225 -365784 -762623
9948 -762623 -1149874 -666815 -227943 -41021 354515 833726 1003142 826458 710534 606945
9938 606945 289069 -11446 -154753 -432015 -705883 -1159839 -1615535 -1544713 -1520312 -1613418
9928 -1613418 -1450412 -1111194 -718424 -215799 281949 479146 171016 -101208 -191262 -249975
9918 -249975 -203914 -160612 -108414 -379489 -340160 -248339 -715037 -581768 -112461 51976 -198963
9907 -198963 -257397 -88920 179097 526699 770548 770841 233021 -654348 -1009497 -1039800 -1281232
9896 -1281232 -1482632 -1163560 -479210 129294 188027 474862 789312 535102 -61881 -220594
9886 -220594 -230263 -442104 -174599 230853 248005 -189250 -76208 363133 440653 391033 563178
9875 563178 797810 783443 760198 340279 -230789 -153904 -154869 -78384 461025 517525 82639
9864 82639 -385725 -765597 -953889 -771434 -215535 122666 -18577 -184879 -188481 -213062
9854 -213062 160148 87142 -505896 -611755 -356221 -215566 -225727 -65680 270734 509664
9844 509664 458739 186201 67299 98548 174289 145552 -187338 -18417 545497 810594
9834 810594 454535 219089 373377 203427 -271125 -214812 -300539 -903495 -1570435 -1605330
9824 -1605330 -1000321 -238260 203636 68491 -149227 -195569 -270308 -276300 -15714 14168
9814 14168 -477459 -1179939 -1766546 -1489106 -848464 -339620 120719 445236 627746 380346
9804 380346 -184018 -295889 -42099 142233 -207597 -299865 -811172 -1586321 -1580838 -1391284
9794 -1391284 -923432 -334395 -210995 -417061 -358390 133250 572630 441284 463867 620165
9784 620165 485781 -188455 -594661 -291245 -207597 -316760 -217225 -479221 -496179 -449991
9774 -449991 -605795 -973872 -987592 -835798 -723351 -431594 -268472 -260043 -290812 -530976
9764 -530976 -725040 -720440 -678618 -888698 -958418 -670143 -193881 -118549 -349635 -478273 -905220
9753 -905220 -1245155 -1235885 -845358 -57139 -48346 -537835 -832775 -748494 -518307 -268439 -192218
9742 -192218 63151 631097 444639 336283 613093 599771 543292 418934 186425 -192715
9732 -192715 -35125 327854 492590 -5384 -315908 74495 676614 719353 357498 540758
9722 540758 637658 640494 201175 -337156 -511961 -287733 221717 737633 788117 448220
9712 448220 413800 1215170 2061599 2457309 2523271 2818900 3480986 3370805 2459191 1931571
9702 1931571 1907793 1746068 1470365 1280226 1034115 647571 660407 841329 534867 360897
9692 360897 755953 1343617 1518180 693483 -162732 -583844 -944561 -957789 -393442 81579
9682 81579 120996 -154088 -376862 -691994 -773346 -260095 -50027 -84955 -107711 -474140 -773630
9671 -773630 -1132378 -1112089 -1109112 -1176365 -1005023 -715592 -456847 -342972 -272495 -463157 -748778
9660 -748778 -658054 -238440 -188976 -328616 -328944 -188319 -155063 -129362 -408028 -702009 -734028
9649 -734028 -436514 -154096 40200 -18295 105044 507263 610357 400801 76474 -302868
9639 -302868 -501517 -251506 151028 508308 370366 -94892 -182644 12925 120406 -47375
9629 -47375 -36143 358017 703658 843030 847569 364857 -7769 -151736 -337516 13711
9619 13711 537189 773504 1127061 1171218 741095 587004 927517 948991 1027375 1017737 523483
9608 523483 248274 -124458 -405518 -207083 -140551 -28897 236468 338600 338264 340585 257323
9597 257323 176752 245525 353656 484129 567655 385744 -139338 -496151 -391718 117492
9587 117492 441268 206739 10530 314766 356680 665377 1044202 987123 689759 1088673
9577 1088673 1809561 1747173 1340454 1082738 853947 322595 -105340 -84832 211007 696251
9567 696251 1019876 1430464 2372004 3028319 2903070 2741806 2830458 3165942 3732755 4336884
9557 4336884 4539566 4724884 5099119 5345260 5602076 6196511 6783795 7669722 9011405
9548 9011405 10375611 11228326 11545887 11607289 11390081 10510687 9150804 8209019 7482782
9539 7482782 6505711 5406805 4941422 5049982 5039077 4279748 3298832 2591893 2460671 2104996
9529 2104996 1769725 2217271 2644584 2450937 2151854 1697347 1324504 1420448 1375391 1269756
9519 1269756 1207444 827225 288481 455118 796620 789302 640840 618991 866828 1070193
9509 1070193 1111177 1040803 942633 895114 995916 949474 781847 1120557 1608252 1630163 1503896
9498 1503896 1369743 1325598 1480507 1580907 1314639 1071483 699159 186464 -74470 155632
9488 155632 908153 1405768 1430896 1127094 915887 782123 987823 896029 563677 301832
9478 301832 79538 325004 134128 -318453 -674273 -911753 -937967 -1109662 -1149864 -1016986
9468 -1016986 -1150336 -1447046 -1420534 -624271 -112824 -260703 -661518 -942106 -692071 -561733
9458 -561733 -525170 -439816 -180029 201723 674678 768352 257816 -337931 -550600 -361419
9448 -361419 -404951 -403327 -155242 53361 57884 305000 714108 760771 555604 292919 22993
9437 22993 -163803 -430866 -973431 -913068 -571934 -468400 -223917 120291 378212 281353
9427 281353 116031 4568 102412 -66897 -483203 -765300 -1054491 -850830 -254157 104776
9417 104776 150909 -177486 -330253 -612344 -1086953 -872695 -671857 -693490 -527354 -582431
9407 -582431 -693653 -757876 17848 660116 738707 666181 507890 452840 417843 453152 452879
9396 452879 620369 435127 -129824 -674654 -908030 -704023 -105619 358076 713262 570456
9386 570456 192018 229612 358803 160865 21917 82245 414388 520402 679135 439908
9376 439908 316964 676740 754768 616315 504930 352237 37484 -407658 -314681 -161018
9366 -161018 -283791 -499067 -605186 -456788 -690060 -1188278 -1591768 -1825309 -1642217 -1380586
9356 -1380586 -1074233 -973653 -876716 -683254 -658446 -499618 -253175 -136563 -327351 -508103
9346 -508103 -735649 -452737 -285306 -545156 -536886 -600059 -1015214 -876972 -718880 -350676
9336 -350676 -371863 -155203 395866 693012 514048 -54356 -722743 -1103502 -819709 -304262
9326 -304262 -209395 -334476 -608780 -573734 -347328 -204247 -259484 -317283 -562268 -446280
9316 -446280 -255018 -505607 -696877 -675226 -404822 -329732 -130617 483450 328893 -154230
9306 -154230 -434040 -569102 -781574 -566367 -524107 -732770 -600976 -437050 -236532 -58
9296 -58 66167 -80607 -422934 -692794 -426171 134674 454451 233889 361672 631327 769942
9285 769942 659787 666710 638508 547298 434205 269419 -71801 -153352 -199548 -524134 -871918
9274 -871918 -777897 -557658 -477917 -862358 -1161344 -1146383 -1029274 -980251 -1173810 -1726245
9264 -1726245 -1668022 -1451676 -1550006 -1227168 -826560 -855451 -932395 -824364 -803797 -839044 -820159
9253 -820159 -985266 -1315027 -1184596 -985214 -771015 -349608 -324536 -388864 -379355 -337186 101432
9242 101432 271733 337031 128509 -379533 -815470 -990611 -952464 -993766 -718804 -238906
9232 -238906 -175905 -12841 -19759 -359126 -460557 -482292 -708032 -1226504 -1493451 -1064625
9222 -1064625 -429357 -293615 -733839 -1269515 -1045864 -306584 208988 296417 4638 -299833
9212 -299833 -326252 -241086 -283085 -402293 -621458 -1059551 -1873588 -1912795 -1462312 -1038275
9202 -1038275 -794626 -1017796 -790100 -335896 -400735 -587806 -647170 -666736 -699030 -634802
9192 -634802 -626297 -854464 -642903 -342154 -374110 -858363 -1262853 -933102 -548049 -330120
9182 -330120 -287659 -341304 -379099 -755860 -986028 -1156127 -1183887 -931868 -552878 24922
9172 24922 496029 319037 202902 368480 329617 91711 156184 131357 -333677 -713481
9162 -713481 -854792 -745061 -547660 -291759 -142809 -553294 -1099502 -972685 -743300 -832802
9152 -832802 -688480 -318373 -164687 -234334 -578768 -781673 -794565 -632611 -528348 -505586
9142 -505586 -7091 -98000 170261 522878 222930 -206896 -777610 -870891 -352623 23545
9132 23545 42757 -282726 -701376 -901602 -704351 -500529 -307658 -415046 -797776 -583661
9122 -583661 -478425 -545820 -474541 -639640 -508260 -362071 -519627 -710090 -227436 201709
9112 201709 115441 -87954 -97511 -44987 166756 23563 -435309 -433031 -327675 -400705 -268987
9101 -268987 365458 598978 594670 788642 736509 250912 72228 38291 -23392 -328798 -766794
9090 -766794 -1359122 -1718035 -1835340 -1781400 -1164325 -507347 -49616 315596 116311 -182013
9080 -182013 -76307 -80939 -74837 21761 22499 203002 147770 255061 385249 -129200 -685717
9069 -685717 -519921 -411669 -491061 -461117 -334061 -255205 -423109 -531302 -952003 -1562155
9059 -1562155 -1821918 -1809902 -1491794 -886762 -597846 -408959 -377265 -226693 126379 69582
9049 69582 316793 777285 1052138 576783 16584 -143588 -198289 -158301 -162926 -325639 -872297
9038 -872297 -943805 -558401 -179023 -65124 404387 635828 292217 -167490 -171685 60843
9028 60843 -24874 -14924 150423 4230 168659 444227 544858 699197 472147 8201
9018 8201 -141043 -401008 -322134 12477 -56826 -334845 -637887 -384494 -153003 -34625
9008 -34625 -154933 -566564 -744702 -628866 -549480 -520015 -418215 -347280 -364655 -74305 -92740
8997 -92740 -191674 -327693 -759055 -921085 -683135 -254606 318879 554793 182169 -193468
8987 -193468 -696480 -808612 -385975 -406982 -837491 -883219 -397786 -242032 -415476 -354930
8977 -354930 -542556 -754504 -571494 -315061 -73063 -132761 -840349 -1321193 -1302115 -1269838
8967 -1269838 -1438792 -1403539 -1026418 -635673 -396511 -380055 -593382 -895229 -859608 -524141
8957 -524141 -304346 -268378 -348702 -459333 -546252 -385452 -238873 -463952 -471124 -35129 514761
8946 514761 794144 498911 293823 706842 699522 -60581 -597520 -634602 -713505 -857264
8936 -857264 -436089 193749 192431 -112799 -484194 -639780 -615626 -570491 -597711 -268093 -94095
8925 -94095 -50334 77179 197324 -11905 -281593 -262054 47834 220617 412922 560912
8915 560912 148509 -114573 -161170 -455953 -607238 -253829 75960 4493 -433742 -636120
8905 -636120 -553274 -560466 -561505 -558096 -341357 -253072 -142311 -54938 -182061 -269772 -509834
8894 -509834 -690637 -832356 -880440 -372744 24275 348076 383370 -24347 -593523 -909245
8884 -909245 -713685 -481485 -167832 516748 962098 893914 826788 885445 1029115 1229430
8874 1229430 902380 462357 227570 -351693 -793803 -669036 -489601 -792208 -1023056 -807507
8864 -807507 -704297 -684010 -501580 -274685 45885 338194 382886 362806 189598 307050
8854 307050 559103 954795 883698 268174 207323 551734 1395187 2026721 2383837 2558484
8844 2558484 2922995 3799758 4285529 4244475 3770863 3094006 2714706 2524988 2172765 1510730
8834 1510730 1194930 1066156 1057066 1185761 1102745 738220 59499 -399361 -314230 -187676
8824 -187676 -147404 -215193 24893 350976 190492 -199356 -254486 -107088 59660 -76037
8814 -76037 -115273 19585 -7057 -320387 -438930 -200226 -25299 230293 689090 645661
8804 645661 449512 248207 -166507 -357867 -250073 -559775 -812355 -874567 -1000149 -1296942
8794 -1296942 -1440710 -873335 -555392 -555513 -170354 -7775 205716 335320 334818 299711 130410
8783 130410 -126239 -83008 359039 573149 506025 242903 -167781 -182663 54675 302209
8773 302209 496327 614063 721998 791501 979861 1009231 773959 867346 1199128 1079774
8763 1079774 1269299 1322957 1501873 2033299 2500083 3031584 3237942 2896709 2754771 3003190
8753 3003190 3547149 4097673 4977544 6088034 7199859 8383410 9547097 10682638 11349306
8744 11349306 11160315 10750993 10068809 9286265 8529705 7658990 6831937 5941317 5201585
8735 5201585 4614994 4144235 3714433 2998432 2316156 1983145 1516262 823591 559204 474238
8725 474238 341433 173850 55455 102056 -10985 261939 537974 784496 890124 818212
8715 818212 1178593 1564152 1514320 1143064 903482 625563 737344 960093 466547 101550
8705 101550 -259978 -429297 -86019 354654 806407 897479 552607 11493 -424471 -549840
8695 -549840 -131057 101655 -117914 -135291 170224 312497 275035 337268 463638 694513
8685 694513 550192 460482 419766 207984 308452 875086 1085446 832961 903371 1344253
8675 1344253 1457915 1683299 2089477 2264141 1957049 1925739 2260801 2346592 2071518 1537693
8665 1537693 977948 525747 98171 -189259 -396651 -369708 -197008 -104704 40920 199206
8655 199206 343344 286825 368024 212639 192240 5076 153688 243794 -406347 -1162666
8645 -1162666 -1101984 -933762 -902201 -903520 -725101 -226495 -167291 -338787 -283462 -621940 -754488
8634 -754488 -576806 -249739 -117529 -53099 220078 669943 860367 787175 545203 352248
8624 352248 150426 -116578 870 127948 404058 526694 -78841 -531145 -506920 -552978
8614 -552978 -494576 -728538 -835033 -576995 -275158 36307 352659 464393 767996 874917
8604 874917 620785 671233 739533 445658 499554 332280 -133597 -367861 -671703 -750112
8594 -750112 -1080880 -1356564 -1161742 -592719 -236991 -332912 -382164 -282326 -129162 159186
8584 159186 296350 -72057 -149810 -212211 -491310 -866603 -1206704 -838918 -288343 -233465
8574 -233465 -453094 -762247 -991225 -1342404 -1710437 -1686144 -1464907 -1280580 -1004745 -671609
8564 -671609 -558862 -363665 -389421 -524054 -200708 259854 108593 -10379 -307048 -748224
8554 -748224 -807957 -831368 -308592 606099 1216528 1157513 878139 436284 149500 114638
8544 114638 391500 775925 884078 807160 550046 360986 287626 33495 93832 197946
8534 197946 59369 -157336 -176646 -313991 -704657 -648646 -241338 179985 449330 440685
8524 440685 273504 275738 237732 411277 447353 475353 744853 905083 918233 899244 790538
8513 790538 569495 597895 271639 -239380 -562687 -629021 -365701 140250 545057 477229
8503 477229 -25739 -686115 -1103943 -910541 -432686 -286486 -222623 -220846 -556039 -999672
8493 -999672 -1017185 -692724 -517336 -358262 -881066 -1430485 -1290517 -1014622 -525621 -30531
8483 -30531 -239929 -634539 -711078 -63041 190453 -103432 22218 216339 254718 306020
8473 306020 188618 9784 -100994 -390288 -384898 37004 190358 477825 172193 -151814
8463 -151814 -158226 -316379 -291553 -32637 39967 -77511 -25054 124599 387032 365402 -9169
8452 -9169 -628702 -1049653 -635657 -220828 -321086 -471302 -729975 -868008 -643293 -729448
8442 -729448 -805676 -660219 -671168 -838024 -560515 -373758 -565090 -1017092 -845969 -134048
8432 -134048 308173 315858 123184 -30695 -91707 74594 91388 66921 -39727 -154694 -72304
8421 -72304 -38934 -233723 -201247 775 -43478 -180087 -585828 -897751 -751840 -641601
8411 -641601 -286409 22255 -666 -561415 -1155880 -1089886 -511029 -171081 -14825 160430
8401 160430 510527 535195 457260 -59433 -571872 -740720 -761356 -539654 -192446 29449
8391 29449 184915 739009 937408 614053 -5476 -396980 -353213 -425983 -550894 -526561
8381 -526561 -291829 153416 409305 575945 754536 743259 510081 478551 504451 577348
8371 577348 869593 1094708 1303095 1297417 1007900 588232 443023 324631 258542 437699
8361 437699 656429 573876 512105 269444 100561 -333940 -826242 -1204993 -940025 -140078
8351 -140078 443435 382737 518375 774027 816632 695078 392405 141538 154244 407273
8341 407273 456286 450027 381414 635772 679894 153436 -389865 -375524 128794 291407 435327
8330 435327 814847 679945 119353 -355447 -483557 -145410 393553 463628 148090 -70789
8320 -70789 -257541 -211971 66091 75559 -137070 -139625 64796 281020 190577 -607716 -1204004
8309 -1204004 -879016 -438606 -248081 144360 246364 156949 141508 -63736 -37790 -49681
8299 -49681 64418 107259 59248 298566 402787 231271 48384 225245 639823 947340
8289 947340 702895 420988 188995 -215949 -501083 -516112 -424864 -453638 -336619 -106754
8279 -106754 -15264 -184282 -215425 -450415 -776982 -953428 -1101421 -1182405 -690802 -107580
8269 -107580 -159544 -225940 -197984 -279184 -331097 -264072 -271523 -144837 35629 73112 17610
8258 17610 -224532 -222520 -113892 -258927 -628058 -762524 -1460411 -1821264 -1521440 -1099310
8248 -1099310 -529349 -311741 -405996 -239028 -33227 -137953 -499029 -482722 171668 409599
8238 409599 305521 221521 110429 386639 991215 1047477 687907 350816 233339 325851
8228 325851 -17908 -574254 -822748 -1046327 -930585 -382888 -104803 -180926 -81110 -354938
8218 -354938 -283643 204737 450526 249649 -44668 216606 400325 398522 406302 253766 324063
8207 324063 404667 151661 -95581 -149501 27406 103260 -96815 -488191 -1051136 -1354377
8197 -1354377 -813685 -10704 513491 674872 624979 452672 350205 140196 -222230 -392733
8187 -392733 -158599 375166 883741 1049229 645877 535784 677504 789551 1025271 1466758
8177 1466758 1647099 1468925 1343980 1397677 951302 181532 -471089 -320487 225529 381765
8167 381765 523604 866219 816128 301756 57439 471476 1081789 1110195 777958 690738
8157 690738 651854 900107 1140089 1157043 924276 776015 1031981 1216489 1057103 830104
8147 830104 746186 644041 811923 955324 999950 930342 955822 994406 941214 851289 864245
8136 864245 1245077 1283149 1207020 675675 412095 595252 1074997 1386583 1352493 1342527 1448680
8125 1448680 1606925 1998216 2195538 1913612 1378536 568425 -136038 -419252 -395488 -12858
8115 -12858 434735 495745 504862 491765 319825 463209 494314 340712 736784 929968 451371
8104 451371 -403504 -940314 -922378 -427181 375698 922900 1034606 1319865 1358444 873230
8094 873230 625288 666840 554998 632384 900758 744083 452772 712910 942943 766394
8084 766394 492579 640833 500845 269056 550071 1129223 1690661 1871164 1818169 1636430
8074 1636430 1929680 2292377 2239143 2079665 1952217 2072394 2582294 2768239 2432629 2070071
8064 2070071 1785400 1740532 1469994 1179954 1236755 1508463 1473520 1205407 1213105 921780
8054 921780 436134 132739 -3951 375271 944865 1510014 1572431 1137820 953127 971364
8044 971364 929133 658483 208284 147256 478149 613131 217021 -139839 -369025 -361032
8034 -361032 -208519 -417429 -664932 -455767 -57783 156320 254417 446545 777381 1192563
8024 1192563 1277419 1222496 1058424 1172851 1518297 1796336 1858202 1790583 1925551 1655310
8014 1655310 1609480 1955693 2673959 3355559 3712946 3974238 3703642 3722551 4175082 4477035
8004 4477035 4764096 5092026 5275381 5753971 6599590 7017160 7450981 7811099 8199830 8533044
7994 8533044 8680874 8844389 9037586 9094977 9503071 9756552 9195287 8447166 8158354 7812281
7984 7812281 7244974 6350162 5523730 5337454 5291027 5108159 4565377 3898738 3045897 2503781
7974 2503781 2112525 1545262 1350320 1401850 1778338 1926277 1318846 1360150 1686530 1504445
7964 1504445 1472712 1423561 1179893 1004352 1347876 1848275 1839959 1370530 837006 548789
7954 548789 727237 786182 693230 318631 -27850 -263784 -492640 -236631 340730 859061
7944 859061 611938 242322 -266009 -855742 -909287 -657253 -611842 -386575 70475 350565
7934 350565 168329 -212539 -350505 -350558 -9533 791900 1378476 1780341 1889868 1922262 2169656
7923 2169656 2213970 1976022 1503703 1069615 559904 406543 673185 964735 538198 11240
7913 11240 -189762 -118051 199360 408000 195537 -31810 282398 923925 910632 1087888
7903 1087888 1252592 1120986 1476145 1754062 1298807 821652 413555 87170 -32878 -117509
7893 -117509 -22735 323689 611732 669994 1020575 1062833 1172041 1451950 1757281 1778537
7883 1778537 1609959 1227465 356018 340069 710684 870850 726368 654662 801623 544521
7873 544521 246705 61241 -91766 -79634 195452 593648 923376 784639 159639 -114451
7863 -114451 80365 142622 374966 686817 867742 248861 -474125 -332950 243654 663906
7853 663906 786028 701486 779945 630476 370920 210373 493221 680043 575106 667360
7843 667360 582445 192314 75521 -38971 344115 1025075 1091513 949584 857042 1032037
7833 1032037 1309242 1496985 1545227 1613247 1820520 1980044 2123268 1800660 1499561 1082854
7823 1082854 614192 237641 67007 46276 -34703 -393551 -530384 -530908 -473579 -470255 -398009
7812 -398009 114788 616255 658246 270157 -453168 -1057828 -929919 -640999 -115019 775195
7802 775195 1695217 2141298 2129959 1588643 1106199 602651 354349 451667 756535 657814
7792 657814 468730 -19398 -96885 302328 421584 545097 531739 366356 23154 -47832
7782 -47832 -79372 -501226 -632006 -610271 -815839 -752199 -293572 136178 104875 -110709 -160600
7771 -160600 -208455 -286046 -191013 -279999 -422707 -627431 -634152 -559133 -545198 -894624 -913528
7760 -913528 -214328 160273 -30590 -136401 -72042 -116711 -436568 -400953 -127901 50646
7750 50646 -76573 -3238 -122689 -581545 -298027 133665 -288346 -597204 -557776 -461484
7740 -461484 -260314 80257 -152792 -550107 -781221 -798634 -603950 -471903 -140642 7332
7730 7332 -123261 41019 360372 496733 934527 1013144 757353 369681 55934 -184887
7720 -184887 -140522 -297207 -479540 -354934 -284536 83677 164847 -259487 -271125 189634
7710 189634 546810 506337 490775 407338 129603 -162171 -216454 -294497 -236386 -91981 319021
7699 319021 725742 1068658 1315804 1427746 1566811 1527644 2028510 1916429 1202252 881101
7689 881101 838269 736855 443892 200461 -91025 -530395 -472379 -289313 -161824 -300770
7679 -300770 -449730 -112006 109164 142874 -68142 -112694 10276 -39027 -141944 -79813
7669 -79813 -206275 -165525 -127508 -785173 -1057192 -379130 -27744 -49292 -315157 -647579
7659 -647579 -813875 -404670 49407 163744 71986 156904 339536 487891 662488 611868
7649 611868 453721 66927 -401433 -801928 -989900 -840174 -312768 380028 554225 483349
7639 483349 478508 1346553 2146868 2163858 1576530 1099468 711639 626547 741606 313119
$$ [...]
##END NTUPLES=NMR SPECTRUM
##END=
