##TITLE=C13_SL71-DAU(DMSO)
 DMSO-d6, 150 sc

 19.10.2022
##JCAMPDX= 6.0         $$ Bruker NMR JCAMP-DX V2.0
##DATA TYPE= NMR SPECTRUM
##DATA CLASS= NTUPLES
##ORIGIN= UXNMR, Bruker Analytische Messtechnik GmbH
##OWNER= root
$$ XWIN-NMR		Version 3.5
$$ Thu Oct 20 13:43:46 2022 Russian Standard Time (UT+4h)  she@DPX200
##.OBSERVE FREQUENCY= 50.327896
##.OBSERVE NUCLEUS= ^13C
##.ACQUISITION MODE= SIMULTANEOUS
##.ACQUISITION SCHEME= undefined
##.AVERAGES= 20500
##.DIGITISER RES= 17
##SPECTROMETER/DATA SYSTEM= spect
##.PULSE SEQUENCE= zgpg30
##.SOLVENT NAME= CDCl3
##.SHIFT REFERENCE= (INTERNAL, CDCl3, 0, 222.653)
##AUDIT TRAIL= $$ (NUMBER, WHEN, WHO, WHERE, WHAT)
$$ ##TITLE= Audit trail, XWIN-NMR		Version 3.5
$$ ##JCAMPDX= 5.01
$$ ##ORIGIN= Bruker BioSpin GmbH
$$ ##OWNER= she
$$ F:/spectra/data/she/nmr/c13/1/pdata/1/auditp.txt
$$ ##AUDIT TRAIL=  $$ (NUMBER, WHEN, WHO, WHERE, WHAT)
(   1,<2022-10-20 12:08:48.03 +0400>,<she>,<DPX200>,
      <created by zg, POWCHK disabled, PULCHK disabled
       terminated by command 'halt'
       configuration hash MD5:
       00 E9 B6 7A A2 85 ED C7 34 08 36 98 17 FE 4E 26
       data hash MD5: 32K
       5C 64 83 A1 F7 AD F7 B2 0C 2A 0C B7 5D 64 F8 39>)
(   2,<2022-10-20 13:41:10.70 +0400>,<she>,<DPX200>,
      <Start of raw data processing
       efp BC_mod = 2 LB = 1 FT_mod = 6 PKNL = 1 PHC0 = -315.8695 PHC1 = 30.56391 SI = 32K 
       data hash MD5: 32K
       EC 82 6C 4A 2E 13 23 8C 75 85 1C 81 86 9B 0C A6>)
(   3,<2022-10-20 13:41:25.73 +0400>,<she>,<DPX200>,
      <abs ABSG = 5 
       data hash MD5: 32K
       BE 7B 57 CC E0 B3 34 71 44 24 CD F0 17 B4 EC C0>)
(   4,<2022-10-20 13:42:02.06 +0400>,<she>,<DPX200>,
      <pk PHC0 = -4.482817 PHC1 = 7.000029 
       data hash MD5: 32K
       CB 79 E4 34 4F 81 34 30 1C FA 2B E0 B6 20 8B 23>)
(   5,<2022-10-20 13:42:05.82 +0400>,<she>,<DPX200>,
      <abs ABSG = 5 
       data hash MD5: 32K
       05 D7 98 12 B9 24 C4 16 7E 4E 5B F6 6A 3D E5 78>)
$$ ##END=
$$ 
$$ hash MD5
$$ 41 AF 3D 15 AA 48 52 1C D2 71 1C C9 81 5A C3 CA
##$RELAX= 
##$RELAX= 
##$RELAX= 
##$RELAX= 
##$RELAX= 
##$RELAX= 
##$RELAX= 
##$RELAX= 
$$ Bruker specific parameters
$$ --------------------------
##$DU= <F:/spectra>
##$EXPNO= 1
##$NAME= <c13>
##$PROCNO= 1
##$TYPE= <nmr>
##$USER= <she>
##$AMP= (0..31)
100 100 100 100 100 100 100 100 100 100 100 100 100 100 100 100 100 100 
100 100 100 100 100 100 100 100 100 100 100 100 100 100 
##$AQSEQ= 0
##$AQ_mod= 1
##$AUNM= <au_zg>
##$AUTOPOS= <>
##$BF1= 50.322709
##$BF2= 200.13
##$BF3= 50.322709
##$BF4= 500.13
##$BF5= 500.13
##$BF6= 500.13
##$BF7= 500.13
##$BF8= 500.13
##$BYTORDA= 1
##$CFDGTYP= 0
##$CFRGTYP= 5
##$CHEMSTR= <none>
##$CNST= (0..31)
1 1 145 1 1 1 1 1 1 1 1 1 1 1 1 1 1 1 1 1 1 1 1 1 1 1 1 1 1 1 1 1 
##$CPDPRG= <waltz16>
##$CPDPRG1= <>
##$CPDPRG2= <waltz16>
##$CPDPRG3= <>
##$CPDPRG4= <mlev>
##$CPDPRG5= <mlev>
##$CPDPRG6= <mlev>
##$CPDPRG7= <mlev>
##$CPDPRG8= <mlev>
##$CPDPRGB= <>
##$CPDPRGT= <>
##$D= (0..31)
$$ [...]
##$SUBNAM4= <"">
##$SUBNAM5= <"">
##$SUBNAM6= <"">
##$SUBNAM7= <"">
##$SUBNAM8= <"">
##$SUBNAM9= <"">
##$SW= 239.972175391363
##$SWIBOX= (0..15)
0 1 3 0 0 0 0 0 0 0 0 0 0 0 0 0 
##$SW_h= 12077.2946859903
##$TD= 32768
##$TD0= 1
##$TE= 0
##$TE2= 300
##$TE3= 300
##$TEG= 300
##$TL= (0..7)
120 120 120 120 120 120 120 120 
##$TP= (0..7)
150 150 150 150 150 150 150 150 
##$TP07= 0
##$TPNAME0= <>
##$TPNAME1= <>
##$TPNAME2= <>
##$TPNAME3= <>
##$TPNAME4= <>
##$TPNAME5= <>
##$TPNAME6= <>
##$TPNAME7= <>
##$TPOAL= (0..7)
0.5 0.5 0.5 0.5 0.5 0.5 0.5 0.5 
##$TPOFFS= (0..7)
0 0 0 0 0 0 0 0 
##$TUNHIN= 0
##$TUNHOUT= 0
##$TUNXOUT= 0
##$USERA1= <user>
##$USERA2= <user>
##$USERA3= <user>
##$USERA4= <user>
##$USERA5= <user>
##$V9= 5
##$VALIST= <valist>
##$VCLIST= <CCCCCCCCCCCCCCC>
##$VD= 0
##$VDLIST= <DDDDDDDDDDDDDDD>
##$VPLIST= <PPPPPPPPPPPPPPP>
##$VTLIST= <TTTTTTTTTTTTTTT>
##$WBST= 1024
##$WBSW= 4
##$XGAIN= (0..3)
0 0 0 0 
##$XL= 0
##$YL= 0
##$YMAX_a= 131665819
##$YMIN_a= -34462531
##$ZGOPTNS= <>
##$ZL1= 120
##$ZL2= 120
##$ZL3= 120
##$ZL4= 120
##$ABSF1= 222.6533
##$ABSF2= -17.34351
##$ABSG= 5
##$ABSL= 3
##$ALPHA= 0
##$AQORDER= 0
##$ASSFAC= 0
##$ASSFACI= 0
##$ASSFACX= 0
##$ASSWID= 0
##$AUNMP= <proc_1d>
##$AZFE= 0.1
##$AZFW= 0.5
##$BCFW= 0
##$BC_mod= 2
##$BYTORDP= 0
##$COROFFS= 0
##$CY= -3
##$DATMOD= 1
##$DC= 0
##$DFILT= <>
##$DTYPP= 0
##$F1P= 0
##$F2P= 0
##$FCOR= 0.5
##$FTSIZE= 32768
##$FT_mod= 6
##$GAMMA= 0
##$GB= 0
##$INTBC= 1
##$INTSCL= 4.134877e-10
##$ISEN= 128
##$LB= 1
##$LEV0= 0
##$LPBIN= 0
##$MAXI= 10000
##$MC2= 0
##$MEAN= 0
##$ME_mod= 0
##$MI= 0.1934396
##$NCOEF= 0
##$NC_proc= 3
##$NLEV= 6
##$NOISF1= 120.0001
##$NOISF2= 80.00006
##$NSP= 0
##$NTH_PI= 0
##$NZP= 0
##$OFFSET= 222.6533
##$PC= 1.4
##$PHC0= -320.3523
##$PHC1= 37.56394
##$PH_mod= 1
##$PKNL= yes
##$PPARMOD= 0
##$PSCAL= 0
##$PSIGN= 0
##$REVERSE= no
##$SF= 50.322730123286
##$SI= 32768
##$SIGF1= 140
##$SIGF2= 120
##$SINO= 11.81781
##$SIOLD= 32768
##$SREGLST= <13C.CDCl3>
##$SSB= 0
##$STSI= 32768
##$STSR= 0
##$SW_p= 12077.2946859903
##$SYMM= 0
##$S_DEV= 0
##$TDeff= 32768
##$TDoff= 0
##$TI= <>
##$TILT= no
##$TM1= 0
##$TM2= 0
##$TOPLEV= 0
##$USERP1= <user>
##$USERP2= <user>
##$USERP3= <user>
##$USERP4= <user>
##$USERP5= <user>
##$WDW= 1
##$XDIM= 32768
##$YMAX_p= 295533560
##$YMIN_p= -1150853
$$ End of Bruker specific parameters
$$ ---------------------------------
##NTUPLES= NMR SPECTRUM
##VAR_NAME=  FREQUENCY,     SPECTRUM/REAL,   SPECTRUM/IMAG
##SYMBOL=    X,             R,               I
##VAR_TYPE=  INDEPENDENT,   DEPENDENT,       DEPENDENT
##VAR_FORM=  AFFN,          ASDF,            ASDF
##VAR_DIM=   32768,         32768,           32768
##UNITS=     HZ,            ARBITRARY UNITS, ARBITRARY UNITS
##FACTOR=    0.368581032318806, 1,           1
##FIRST=     11204.5221812756, 0,            0
##LAST=      -872.772504714734, 0,           0
##MIN=       -872.772504714734, -1150853,    0
##MAX=       11204.5221812756, 295533560,    0
$$ Real data points
##PAGE= N=1
##DATA TABLE= (X++(R..R)), XYDATA
$$ [...]
10909A48898J62058n9353O8663k5797q5223r6012l0650O3531O9164J01430J8934
10898C35643j0506m4345j6480K1439k57143m10622j35683J38088J89543J63329
10888b6737J36695R5297l5471j50196J6264L1270j31225j65263j94927L0606J67509
10877b26178Q0636o7989l11610l18199o1428P6321K25277M3982k96904K6605M59271
10866c70216K55168k4235m0288p0740K8760J23577M8139j85262j23866o217J84345
10855a80835L18173O7866r886J46326K5318k83344j82972o3067k08362j29525
10845e00308J14583Q8009R3168J00438J70933K94437m0436k77250p3944J12942
10835H2572K5223j44228j01307N898J74915J32319k5997j0181N890j00673j23847
$$ y = [148898, 310956, 251603, 320266, 294469, 209246, 113234, 82584, 146115, 215279, 316709, 335643, 325137, 280792, 264312, 285751, 28608, -382014, -517697, -379609, -190066, -26737, 109958, 205255, 169784, 19588, 35852, 67122, -64103, -229366, -424293, -393687, -226178, -145542, -213531, -525141, -843340, -904768, -828447, -603170, -559188, -856092, -829487, -370216, -115048, -139283, -179571, -250311, -221551, -97974, -49835, -235097, -358963, -365180, -180835, 137338, 205204, 195318, 341644, 366962, 83618, -99354, -162421, -370783, -500308, -385725, -297716, -204548, -104110, 66823, 361260, 320824, 43574, -30370, 82572, 107795, -36433, -137740, -131842, 43073, 175392, 149395, 139214, 145104, 44431, -79416]
10824g9416J04652l7519j57828j54432j92735k30662J8612L13779J31304m3696
10814c27941k12913j38396J06763J69222P9268j08053J94700K02462J099L1398
10804b391o5550n9785m7536q4573o0307K4753N0193J6648j22509k23166J64339
10793d09884K90031K3317q2789Q7576J40559M8690p074o3230l9604M4304J3647
10782D5543l9324N2814K09262L3316j5563n2250N3429o8009k67620k3370K42198
10771A70426K87645O2922j30735o5359Q0729j2605q0451k95426j7347J06035j34848
10760b9014k53683l5897L319l8909J65954J92157J14262M2834j4129o3036L193
10749H7051J17665R0691L528R2258j54838j92085k4726K7706K16965Q9757r6201
$$ y = [-79416, 25236, -12283, -170111, -324543, -517278, -747940, -729328, -415549, -284245, -327941, -540854, -679250, -572487, -403265, -323997, -432050, -237350, -34888, -33789, -2391, -67941, -127726, -175262, -259835, -320142, -295389, -245196, -228548, -351057, -574223, -409884, -119853, -96536, -179325, -91749, 48810, 97500, 90426, 27196, -12408, 31896, 45543, 6219, 59033, 268295, 301611, 286048, 233798, 287227, 219218, -48402, -71772, 170426, 458071, 520993, 390258, 324899, 405628, 393023, 312572, 17146, -201, 105834, -29014, -282697, -318594, -315275, -354184, -188230, 3927, 118189, 161023, 146894, 83858, 87051, 204716, 295407, 298935, 391193, 236355, 44270, 19544, 47250, 264215, 353972, 257771]
10738B57771O9756j73802n6738R1126J56317K3252J57220J90566j8392j66760
10728E30316l3933n6950k35689k09669n7031R3907j82273k41329J6601J78739
10718a97311J14227r2398j66423J11393L36294J35549k18677k11511Q7688R8968
10708b201P355j31052j91962K0704P0716O2127J44272P6530q5938p282Q4102R3321
10696A40692o963k7663m1639O5065R4688R88j79530l64351j57898J05253R9904
10685b71454J13728K08562J57347l0979M5272L6483j80554j59876Q7679p5100
10675f8892k36204J059O7413K5042R1288j25211j50464j4621J46514J30552j5777
10664a49301k2876J16875l0864j96571Q999K43222J37331M4692j6109j11957j09482
$$ y = [257771, 327527, 153725, 96987, 188113, 344430, 367682, 524902, 715468, 697076, 530316, 496383, 439433, 203744, -5925, -62956, 30951, -151322, -392651, -376050, -197311, -83084, -175482, -341905, -230512, 105782, 241331, 22654, -188857, -101169, -2201, 5154, -125898, -317860, -297156, -226440, -164313, -20041, 56489, -29449, -36731, 47371, 140692, 133729, 106066, 64427, 129492, 224180, 225168, 45638, -318713, -476611, -371358, -271454, -157726, 50836, 208183, 177204, 222476, 258959, 78405, -81471, 6208, -68892, -305096, -304037, -236624, -211582, -120294, -245505, -395969, -410590, -264076, -133524, -149301, -172177, -55302, -86166, -282737, -273738, -30516, 106815, 151507, 135398, 23441, -86041]
10653h6041L4601J30191n6020k20241j32238K8480L6940k09962k04556l5983J4682
10642g00147R321J72503K37883K62357p833k29811K164R113Q228Q0943M2391J41216
10630B8328K06521J29663n8990j03930j66508j74526O6940J45516j1126q4414
10620b2526r461k43025j18951J03971P2222J11364R7792J04665k5573j3398K25576
10609B82656N2961k52221j58808k34089l04782k970J29272o1421j04855J20258
10599e33999J45335j13638p6013P4641K9276j86163j15085L8997L49876L94420
10589G647l8861n1282J89787J81892o7326l93411l90844j67473L9255R6677J82586
10578d11353K25967Q1201J685r3602n4801M0575J55006p6792j84598K6739O3350
$$ y = [-86041, -51440, 78751, 22731, -197510, -329748, -301268, -264328, -474290, -678846, -714829, -700147, -690826, -518323, -280440, -18083, -25916, -255727, -253563, -244450, -236222, -155279, -112888, 28328, 234849, 364512, 305522, 201592, 35084, -139442, -72502, 73014, 61888, -22526, -31987, -275012, -393963, -289992, -217770, -106406, -8614, 96051, 70478, 57080, 282656, 335617, 83396, -75412, -309501, -614283, -617253, -487981, -549402, -654257, -533999, -388664, -502302, -578315, -503674, -474398, -660561, -775646, -736649, -386773, 7647, -31214, -82496, 107291, 289183, 221857, -171554, -562398, -729871, -690616, -593939, -411353, -185386, -104185, -102500, -196102, -250903, -210328, -55322, -132114, -316712, -289973, -226623]
10567b26623j86303l1073J78624J89093m148n1292r848R5033n9191k79854l86694
10556g72276j52917J40257Q4830J51219K54630K73623J97026M6745j53003j93472
10546a23338M7351J47487N1245J01626r0759k98740l95568m2466K73160L94748
10536F4746R7724R3673K48298K21397l1619k24289k58607l41335j91096J88684
10526a32424J67540R6180J38051R9364L5317j08348j70723j27312o2753N4020
10516a1088J26038K21220K85358K03091m4011m6326j22176j50758J03342j20252
10506D44438j78365k0263R3343R5936J51497J51433l2433k33479l62435k17885
10496a08213P4126o8630k1229J81602n4989k50766m0283M453N7348K24182K0058
$$ y = [-226623, -412926, -443999, -265375, -76282, -80430, -131722, -141570, -46537, -105728, -385582, -772276, -925193, -784936, -700106, -548887, -294257, -20634, 176392, 223137, 70134, -123338, -75987, 71500, 122745, 224371, 133612, -165128, -560696, -603162, -330002, 64746, 162470, 256143, 504441, 725838, 694219, 469930, 211323, -130012, -321108, -132424, 35116, 131296, 269347, 368711, 404028, 295680, 124957, -2355, -65108, -11088, 114950, 336170, 621528, 824619, 780608, 734282, 612106, 461348, 564690, 444438, 266073, 245810, 339153, 435089, 586586, 738019, 705586, 472107, 109672, -108213, -34087, -102717, -123946, 57656, 2667, -248099, -288382, -283929, -226581, -2399, 17659]
10485A7659q5224M0673j47953k46845R8672J72186K46248K19181N2413O8540m9771
10474C85779m7812K6872k2117m8201j64014j18125o4721j92958j77421r3173K10844
10463c05047M25218K28246o5569n3785n4428o2009q8597k00921r2667J18068j12052
10452b63543l30093k04918l7783L42331K79447l2388j3550p5017R3912J50661
10442i0941J52986J50203N7278k57476l16931N3369K21596J44610k810j70143
10432e8259K8154J02134q3355n9798J03174m6696k38154j61386m2362j8263O1518
10421d13293K37153J06505n3563k5594o3709J0894k9940J16145J36889k5531J5992
10410A1948m1160j86583q8670O9037J37129L6529r8061j49274k6961L35836J17502
$$ y = [17659, -67565, -26892, -174845, -421690, -323018, -150832, 95416, 314597, 367010, 435550, 385779, 337967, 364839, 342722, 294521, 130507, 12382, -52339, -245297, -422718, -515891, -305047, 120171, 348417, 282848, 229063, 174635, 112626, 24029, -176892, -269559, -151491, -263543, -593636, -798554, -836337, -494006, -214559, -246947, -260497, -335514, -241602, -90941, 62045, 212248, 269526, 12050, -304881, -251512, -29916, 114694, 111884, -58259, -30105, 72029, -11326, -71124, 32050, -14646, -252800, -414186, -456548, -474811, -413293, -176140, -69635, -123198, -148792, -212501, -201607, -231547, -115402, 21487, -4044, 11948, -29212, -215795, -304465, -235428, -98299, -61770, -159831, -309105, -336066, -230, 117272]
10399A17272j87587j15595r59J2268K48760J92141K6138k05312o9997Q9765N9314
10388A66208n1018k06160N3167L8325k0002m3619k3712K1514k0757q3615r4084
10377b63753j03618J3618J88163Q789j12094J49002J68060n9580k66991q063J76926
10366a09541Q4568K9547k8901j3814j6833j70090j20457m0082q473R1091J81950
10355a21035p7927r6982J88701K51897J33861l3802k19585k99631l6652J30384
10345a80771n7729j16413j18522R1967K04214L0188j56941j24658Q8497M72j20214
10334d59910M1960K60641l9959j98096m21996l33493L123L6578K2105K25146J66852
10323f97049J02636J3318o8504Q3332J07213J48046J34741q2670j67736j23603
$$ y = [117272, -70315, -185910, -186869, -174601, 74159, 266300, 292438, 87126, 17129, 106894, 166208, 115190, -90970, -37803, 522, -19480, -63099, -86811, -65297, -86054, -169669, -263753, -367371, -353753, -165590, -156801, -268895, -119893, 48167, -11413, -278404, -286467, -109541, -24973, 4574, -24327, -38141, -54974, -225064, -345521, -385603, -394076, -302985, -121035, -198962, -295944, -107243, 144654, 278515, 244713, 25128, -274503, -311155, -180771, -238500, -354913, -473435, -381468, -177254, -147066, -304007, -428665, -340168, -339696, -459910, -417950, -157309, -197268, -395364, -817360, -1150853, -1147730, -1111152, -1089047, -863901, -697049, -594413, -581095, -649599, -566267, -459054, -311008, -176267, -258937, -426673, -550276]
10313e50276k13374j18106J49170K12023M7487J39889K89453J79912J7696k70329
10303a16455l47186P970L44398J70489k05004j60467O3216J03885M3913o0942
10293a56183l41950k61778N3961J50457K23030K92555L58165P2095M1085p0059
10283C61378l59092l59083j06202J16307J74625K07426J54196P8645J6084k1256
10273B63028j20316l19528k40416j29455q3534J5715J00213R4472J80462J96378
10263d2981r327j02270j240J21818J92677Q2886k59581j52998J1824m9470L3107
10252a75555M3579J8424j37531j60131J42660L4305q2552j68018k53022j21187
10242h59028K06883L90890K35775N1857l8059q3650l9444j52205o5133J25910
$$ y = [-550276, -763650, -881756, -732586, -520563, -473076, -333187, -43734, 136178, 153874, -116455, -463641, -455671, -111273, 59216, -145788, -306255, -243039, -139154, -95241, -156183, -498133, -759911, -705950, -555493, -332463, -39908, 318257, 390352, 431437, 361378, 2286, -356797, -462999, -346692, -172067, 35359, 189555, 268200, 284284, 263028, 142712, -176816, -417232, -546687, -630221, -614506, -514293, -419821, -239359, -42981, -52308, -154578, -155818, -34000, 158677, 241563, -18018, -171016, -159192, -208662, -175555, -131976, -113552, -251083, -411214, -268554, -234249, -316801, -484819, -737841, -859028, -652145, -261255, -25480, 26377, -11682, -95332, -134776, -286981, -352114, -226204]
10232b26204K7699k04917j51346J99117K59690j6238j28724J8275J59874J8752
10222d4022n8637m8956J05730J5355j71620o8792r356J06051J74853j4044m3048
10211e6486j3926L8172J32669K4812Q8612J60521K5533k05873p2905j15996n649
10200e16J78421K1053q9904j62284j50498L4059J91408L8564J02406J83767M00624
10189G47100Q5647m85195n04678p0526R9237M3874O739O0705R4824j36005j37501
10178a95779p7277O6299o5911j04394j13315j97193O5384K61171K31342m1385
10168a71058k2639K4819j03826J59534M50881N06151M14636K72567J83096M01807
10158B115968L48496L75283M04794J21984l69039o60810n86140l36742l62593
$$ y = [-226204, -198505, -403422, -554768, -355651, -95961, -112199, -240923, -222648, -62774, -44022, -102659, -151615, -45885, -30530, -202150, -270942, -280298, -174247, 606, -13438, -56486, -70412, -32240, 100429, 125241, 213853, 374374, 399907, 194034, 121129, 5133, -516, 177905, 198958, 109054, -53230, -203728, -169669, 21739, 60303, 162709, 346476, 747100, 832747, 347552, -157126, -227652, -128415, -84541, -77802, -17097, 77727, -58278, -195779, -273056, -206757, -272668, -377062, -490377, -687570, -622186, -361015, -129673, -171058, -193697, -168878, -272704, -113170, 337711, 843862, 1258498, 1531065, 1714161, 2115968, 2464464, 2839747, 3244541, 3366525, 2997486, 2336676, 1750536, 1413794, 1051201]
10149A051201m84286l09684j17972l697n8246k65841m2908K87030L7824q3425
10139I996L2110j4271J0094J56667J42904R1292J98036M7961o6715k8027j5952
10128E64095p4211k38027k43302j40557J11081J91285p8589k57260k01673r7022
10118d64180j26474Q8798J67763K38004K46661O1163j73495j01119J60515K42413
10108C40049K3881o7422q9949j15595j67140j08865P4220J77081K64538L3341
10098C64139l12977j15216J49331J65885k4507L5400Q5879r7997q5402L9512m2611
10087A61436j42155j0913j3835N5594J87760m3169r0809J6196j50713j45693p3240
10076b49541r9899J61092J66505k09568j82950o2717J81625K49185J99203l9084
$$ y = [1051201, 566915, 257231, 139259, 135562, 77316, -188525, -231433, 55597, 93421, 9996, 42106, 27835, 37929, 194596, 337500, 428792, 626828, 674789, 608074, 580047, 564095, 489884, 251857, 8555, -132002, -20921, 170364, 91775, -165485, -367158, -464180, -590654, -501856, -334093, -96089, 150572, 211735, 38240, -62879, 97636, 340049, 363930, 296508, 206559, 90964, -76176, -185041, -110821, 66260, 330798, 364139, 51162, -64054, 85277, 251162, 226655, 262055, 347934, 249937, 164535, 204047, 161436, 19281, 8368, -5467, 50127, 237887, 194718, 103909, 120105, -30608, -176301, -249541, -349440, -188348, -21843, -231411, -414361, -477078, -295453, -46268, 152935, 113851]
10066A13851l3283j03964j04910J80475r256j39571j39312l19579k71319p4688
10056i01556J30822J44673J62085J67346Q6173J85107K9123O658N0791J42890
10046B04112j22069k22429l16659k27959O8753J53435J43298o530k0496J46003
10036b00541K10749K00132K07351R2571k8287p7339p1688K6454n9288k67769l10653
10025b78308j80880O7481O1254K7976j51291n904J05553K08033O0089k28443j72869
10014d87309O4933J04780J85521J50432j73392j18266P1070K5726R8788R2941
10004A5224l4211J16077K34472K68975K56390K22524K30281K11195K21825J69175
9994A911927M134k0411l7556o5876n6560j65086r5785j43640j55142l18950k59404
$$ y = [113851, 80568, -23396, -128306, 52169, 42913, -96658, -235970, -555549, -826868, -901556, -770734, -626061, -463976, -296630, -210457, -25350, 3773, 10431, 61222, 204112, 82043, -140386, -457045, -685004, -616251, -462816, -319518, -326048, -346544, -200541, 10208, 210340, 417691, 510262, 481975, 404636, 332948, 359402, 300114, 32345, -278308, -459188, -391707, -330453, -302477, -453768, -459672, -354119, -146086, -85997, -314440, -487309, -422376, -317596, -132075, 18357, -155035, -273301, -202231, -176505, -77717, 15224, -18987, 97090, 331562, 600537, 856927, 1079451, 1309732, 1520927, 1742752, 1911927, 1916061, 1895650, 1858094, 1792218, 1735658, 1570572, 1474787, 1331147, 1176005, 857055, 597651]
9983E97651j43696m5716R9528K5042j75351N9182J15128O4618m3291k30340r4929
9972B27826n6351j88773k8285K45113J81045r6041j94858j28417K0475P6784j6737
9961D1781q0085k34551k32487J25364M42697K64083Q2339l9320j21491R8236M1842
9950C88408r4834o1188m8756j16157K8104K4283o152J52542P6345N9261N0426
9939D52282j21242n6857K528k54100j47548K6023J71990K86515j6281k67901j69845
9928i4436m841m525R9578P6026j29961j56622j21156l8127M5391J65954K95684
9917A32965J45216r5279k04970m5903q0485k72339j99246L6977J59598K00133
9907b23333K29204Q632m7026Q5344o0125L379J48571j40585j28201J4597j79374
$$ y = [597651, 453955, 408239, 507767, 532809, 357458, 416640, 531768, 596386, 553095, 322755, 227826, 171475, -17298, -45583, 199530, 380575, 284534, 89676, -38741, -18266, 58518, 41781, -38304, -272855, -505342, -379978, 62719, 326802, 409141, 369821, 248330, 346566, 388408, 293574, 232386, 183630, 67473, 95577, 119860, 113708, 266250, 342595, 401856, 452282, 331040, 274183, 276711, 22611, -124937, -98914, 73076, 359591, 343310, 75409, -94436, -99277, -103802, -4224, 71802, -58159, -214781, -335937, -374064, -328673, -162719, 132965, 278181, 182902, -22068, -67971, -148456, -420795, -620041, -583064, -423466, -223333, 5871, 14503, -32523, 52821, -7304, -3925, 144646, 4061, -124140, -109543, -288917]
9896b88917K6384K26238o387k3661k81576k06039R7824p7399K6384J73333J23793
9885b10023R3477O6048k05689k81022p3167o0221L1249J60431J30557J83859J55063
9874i438j15601k17409j19157Q4742R8789J46455R5275J4986p8038o8067P2454
9863i5009J28270P6536l4308r4952j00913O257Q8614j2582N8166l1380l2108J6808
9851b6601j76715j43353L5084m7692q8886P4991J07116j35568k67627p6266K28555
9840e16962K04862r2181J0138L59049J81594L5572P3813J30424M0476m9306j02727
9829B74752l6241J87159N8642j09612j25799j38379j2368q7265p3563N8994p5351
9818g9031q0694k2347l4454k5284j32627o5840J01444J54704l6391M313K6981
$$ y = [-288917, -262533, -36295, -42682, -66343, -347919, -553958, -456134, -533533, -507149, -333816, -210023, -116546, -50498, -256187, -537209, -610376, -670597, -639348, -478917, -348360, -164501, -9438, -125039, -342448, -461605, -376863, -278074, -131619, -36344, -21358, -99396, -167463, -95009, 33261, 109797, 75489, -19463, -120376, -114119, -25505, -38087, 20079, -11301, -43409, -26601, -203316, -346669, -311585, -359277, -448163, -373172, -266056, -401624, -669251, -745517, -516962, -312100, -404281, -394143, -35094, 146500, 182072, 255885, 386309, 426785, 377479, 274752, 238511, 425670, 484312, 374700, 248901, 110522, 98154, 10889, -62674, -3680, -79031, -159725, -182072, -216526, -241810, -374437, -440277, -338833, -184129, -220520, -216207, -189226]
9807a89226q5078m3190o3819Q3433J63379J02351Q0852K1093K6769M3466n9152
9796H0878m1873r4448j05692O047O5676j41069q0010M3395M4883J54104o580o7562
9784a42251J93k4378j21272O1810K61186J29350j33749O955P146j26210j26521
9773b07741k5677k8221O6913J39435J09617P8343n174L3347J59746N6306N306
9762C82200k97952k93704J6154k2845J39538J95229K75795M3499k96615j41334
9752c5Q2033J912j71176l37127p9861K75202K21319R9070P6856m4237R596K85202
9740D18754N3214j98911j48225k25199j69869l4625o7702Q3872K90593J51200
9730A53102Q8885N1155j25888k69796k05513j39144j06916k01541J30451M17184
$$ y = [-189226, -274304, -317494, -381313, -297880, -134501, -32150, 48702, 69795, 96564, 140030, 80878, 39005, -55443, -161135, -155088, -89412, -230481, -310491, -267096, -222213, -68109, -74689, -142251, -142058, -166436, -287708, -225898, 35288, 164638, 30889, 37844, 44990, -81220, -207741, -233418, -261639, -194726, -55291, 54326, 132669, 127495, 160842, 320588, 376894, 382200, 84248, -209456, -193302, -216147, -76609, 118620, 394415, 437914, 141299, -35, 81998, 83910, -87266, -424393, -504254, -229052, -7733, 91337, 168193, 123956, 133552, 418754, 471968, 273057, 124832, -100367, -270236, -304861, -372563, -288691, 1902, 153102, 241987, 293142, 167254, -102542, -308055, -447199, -554115, -755656, -625205, -208021]
9720b08021L05513j2810j89863j80436j2497o0056J04166K4371p5106J41446J4586
9709a48707j55809Q3376K92492R7321R9259r4906j13398N9606J9074j2091o95
9698A25522j75552k23803o5789J2338p8716N4353K15081K40328P2602j43147J28682
9687A61899j20298k39970k6072J76021J81667j29764k71746k11920p5097J24405
9677d30875M0412J01299J60414J54674J43665R9896K46314j3687j54142k6228
9667C21742j54141p9829j0726L1543j61984j21816K15555M7442k56179q5029J23134
9656a30288p4807j13781o64J89881J7540k26524j29222r073Q9236J11659M6120
9645b29923K57226J94922R3359Q8483j09297J4423J30357L3187J25438r445k10133
$$ y = [-208021, 97492, 84682, -105181, -285617, -298114, -358170, -254004, -229633, -304739, -163293, -148707, -304516, -221140, 71352, 168673, 267932, 173026, 59628, 119234, 138308, 126217, 125522, -50030, -273833, -339622, -327284, -406000, -351647, -136566, 103762, 176364, 33217, 161899, 41601, -198369, -224441, -48420, 133247, 3483, -268263, -480183, -555280, -430875, -390463, -289164, -128750, 25924, 169589, 269485, 515799, 502112, 347970, 321742, 167601, 87772, 77046, 108589, -53395, -175211, 40344, 87786, -168393, -253422, -130288, -205095, -318876, -319540, -129659, -112119, -338643, -467865, -476938, -387702, -276043, -229923, 27303, 222225, 315584, 404067, 294770, 309193, 439550, 472737, 598175, 588730, 378597]
9634C78597k07610k7064K6109N2802M8738Q5920K8058k89529k57733j70749j66142
9623d98603j17072J04312R3778J77055L88207J98779j84390k71814j67472J55782
9613a21438J95967J47653K2731M6050J35586K57950K30821J19703J20028J67047
9603A322098P4642k09645j95097j61320k18013j79130j50108k1084Q7324k27767
9593A21900m73122l42081N2826J88880J05113J27625R4123j1697m1626M2506J60160
9582B4607J42320k7355l20410q5357L24763L15824L1120q6145j17359r8515r9547
9571C946r6744J169Q8511q2316J63888O1556j81978l6289j79828j83612N4747
9560c86950J70446J31102J41848Q8821P8503l3091p2331O6408k13625l35957m6758
$$ y = [378597, 170987, 143923, 170032, 222834, 271572, 357492, 385550, 96021, -161712, -332461, -498603, -615675, -511363, -417585, -240530, 147677, 346456, 162066, -109748, -277220, -121438, 74529, 222182, 244913, 290963, 426549, 684499, 915320, 1035023, 1155051, 1322098, 1396740, 1187095, 991998, 830678, 612665, 433535, 283427, 262343, 349667, 121900, -351222, -693303, -640477, -451597, -346484, -218859, -124736, -136433, -178059, -135553, 24607, 166927, 139572, -180838, -266195, 58568, 374392, 405512, 319367, 202008, 103493, 3946, -92798, -91629, -3118, -85434, 78454, 140010, -41968, -78257, -258085, -441697, -386950, -216504, -85402, 56446, 145267, 223770, 190679, 118348, 184756, -28869, -364826, -411584]
9549d11584J38859L63813J98544J33219J1649k46208l54728k70716K9166J37659
9539b70327K91884J76019M6693J22152k06734j87787K3376R2567K12317K73906
9529E74066N6021o4263j06766O6271Q0699j59554j12690j10337j22087M3703R0874
9518B35937q2762k82456l94048jR3201j8546N504m2713O307J00326J05008J54500
9506a19743M9706j36504m7379m3838j19330r3355J0016J53559J77552K0051K02619
9495E3354K98770L1040J4391n7088j92234j77751p7596k2582j26577n7344J53964
9484a59653R0348J1269j25844j90920j14869O9784K50496J22877j78355N787J45327
9473g3753O6461L7840J83668K5227j17913j04334n7584r6435m3181K62830K94139
$$ y = [-411584, -272725, 91088, 289632, 422851, 434500, 188292, -166436, -437152, -407986, -270327, 21557, 197576, 244269, 366421, 159687, -28100, -4724, 87843, 300160, 574066, 630087, 565824, 459058, 525329, 606028, 446474, 333784, 223447, 101360, 145063, 235937, 153175, -129281, -523329, -523330, -430129, -448675, -443171, -485884, -479577, -379251, -274243, -119743, -70037, -206541, -253920, -297758, -417088, -510443, -500427, -346868, -169316, -149265, 53354, 352124, 383164, 397555, 340467, 148233, -29518, -107114, -129696, -256273, -313617, -159653, -69305, -58036, -183880, -374800, -489669, -419885, -169389, -46512, -224867, -219080, -73753, -7292, 30548, 214216, 239443, 121530, 17196, -40388, -136823, -180004, 82826, 376965]
9462C76965J1561q4536k81704k85573k00850j46051Q3496K08263J48133k8863
9452a99159J28679Q6178j42141J9874J25809n2458j99188J05K3101P0576R4640
9441d3984J9701l0923k7615J60053K37426k9074k56865k72640k11954j59356J7623
9430e97608R4304L4786N2013J11203m6985j32094j3269L5846o3175p1843M080
9419e92742M7656K28189Q2332K7245J02268o3436k56350k13513n0591L556K84501
9408d00885L10089J5387P5553O1275j64560k39985j15775J8117J05314K8765q3127
9397c89832J22889J07058J1761l1193j79769p8234j30867j75421l2225J52405
9387f23428O7092J30140n2164j23011O2153J36190L93235K70200Q9403k4931L1060
$$ y = [376965, 388526, 303990, 22286, -263287, -464137, -610188, -526692, -318429, -170296, -199159, -70480, 15698, -126443, -106569, 19240, -33218, -232406, -232301, -209200, -138624, -43984, -24283, -55206, -82821, 77232, 314658, 285584, 28719, -243921, -455875, -615231, -597608, -503304, -468518, -416505, -305302, -352287, -484381, -497650, -461804, -524979, -596822, -592742, -545086, -316897, -234565, -207320, -105052, -168488, -424838, -638351, -688942, -685386, -400885, -90796, -75409, 144, 61419, -103141, -343126, -458901, -440784, -335470, -306705, -389832, -266943, -159885, -148124, -179317, -359086, -437320, -568187, -743608, -775833, -623428, -556336, -426196, -478360, -601371, -539218, -403028, -9793, 260407, 349810, 324879, 355939]
9376C55939q6135k52419k12038j33106K06971L17276J21679j00632k04508k27411
9366b14384j48925L8866L9445O6740K9080N3430o434k3831P7894r9090K0638K2749
9354a43822J53600J86556K9304M1343J46934K6924j28620l34055p8563l6339J74066
9343C7328L54249P8146j67188k07287m4391M860j71460q7124J54357O1911K2583
9332C5984n2068l9201j14176j41785k54551n5212j7043k66090m0631J94452K51045
9321d99276N16j313P1854J3121J96716J13751j32339j79271J2616Q723q1895M8474
9309d28323J06295K6903r7888J87278J07015J02054n9308j99053k18742N9019
9299d14750J89821K92644J54162j47755k25052N4286J70901k8586J5427m6807
$$ y = [355939, 269804, 17385, -194653, -327759, -120788, 196488, 318167, 217535, 13027, -214384, -363309, -324443, -284998, -218258, -189178, -135748, -142182, -166013, -88119, -187209, -166571, -143822, 9778, 196334, 225638, 266981, 413915, 440839, 312219, -21836, -100399, -136738, 37328, 391577, 469723, 302535, 95248, 50857, 55717, -115743, -202867, -48510, 13401, 35984, -16084, -55285, -169461, -311246, -565797, -621009, -638052, -904142, -944773, -750321, -499276, -498760, -500073, -428219, -415098, -218382, -104631, -236970, -416241, -403625, -394902, -476797, -428323, -322028, -295125, -393013, -205735, -98720, 3334, -55974, -255027, -473769, -414750, -224929, 67715, 221877, 74122, -150930, -96644, 74257, 45671, 61098, 14291]
9289A4291J09778K8598n6989j5521o5970k5334k20459j41136R0921R7899L9095
9278a44827L6782j32418k47561M8517R4591Q2768K3490j32251m2201j51757k33219
9267g98086J26025J28999q4274j90044L7095J40203J09756K16166K20835R6707
9257C382o8220L945J19323k8742r763j26784o9230J1496M5323j03589l2713r1918
9245c47490j85031m6057m5490l2248J7988k2349r0599m1095K14293K25558J97323
9234a55197J49498j30359j06794R0580J12135K01626J03312j6943k0971J92857
9224D19744J17953r1425j55041k30366j05594J34567J45502o9563Q1323J47588
9214C94688k3657l83044l47056r8424N2551K46990K18004O8693P6551n6892m0319
$$ y = [14291, 124069, 152667, 95678, 80157, 14187, -11147, -231606, -372742, -281821, -183922, -144827, -108045, -240463, -488024, -439507, -344916, -262148, -238658, -370909, -413110, -564867, -798086, -672061, -543062, -627336, -817380, -780285, -640082, -530326, -314160, -93325, 3382, -64838, -60893, 58430, 29688, 19925, -106859, -176089, -164593, -119270, -222859, -255572, -347490, -532521, -578578, -624068, -656316, -638328, -660677, -751276, -792371, -578078, -352520, -155197, -5699, -136058, -242852, -152272, -40137, 161489, 264801, 247858, 226887, 419744, 537697, 446272, 291231, 60865, -44729, 89838, 235340, 165777, 247100, 394688, 371031, -12013, -359069, -457493, -404942, -157952, 60052, 128745, 205296, 148404, 108085]
9203A08085J9672K0196k4381k42295q8980J10164l5363o5044j70007L4267J90181
9192a43505R7569K1604r1467J60105J04773n2071r5971k53732l96784k87156n9324
9181i95959K67995K19032R9014J93308O2362j3762j3907J33961J83077K50460
9171C85581J57969o6923q3056j9456m1991M4855k114j73729r7825Q8944J5766
9160B08021m3454j39214J4376N7833k7998k501j13239k52606m1479O0709j6442
9149b95994P036K649j84j48340j65820l2530j00820j35778K7213J63020J38970
9138e40578k3840l2031P9569K16217K15269J71495J18029N9749q4209j64961l70
9127A4339J54688N6361J3427n035j92827k63165L8363j29268P2989J64977k0509
$$ y = [108085, 127757, 147953, 123572, -118723, -207703, -97539, -132902, -197946, -367953, -333686, -143505, -45936, -24332, -115799, 44306, 149079, 97008, 1037, -252695, -649479, -936635, -995959, -727964, -508932, -409918, -216610, -154248, -168010, -181917, -47956, 135121, 385581, 543550, 476627, 393571, 374115, 332124, 376979, 374865, 201136, 103311, 192255, 208021, 164567, 25353, 39729, 97562, 69564, 67063, -46176, -298782, -340261, -279552, -295994, -288958, -286309, -286493, -434833, -600653, -633183, -734003, -869781, -842568, -679548, -540578, -564418, -596449, -516880, -300663, -85394, 86101, 204130, 263879, 179670, 14709, 14339, 169027, 225388, 238815, 233780, 40953, -222212, -183849, -313117, -240128, -75151, -95660]
9116i5660j15492q9351R8065J36290J694R8940J18547j35446k01779O6853P2051
9105d5288L1171K2556o3915o1198J52729K64848m6479j03999j738q8978k34037
9094a74328r2467m9456k4423L3560J34185K59394L0926j37399p9356r954j0426
9083a19744j32930r8324r0990J72590L10957L13657K45594Q9440r037l5570N8755
9072G04398N5789R9526L43073K52900L68032O82533L14741o9539j35128j32786
9062B483539l09658l32144k87078j27022j85340r8212k07748l40519l85603m95624
9052b85409l0661K31998M999j60819L4451m4850k8145K24668J86916j99571l55204
9041d21627m8942R6226M2951M4482J69339K8046j18719p5552J8930K50829J30346
$$ y = [-95660, -211152, -300503, -202438, -66148, -64454, 34486, 153033, 17587, -184192, -117339, -45288, -14117, 8439, -55476, -116674, 36055, 300903, 254424, 150425, 148687, 59709, -174328, -266795, -316251, -340674, -307114, -172929, 86465, 117391, -20008, -99364, -109318, -119744, -252674, -350998, -441988, -269398, 41559, 355216, 600810, 690250, 681213, 645643, 704398, 760187, 859713, 1202786, 1455686, 1823718, 2506251, 2820992, 2751453, 2616325, 2483539, 2173881, 1841737, 1554659, 1427637, 1242297, 1144085, 936337, 595818, 210215, -285409, -316070, -84072, -79073, -239892, -205441, -250291, -278436, -53768, 133148, -66423, -421627, -470569, -374343, -331392, -286910, -117571, -89525, -208244, -283796, -264866, -14037, 116309]
9030A16309j8181L5575j89756l08242m171J50717J62334R3518l7185k19155j6426
9019b34663J01883r3178o8033J15435O6816P4078J40352n5431j16217L5874J6334
9008a6750L0785M0470q0700R2740J06767r209M3592k76623j04613K15456P9491
8997A21406O3402n6268j58776K4655J6274M7722J52684P8224J30416P477M545
8986D31761L7622j72530k78063j81233r8829K9044J23081J50135J31964Q4108
8976B57060l5029j15233r4303L6356Q0799j35170J3308J34232o9275j24875J16085
8965F3955o5458j15985Q6061J05653m115J23811J90003J70820j19227m44362j20458
8954a29302p1085K1097J44175L5816l6908n5576j39635J65820O1504j62143r4719
$$ y = [116309, 98128, 133703, -56053, -364295, -368466, -217749, -55415, 38103, 918, -218237, -234663, -132780, -225958, -293991, -178556, -111740, -37662, 102690, 47259, -68958, -33084, -16750, 14035, 54505, -26195, 66545, 173312, 164103, 207695, -68928, -173541, 41915, 121406, 184808, 128540, -30236, -5581, 10693, 58415, 211099, 289323, 419739, 427216, 431761, 469383, 296853, 18790, -162443, -261272, -232228, -109147, 40988, 172952, 257060, 222031, 106798, 12495, 48851, 129650, -5520, 7788, 142020, 72745, -52130, 63955, -1503, -117488, -31427, 74226, 70111, 193922, 383925, 554745, 435518, -8844, -129302, -200387, -179290, -35115, 701, -36207, -91783, -231418, -65598, -4094, -166237, -260956]
8943b60956K09933L05001M2607r3337N1190R5585N8624r3857N8560L07169j1625
8932F68894l65716k28004o0308j4604O2397j3737j30324q4544p4128j95609r0667
8921e26350K4579l41M4485J08983J94132j35008k12422J42400J40580J60457o57
8910e9162j53784j96599P0537L53409J93425p5289L2945p4613k63567o2904Q1604
8899a53998L74729K33682Q480J09049K4357j80507k12652O899k110q4919n3858
8888F9152l0918j09898n6826J59947L7342j98110p3766J28357J70487N0191q5864
8877F0094j54728J96586J46573j46707j66641j44997j40029N8084Q1954J17829
8867i1982L11661J19549l69134k27229K3860k91340k85451o2568J06527L99800
$$ y = [-260956, -51023, 253978, 296585, 203248, 254438, 350023, 408647, 314790, 373350, 680519, 668894, 303178, 75174, 14866, 262, 62659, 48922, -81402, -165946, -240074, -435683, -526350, -501771, -502112, -457627, -348644, -154512, -289520, -501942, -359542, -218962, -58505, -59162, -212946, -409545, -339008, 14401, 207826, 132537, 165482, 90869, -172698, -235602, -153998, 220731, 454413, 462893, 571942, 596299, 415792, 203140, 210039, 207929, 123010, 69152, 38234, -71664, -128490, 31457, 68799, -129311, -203077, -74720, 95767, 145958, 60094, -94634, 101952, 248525, 101818, -64823, -209820, -349849, -291765, -209811, -91982, 219679, 339228, -29906, -257135, -233275, -524615, -810066, -872634, -766107, -366307]
8857c66307L49919K10298m0696j7358K07877R3866r7521j03661m0205j9694J64866
8846C41384L5130K7402K78319K61460K10925K19824K04689K02820o3851j58013
8836A560089j83685j49697M7942n1770k50939j75248J4768J25892j1529P4923
8826A000746N0082j56788k40836p9398J6387j69229j99408J43122k2658j17300
8816B24720R8616K060L9865P3151Q0243K2496Q8051J73885O6287j13818j28034
8805F27522O344j9498j24122K4641k10361m12700j3558N8802m7646J15658J09984
8794A15066q4490k150O8218J06478J79144J16239J70309R0680l2780k52368k84710
8783A89636j21061j3625k34224j26576N1399L9673J3970o881j9734j00395K7519
$$ y = [-366307, -16388, 193910, 153214, 135856, 343733, 437599, 340078, 236417, 196212, 176518, 341384, 376514, 403916, 682235, 943695, 1154620, 1374444, 1579133, 1781953, 1718102, 1560089, 1376404, 1226707, 1274649, 1222879, 971940, 796692, 811460, 937352, 925823, 1000746, 1050828, 894040, 653204, 573806, 590193, 420964, 221556, 364678, 342020, 224720, 323336, 325396, 365261, 438412, 518655, 541151, 629202, 803087, 869374, 755556, 627522, 633866, 614368, 490246, 514887, 304526, -108174, -121732, -62930, -110576, 5082, 115066, 30576, 28426, 96644, 203122, 382266, 498505, 668814, 759494, 726714, 474346, 189636, 68575, 54950, -179274, -305850, -254451, -214778, -200808, -207689, -227423, -327818, -300299]
8772c00299J49059K07162J05577r9120j40592q7052l5477K6501n3285j12457m3233
8761c83216K13748K97305J07159Q595j43683l5052Q1417Q0776J08665j39876M023
8750A99861K0158j25839J8672K34916J39673p1749P3894Q2664O9041j89962k65685
8739A85644j48846o6963j5229j5194Q3457r3566p5213P8844J9188r0520j67779
8728c06177n3214K9312J88793P5827r4713r1138p4463k9227n5063j82243j59716
8717g52022K73136L84054K00517N3220K7005J61125K03549P1012r0832k00989
8707C29775o2292J65032R3309J8521r3711o8801L0793l9707l4960k9694r6357
8696B11908j6611k1946k19104k7678K62330L8744k17157m5780J01461J65223J88598
$$ y = [-300299, -151240, 55922, 161499, 62379, -78213, -165265, -200742, -174241, -227526, -339983, -383216, -169468, 127837, 234996, 243591, 99908, 64856, 146273, 227049, 335714, 195838, 199861, 220019, 94180, 112852, 347768, 487441, 415692, 489586, 572250, 641291, 451329, 185644, 36798, -30165, -45394, -60588, 22869, -70697, -145910, -67066, -47878, -138398, -306177, -359391, -330079, -141286, -65459, -160172, -251310, -325773, -355000, -410063, -592306, -752022, -478886, -94832, 105685, 158905, 185910, 347035, 550584, 621596, 530764, 329775, 267483, 432515, 525824, 544345, 450634, 381833, 412626, 372919, 337959, 308265, 211908, 195297, 173351, -45753, -73431, 188899, 227643, 10486, -35294, 66167, 231390, 419988]
8685D19988K69577J7532l74863k49298q0215Q1160P9299j54916J27946J67756
8675C03966K06815K52434M9465m5557j01823O1241K65225K78311O0081j58774
8665A171384l3359J78581j6452k84175j80500o2686Q3472K08928O0202p3954j71944
8654H79497j34425n0172J20788J05709Q152j82696k49607l05815l54845j27476
8644b90890k11875j18833J73552J43287R0267K0844L8542R6770q1569j61645J20199
8633a81351K32765O2716k2858J5322P7415L0531r9133j62839p5611M4346M5245
8622c3452J1300K46604K06616j06661l42925j46129O2467K27068J84153J3538
8612C22579k58508k45862j86505j00781j42665J40851R0691j3398N8869M81M7315
$$ y = [419988, 689565, 707097, 332234, 82936, 2721, 83881, 163180, 8264, 136210, 303966, 510781, 763215, 812680, 767123, 665300, 726541, 991766, 1270077, 1330158, 1171384, 1138025, 1316606, 1300154, 1015979, 835479, 772793, 856265, 1065193, 1125395, 1051441, 879497, 745072, 694900, 815688, 921397, 929549, 746853, 497246, 191431, -163414, -290890, -502765, -621598, -448046, -304759, -214492, -193648, -155106, -58336, -139905, -301550, -181351, 51414, 114130, 91272, 106594, 184009, 214540, 115407, -47432, -123043, -78697, -33452, -22152, 224452, 431068, 324407, -18518, -164647, -102180, 124888, 309041, 322579, 64071, -181791, -368296, -469077, -611742, -470891, -380200, -393598, -334729, -334248, -286933]
8601b86933R6173K08861J20868k87527k76798q3874O282j6294j04811P8508J64402
8590c81143K11240K24190J98891Q7618j61849k27851Q613P3825Q3089N9722k24333
8579d7988j42501L976J09149P3714j94155j73605k00539o8084K44559J33776P2238
8568a89460J10809J4844o9593m0813J2489o5449j68926j89000K7772P4349j16804
8557e99782N6508K35176J72025P4014j44669j30178Q9046K26691O0893p6785j47310
8546a84371n3451R4872P2172N170n9069k22957m1695Q6632n5974j61125r8710
8535f18506j81337o4899J91168K28744J77822K71676R3239J37071O0363j2393
8525B82948p5732l8595j24856j16384n6230O282n7520j39146j75320l5932N4646
$$ y = [-286933, -190760, 18101, 138969, -148558, -425356, -509230, -502948, -519242, -624053, -545545, -381143, -169903, 54287, 253178, 340796, 178947, -48904, -40291, 33534, 116623, 176345, -47988, -190489, -186513, -77364, -3650, -197805, -371410, -571949, -640033, -395474, -261698, -189460, -78651, -63807, -133400, -174213, -161724, -227173, -396099, -585099, -557327, -482978, -599782, -543274, -308098, -136073, -62059, -206728, -336906, -247860, -21169, 39724, -37061, -184371, -237822, -142950, -70778, -65608, -124677, -347634, -389329, -302697, -358671, -519796, -618506, -799843, -864742, -673574, -444830, -267008, 4668, 97907, 234978, 295341, 282948, 207216, 168621, 43765, -72619, -128849, -122567, -180087, -319233, -494553, -530485, -475839]
8514d75839k3440K06502L19679K0047j45039l4615o2489k8890O3280J18663K2245
8503a9896j06966j01903N7562j31512j87975J98717J39304J37795J94891J31321
8493C11338q1707q6950J3309q0447k1725J07601j15944p9972m9449l6437j70655
8482b91038k35417N4911K47169K15649Q5105p5887Q908K2500P9300J05629J38341
8471C55170L5269K1014Q6316k96386k53704k2203j8433j16874J08109K10770J61150
8460B70198l1210k90183k10586Q1367j01300r7421j2000O876K28104K40443J9538
8449A03826j10546j15561N8126M3153j88060j89880L7641K24528K47070n8190
8439E2107j77360q1784j10656M0590J50145J507j7718L0803N384K3139J24298
$$ y = [-475839, -499279, -292777, 26902, 46949, -98090, -132705, -195194, -224084, -160804, -42141, -19896, -126862, -228765, -171203, -302715, -490690, -291973, -152669, -14874, 180017, 311338, 229631, 142681, 155990, 75543, 53818, 161419, 45475, -34497, -83946, -120383, -291038, -526455, -471544, -224375, -8726, 76379, 492, 9400, 31900, 111200, 216829, 355170, 390439, 411453, 497769, 201383, -52321, -74524, -92957, -209831, -101722, 109048, 270198, 238988, -51195, -261781, -180414, -281714, -379135, -391135, -384259, -156155, 84288, 103826, -6720, -122281, -64155, -21002, -209062, -398942, -361301, -136773, 110297, 52107, -125253, -207037, -317693, -277103, -126958, -125451, -143169, -112366, -106982, -83843, 40455]
8428D0455N3419k0711P2182J59594j42355k15964r2494Q0242J30680M1374K5165
8417A31587O319j10957j91766j07710r7725r1948M886J31027J38236K27503K25943
8406B65395O8601J7454n5302n7609N5113j51725j99903J99270J63048p9285k48924
8395b3867l10759j19409J97912J62908P7354R177J07255J38960j33383k77634
8385a71486j42477Q0129k5693J13211K88003J90122M2865j66756j06338P8644
8375A80224M3661p5994o2359N660N0119j24911L9860K98427K69828K15715O9370
8364I09600j37497k06054p9762j22750r4511j43751l8325k8985j53254k2745K71170
8353A53136J27992j33677j4607N6897j60876j56501p7205K2814L0773J40786J42728
$$ y = [40455, 93874, 73163, 145345, 304939, 162584, -53380, -145874, -65632, 65048, 106422, 131587, 137906, 26949, -164817, -272527, -370252, -462200, -457314, -326287, -188051, 39452, 265395, 333996, 351450, 296148, 238539, 293652, 141927, -57976, 141294, 304342, 225057, -23867, -334626, -454035, -256123, -93215, -15861, -6684, 100571, 239531, 106148, -171486, -313963, -233834, -259527, -146316, 141687, 331809, 374674, 207918, 101580, 180224, 223885, 147891, 85532, 91192, 141311, 16400, 56260, 354687, 624515, 840230, 909600, 772103, 566049, 486287, 363537, 269026, 125275, 86950, 57965, -95289, -118034, 153136, 281128, 147451, 132844, 189741, 28865, -127636, -204841, -182027, -151254, -10468, 132260]
8342A32260J52809K30830J54906J59285q4489k78093j67124P6816J07827k6005
8332D59022l532K29346J61177J65626O2038k15062k19936p1433L793j5238J56374
8321G12175J62710P0471R7114K60124K76333M4533O9436j02103r3459o9577o2228
8310A365529M5884n7601m30952k99032j86824j55702j0098Q7952K00255J15005
8300F74416j68557q6986o9351j24445j32284L9807L3437j46691k7587R2815P1661
8289A56235r4354j57910k09005J39740K67589K05969j12884n9552R1592J37345
8279C64765J39689O5930j65989j66823N2450J42545J00195J5195J16302J39188
8269H03447R2395J43807K74554K44097K65352O5362L5033K32392K71503P7886
$$ y = [132260, 285069, 515899, 670805, 830090, 745601, 467508, 300384, 377200, 485027, 459022, 455490, 684836, 846013, 1011639, 1073677, 858615, 638679, 567246, 571039, 555801, 712175, 874885, 945356, 1042470, 1302594, 1578927, 1623460, 1692896, 1590793, 1497334, 1427757, 1365529, 1411413, 1353812, 922860, 623828, 437004, 281302, 271204, 359156, 559411, 674416, 505859, 418873, 349522, 225077, 92793, 132600, 166037, 19346, -8241, 84574, 156235, 61881, -96029, -305034, -165294, 102295, 308264, 195380, 135828, 227420, 364765, 504454, 570384, 404395, 237572, 290022, 432567, 532762, 547957, 664259, 803447, 895842, 1039649, 1314203, 1558300, 1823652, 1889014, 1924047, 2156439, 2427942, 2505828]
8259B505828J0830L66410K60772j84683l94366l73590l97872k86430j44678j1376
8249A350845N8654q1638k22578j56157n0982j68217j50305Q2760J24043P0026
8239H56451L383r6644m22902l18299J50993j5410j2577l1808k8122r6299o8126
8228g9360q2815j87471j72620O0724J88136K14407K52498J00087N5424O1062k22368
8217A87704j07373J55320p1763k11645q4956j7145J97939L61429p7791k49796
8207H1923j00925N565R1045J09539l051O4273r4332O0399K8602j24832j47361
8196b9155o6125J42132Q9946Q1401J04013J917K1151j8547n7554J33222J95583
8185E97984k8128p6164J14255j1209r5888O2660j10126j76173l06445l28505m7476
$$ y = [2505828, 2516658, 2883068, 3143840, 2959157, 2564791, 2191201, 1793329, 1506899, 1362221, 1350845, 1409499, 1327861, 1105283, 949126, 898144, 729927, 579622, 662382, 786425, 856451, 859834, 763190, 340288, 21989, 172982, 157572, 144995, 113187, 85065, -11234, -79360, -162175, -349646, -522266, -461542, -273406, -58999, 193499, 293586, 349010, 410072, 187704, 80331, 235651, 163888, -47757, -132713, -149858, 48081, 409510, 331719, 81923, -19002, -13437, 77608, 187147, 184096, 248369, 154037, 214436, 243038, 118206, -29155, -95280, 46852, 136798, 218199, 322212, 324129, 345280, 326733, 269179, 402401, 597984, 569856, 493692, 607947, 596738, 500850, 563510, 453384, 277211, -29234, -357739, -405215]
8174d05215J41628J92380O2939j30953m6115P2785Q8653J09402J21071J92767
8164C99342J67510o9371k02691j5774J85535J36817j63491k99386l6528J96452
8154B98415N3988K29833K42186L147m8307m6270o6659j00233k5924j9680k7817
8143D92679j95646r8541J26606R337k76354r9679K12626K55585J85898q8824j99133
8132C24554l51746l0527K12520J45790J80715L8131l8183j10493K1045M1391R7412
8121E30609J98460J12331o8352j82381j03993j28326K3641J47421J23278k5643
8111F27045o8184P8318J46163l0844j32199P4701K25862N2525Q9020J62240L4271
8100A258918p8891p5761p440J25301J7238k62753l78671k71044j86736J19665
$$ y = [-405215, -263587, -71207, -8268, -139221, -185336, -112551, -23898, 85504, 206575, 399342, 566852, 497481, 294790, 279016, 464551, 601368, 437877, 138491, 101963, 298415, 352403, 582236, 824422, 827569, 779262, 732992, 666333, 566100, 540176, 520496, 492679, 297033, 198492, 325098, 334435, 58081, -41598, 171028, 426613, 612511, 523687, 324554, -27192, -57719, 154801, 300591, 481306, 519437, 481254, 370761, 391806, 433197, 530609, 729069, 841400, 773048, 590667, 486674, 358348, 381989, 529410, 652688, 627045, 558861, 637179, 783342, 752498, 620299, 695000, 920862, 973387, 1062407, 1224647, 1258918, 1180027, 1104266, 1096826, 1222127, 1239365, 976612, 597941, 326897, 140161, 259826]
8090B59826L00736K37171Q3652R2162K8111K22458L13543k52087l71786j43153
8080G70633j04232j12525P5462J44216J01000K5935j23051j38470j06467r738
8070E22763q5895j47775J29751K97388K08913Q6337R202M9340o5210k60453j63839
8059E80522J12451K42056J46894m0956n3419J12436Q4888K15863J12139m7490
8049A465384l2771j13486j05252M4301K67222J5640J30983J88272j36753j63401
8039A560139j14239j71526K1660J49600J97415J65980r1988n9163O5968Q0484
8029A804330J78904J46071R2926o906j79164N4602l6586k6277J52431J23690k128
8018B301893J18244K02448J74163J71155R6344P2650P7354k8101K36708L74384
$$ y = [259826, 560562, 797733, 881385, 973547, 1001658, 1224116, 1537659, 1285572, 913786, 770633, 666401, 553876, 629338, 773554, 874554, 900489, 777438, 638968, 532501, 522763, 436868, 289093, 418844, 716232, 925145, 1011482, 1020684, 1070024, 1004814, 744361, 580522, 692973, 935029, 1081923, 1040967, 987548, 1099984, 1184872, 1400735, 1512874, 1465384, 1432613, 1319127, 1213875, 1258176, 1525398, 1541038, 1672021, 1860293, 1723540, 1560139, 1445900, 1274374, 1296034, 1445634, 1643049, 1809029, 1717041, 1657878, 1723846, 1804330, 1983234, 2129305, 2222231, 2215325, 2036161, 2090763, 2054177, 2027900, 2180331, 2304021, 2301893, 2420137, 2622585, 2796748, 2967903, 3064247, 3136897, 3214251, 3186150, 3422858, 3797242]
8008C797242K65914L49336M34441M90717P14659J016040J087646J379915J509057
7999A1044967J802009K390258K941069L634420M233820M597631M508116L829186
7991C8981476K406581P05603j099655k814229l857271m211798m209833l635322
7983B2265552l141556k634322k096212j670253j090607m71938n56800m96941J02298
7974A0209221J52403J49258J06240K67820M11876K89580K47108k40798p41576
7965A0851132q43232q03939n56859l97780j66409J51065R1418J637J8327K14399
7955H559759N51911N86949L29693N29284R17036J284742J381499J577276J989326
7946A7707475K398109K917805L650672M633935N694428P153358Q727387J0563660
$$ y = [3797242, 4063156, 4412492, 4846933, 5337650, 6052309, 7068349, 8155995, 9535910, 11044967, 12846976, 15237234, 18178303, 21812723, 26046543, 30644174, 35152290, 38981476, 41388057, 42093660, 40994005, 38179776, 34322505, 30110707, 25900874, 22265552, 19123996, 16489674, 14393462, 12723209, 11632602, 11160664, 10603864, 10106923, 10209221, 10361624, 10510882, 10617122, 10884942, 11296818, 11586398, 11833506, 11592708, 10851132, 10007900, 9203961, 8647102, 8249322, 8082913, 8233978, 8325396, 8327033, 8345360, 8559759, 9111670, 9698619, 10028312, 10557596, 11474632, 12759374, 14140873, 15718149, 17707475, 20105584, 23023389, 26674061, 31307996, 37002424, 44155782, 52883169, 63446829]
7938F3446829J2673832J4013796J4080615J2251629Q228973K462039l678254r022291
7930A14457168j2823489j4158881j3607300j1973407r895902p911361n852235
7923C8234593m435442l525845k925499k201243j633840j112367n46017Q1571N91498
7914B2527409O50967P93636M71928k59063q48289j038798j192015j501318j680788
7905A7923669j251318p42738j79874K67571K12186L62663N74379P11277P98676
7896A8676491P94711J262032J942727K314665K610312L371140L899223M561162
7888C9432463N809857P223541R115713J1076450J3893076J7452051K1289528K5169669
7880A50462348K7948094K8237419K4374922J5983596M547774p839070j8629036
$$ y = [63446829, 76120661, 90134457, 104215072, 116466701, 124695674, 127157713, 123479459, 114457168, 101633679, 87474798, 73867498, 61894091, 51998189, 44086828, 38234593, 33799151, 30273306, 27347807, 25146564, 23512724, 22400357, 21854340, 21935911, 22527409, 23178376, 23972012, 24443940, 24184877, 23336588, 22297790, 21105775, 19604457, 17923669, 16672351, 15929613, 15749739, 16017310, 16229496, 16592159, 17166538, 17877815, 18676491, 19471202, 20733234, 22675961, 24990626, 27600938, 30972078, 34871301, 39432463, 45242320, 52465861, 61581574, 72658024, 86551100, 104003151, 125292679, 150462348, 178410442, 206647861, 231022783, 247006379, 251554153, 243715083, 225086047]
7873B25086047k5821985k8591575k7500769k4036642j9692257j5736235j2489305
7866G1217279r592620p271393n755782m483676l463767k308575j321716m06983
7858C6612767M2106L06288L42967m0054p30927j319628k085382k704114k573985
7849B7850038k082513j531106j020932q46425o91711m72392j71373J30897N78270
7840B1742753J087238J359094J644649J961029K243884L100905M187503M598653
7832D1925708N386354O614491Q268892J0325805J3007297J6279568K0252051K5008366
7824A47068532K9782234L3193582L3422676K8623321J8525633M917582r993400
7817B85540160k2862388l1250442l4332567l2657597k8345753k3310895j8501621
$$ y = [225086047, 199264062, 170672487, 143171718, 119135076, 99442819, 83706584, 71217279, 61624659, 54353266, 48597484, 44113808, 40650041, 38341466, 37019750, 36612767, 36654873, 36961161, 37304128, 37264074, 36533147, 35213519, 33128137, 30424023, 27850038, 25767525, 24236419, 23215487, 22369062, 21677351, 21204959, 21033586, 21164483, 21742753, 22829991, 24189085, 25833734, 27794763, 30038647, 33139552, 37327055, 41925708, 47312062, 53926553, 62195445, 72521250, 85528547, 101808115, 122060166, 147068532, 176850766, 210044348, 243467024, 272090345, 290615978, 295533560, 285540160, 262677772, 231427330, 197094763, 164437166, 136091413, 112780518, 94278897]
7810I4278897j4353526j1191124q923814p078431n724926m321632l125261k084323
7802C7475860j373101j003037o33539n81735o34934q17132j324533j742473k129282
7793B7236094k016536j668724j440673j186119r07710l27854n3589n6842R8918
7784A9676965M42772P59888J023001J426399J891300K229690K608578L201016
7776C3259609L817241M398821N438876P131156R001772J1492174J4275077J7424624
7768A06239350K1380713K5192083K7761411K7570447K3373643J5252335L911493
7761B50681475q578415j9252378k6464017k9269749k8051588k4307179j9939836
7754I4818313j5977412j2631824r727739p741019o263989m862676l882695k901025
$$ y = [94278897, 79925371, 68734247, 59810433, 52732002, 47007076, 42685444, 39560183, 37475860, 36102759, 35099722, 34466183, 33884448, 33249514, 32432382, 31107849, 29365376, 27236094, 25219558, 23550834, 22110161, 20924042, 20016332, 19688478, 19634889, 19578047, 19676965, 20119737, 20879625, 21902626, 23329025, 25220325, 27450015, 30058593, 33259609, 37076850, 41475671, 46914547, 54045703, 63047475, 74539649, 88814726, 106239350, 127620063, 152812146, 180573557, 208144004, 231517647, 246769982, 250681475, 242103060, 222850682, 196386665, 167116916, 139065328, 114758149, 94818313, 78840901, 66209077, 56481338, 48740319, 42476330, 37613654, 33730959, 30829934]
7746C0829934k389231k045997j474148r88807p64499o81802j010490j273777j081110
7737A9120073j098576j190490j012100r18717q89914p99551m29773k12528j13977
7728A2454447J08950J86154L41512J86681K56536O58285J003387J260029J543920
7719A7999901J824200K295938K965809L806645M720401N549197O947699Q676337
7711E4786127J0533678J2561267J3880416J3655865J1433091P395144J827886
7704A26073474m420899r896323j3333999j4639767j4173804j2506283j0211040
7697D6891359p892825o054087m655042l828566l292480k898314k330799j784618
7689A4154628j433395j224133j129349r89773p49262n63634m75767m07365j55610
$$ y = [30829934, 28440703, 26394706, 24920558, 23931751, 23167252, 22485450, 21474960, 20201183, 19120073, 18021497, 16831007, 15818907, 14900190, 14010276, 13210725, 12780952, 12568424, 12454447, 12563397, 12749551, 13091063, 13277744, 13534280, 14192565, 15195952, 16455981, 17999901, 19824101, 22120039, 25085848, 28892493, 33612894, 39162091, 46109790, 54786127, 65319805, 77881072, 91761488, 105417353, 116850444, 124245588, 126073474, 121652575, 111756252, 98422253, 83782486, 69608682, 57102399, 46891359, 38998534, 32944447, 28289405, 24460839, 21168359, 18270045, 15939246, 14154628, 12721233, 11497100, 10367751, 9377978, 8628716, 8065082, 7589315, 7181950, 7026340]
7680G026340m5755k49051n79255l86914q6988r3538j76151k541q2440J3759R6589
7669E434055J8866J08875K40651K68178K89901K37162M36064O91195P74072J094107
7659I593126J269878J468045J745383K377520K960602L368986L961120M455785
7651C1200445M365585L561219K181730M29381j430872l041190m141359m565952
7643B8558987m591577m055986l207144k252899j696225j584808j356039r37083
7635H877226p06737o86899p07260k78337p3204j37665l83363m47233m27346k89670
7625D739512m15233o23107l85764m23409n06788n50920l15728L7707J3304j2427
7615A557147J6255k6184j36867L4806L38688J02240k37712m53327k86336P3449
$$ y = [7026340, 6980585, 6731534, 6152279, 5765365, 5678377, 5584839, 5408688, 5406147, 5323707, 5337466, 5434055, 5452921, 5561796, 5802447, 6070625, 6360526, 6597688, 7033752, 7724947, 8499019, 9593126, 10863004, 12331049, 14076432, 16453952, 19414554, 22783540, 26744660, 31200445, 35566030, 39127249, 41308979, 41738360, 40307488, 37266298, 33124939, 28558987, 23967410, 19911424, 16704280, 14451381, 12755156, 11170348, 9814309, 8877226, 8170489, 7483590, 6776330, 6497993, 6424789, 6287124, 5903761, 5456528, 5029182, 4739512, 4324279, 3701172, 3315408, 2891999, 2385211, 1834291, 1518563, 1556270, 1569574, 1557147, 1573402, 1547218, 1410351, 1445157, 1783845, 1886085, 1648373, 1195046, 908710, 982159]
7605I82159K55022J99512N7805J3935l0417j77273l20772k27382o0292m9863K7951
7594F70385K50396K67867k5366n7863N5291K3690j01914k41341k61473j42974
7584D36698K14022K68693J69697M712q2231k52439l09600j82021p9386o3994N4211
7573A78362M9481o3433m5435O0485Q3965J71767M9369N0433K15416J41815o2613
7562H29612l03108k44447P6477J62165o5199j58944p1392j41588j23497J10144
7552G0223J74275J7615l0756l2002M085M7919R5948J32586K03539R3076P1782
7541H48290J09612J49404o5821j25900j06261o6811L7517Q3995Q4546j12815j06091
7530G29665j70298k10847o5584K7570J43986K09027J38130Q5444j32623m47820
$$ y = [982159, 1237181, 1436693, 1494498, 1508433, 1478016, 1300743, 979971, 752589, 692297, 642434, 670385, 920781, 1188648, 1163282, 1105419, 1160710, 1184400, 1082486, 841145, 579672, 436698, 650720, 919413, 1089110, 1093822, 1011591, 759152, 449552, 267531, 188145, 124151, 178362, 227843, 164410, 118975, 179460, 263425, 435192, 484561, 534994, 750410, 892225, 829612, 526504, 282057, 358534, 520699, 455500, 296556, 225164, 83576, -39921, 70223, 244498, 262113, 231357, 199355, 203440, 251359, 347307, 479893, 683432, 776508, 848290, 957902, 1107306, 1041485, 915585, 809324, 742513, 780030, 864025, 948571, 835756, 729665, 559367, 348520, 282936, 310506, 454492, 663519, 801649, 887093, 754470, 306650]
7520C06650k82008r7129n95J87839J33908r2916m007J05710J38442J15831q8646
7509D23079n3126n3667J0156K9130R8509J41230r1486j01218l1788j23219R7991
7498C45591J87736j55516k39886N0828J50974K04061Q3566L3171J31066J01003
7488H92594j39824r6883Q6069L8134k031p2870j1379o1230j56617j43295r0273
7477B42395l2830K9993L40442K93618j91130k44354j15145p4657j21725j69231
7467d2624j13627J9601k037k5844J24041P3915L751r0018q7625j9282J8703M3620
7455i7426K76776J53923p2387K2303n6009M6380J23034O2377J7818K8041J28102
7444F32932J6384j63524r2789j0381m5508m7143l3274j39023l06816k40841k977
$$ y = [306650, 24642, -72487, -73082, 114757, 248665, 155749, 151742, 257452, 395894, 511725, 423079, 369953, 316286, 326442, 355572, 454081, 595311, 503825, 402607, 370819, 247600, 345591, 533327, 377811, 137925, 188753, 339727, 543788, 627354, 660525, 791591, 892594, 752770, 655887, 741956, 780090, 778059, 705189, 693810, 632580, 475963, 332668, 242395, 209565, 239558, 580000, 873618, 682488, 438134, 322989, 248332, 126607, -42624, -156251, -136650, -138687, -164531, -40490, 33425, 37176, -52842, -140467, -159749, -141046, -97426, 179350, 333273, 260886, 283189, 227180, 273560, 396594, 458971, 476789, 504830, 632932, 649316, 485792, 393003, 382622, 337114, 289971, 256697, 117674, -189142, -429983, -432960]
7433d32960M15252L87323M7549j56657j18899J8743N6707J62654M9998j93742
7423B35968j15295n1014l3775L8157J8700N908J60793K64411K52240j3551k52026
7412E10516k15787K7386J14318M2081j45704k1660J90177J01425O0175m3170l371
7401F16386M978M866O7164Q9370k4377k5856M1135M1239L4651L36331M15948L5247
7389A637082j22644j24549j43517j11093k52301l8985J68142K26552J30285j48460
7379A220512q0920j58631r9668j7836P6288Q0063R8188j18430k13610m8293Q8623
7368H26286J89811J00931N130J33366j9577q2623K5q6761m3124k62563j56005
7357F04896j12504j72305K6605J34029J85675L20814O8480k92572j39950j4326
$$ y = [-432960, -17708, 369615, 417164, 260507, 141608, 160351, 217058, 379712, 429710, 235968, 120673, 69659, 35884, 74041, 92741, 98649, 259442, 523853, 776093, 762542, 510516, 294729, 322115, 436433, 478514, 332810, 311150, 501327, 602752, 662927, 619757, 616386, 621364, 626230, 693394, 782764, 758387, 732531, 773666, 814905, 849556, 1185887, 1601835, 1637082, 1514438, 1389889, 1246372, 1135279, 882978, 843993, 1012135, 1238687, 1368972, 1220512, 1139592, 980961, 881293, 863457, 939745, 1019808, 1117996, 999566, 785956, 737663, 826286, 1016097, 1117028, 1122158, 1255524, 1235947, 1153324, 1153349, 1066588, 1023464, 760901, 604896, 492392, 320087, 346692, 480721, 666396, 987210, 1055690, 763118, 623168, 608842]
7347F08842r4774j57695j39282j56866M2247Q8314M6569M9273k10546k99860n7526
7336b81304J46321J31568K3816k29070j49304K97507J75470j9439j28699p1296
7326a04430R9564J86386j48761j75369N5090J21762J83347L20225J04546J92688
7316H35048J14508l68372j22008K81j02332n6096O5306P1298j30995j70070m0392
7305I6176M587N2268M202M0145P4335K4612k2755J52368J18822m9602J8383j30112
7293C83429j78132N6023M9936j06853o1196R9418p8337J8869L38477J9609l1443
7282E09800n0347j98481j28940R311J1742M1959O3060M5551k5001O6424R3729
7271D38807R630j62227k74987K7900K9997j33831j79184R003J46542K03353K38572
$$ y = [608842, 514068, 356373, 217091, 60225, 102472, 190786, 237355, 286628, 76082, -223778, -281304, -134983, -3415, 20401, -208669, -357973, -60466, 115004, 95565, -33134, -104430, -4866, 181520, 32759, -142610, -87520, 34242, 217589, 537814, 642360, 835048, 949556, 581184, 459176, 459457, 357125, 301029, 366335, 437633, 306638, 136568, 96176, 100763, 153031, 157233, 197378, 271713, 296325, 273570, 425938, 544760, 495158, 513541, 383429, 205297, 261320, 311256, 204403, 143207, 242625, 164288, 183157, 521634, 541243, 509800, 459453, 260972, 132032, 141343, 153085, 195044, 258104, 303655, 278654, 345078, 438807, 448437, 286210, 11223, 39123, 69120, -64711, -243895, -234892, -88350, 115003, 353575]
7260C53575q0444j18208K5987k4629j44457O6475K08498O5207J7130K7185N6558
7249D52877n1945j00620J9872l2182j3097J0553N454J74355J31877p8602j80202
7238C38340j9191J5522j98409j65110L2555O8262O5927j15186k19793j70405R4404
7227b73084K03228J59138M6835q0491j05031n7090l1592j51761n6491N1574m3308
7216c38073p3277j57026J88259L32056K13647R2060L0101q3409l59019r6626L5118
7205b16189J9193K02812L25730J07269k1052j39510j27356K32747J21178J544
7195E06366K57871M3806k76536j54160o2144j9590k02384j36479J833m5376M8831
7184c7962p438j44767l4944R0384Q2630l3266J3957J72793J25247n1440j69465
$$ y = [353575, 273131, 154923, 180910, 156281, 11824, 78299, 286797, 352004, 369134, 396319, 452877, 400932, 300312, 320184, 288002, 274905, 285458, 290912, 465267, 597144, 518542, 338340, 319149, 334671, 136262, -28848, 3707, 71969, 137896, 22710, -197083, -367488, -273084, -69856, 89282, 136117, 55626, -49405, -106495, -138087, -289848, -346339, -294765, -338073, -411350, -568376, -380117, -48061, 165586, 257646, 287747, 204338, -154681, -251307, -216189, -196996, 5816, 331546, 438815, 417763, 278253, 150897, 383644, 504822, 506366, 764237, 808043, 531507, 377347, 315203, 295613, 93229, -43250, -41417, -86793, -37962, -45400, -190167, -225111, -134727, -52097, -85363, -71406, 101387, 226634, 175194, 5729]
7173E729K7016P2593o3348k977N2256J62936R6149l4798j22254n3714n921r2578
7161D1089q5719Q9664N6416q5591n0345q2585O1557J29251n480r396Q6968l9359
7149A06470j71816l1016p6681J09402K32205P3518o5696q7295l4928o3970j01192
7138a10999n2190j4409J78768J06727o1798k26669j59390r9240r0709P0139J27574
7127c32196K4757J57984l4486j19348N6705J77465O2113r9125j09646l8068n9422
7116c13267P1720j17612j60549K0825J48694K17898N2637K34218K02096O4298
7106D20958j7232n6408Q1556N4329k66092k54503n2937j44877j64832P2495M16511
7095H8968J72042k44935k52661j60809m0735N0191K23000J43727k0342j16470
$$ y = [5729, 32745, 105338, 41990, 39013, 91269, 254205, 350354, 315556, 193302, 139588, 133667, 41089, -44630, 45034, 101450, 15859, -34486, -117071, -55514, 73737, 68257, 58861, 145829, 106470, -65346, -96362, -173043, -63641, 168564, 242082, 176386, 89091, 54163, -9807, -110999, -163189, -177598, 1170, 107897, 46099, -180570, -339960, -439200, -529909, -459770, -332196, -307439, -149455, -183941, -303289, -246584, -69119, -7006, -106131, -215777, -253845, -313267, -241547, -359159, -519708, -498883, -350189, -132291, -79654, 154564, 356660, 420958, 403726, 347318, 428874, 483203, 217111, -37392, -90329, -235206, -400038, -327543, 88968, 261010, 16075, -236586, -397395, -438130, -387939, -164939, -21212, -41554, -158024]
7085a58024l3131l0522j1312J35073K11867P5019R0864Q7322n490j10185k49743
7074A738p7519M9767M4998K16543L9719k31833l64624j38162M8338J99970J31645
7063g9420M4340J14750L9706N7252R6041o045q4394n2478O0094K28968J08546
7052E27360P2682P1698n1372N9830N7906J58273L6220k14743j10835p1433l04869
7041B30717j41097J2217r5268K5079j77624j84937L5129M2285k4187J35459J26160
7030a6067J7628J9085L2707j11326k77935n029L05035P0922J1479J12958k3073
7019A36384l1196J0327P1589J40851Q7897r6271j54360k98317p6985J13100j3007
7008a09988L8339N0752N16j3219j05796m1563l7403k1465L4947O6517k4440j56938
$$ y = [-158024, -191155, -221677, -232989, -97916, 113951, 188970, 279834, 367156, 361666, 251481, 1738, -75781, -26014, 18984, 235527, 275246, 43413, -321211, -459373, -411035, -211065, -79420, -35080, 79670, 119376, 176628, 272669, 266624, 182230, 129752, 189846, 418814, 527360, 600042, 671740, 620368, 680198, 738104, 896377, 932597, 717854, 607019, 535586, 230717, 89620, 101837, 6569, 31648, -145976, -330913, -295784, -253499, -277686, -142227, -16067, 1561, 20646, 53353, -57973, -335908, -340937, -35902, 35020, 46499, 159457, 136384, 105188, 115515, 187104, 327955, 415852, 319581, 165221, -133096, -210081, -96981, -109988, -71649, -20897, -20381, -33600, -139396, -180959, -218362, -239827, -204880, -138363, -162803, -319741]
6996c19741o785K5689J40147J39811j3247j32341m8819K34518J32342Q7385J54453
6985C93412P8211k03465k15707O1253M341j21254N1474O7702O0194J5313J1717
6974B03191j25942j23282J00978J07270q6446k57304j72872L4107J46956k2273
6964a95617j09012k8316k3818p3272k0281J15201O7108K19477N445k84939k04240
6953e32264m3468J62493J74753J20742M0951R3108J63157o2488j80928M3274J67769
6942A47099O0267p9588k3596K26196J27999j17413j75831j74364r0804j58900
6932b58935j80685j0063J99911k7077k0344M0859J487J13344J30082J36533J71325
6921B96437M7329j01925k4342K9099m7467l115J16226K0239j41331k8222n3614
$$ y = [-319741, -326526, -300837, -160690, -20879, -34126, -166467, -215286, 19232, 151574, 238959, 393412, 471623, 268158, 52451, 113704, 118045, -3209, 48265, 115967, 176161, 191474, 203191, 77249, -46033, 54945, 162215, 75769, -181535, -354407, -320300, -173344, -195617, -304629, -332945, -356763, -430035, -450316, -335115, -268007, -48530, -43085, -328024, -532264, -575732, -413239, -238486, -117744, -76793, 16315, 179472, 116984, -63944, -20670, 147099, 207366, 127778, 104182, 330378, 458377, 340964, 165133, -9231, -100035, -258935, -439620, -449683, -249772, -276849, -297193, -256334, -254847, -141503, -11421, 125112, 296437, 343766, 241841, 217499, 246598, 199131, 196016, 312242, 332481, 191150, 162928, 109314]
6910A09314o0848q1542o788K1222K6872J1344L675O7744q1656j94453n4519N1053
6898a88582R2383N9747n4407J96286K27923n5539k46468j50627Q7452l2021k94329
6887c58182q0128Q8561K11664O5656K8004K42407J44337j3470l8021o4711L3893
6876B60010J50175J23814M2818p2581k02260l03112k16532L4227J65170j6824
6866c5095k10532j56650J02809J55171J26229n9328l9468R2976J23639o5747j90441
6855a56437K5423J14160K18401p2501j94230r7052j76790q8870K1568N6023R1156
6844b59149Q6440j7173R3291J69183J4038M8014k1148M6896O3467j50472j36218
6833f2831j05710R221K13565m44r2345k08608j20911J83152q0719k32641o559
$$ y = [109314, 48466, -33076, -39864, -18642, 8230, 19574, 23249, 90993, 9337, -185116, -239635, -188582, -96199, -36452, -90859, 105427, 333350, 277811, 31343, -119284, -31832, -63853, -358182, -438310, -349749, -138085, -72429, -44425, 197982, 342319, 328849, 290828, 226117, 260010, 410185, 533999, 576817, 504236, 301976, -1136, -217668, -183441, -18271, -35095, -245627, -402277, -299468, -144297, -18068, -77396, -116864, -23888, 99751, 34004, -156437, -131014, -16854, 201547, 129046, -65184, -162236, -339026, -427896, -406328, -350305, -259149, -172709, -189882, -96591, 72592, 86630, 134644, 113496, 160392, 223859, 73387, -62831, -168541, -159320, 54245, 53801, -38544, -247152, -368063, -184911, -265630, -498271, -504830]
6822e04830J48618M0147J54499P0759k4955p4653M6622J55360J76156L23234o5443
6811D45514k81353k53488j65861J63624L10516N1759j44502j72480J0676M4924
6801I329L1950j10114q703J68787J71774J26673R1840m9353r6362K7538K5761
6790C89120j07749j40393J9342r9485j45009n356J43012J58626p2975K846k4901
6779A17078o4098K03647J96848J50323q479J14249J18551j29069j14722o749k9233
6768E48346p6387O030M3362L3910J9664j00728l5430Q6107K36147M4973m4104
6757G61890p0139m916J57483Q2746j6304j12431k0408J11083P8867M0940r7758
6746I11053q5664p8655l2564j23938m138J08632r30p2291j98462k43323o2120
$$ y = [-504830, -356212, -316065, -161566, -90807, -115762, -190415, -143793, 11567, 187723, 510957, 445514, 164161, -89327, -255188, -91564, 218952, 270711, 126209, -46271, -35595, 9329, 41279, -68835, -77538, 91249, 263023, 389696, 481536, 432183, 335821, 363359, 389120, 281371, 140978, 160320, 60835, -84174, -89530, 53482, 212108, 139133, 141979, 117078, 52980, 256627, 453475, 603798, 595319, 709568, 828119, 699050, 584328, 577579, 548346, 471959, 477989, 521351, 555261, 574925, 474197, 438767, 524874, 761021, 805994, 761890, 691751, 686835, 844318, 927064, 910760, 798329, 777921, 889004, 967871, 1008811, 911053, 825389, 746734, 714170, 590232, 586094, 694726, 693796, 621505, 423043, 179720, 117600]
6735A17600K24870J17321j21129R544K24279N6316k15787k90750j94433j5993
6725h8162J98402K58224q9165j8332J66536J14752l7921k9880P0638L8140j29688
6714D53544k03279o2245l6645j29363J14840K20333K5587M3027P5613J31116J05511
6703G38039k6669j5952q6150k24271j88962M1520k364k31378n264O2942o6692
6692e201m1250L2966k6404K04235Q5269L1115j9234k70666k93684L3340K52390
6681a7124Q2492m9628q1903J228J72065J55859R9287m2011J3814J60488N1449
6670E46016m2150q2196Q4124J23689Q7683j65213m33401l10753J13380L67814
6660B88993K67642J35407p6375j63732j11287j43985q4017L6988j47583k7489
$$ y = [117600, 342470, 459791, 338662, 348206, 572485, 628801, 413014, 122264, -72169, -88162, 110240, 368464, 279299, 260967, 427503, 542255, 504334, 474454, 545092, 583232, 453544, 250265, 188020, 151375, 22012, 136852, 357185, 382772, 425799, 501412, 632528, 738039, 711370, 695418, 609268, 384997, 196035, 237555, 235191, 3813, -1451, 61491, -5201, -46451, -13485, -39889, 164346, 249615, 280730, 261496, -9170, -302854, -269514, -17124, 65368, 15740, -66163, -64935, 107130, 262989, 362276, 320265, 334079, 494567, 546016, 503866, 421670, 505794, 629483, 717166, 551953, 118552, -192201, -78821, 288993, 556635, 692042, 615667, 451935, 340648, 196663, 112646, 149634, 2051, -25438]
6650b5438J31684j11196Q6374K96827M8737l9316k35884k20574l4397M7166k1905
6639g7922o5829J4236J96735K53240K04901j65q6005N8346m6084M1241n7017j45140
6627B90537j05658k4807K9804o717R3187J94926K42831N0219j13950J2599P8469
6616G41440k55261k62589q0580o7988Q3260L09456J71631p7823j94570j26114
6606B40862k24802j49730O4796j9997r9441Q8340J16518J08222J85392K98039
6596F08199J04831r985N7250k63424j47771m9575L2016Q9247K1628J2464N2187
6585E07067o5750K36669M20831O6517J6q1733k85897k14634R619j9736K2109l7979
6573E57099j75823k24891k8062m277j25609o5946M5193K44563J55105O8217J54060
$$ y = [-25438, 106246, -4950, 81424, 378251, 426988, 387672, 151788, -68786, -103183, -56017, -77922, -143751, -129515, 67220, 320460, 525361, 525196, 439191, 497537, 451453, 492694, 435677, 290537, 184879, 160072, 189876, 183159, 276346, 471272, 714103, 764322, 650372, 662971, 741440, 486179, 223590, 143010, 75022, 158282, 467738, 639369, 561546, 366976, 240862, 16060, -133670, -68874, -88871, -188312, -99972, 16546, 124768, 310160, 608199, 713030, 703045, 760295, 496871, 349100, 299525, 331541, 420788, 442416, 454880, 507067, 441317, 677986, 1098817, 1165334, 1165350, 1083617, 797720, 583086, 592705, 572969, 595078, 557099, 381276, 156385, 128323, 124046, -1563, -67509, -22316, 222247, 377352, 445569, 599629]
6562E99629M0642j52015j80008j62985j13778J12556J30532j66239j17869Q5853
6552G6318N7701J84396K10887N370j30639q2818R6198K22099J1306j42999k89627
6541B18192j49805J50838J83448J58068P3047n8758j25132r0611m3482L9554q1466
6530B73893M9639P9566M5040k78341l30417k1239m805j867j3990m547m805j31539
6518c43412p7307L4754K01386J81576K39838J03105j22155k36546j11316q3760
6508b13837P4473K64800J82056r1328j17735J52217K25881q2553j40446j2323
6498B41205j27050j95848q0995K53534J99079K2336J0800m4622K2774P7878j17042
6487B62049j20317j12166l0667J18001L1234r0479j9780j2468r1165J31097K75651
$$ y = [599629, 640271, 488256, 308248, 145263, 31485, 144041, 274573, 108334, -9535, 76318, 134019, 318415, 529302, 534672, 404033, 321215, 417413, 639512, 650818, 507819, 218192, 68387, 219225, 402673, 560741, 633788, 575030, 449898, 359287, 315805, 355359, 273893, 323532, 403098, 448138, 169797, -160620, -181859, -186664, -188531, -202521, -207068, -211873, -343412, -420719, -385965, -184579, -3003, 236835, 339940, 217785, -18761, -130077, -213837, -139364, 125436, 307492, 216164, 98429, 250646, 476527, 393974, 253528, 241205, 114155, -81693, -162688, 90846, 289925, 312261, 323061, 278439, 301213, 379091, 262049, 141732, 29566, -1101, 116900, 148134, 57655, 37875, 25407, -65758, 65339, 340990]
6476C40990J17109J14045p2412j34607j3480j47573j51940n3942r6639p2820J72009
6465G40K50587O8670K45J26586J23750K1428L088j33024r7856k3829j04697J4480
6453B50168p4110k9199P7328M6154p2201n3440n5475L3501m7474n7413J35918
6442A53757R5507L2022p2688J12033O7261J51573P1664k12497k08079r5176J38672
6431B34049J63697j3420j45728q8614P8285J55482J27208j35170k75446j01462
6421a119q2686Q95N2861M5565J55639J66249R8964k29522k66914p6685l4497J95064
6409B3814K75974J05705R4578P4459J72703R0829N4187L44715J38811j30972r5590
6398A149213j49703j41918M5752J89242q348k02777O9268M6077o6114J28222J90147
$$ y = [340990, 458099, 572144, 499732, 365125, 351645, 204072, 52132, -1810, -98449, -171269, 740, 251327, 319997, 320242, 446828, 570578, 592006, 595094, 462070, 364214, 340385, 235688, 250168, 176058, 146859, 224187, 270341, 198140, 144700, 89225, 122726, 75252, 17839, 153757, 249264, 281286, 208598, 320631, 387892, 539465, 611129, 398632, 190553, 95377, 234049, 397746, 384326, 238598, 149984, 228269, 383751, 510959, 375789, 100343, -1119, -83805, -82910, -30049, 15516, 171155, 337404, 436368, 206846, -60068, -136753, -171250, 23814, 299788, 405493, 500071, 574530, 747233, 838062, 892249, 1236964, 1375775, 1244803, 1149213, 999510, 857592, 903344, 1092586, 1084238, 881461, 950729, 996806, 930692, 1058914, 1249061]
6387A249061K03339k57194m78431k54131q4029j43196q5670J17622j04633k24548
6377f1810N6906J57243k17124k19051j22035o5856K6617K21282M05741L41073
6367E22986J40353J18752Q2179l048j40824j75358J64308K49035R5391j47032
6357I06742k62916k54601j14767l7257N0540j7349J46242K79217J4134k12681
6347D97304j05672j27202J0573j53607k48041N0478o9061R1783J17532Q9883N9967
6336B13937L7814j8863k56560j03477J89644J85679N5282K5837J36921O6661J1080
6325E43955N8656O4316j00436k67355p5725M3233q3018n4530j29295j36213J51661
6314A5249J41787K8093J82180N9890j42433n7126l5448J4603J60244N7861j27948
$$ y = [1249061, 1452400, 1195206, 716775, 462644, 378615, 235419, 149749, 267371, 162738, -61810, -4904, 152339, -64785, -283836, -405871, -471727, -445110, -223828, 181913, 522986, 663339, 782091, 864270, 861222, 720398, 545040, 709348, 958383, 1053774, 906742, 643826, 389225, 274458, 237201, 287741, 270392, 416634, 695851, 709985, 497304, 391632, 264430, 275003, 121396, -126645, -76167, -145228, -53445, 64087, 153970, 213937, 251751, 232888, -23672, -127149, 62495, 248174, 303456, 329293, 466214, 532875, 543955, 602611, 666927, 566491, 299136, 223411, 266644, 183626, 129096, -199, -136412, 15249, 157036, 185129, 367309, 427199, 284766, 227640, 192192, 206795, 367039, 424900, 296952]
6303B96952l08154j34850M4844P8626P3565J32778K22038K15311o6370k40534
6293C14206j8688j29603k70181o7605K10093K65979j5848j74315q371o9986K2144
6282E7825J35622j23122k35710k38211r7939L9921P2081p2287n9934O5537Q9502
6271c66715K02468K00611O2720j34907j48763o4795N9107J05802M1746O3589J51613
6260A72476j28207n6962O8585r8538K9370J28376j44198k7007J31604J32216R1096
6249B98811P393n4196R8912K3377j55297j67114J5029R6055J68308J03544q4482
6238C50340q36Q2503j45585k76068j842J11863N5671J28986J51681n3898j81656
6227B21159r5612l2621j30691o2426K7737M6591J41595L3020R685k5321P5375
$$ y = [296952, -11202, -146052, -101208, -22582, 50983, 183761, 405799, 621110, 554740, 314206, 295518, 165915, -104266, -171871, 38222, 304201, 288353, 114038, 105667, 35681, 57825, 193447, 70325, -165385, -403596, -501535, -461614, -389533, -461820, -521754, -456217, -366715, -164247, 36364, 99084, -35823, -184586, -249381, -190274, -84472, -42726, 20863, 172476, 44269, -12693, 55892, -42646, -13276, 115100, -29098, -56105, 75499, 207715, 298811, 306204, 252008, 350920, 374297, 219000, 51886, 66915, 162970, 331278, 434822, 350340, 349504, 432007, 286422, 10354, 8512, 120375, 176046, 305032, 456713, 402815, 221159, 125547, 92926, -37765, -100191, -72454, -25863, 115732, 148752, 158437, 133116, 208491]
6216B08491N2672K0437m722j05244Q5746K12605P3028M5029J21629l1371k91243
6205C87057k36780j01023j18860Q1968J80754K05222R0295o2790M5458P5862M2356
6194E89519M2365K3655L3149j30107r3424j62632j16675l5825j13165j07001Q4144
6183A4003N5255L054p5849J26604J48990k66833k06293M9071K89453J54509J5831
6172C07795j50302k51371J75838J61027J7130Q0223J8842L2553k62568m65323
6162c36156j67346L4218J16826K34024J72610Q507j73902j57258j346J79347N0640
6151c9836n8923P7332Q5620J00854O8339J27874L9429k03878q1864K7197K1845
6140A63989n3797q7934l0581p636m9755M5705K30978J83729R1154l8299Q106J25214
$$ y = [208491, 261163, 281600, 276878, 171634, 257380, 469985, 543013, 588042, 709671, 678300, 387057, 150277, 49254, -69606, 12362, 193116, 398338, 488633, 425843, 471301, 547163, 589519, 631884, 655539, 688688, 558581, 465157, 302525, 185850, 150025, 36860, -70141, 14003, 69258, 72312, -3537, 123067, 272057, 5224, -201069, -151998, 137455, 291964, 307795, 157493, -93878, 81960, 242987, 260117, 340340, 359182, 391735, 129167, -336156, -503502, -469284, -352458, -118434, 54176, 62683, -111219, -268477, -269823, -90476, -39836, -98759, -21427, 64193, 165047, 233386, 361260, 400689, 196811, 114947, 142144, 163989, 110192, 22258, -8323, -15959, -65714, -20009, 210969, 394698, 485852, 447553, 455659, 580873]
6128E80873J19632K16950L3050j88696n3844P682j51219k27130L2053k9009l8747
6117C01595L0382Q0702k2719J89253J39060j75102m62918j75329J01189j9927
6107a3814o5550k09701p8255R3779J29027l5365Q1481L25411K12538o1100N2229
6096D30680J3494r7583r3800l4852j49036j9809O5055j39576k24521p1515K50566
6085g0897J53234m35J324j92234k26428r7951N2577J51413J49319J0919p1383
6074a40542J69520J61880P1925Q347j88224j96764q5954n2492l2445J38643J70653
6063B4547J82215m6782J453O8984k5133n6736j61610j93227j71795N2952L4758
6052b90374q3156O0935J50731K8813R4939J6726Q375M6796Q950j23644r9736N3342
$$ y = [580873, 700505, 917455, 950505, 761809, 707965, 715647, 564428, 337298, 369351, 340342, 301595, 331977, 412679, 389960, 579213, 718273, 543171, 80253, -95076, 6113, -13814, -79364, -289065, -367320, -273541, -144514, -179879, -98398, 227013, 439551, 378451, 430680, 444174, 346591, 252791, 217939, 68903, 49094, 114149, -25427, -249948, -321463, -70897, 82337, 81902, 83226, -109008, -335436, -433387, -380810, -229397, -80078, -69159, -140542, 28978, 190858, 262783, 271130, 82906, -113858, -199812, -252304, -284749, -146106, 24547, 206762, 159980, 161433, 230417, 205284, 148548, -13062, -206289, -378084, -325132, -290374, -373530, -312595, -161864, -133051, -38112, -21386, -13011, 33785, 42735, -80909, -180645, -127303]
6040a27303J63919M6674j54417j85102j05513R7594J51608N8576q130M8928K21654
6029B08488K78680L5979j20718k19389J1772J55304J21399j52973k42610q4977
6019i045q7488J2206o4539q5437J34203J92420J82277R2690j05790m5802M9922
6008B65617L343J17781J20835j38755j56914o725m7581J29635m738k0616Q288
5997B70170l1703R8135J7696P200o0887l37911l31902k1901j04202P4138K47923
5986a73244K15180R2167M2543j25290j77274j02655q3360l5229J93310J13408
5976d0444j9791M6130L5616n8389R4087O4672p6985j31853j49003q2972k8284
5965c47216J06249K10468J89884p683k67136j09902J877P3680J56005m072j01970
$$ y = [-127303, 36616, 83290, -71127, -256229, -361742, -264148, -112540, -53964, -62094, -13166, 208488, 487168, 523147, 402429, 183040, 194812, 350116, 471515, 318542, 75932, -9045, -96533, -84327, -148866, -234303, -100100, 92320, 274597, 367287, 261497, 215695, 265617, 268960, 386741, 507576, 368821, 211907, 205182, 157601, 287236, 282498, 261882, 270170, 238467, 336602, 354298, 361498, 300611, -37300, -369202, -391103, -495305, -421167, -173244, 41936, 134103, 176646, 51356, -125918, -228573, -311933, -347162, -153852, -40444, -60235, -14105, 21511, -36878, 57209, 121881, 44896, -86957, -235960, -318932, -347216, -240967, -30499, 159385, 151702, -115434, -225336, -223459, -149779, 6226, 2154, -99816]
5954i9816J5629K9870m8396p4307j9474J53871J40409k37622k89821r9814k668
5943e32139O6088M9131Q4223M322j16452k4839Q2412K48960L06438J88135L1214
5932C87493j14449j85300j36823Q7958O2421J2536J55157J12169j08571k69050
5922C541n4681J58285N1615j64619j61637r8458k1727J26912L7654l2972K69597
5911A13510L38963J55827m7422k10562k47386l06795R2238K73080P5616n8678
5901A78391j05640k46231k35216j946k4186j5437J34446Q3462q8511r8874J16695
5890c03047L92498L61296j6568N8876J12599j97315j96472N8410J07182J9544
5880C97003Q0795k1746k5897l4645j51635k0294J25264K12881J48568K7987j97650
$$ y = [-99816, -84187, -54317, -102713, -177020, -196494, -42623, 97786, -139836, -429657, -529471, -532139, -466051, -416920, -332697, -328375, -444827, -469666, -387254, -138294, 168144, 356279, 387493, 273044, 87744, -49079, 38879, 101300, 113836, 268993, 381162, 272591, 3541, -51140, 107145, 158760, -5859, -167496, -265954, -287681, -160769, -123115, -156087, 113510, 452473, 608300, 560878, 350316, 102930, -203865, -111627, 161453, 237069, 178391, 72751, -173480, -408696, -410642, -434828, -450265, -315819, -232357, -320868, -419742, -303047, 89451, 450747, 434179, 493055, 605654, 408339, 211867, 270277, 377459, 397003, 477798, 456052, 430155, 395510, 243875, 223581, 348845, 561726, 710294, 738281, 540631]
5869E40631k14605j25923p0961l9709K689N397K728r1678k37668k3064Q802j46379
5857c89740j49738M3343J32748N4503J10599M9971J36207K58839P8199r7454Q7093
5846C14570M3043O0276J07300l9849q9790k42454k76884M4273J51713M8713J79353
5835C00264Q2107K5558n8718j88126k13710j74813J1211Q3396n8657m4443O7500
5824a68431L9585p3463j0365J02033n6139Q9396J09372j85855j58074J17720J93131
5813a090L553k05021k50842l38546j03705M6298K62445J85931J18855J79996M1564
5802f0562p9221N6755J74976R768p8632J42456J63379P9833P203O7372k944j65049
5790C15334j21936o4414j93896j40116o0079j31529o4839J65020J19319k8030
$$ y = [540631, 326026, 200103, 129142, 89433, 92122, 97519, 100247, 8569, -229099, -252163, -243361, -389740, -539478, -496135, -363387, -308884, -198285, -148314, -12107, 246732, 324931, 227477, 314570, 357613, 417889, 525189, 485340, 395550, 153096, -123788, -79515, 72198, 120911, 300264, 382371, 407929, 349211, 161085, -52625, -227438, -216227, -132831, -191488, -235931, -168431, -128846, -202309, -212674, -110641, -166780, -77384, 31988, -153867, -311941, -194221, -1090, 2463, -202558, -453400, -791946, -895651, -849353, -586908, -400977, -282122, -102126, -60562, -139783, -83028, 91948, 101716, 23084, 165540, 328919, 408752, 415955, 483327, 480383, 315334, 193398, 128984, -64912, -205028, -265107, -396636, -461475, -296455, -177136, -205166]
5780b05166L9720p2409O1107J66944P26j17874l7376n7216N969M6894j77541K5069
5768c21153J86693J61464O2989m3197J03432M158K1571j7731r4465n4156Q7215
5757I6820Q4644j62828n7191l3878j44758j58512k3530Q2373P9586J14704j38153
5746b60723k43505j14434Q498J70095L84557M25098Q8421k95514k16372j1283
5736f5162N0802J77151L12434K08809O1160N1650R9272K40357K09032L1280J11249
5725A488034m1327K967K25968L32300N97124P65558J51332o61981p89686n44847
5715A525442l08291l26302k16665J08263J79025R2121j53723k92484O0309J33193
5705H00888k34945k31975j61804k3094m4008N541K6722o5567j54486K072O9077
$$ y = [-205166, -165446, -237855, -176748, -9804, -9078, -126952, -164328, -221544, -215575, -168681, -346222, -321153, -134460, 27004, 89993, 46796, 150228, 154386, 175957, 158226, 63761, 9605, 96820, 181464, 18636, -38555, -72433, -217191, -375703, -399233, -316860, -237274, -122570, -260723, -504228, -618662, -610164, -440069, -55512, 369586, 458007, 162493, -53879, -65162, -14360, 162791, 475225, 684034, 745194, 796844, 896116, 1136473, 1345505, 1376785, 1488034, 1446707, 1449674, 1675642, 2007942, 2605066, 3370624, 3521956, 2859975, 2070289, 1525442, 1217151, 890849, 674184, 782447, 961472, 1053593, 899870, 607386, 667695, 800888, 565943, 333968, 172164, 149070, 105062, 110603, 137325, 71758, -82728, -80656, -11579]
5694a1579j26869k84325l03947k08327P3964J39501J62139J48459J02410L6888
5684b71686m5609J72109L22251Q1286j82096j20090K5743J17498J00812o5108
5674A35110j33500M1495k3160k9290j03585r1401M8156N0714j48705p2965K16456
5663a10675K68520Q0134k05888k76762k09080j19031K965r3331J82381L30753
5653a50014J71747n4420m8278k1700k2180Q8655J40187m2910O0508J98960l889
5642C16666p4225o3613j21234j65604n9062l1876q9584j66007m9551K01701K36828
5631f5561P2297L1096K209j09944q4770P8659K06977P1395j02714J7677o3482
5620E3839j70975L596p797J80170J90355j6061K1759l0186r9672j44164l1226
$$ y = [-11579, -138448, -422773, -726720, -935047, -861083, -721582, -559443, -410984, -308574, -271686, -317295, -145186, 177065, 258351, 76255, -43835, -18092, 99406, 200218, 135110, 1610, 43105, 19945, -9345, -112930, -204331, -156175, -105461, -254166, -327131, -110675, 157845, 237979, 32091, -244671, -453751, -572782, -569817, -663148, -480767, -150014, 21733, -32687, -80965, -102665, -124845, -36190, 103997, 61087, 121595, 320555, 316666, 242441, 178828, 57594, -108010, -167072, -198948, -288532, -454539, -504090, -302389, -65561, 6736, 37832, 40041, -69903, -154673, -76014, 130963, 202358, 99644, 117321, 53839, -117136, -113540, -121337, 58833, 249188, 233127, 254886, 224700, 125028, -19136, -50362]
5609e0362J68934J66024J38520M4429j08568n9932p4143j13735j14130j36982
5599a39945j51581j6848m1240j94157P5462J66212R6513O1188l3081K28739j1777
5588C9485k85847r6908J7961r5077k36829N392J97540J64401R4876p440L9284
5577a63162K47405N9560j81767j42951K9426Q8825l6423o2929p4715J87469K60570
5566B11308l4883J73394L47633j5986j69385l1526K0367j87835j49563P754J24084
5555B95362J11233j10218l49491l18486J22061J53899P7909J24069J63191j42931
5545A26598k60400R8430J44573L9822J60632Q8596k93925j90998J25994K36021
5535B75343P4770N9691j27746j97985j58479K7518L03139J67991l0986k96022
$$ y = [-50362, 118572, 284596, 423116, 467545, 358977, 299045, 224902, 111167, -2963, -139945, -291526, -308374, -349614, -543771, -468309, -302097, -205584, -144396, -177477, 51262, 39485, -246362, -343270, -325309, -420386, -657215, -651823, -454283, -289882, -195006, -202446, -163162, 84243, 143803, -37964, -180915, -151489, -62664, -99087, -162016, -236731, -49262, 211308, 176425, 349819, 697452, 681466, 512081, 480555, 500922, 313087, 163524, 171278, 295362, 406595, 296377, -53114, -371600, -249539, -95640, -17731, 106338, 269529, 126598, -133802, -35372, 109201, 149023, 309655, 398251, 104326, -86672, 39322, 275343, 350113, 409804, 282058, 84073, -74406, -46888, 256251, 424242, 393256, 97234]
5525I7234j56932k01156j62769j30944Q4061J57445J69226o461q2575n8575r6301
5514c87747j84670K3092J02073r1749j61894K5931M26309L20399K00285P3457
5504C45486o8447r0883j44796O7424J16665j00581q1397n8670N8956J83283J82841
5493D09881M4254k02234l40771j75586n9884N6419p3481j7299J49398J54213K10587
5482A55497k770k23091m5509k5604j70885n5919J27770M4467K18284J77798J15726
5471C15764m2671q4915l9056P9331Q1708J38118J82133K9655l63710m71342j74052
5460c49037J43946J38699q3134j08171k495K86195J68039j23296j47244q3141
5450a59639R6260m0514q7804m4845j2021r260N9749m5110j23243k0313m2049j12344
$$ y = [97234, -59698, -260854, -423623, -554567, -470506, -313061, -143835, -150296, -232871, -291446, -387747, -572417, -549325, -447252, -539001, -700895, -674964, -248655, 71744, 272029, 345486, 277039, 186156, 41360, 108784, 225449, 124868, 43471, -15199, 43757, 227040, 409881, 454135, 251901, -88870, -264456, -324340, -267921, -341402, -358701, -209303, -55090, 155497, 152727, -70364, -115873, -141477, -312362, -368281, -240511, -196044, 22240, 200038, 315764, 273093, 188178, 149122, 228453, 310161, 448279, 630412, 660067, 296357, -174985, -349037, -205091, -66392, -149526, -257697, -260192, 26003, 194042, 70746, -76498, -159639, -63379, -103893, -191697, -236542, -248563, -257823, -198074, -243184, -366427, -386740, -428789, -541133]
5438e41133J05361J3196j29751Q1787Q7841J37403J20313K0720j8502l5447R0185
5427f8027K9818q0664J44792J28277k5074j03289k5223K2280k44533k35661k33358
5416f90662q2643K24692J77949J02169j08859M5526J41372o9405K8876K19942
5406a1043K01334l2492j52649O0477R7440k4288O7932l38539l95004n5269J97408
5395c84693K32216o1556j43073l6932K5724n7574L7269Q231J47157K10092J8760
5384d379O5564J47152Q1005j48083j6165J88418K48692J18705M148m9134q2276
5373E53647j30794j87699j07904M3430n3760l03326j70368M484J40168O5264O1494
5362h5364O8584J05965o7018m7313L7745m8087L4250L4961O8661J82473K65523
$$ y = [-541133, -435772, -422576, -552327, -470540, -382699, -245296, -124983, -104263, -122765, -158212, -68027, -38209, -118873, 25919, 154196, 129122, 25833, 610, 22890, -221643, -457304, -690662, -773305, -548613, -370664, -268495, -377354, -331828, -190456, -259861, -230985, -11043, 190291, 157799, 5150, 65627, 163067, 138779, 206711, -131828, -526832, -582101, -384693, -152477, -214033, -357106, -394038, -368314, -425888, -388619, -380388, -233231, -23139, -4379, 61185, 208337, 289342, 141259, 125094, 313512, 562204, 680909, 685057, 635923, 553647, 422853, 235154, 127250, 170680, 116920, -186406, -356774, -352290, -212122, -146858, -85364, -16780, 89185, 22167, -25146, 12599, -35488, -1238, 33723, 102384, 284857, 550380]
5351E50380J39518P6757j28919n15097k66771r6259j97537J30939J92149J20719
5341E879J18192M7177O5362O6887j36913k97570r2510k7507J26020j19679n7653
5330c02315K22567K84321o4893k92791j49946n5276J82355J88815K6176K77937
5320C16950N03230K13318n6563N2979K29419L60580P14000O33393P45666J141285
5310D854257P88984p39746j545592j069165n38344m01733m14540k20224j62044
5301E51853m9787k044m8616p5203N7147J26102R9749o247K589j0601k15266k79566
5289A50110K0548J91402j23234k32477l0027J5658m5437L5094N5966p1619j55254
5278a89270j34147K072J83884L49035K71716P7401j52948j67288j40162j7924
$$ y = [550380, 689898, 766655, 637736, 122639, -144132, -240391, -437928, -306989, -114840, 5879, 124071, 171248, 236610, 303497, 166584, -130986, -223496, -251003, -124983, -244662, -302315, -79748, 204573, 139680, -153111, -303057, -358333, -175978, 12837, 39013, 316950, 820180, 1033498, 976935, 1029914, 1259333, 1619913, 2333913, 2967306, 3712972, 4854257, 5643241, 4903495, 3357903, 2288738, 1750394, 1348661, 934121, 713897, 551853, 502066, 500022, 451406, 376203, 433350, 559452, 659201, 652954, 655543, 644942, 429676, 150110, 170658, 362060, 238826, 6349, -23678, -8020, -53457, -18363, 37603, -34016, -189270, -323417, -321345, -137461, 211574, 483290, 560691, 407743, 240455, 100293, 82369]
5268H2369Q383J80245P7039k28767l03152j42354K04997R7605j68182j68935M5038
5257c15714J23181q2282j17253r2551K5753L56958K26859k21694p6049J29778
5247d3014o7137k20563P399O8477J39321J53110J7578k08470j35815K7933Q8192
5236a72989p8013j88679J96554K25497o1521j294J06243K4590J49204K64888J4747
5225D79227j46710J424r8716k67407k66679n2348J85719K26958O5309k1873o3049
5214D1855j06023Q7527J31115J50907J72539j6362j62633k9234q8018j29715k5265
5203B6693M9485m015Q2921K97309R5291j91040k48626q0519J47577N8301k35926
5192b549j99093J02432K26035J27684J1461q5535j15876j22849l8191J02319k6752
$$ y = [82369, 90752, 270997, 348036, 119269, -183883, -326237, -121240, -23635, -191817, -360752, -315714, -192533, -274815, -392068, -484619, -458866, -101908, 124951, -96743, -172792, -43014, -110151, -330714, -323315, -254838, -115517, 37593, 55171, -153299, -289114, -261181, -172989, -251002, -439681, -243127, -17630, -79151, -80445, 25798, 50388, 199592, 464480, 479227, 332517, 333941, 235225, -32182, -298861, -351209, -165490, 61468, 126777, 104904, 41855, -64168, 23359, 154474, 305381, 477920, 461558, 298925, 269691, 181673, 51958, 26693, 76178, 72163, 155084, 452393, 547684, 356644, 108018, 27499, 175076, 233377, -2549, -201642, -99210, 126825, 254509, 265970, 180435, 64559, -58290, -96481, 5838, -20914]
5181b0914k8155P011j13497j37913L5603J29388Q0336q6889o1588J81553K37360
5170B22295Q8588j45839k46323p2128o3933k54365o3399J12467J75427j9483J4398
5159b52295J18503j7939J97169K90266J56349j79037l33249j37790J54848J91338
5149A88163j266k32958j98875K5161J17367l0768j02309J46951J56186k1220j14787
5138f8355m2952J04337K670p6027K35581K29797p3539k34469r1974M4447k5081
5127D435q628m3566Q1264N431l94550k21138J47673R4880M6576J51272K44115
5116A07764N8426k29576r5822m3104M3088R7728k2474k6778J20350M778r7911
5105h3531N2758j0730j83560R557q9307Q0746K71926J32659n4898Q342r2069Q6533
$$ y = [-20914, -49069, -42058, -155555, -293468, -257865, -128477, -48141, -135030, -196618, -15065, 222295, 310883, 165044, -81279, -153407, -217340, -471705, -535104, -422637, -247210, -266693, -252295, -133792, -151731, 45438, 335704, 492053, 313016, -20233, -158023, -3175, 188163, 186897, -46061, -244936, -219775, -102408, -133176, -235485, -88534, 67652, 46432, -68355, -111307, -6970, -4300, -80327, 155254, 385051, 311512, 77043, -14931, 29516, 4435, -4193, -47759, 33505, 38936, -355614, -576752, -429079, -334199, -287623, -136351, 107764, 166190, -63386, -159208, -202312, -159224, -61496, -83970, -110748, 9602, 14380, -83531, -30773, -41503, -225063, -215506, -304813, -224067, 47859, 180518, 125620, 133962, 41893, 128426]
5093A28426K80475J76422k1917j21509j91108j46623k4382o0833j03535j00509
5083a85093R0818J45170J29125Q9550J60634j36958l64338j66047k99485l4742
5073e71366K98606R4353J88556L41224P1560R598k01212k62785k57748N5964K14539
5062a8711J14432J05052M4033l0043n5713j15279J3534J32849n9902r0121n1101
5051a0970L2869r0O5646k5448j64382J67120L48371Q772l2966N7898j81925j99242
5039F5653k323M6481j03728j72994J3205J48209J99554K14784L2492p3300j07906
5028B60127p9974k25160k93960k74634o9263K00611K40360l9966j7111K74741
5018b4229J22350j4621n2755l2021j87422j72403M4572K63799J76188K5397j29931
$$ y = [128426, 408901, 585323, 563406, 441897, 250789, 104166, 79784, 18951, -84584, -185093, -94275, 50895, 180020, 269570, 430204, 293246, -71092, -237139, -536624, -571366, -272760, -178407, 10149, 351373, 422933, 432531, 231319, -31466, -289214, -233250, -18711, 95721, 200773, 244806, 214763, 159050, 43771, 57305, 190154, 130252, 40131, -10970, 21899, 21809, 87455, 62007, -102375, 64745, 413116, 421888, 388922, 446820, 264895, 65653, 63330, 109811, 6083, -166911, -153706, -5497, 194057, 408841, 441333, 368033, 260127, 180153, -45007, -338967, -613601, -682864, -482253, -241893, -281859, -298970, -24229, 98121, 83500, 30745, -1276, -188698, -361101, -316529, -52730, 123458, 148855, 18924]
5007A8924j1898J85008P1305j41622j15382n4218k27392j74832P7504J25542J42475
4996a04586J80007j01286k41839j13385K8921K35826J67824l9974j68505k5947
4986a82944q3636n2407J62219J78102J51931P164R4338J10661Q669r1418k39262
4975F3417k77527m9321L2643j00902j04774L1244J24802r4464L5793R9798J66010
4964g3281K24928K65238K41849Q2028r8922l16380j27039K0872j54315j87291
4954a22313j33191l9440N5572O2410K08586K59764K15936j7468j25275Q959m0360
4943C33180k16685r5040R1731Q0565L9619l0315j81175j00169K4677J94727J32622
4932B73737j48946j29617r6403N4975J81692J67281l9048k32817k24353n1925
$$ y = [18924, 7026, 192034, 263339, 121717, 6335, -47883, -275275, -450107, -372603, -247061, -104586, 75421, -25865, -267704, -381089, -352168, -116342, 51482, 11508, -156997, -182944, -266580, -318987, -156768, 21334, 173265, 180429, 274767, 385428, 394097, 302679, 63417, -214110, -263431, -230788, -331690, -436464, -405220, -280418, -374882, -339089, -239291, -73281, 151647, 416885, 658734, 740762, 641840, 325460, 198421, 219293, 64978, -122313, -255504, -294944, -239372, -176962, 31624, 291388, 507324, 489856, 364581, 373540, 333180, 116495, 21455, 113186, 193751, 233370, 203055, 21880, -78289, -53612, 141115, 273737, 124791, -4826, -101229, -46254, 135438, 302719, 263671, 30854, -193499, -245424]
4922b45424J36097P1800M1217R786p7193k47056k05681P4650K94352K35030j39745
4911e2167m5919n848j21283J40748K08741P3232m763q8597j05235j3535l2028
4900d6654j34727j19188K0725J30378m1716k01007N940O5148J15073J07896J42628
4889D4496J55400L0183k4556o2773j10512j07627j66644j82526J57094L34185
4879F6720J76214l1391L6925r6004j07228r0485l1081O9537J00459R5799p9405
4868A10060j65141J0962j1657J08269J08373J3183L2602J01358m1887j55914l2189
4857G8019M4134K1346j2366j49535k86535j85322k3300J75698K64447O7422o8781
4846g4773j77666j34987l6799K7248k2570J35655L38619M53387L61118j10837
$$ y = [-245424, -109327, -37527, 3690, 13476, -63717, -310773, -516454, -441804, -147452, 87578, -52167, -98086, -103934, -225217, -84469, 124272, 197504, 192741, 104144, -1091, -14626, -46654, -181381, -300569, -279844, -149466, -191182, -392189, -386249, -321101, -206028, -98132, 44496, 199896, 230079, 205523, 142750, 32238, -75389, -242033, -424559, -267465, 66720, 242934, 211543, 248468, 152464, 45236, -45249, -76330, -6793, 93666, 189465, 110060, -55081, -44119, -55776, 52493, 160866, 174049, 206651, 308009, 266122, 110208, 78019, 122153, 143499, 131133, -18402, -304937, -490259, -513559, -337861, -73414, -5992, -74773, -252439, -387426, -424225, -396977, -419547, -283892, 54727, 508114, 869232, 758395]
4836G58395m30619n44868l62286j24565J33154K16075J76616O5782J0781k572
4826a04107l12111k32626Q0853P7361j40310k02757P6624K38519J47964j3747
4816c84337j18852J13152L53726K62191j16849k31738J41345J53510n0805j69653
4806d8310j33083j45925r681P0719J18245R6740K4582J35074Q7026L19516L28873
4795H43776o3803k12295j90043L6655K7689M5790J24419J47103N3124j35787j11709
4784E64919Q0702K12473K71837J95593N1285j53130m9801J43755K99941M15389
4774B032963K86909J77656K70673Q7220k19324l66230k19925j64127k37674j89285
4764A458856k90079j63980J2357j89207l64378l25381j66413O4895K02707J11648
$$ y = [758395, 327776, -217092, -579378, -703943, -570789, -354714, -178098, -112316, -101535, -104107, -416218, -648844, -567991, -490630, -630940, -833697, -757073, -518554, -370590, -384337, -503189, -390037, -36311, 225880, 109031, -122707, 18638, 172148, 121343, -48310, -181393, -327318, -336999, -266280, -148035, -51295, -26713, 108361, 195387, 514903, 843776, 779973, 567678, 377635, 414290, 441979, 487769, 612188, 759291, 812415, 676628, 564919, 645621, 858094, 1129931, 1325524, 1376809, 1223679, 1173878, 1317633, 1617574, 2032963, 2319872, 2497528, 2768201, 2855421, 2636097, 2269867, 2049942, 1885815, 1648141, 1458856, 1168777, 1004797, 1017154, 827947, 463569, 138188, -28225, 36670, 239377, 351025]
4754C51025k1459j48342L3865J85167J9698o8269j07390j48371j03331p3514J20071
4743C9150R7666r643p5455j35402j78418l1534k1797K2303q2737p1388J13812
4732c33443J56394K92793K11588k66079m17419j29164m4848J10287K52420K82521
4722A15050N0189j60255K8064R3770J87126J64355K1104O7725m9161j57536j9877
4711C40554m8561j89760o7198L2094j0102o5339r2207j16753j20308k4488J77546
4700a84522J08700J93699K18047q5485j03104R2490J64516K18116J31886K09862
4690I64205j07484n48622k54948m5321p685p1794o7903J13247O0064K24k415R6602
$$ y = [351025, 329566, 181224, 215089, 400256, 419954, 351685, 244295, 95924, -7407, -80921, 39150, 136816, 127173, 51718, -83684, -262102, -293636, -315433, -293130, -375867, -447255, -333443, -177049, 115744, 327332, 61253, -356166, -485330, -530178, -419891, -167471, 115050, 165239, 4984, 33048, 126818, 313944, 478299, 499403, 567128, 517967, 360431, 340554, 291993, 102233, 35035, 67129, 57027, -8312, -100519, -217272, -337580, -362068, -184522, -75822, 117877, 335924, 250439, 147335, 239825, 404341, 622457, 754343, 964205, 856721, 308099, 53151, 7830, 145, -71649, -139552, -26305, 33759, 33983, 31568, 128170]
$$ [...]
##END NTUPLES=NMR SPECTRUM
##END=
