##TITLE=C13_SL69-SePh-f4
 CDCl3+DMSO, 2600 sc

 14.03.2019
##JCAMPDX= 6.0         $$ Bruker NMR JCAMP-DX V2.0
##DATA TYPE= NMR SPECTRUM
##DATA CLASS= NTUPLES
##ORIGIN= UXNMR, Bruker Analytische Messtechnik GmbH
##OWNER= root
$$ XWIN-NMR		Version 3.5
$$ Tue Apr  2 13:47:10 2019 Russian Standard Time (UT+4h)  she@DPX200
##.OBSERVE FREQUENCY= 50.32789651
##.OBSERVE NUCLEUS= ^13C
##.ACQUISITION MODE= SIMULTANEOUS
##.ACQUISITION SCHEME= undefined
##.AVERAGES= 24362
##.DIGITISER RES= 17
##SPECTROMETER/DATA SYSTEM= spect
##.PULSE SEQUENCE= zgpg30
##.SOLVENT NAME= CD3CN
##.SHIFT REFERENCE= (INTERNAL, CD3CN, 0, 222.653)
##AUDIT TRAIL= $$ (NUMBER, WHEN, WHO, WHERE, WHAT)
$$ ##TITLE= Audit trail, XWIN-NMR		Version 3.5
$$ ##JCAMPDX= 5.01
$$ ##ORIGIN= Bruker BioSpin GmbH
$$ ##OWNER= she
$$ F:/spectra/data/she/nmr/c13/2/pdata/1/auditp.txt
$$ ##AUDIT TRAIL=  $$ (NUMBER, WHEN, WHO, WHERE, WHAT)
(   1,<2019-04-02 12:17:33.32 +0400>,<she>,<DPX200>,
      <created by zg, POWCHK disabled, PULCHK disabled
       terminated by command 'halt'
       configuration hash MD5:
       00 E9 B6 7A A2 85 ED C7 34 08 36 98 17 FE 4E 26
       data hash MD5: 32K
       DC 1B AC BB 59 D9 C2 AB 46 6F D7 1E 27 37 C2 ED>)
(   2,<2019-04-02 13:44:17.25 +0400>,<she>,<DPX200>,
      <Start of raw data processing
       efp BC_mod = 2 LB = 1 FT_mod = 6 PKNL = 1 PHC0 = 1445.207 PHC1 = 23.06678 SI = 32K 
       data hash MD5: 32K
       32 90 BA 94 EF 7A 29 E2 20 30 7F 70 80 5E 67 F8>)
(   3,<2019-04-02 13:44:34.00 +0400>,<she>,<DPX200>,
      <pk PHC0 = -12.8569 PHC1 = -5.2 
       data hash MD5: 32K
       D0 B6 3F 78 C3 87 0A D1 BD 67 27 EE DD 75 F4 7D>)
(   4,<2019-04-02 13:44:37.42 +0400>,<she>,<DPX200>,
      <abs ABSG = 5 
       data hash MD5: 32K
       64 35 58 A6 96 A0 A9 B7 88 00 86 70 AB C4 4D A0>)
$$ ##END=
$$ 
$$ hash MD5
$$ 88 5B D2 3C ED 60 23 CC 33 C4 A8 CC B0 F4 5F BE
##$RELAX= 
##$RELAX= 
##$RELAX= 
##$RELAX= 
##$RELAX= 
##$RELAX= 
##$RELAX= 
##$RELAX= 
$$ Bruker specific parameters
$$ --------------------------
##$DU= <F:/spectra>
##$EXPNO= 2
##$NAME= <c13>
##$PROCNO= 1
##$TYPE= <nmr>
##$USER= <she>
##$AMP= (0..31)
100 100 100 100 100 100 100 100 100 100 100 100 100 100 100 100 100 100 
100 100 100 100 100 100 100 100 100 100 100 100 100 100 
##$AQSEQ= 0
##$AQ_mod= 1
##$AUNM= <au_zg>
##$AUTOPOS= <>
##$BF1= 50.322709
##$BF2= 200.13
##$BF3= 50.322709
##$BF4= 500.13
##$BF5= 500.13
##$BF6= 500.13
##$BF7= 500.13
##$BF8= 500.13
##$BYTORDA= 1
##$CFDGTYP= 0
##$CFRGTYP= 5
##$CHEMSTR= <none>
##$CNST= (0..31)
1 1 145 1 1 1 1 1 1 1 1 1 1 1 1 1 1 1 1 1 1 1 1 1 1 1 1 1 1 1 1 1 
##$CPDPRG= <waltz16>
##$CPDPRG1= <>
##$CPDPRG2= <waltz16>
##$CPDPRG3= <>
##$CPDPRG4= <mlev>
##$CPDPRG5= <mlev>
##$CPDPRG6= <mlev>
##$CPDPRG7= <mlev>
##$CPDPRG8= <mlev>
##$CPDPRGB= <>
##$CPDPRGT= <>
##$D= (0..31)
0 1.5 0.00345 0 0 0 0 0 0 0 0 0.03 2e-05 3e-06 0 0 0 0 0 0 0 0 0 0 0 0 
0 0 0 0 0 0 
##$DATE= 1554122104
##$DBL= (0..7)
120 120 120 120 120 120 120 120 
##$DBP= (0..7)
$$ [...]
##$SUBNAM4= <"">
##$SUBNAM5= <"">
##$SUBNAM6= <"">
##$SUBNAM7= <"">
##$SUBNAM8= <"">
##$SUBNAM9= <"">
##$SW= 239.972172959595
##$SWIBOX= (0..15)
0 1 3 0 0 0 0 0 0 0 0 0 0 0 0 0 
##$SW_h= 12077.2946859903
##$TD= 32768
##$TD0= 1
##$TE= 0
##$TE2= 300
##$TE3= 300
##$TEG= 300
##$TL= (0..7)
120 120 120 120 120 120 120 120 
##$TP= (0..7)
150 150 150 150 150 150 150 150 
##$TP07= 0
##$TPNAME0= <>
##$TPNAME1= <>
##$TPNAME2= <>
##$TPNAME3= <>
##$TPNAME4= <>
##$TPNAME5= <>
##$TPNAME6= <>
##$TPNAME7= <>
##$TPOAL= (0..7)
0.5 0.5 0.5 0.5 0.5 0.5 0.5 0.5 
##$TPOFFS= (0..7)
0 0 0 0 0 0 0 0 
##$TUNHIN= 0
##$TUNHOUT= 0
##$TUNXOUT= 0
##$USERA1= <user>
##$USERA2= <user>
##$USERA3= <user>
##$USERA4= <user>
##$USERA5= <user>
##$V9= 5
##$VALIST= <valist>
##$VCLIST= <CCCCCCCCCCCCCCC>
##$VD= 0
##$VDLIST= <DDDDDDDDDDDDDDD>
##$VPLIST= <PPPPPPPPPPPPPPP>
##$VTLIST= <TTTTTTTTTTTTTTT>
##$WBST= 1024
##$WBSW= 4
##$XGAIN= (0..3)
0 0 0 0 
##$XL= 0
##$YL= 0
##$YMAX_a= 165819554
##$YMIN_a= -94651720
##$ZGOPTNS= <>
##$ZL1= 120
##$ZL2= 120
##$ZL3= 120
##$ZL4= 120
##$ABSF1= 222.6533
##$ABSF2= -17.34351
##$ABSG= 5
##$ABSL= 3
##$ALPHA= 0
##$AQORDER= 0
##$ASSFAC= 0
##$ASSFACI= 0
##$ASSFACX= 0
##$ASSWID= 0
##$AUNMP= <proc_1d>
##$AZFE= 0.1
##$AZFW= 0.5
##$BCFW= 0
##$BC_mod= 2
##$BYTORDP= 0
##$COROFFS= 0
##$CY= -3
##$DATMOD= 1
##$DC= 0
##$DFILT= <>
##$DTYPP= 0
##$F1P= 0
##$F2P= 0
##$FCOR= 0.5
##$FTSIZE= 32768
##$FT_mod= 6
##$GAMMA= 0
##$GB= 0
##$INTBC= 1
##$INTSCL= 1.329259e-09
##$ISEN= 128
##$LB= 1
##$LEV0= 0
##$LPBIN= 0
##$MAXI= 10000
##$MC2= 0
##$MEAN= 0
##$ME_mod= 0
##$MI= 0.9312502
##$NCOEF= 0
##$NC_proc= 1
##$NLEV= 6
##$NOISF1= 120.0001
##$NOISF2= 80.00006
##$NSP= 0
##$NTH_PI= 0
##$NZP= 0
##$OFFSET= 222.6533
##$PC= 1.4
##$PHC0= 1432.35
##$PHC1= 17.86678
##$PH_mod= 1
##$PKNL= yes
##$PPARMOD= 0
##$PSCAL= 0
##$PSIGN= 0
##$REVERSE= no
##$SF= 50.3227306370915
##$SI= 32768
##$SIGF1= 140
##$SIGF2= 120
##$SINO= 35.31775
##$SIOLD= 32768
##$SREGLST= <13C.CDCl3>
##$SSB= 0
##$STSI= 32768
##$STSR= 0
##$SW_p= 12077.2946859903
##$SYMM= 0
##$S_DEV= 0
##$TDeff= 32768
##$TDoff= 0
##$TI= <>
##$TILT= no
##$TM1= 0
##$TM2= 0
##$TOPLEV= 0
##$USERP1= <user>
##$USERP2= <user>
##$USERP3= <user>
##$USERP4= <user>
##$USERP5= <user>
##$WDW= 1
##$XDIM= 32768
##$YMAX_p= 314104853
##$YMIN_p= -5211659
$$ End of Bruker specific parameters
$$ ---------------------------------
##NTUPLES= NMR SPECTRUM
##VAR_NAME=  FREQUENCY,     SPECTRUM/REAL,   SPECTRUM/IMAG
##SYMBOL=    X,             R,               I
##VAR_TYPE=  INDEPENDENT,   DEPENDENT,       DEPENDENT
##VAR_FORM=  AFFN,          ASDF,            ASDF
##VAR_DIM=   32768,         32768,           32768
##UNITS=     HZ,            ARBITRARY UNITS, ARBITRARY UNITS
##FACTOR=    0.368581032318806, 1,           1
##FIRST=     11204.5222956761, 0,            0
##LAST=      -872.772390314241, 0,           0
##MIN=       -872.772390314241, -5211659,    0
##MAX=       11204.5222956761, 314104853,    0
$$ Real data points
##PAGE= N=1
##DATA TABLE= (X++(R..R)), XYDATA
$$ [...]
17769 1341514 492245 -490900 -748966 -882560 -1267742 -1356612 -771440 -116470 51884 138193
17759 138193 719982 1095741 1420845 2054447 1675369 1189242 1402006 1735514 2378986 2178275
17749 2178275 1327812 1040339 1016086 1113141 1436369 1937043 1453579 -123236 -494062 864340
17739 864340 1609450 1038253 -75420 -944215 -1599344 -1754976 -1241169 195573 1346349
17730 1346349 1445699 136109 -849225 -566896 -166860 13757 1409172 2334032 2134715
17721 2134715 2359594 2615457 2439894 2523674 2398820 1701720 827999 -76358 -245664 112587
17711 112587 641672 868554 485536 -139337 -170841 765112 1165428 870201 665146 345864
17701 345864 -809516 -1443017 -1133413 -359201 -188385 -183305 741882 955108 380185 305732
17691 305732 475896 224003 707677 807012 54382 -1406046 -1999522 -1378997 -524914 -297128
17681 -297128 -349879 -358677 -446565 -362367 -787023 -1276551 -1246957 -509040 -61428 -807612 -1663033
17670 -1663033 -1512217 -333338 894725 760746 -780866 -2385888 -2824241 -1826169 -778967
17661 -778967 283029 1345949 1813583 726198 -74721 266175 18492 -1390519 -2549195
17652 -2549195 -3120795 -2665316 -1080599 -693658 -1349722 -2298831 -2885448 -2023537 -1158689
17643 -1158689 -801411 -472096 -759926 -1374338 -1111251 -495397 -70852 -25072 198856 -244708
17633 -244708 -330499 319328 735221 347383 -249051 -588364 -1126667 -1377091 -1725555 -1305524
17623 -1305524 194647 2152021 2704116 1909801 1350779 565672 -797739 -2051577 -3184696
17614 -3184696 -3176235 -2960493 -1779456 -682377 -270100 -685609 -1990176 -3464242 -3805992
17605 -3805992 -3705975 -3416107 -2579503 -2394629 -2458454 -2101885 -1013970 -188176 -451275
17596 -451275 -885311 -1376972 -1286525 -681576 -182162 357995 -303460 -156639 982875 1156303
17586 1156303 1265557 1319473 1405605 1254926 280463 764495 1357914 1523256 1978661 2324291
17576 2324291 2536109 3229574 2911757 2312313 2113779 2037369 1820359 1306850 754040 508088
17566 508088 205574 229804 -94481 -714693 -1418530 -668009 69804 228439 267963 793569
17556 793569 2125987 1212830 387147 648167 1018527 1751804 2585655 2896078 2156336
17547 2156336 1428970 643079 355544 904311 987025 536948 677086 131613 -865695 -677024
17537 -677024 -460406 -855596 -902587 -679441 -505597 343751 1168715 1556350 1370446 316165
17527 316165 -842302 -1504072 -867902 -344068 -46600 -31554 -573441 -548580 38533 345902
17517 345902 719026 1288920 1481412 1777895 2135954 2225406 1448541 559177 928294 880474
17507 880474 -114923 -1122823 -1951474 -1861102 -1663722 -1178212 -227265 847146 1080421
17498 1080421 1022292 1043932 1104679 348957 -530225 -1063404 -1582958 -1830336 -2139755 -2099298
17488 -2099298 -1452450 -465395 300145 174001 -90804 922924 2158753 2799398 2632602
17479 2632602 1348307 711728 741946 872272 507962 -364654 -1183326 -1780367 -1682030 -1096907
17469 -1096907 -711361 -837754 -1692040 -1970030 -1923338 -1451856 -642930 -569220 -152200 -1337
17459 -1337 -627459 -1069739 -717416 33951 689147 387825 236481 298659 -62644 -176811
17449 -176811 -252939 677271 1714549 1712710 2254182 2667812 2633286 2240072 2022354 1628740
17439 1628740 1176182 748208 1448388 2331818 2237650 2204846 1206379 -210514 -1092336 -1094706
17429 -1094706 -694388 -592027 -771633 -739661 -49704 579816 200065 222002 720625 820424
17419 820424 89427 -1233449 -2393284 -1466290 -219955 236177 208 -566162 -1087148
17410 -1087148 -939156 -264558 765784 876121 504995 708651 1478652 1371027 1153874
17401 1153874 2052329 2710294 2385191 2517766 1742775 572956 249882 469111 1218486
17392 1218486 1149961 587251 -255115 -1145962 -1485672 -667024 766721 1263494 1359250 1664817
17382 1664817 1926564 2213299 2026304 984323 361250 143361 -445015 -698405 -680121
17373 -680121 -551626 -202489 575114 1695388 2232814 503470 -1428829 -1733599 -838979
17364 -838979 228547 611480 1026654 1402794 1891482 1831108 609931 -863829 -1946426
17355 -1946426 -2007134 -1636455 -1194152 -689610 -172482 99982 -83822 -147420 163799 674095
17345 674095 1431600 1810964 1150913 -26660 353621 531464 363016 474876 676105
17336 676105 1096312 1094071 646313 287584 -156287 222316 -243272 -1792770 -3434016 -4505625
17326 -4505625 -4280629 -2899762 -1157009 -175785 605157 782380 -7138 -860285 -1176137
17317 -1176137 -775422 -808504 -1496576 -1866803 -2150130 -1819533 -1871639 -1890699 -1001749 -24528
17307 -24528 625359 916663 -314006 -1180655 -1273563 -685294 -132890 -711372 -1313853 -1088922
17297 -1088922 -1042995 -1364480 -1473644 -1373524 -1420277 -1667482 -1706029 -1897758 -2057267 -2406255
17287 -2406255 -2932372 -2767604 -1662439 12968 1126212 2267463 2391426 1640633 631867
17278 631867 -35661 18506 -69116 -345981 -748097 -872370 -947080 -497977 6466 111090
17268 111090 864402 1253530 154501 -920778 -866892 -577081 -251642 559590 1586036
17259 1586036 2142517 1809331 1646236 1461857 957340 -323009 -1592292 -2736750 -2482225
17250 -2482225 -1126120 -946439 -862764 -870861 -1151924 -1044164 -506926 -260143 -168300 905114
17240 905114 2104640 2060373 2194736 2668465 1990904 1377498 1552692 1890515 1409698 100534
17230 100534 -776355 -559703 78603 -66720 -905794 -2183344 -2317774 -1796772 -1084081
17221 -1084081 -560366 -1227627 -1547371 -1035754 -988097 -296280 895003 2005503 2703067
17212 2703067 1851266 346606 -452828 -694157 -633101 -534925 -368988 -122799 4824 410198
17202 410198 125357 530280 1248091 1045670 -265301 -1143598 -1053311 -104239 325358 -81500
17192 -81500 -166591 -608516 -968153 -1319765 -2027218 -2401883 -1800191 -549893 376100 615606
17182 615606 102307 -640693 -684031 -907214 -1497704 -1726805 -1231895 -782808 -761152 -1289623
17172 -1289623 -2257463 -2667252 -2105291 -1364073 -1446924 -2443494 -2540988 -1637454 -1364875 -1941933
17162 -1941933 -2332294 -2341234 -2426416 -2133592 -1151008 -1077199 -984000 -512506 488076 1911167
17152 1911167 2069329 931489 -260289 -491562 -908970 -2176905 -3138156 -2719798 -1879555
17143 -1879555 -1445168 -2009671 -1920402 -1267502 -1162477 -1203158 -406151 39541 415197 787761
17133 787761 481352 536111 1224133 871858 -248144 -857787 -890927 -142932 582104 632524
17123 632524 94002 -582599 -370334 -173338 -966818 -1618998 -866638 -563885 -583567 -222409
17113 -222409 -103237 -454885 -503653 -486559 262285 1370767 1635230 980449 73247 -356505
17103 -356505 -521649 -420013 -604017 -1339304 -2557061 -2720592 -2255201 -2216691 -2273656 -1841735
17093 -1841735 -1036511 -566741 -157890 447118 523583 -497119 -1139515 -874980 -1056919
17084 -1056919 -1899804 -3085971 -4042081 -4234239 -4327307 -4445966 -3836988 -3191301 -3356648
17075 -3356648 -2591629 -1410136 -802736 -330360 -570578 -1690038 -2257518 -1773294 -1057803
17066 -1057803 -853658 -730995 -1070283 -1204675 -1299165 -796527 -249088 73287 546823 562657
17056 562657 -343535 -1015388 -1417026 -2083066 -2142025 -1292567 112004 739299 1031686 848434
17046 848434 1288605 1475245 1728712 1075933 -294312 -852508 -219314 709118 966777
17037 966777 933983 872274 365416 -511532 -612603 -372741 -415674 -414583 -949567 -1161009
17027 -1161009 -539286 168238 992851 1603612 1187049 -321802 -1124325 -955211 -227064
17018 -227064 691927 526997 -809643 -1650386 -969181 158815 1153480 1565645 1145815
17009 1145815 541167 -313603 -465982 130189 556599 641516 883359 299929 -451475 -806532
16999 -806532 -192173 990003 1226026 959514 1049049 1040325 827911 270048 -122553 132603
16989 132603 327646 523800 419778 176921 -751422 -868231 -729510 -1587505 -2418013 -2657522
16979 -2657522 -2328441 -1052277 -151821 -515998 -442004 -451162 120217 902148 1188740 596781
16969 596781 44579 646805 1001036 1583919 2470646 2358921 1370258 1388722 1549359 569680
16959 569680 389561 460460 -41384 425107 1698890 2289942 1715569 909917 499052 618384
16949 618384 975044 1608273 2520243 2550043 1625571 1186267 1240634 1973684 2331756 1535467
16939 1535467 700856 578849 1309971 2321398 2586949 1370917 76201 243822 -290835
16930 -290835 -934785 161138 511314 860622 1997712 1699443 420650 -782316 -885548
16921 -885548 -377873 -614183 -1037490 -839177 384934 1619349 1955136 1137195 -934335
16912 -934335 -1885426 -2341684 -2609886 -3453619 -3249899 -1648217 -1359021 -1379604 -937341 -497610
16902 -497610 -412753 -421220 -462417 -448823 553379 1353491 455835 483392 838496 69387
16892 69387 -86447 241200 846455 1626072 1953779 1463850 554647 -157769 -900820 -1959144
16882 -1959144 -1862986 -1416111 -1012647 -817459 -1217709 -1564973 -2617686 -2475408 -1295791
16873 -1295791 -1634028 -2801887 -3210401 -2568164 -1382937 -22617 672240 978268 1008516
16864 1008516 -4086 -285080 -38259 -230567 -435818 -77001 112813 -181707 -1086960
16855 -1086960 -1202488 -774385 -911017 -560568 -100317 549872 716458 452517 -120916
16846 -120916 -239389 314797 158844 388008 1059914 982445 239771 362857 253942 -1756399
16836 -1756399 -2976360 -2397575 -813790 -154421 -1049469 -1655738 -1008719 457862 2022147
16827 2022147 1587898 -16787 -782475 -163756 -99884 22499 941474 1710635 2007058
16818 2007058 1557732 477247 -113337 293644 1284502 2774402 4128551 3677685 2218138
16809 2218138 1180516 521766 370253 140927 -616934 -769169 -1036361 -969793 -669972
16800 -669972 -966344 -1109920 -380052 614250 1018004 1055577 816023 593582 808668 661589
16790 661589 371987 321144 -575203 -2049346 -2757621 -3134211 -2911833 -1854210 -1614712
16781 -1614712 -987982 -81147 731876 939618 323665 -305399 -541219 -385485 -918162
16772 -918162 -999175 476404 1833161 2360745 2156697 1843785 1459575 991192 629180
16763 629180 1049218 2175667 2761743 2395554 1236366 1220305 1627753 1777440 1487928
16754 1487928 1182329 971097 1438559 1160070 -299620 -1450133 -2127626 -1484272 -566027
16745 -566027 265500 72748 -1250632 -1374425 -1217598 -706336 68752 414050 505986 219335
16735 219335 234073 730340 731995 762892 665678 417987 1422052 2093506 1454759 295893
16725 295893 -572138 -1236471 -1516909 -1670843 -1892892 -1812325 -1670035 -394054 1252116
16716 1252116 2203120 2277725 1207949 350934 -678823 -1416749 -1499847 -1208381 -1488911
16707 -1488911 -1356517 -1696370 -2320871 -2419801 -1685159 -1122614 -916388 -65707 1649786
16698 1649786 3030493 2992520 2731082 2383613 1606824 671588 -26276 -415633 -577737
16689 -577737 -666116 -229042 438476 -90729 -568291 -486770 -249623 -755299 -1125548 -218339
16679 -218339 168728 -352402 -255035 439135 823454 539542 -313977 -1548898 -1578009 -1078463
16669 -1078463 -943426 -1396825 -2217379 -3042175 -2923415 -2330479 -1831269 -1421931 -218893
16660 -218893 640483 45455 -201222 103351 18518 213307 728669 155533 -492180 21902
16650 21902 540312 402220 405752 693328 532665 418504 493791 694313 1507868 1786888
16640 1786888 1759698 1882397 1568908 822504 564200 567427 427716 1155074 1406755 766269
16630 766269 -424812 -1123292 -927897 -177966 344070 444051 131816 919457 2132200
16621 2132200 2414738 2970015 3516734 2295695 -349512 -2054829 -2399732 -2521211 -1803131
16612 -1803131 -1063799 -795816 -347850 310695 524320 720413 151034 -676744 -1348271
16603 -1348271 -1677927 -872492 422080 985622 514209 810379 1249568 675712 -49466
16594 -49466 29303 264755 169396 -248504 -332675 561042 1622435 1806552 1383480 407404
16584 407404 -1140718 -2035890 -1791597 -1254903 -1160193 -1056186 -1770179 -1957318 -1462392 -1174758
16574 -1174758 -1198391 -717908 -261617 -206421 -354702 -398639 889790 1731854 1479210 1220801
16564 1220801 1730108 1835459 1674457 1483308 1611484 1809207 1108357 -204690 -818905
16555 -818905 -980949 -344665 401910 976910 711738 94746 -352661 -276470 128913 604362
16545 604362 1184856 1783479 1689184 1932602 2348375 2193089 2121644 1970436 1869672 1294131
16535 1294131 -674745 -2269853 -1950030 -902101 -94480 203334 -170152 -535932 -121391
16526 -121391 261118 137743 -107564 -423951 -814980 -72545 119465 -175352 295312 689197
16516 689197 923073 724835 1014377 1726003 1532100 1640274 2519933 2807779 3112272 2623263
16506 2623263 1713429 890318 141155 -242024 -526477 -1079104 -1585052 -1259108 -1773529
16497 -1773529 -2747552 -2776457 -1991321 -867693 -90032 538544 1063553 1033451 326877 -154603
16487 -154603 -125995 552047 731134 811526 553790 -154241 -232395 98507 720188 999280
16477 999280 120321 -488191 -520328 -758015 -1644749 -1884704 -1011553 -433308 -448430 -242800
16467 -242800 -304650 -600697 409573 449604 -30063 -158257 -207488 -499706 -308578 299020
16457 299020 -52625 -592722 -619348 -387700 -54011 241348 241477 -706124 -1299591 -1186101
16447 -1186101 -576442 250017 279674 -567656 -1159687 -406850 479405 1163671 513020 -765652
16437 -765652 -1875485 -2162289 -1889201 -1764294 -1688806 -1197990 -1114978 -442453 428289 917581
16427 917581 1011083 148989 -1376177 -2579697 -2804335 -1601969 -888489 -965393 -291081
16418 -291081 455815 260640 -189457 -854094 -1268023 -1364516 -809642 277268 527425 20230
16408 20230 30416 606480 553564 14276 249354 344299 129370 176383 40685 156240
16398 156240 39311 -243808 53175 454736 723920 464647 -365781 -955235 -827920 277593
16388 277593 763421 734169 623408 -954001 -3500155 -4305879 -3899757 -3894707 -3836509 -3296190
16378 -3296190 -2439522 -1199403 -1070791 -1294981 -749565 343479 1553577 2013270 1232054
16369 1232054 229383 -288668 -99072 468392 653303 42717 -915535 -770189 -291559
16360 -291559 -869952 -546420 -46259 -199953 -271996 -539703 -1151100 -1897059 -1948625 -1792262
16350 -1792262 -1301413 -2051597 -2998688 -3792563 -3423337 -1472336 -669606 -964416 -940327
16341 -940327 -752555 -945837 -924586 -904454 -816760 -96849 611557 574511 -331680 -1449515
16331 -1449515 -1604283 -2211198 -2355598 -1837198 -905325 107641 275249 120744 378642
16322 378642 -365383 -1483974 -1049347 -780341 -1604314 -2842093 -3079851 -2661183 -2410966
16313 -2410966 -2006697 -1659284 -1760844 -1520416 -750483 -227594 537100 2207851 2728465
16304 2728465 1968379 1213566 1212097 693414 466638 437759 -282456 -1053748 -1645310 -1579772
16294 -1579772 -613739 -20545 -838274 -1427608 -628430 -154113 -937648 -610272 702751
16285 702751 1166867 863459 41492 -1498877 -1669884 -1248407 -933896 -633367 -657437 -494510
16275 -494510 -893605 -779608 -103905 484854 762117 874315 1212980 1788025 2741550 3082662
16265 3082662 3200101 3339621 3253612 3321180 2886532 1342411 585614 1189267 749143 -827572
16255 -827572 -1663120 -1894308 -1387932 -911724 -753962 -1289345 -1545966 -1058049 -1453669 -1286016
16245 -1286016 -273346 398663 866686 1836344 987081 -1455280 -2380764 -2524532 -2605345
16236 -2605345 -2696640 -2514112 -2227613 -1893485 -2086756 -2317534 -2902296 -2830522 -2444470 -1852863
16226 -1852863 -1647550 -1844005 -1830941 -1032537 -763473 -1438730 -1890769 -2303966 -2030366 -1577095
16216 -1577095 -1545995 -2358755 -2373857 -1615938 -771909 -363412 -645098 -1156923 -988185 -634066
16206 -634066 -1300101 -1840547 -1908755 -1546258 -866178 -790436 -711159 -598804 -408961 -79672
16196 -79672 62574 449061 951135 1519353 1386298 227100 -927711 -787148 -194520
16187 -194520 640207 973230 956083 724149 -759076 -2369425 -3138480 -3938688 -3399288
16178 -3399288 -2446074 -1383507 -953790 -1471419 -1976178 -2211033 -2678561 -2882682 -2624613
16169 -2624613 -2788087 -2073992 -1646203 -1962749 -2733634 -2074786 -134778 1225502 1922971
16160 1922971 1995459 1265700 710752 -346279 -1078812 -1028129 -811545 -218563 -523167 -1002866
16150 -1002866 -1167348 -1390136 -1305327 -1200888 -716942 -25913 1183416 1314318 873109
16141 873109 294767 -1806 -137335 486795 733225 114756 -823503 -1710987 -2236154 -2300878
16131 -2300878 -1804291 -1338889 -1002314 -1626532 -2580150 -2731163 -2745609 -2826173 -2033553 -2056939
16121 -2056939 -1954535 -1862109 -1219289 -102268 383063 368839 562822 910703 2057254
16112 2057254 2107484 900000 866755 679327 -627730 -1805267 -1638141 -1048227 -577359
16103 -577359 89601 1272795 1361178 756042 660388 639745 251925 -702603 -984030 -1135812
16093 -1135812 -1434525 -1595247 -1677619 -1919162 -1592939 -1692350 -1667998 -1167178 -1415723 -1936464
16083 -1936464 -1764620 -1863675 -2112738 -1658927 -921481 -875471 -961005 35170 645792 1351729
16073 1351729 745016 -17047 40299 6955 -274023 -530248 -202011 -96323 -124082 -19811
16063 -19811 537409 1236654 1229402 902414 950324 341378 -110582 -111918 -101085 -203378 -363984
16052 -363984 -610971 19285 578975 1879 -1017029 -1375143 -1351483 -1274623 -1027891 -1191670
16042 -1191670 -1069381 -372009 -229556 -786724 -1158254 -1254843 -266721 197519 433225 1193087
16032 1193087 932647 -514897 -1193101 -833815 -746837 -815446 -746389 -449892 271816 559584
16022 559584 531483 983548 1035043 663630 167009 -472674 -420993 -2321 459603 1374482
16012 1374482 1067433 -404806 -1380881 -1753728 -1636615 -1170959 -910776 -1204204 -1105533
16003 -1105533 -1035760 -1133597 -978776 -945473 -1221371 -1361348 -1064836 -114440 505287 598653
15993 598653 212767 -414859 -1087691 -1238649 -364825 805319 1062588 1154319 1531555 1860259
15983 1860259 1793789 1975460 2080641 1298158 754317 747848 579036 -306176 -883569 -991154
15973 -991154 -861109 -1060907 -742987 68330 863803 1050035 812032 1030424 743474 -397897
15963 -397897 -1281350 -1532047 -1802803 -1359031 -775538 -1366515 -1855384 -1634165 -1409016 -827381
15953 -827381 -183009 67417 377150 436315 240007 380162 173283 -118564 -328860 -488099
15943 -488099 -651599 -203607 745268 1333390 1445642 1160075 703597 -14636 -1183143
15934 -1183143 -1620801 -689657 628055 1191082 1472460 1356271 236031 -1230592 -908644
15925 -908644 -449889 -414793 -420949 144484 1007407 2219442 2172382 1191847 557570 530557
15915 530557 1056321 1111620 253903 -610979 -1135637 -1480311 -1399017 -1562234 -776985 866109
15905 866109 1911430 1200289 -222922 -1421054 -2100061 -2179469 -2291626 -1806011 -1005211
15896 -1005211 -286458 -234140 -1134771 -1350867 -1143268 -1231032 -1287955 -1625564 -2048665 -1444375
15886 -1444375 -419722 53088 384194 443042 167084 178416 796476 1181974 1103871 1004616
15876 1004616 309498 -626024 -1127299 -667617 -441652 -950760 -1485651 -908873 -163906
15867 -163906 -10434 284831 985335 771846 211204 -417063 -1220723 -1520734 -946508 -195174
15857 -195174 -284752 -846001 -1526667 -1842065 -1136230 -768568 -753175 -609863 -838857 -1080215
15847 -1080215 -1534858 -2310899 -2924922 -3714495 -4518173 -4558909 -2803454 -645132 -200741
15838 -200741 107847 949671 1457974 1496544 1330922 1162382 841594 998935 1037592 662103
15828 662103 881613 974402 414884 -23638 -624055 -1004361 -1254601 -1041611 -952038 -1137106
15818 -1137106 -1202746 -853910 -617879 -272229 115673 -441073 -1223016 -1639413 -1576026 -923935
15808 -923935 -571958 -453932 -250359 -288980 -320425 38138 641130 -363386 -1760836 -1955069
15798 -1955069 -2601350 -2433241 -1852122 -1463750 -2019948 -1978780 -1510090 -1518533 -1212160 -236351
15788 -236351 168450 144027 664439 508552 838487 1669488 2395367 1904749 776954 -161088
15778 -161088 -169666 -300564 -722304 -655319 567259 1230434 815095 537562 782753 829348
15768 829348 689140 922987 1173538 663762 540993 386296 -378263 -1604281 -2748290
15759 -2748290 -3153056 -3024283 -3047920 -2519641 -973954 -502622 -1371441 -2088324 -2627870
15750 -2627870 -2584797 -2789702 -2963269 -2369202 -2193187 -2424108 -2205618 -1364564 -983557 -673794
15740 -673794 -780365 -378557 -500910 -867082 -754014 105534 729339 372164 -317210 -1361911
15730 -1361911 -1102660 354005 1232355 701251 -422269 -586817 -762765 -1356344 -1511243
15721 -1511243 -1474324 -1822545 -2678724 -3627192 -3908905 -3418542 -2610332 -1687071 -1111329 -1042714
15711 -1042714 -606941 644816 1485112 1976478 2226380 2539025 1877260 428909 399805
15702 399805 1368780 764286 -479453 -1328366 -2463946 -2477357 -2019344 -1633510 -1087704
15693 -1087704 14790 879444 734507 425335 -124551 -907702 -1835527 -1884915 -1476820
15684 -1476820 -1983641 -2341557 -1601610 -907701 -555914 -532333 -148439 -926572 -3112839
15675 -3112839 -3476396 -2220879 -1889931 -1872834 -1690649 -1110557 -957401 -871616 -295633 91606
15665 91606 -334765 529204 1583937 1184465 184568 -579742 -869314 -1974862 -2566286
15656 -2566286 -1751593 -1149354 -888268 -234763 404104 982936 805773 862900 1505634 2405364
15646 2405364 1901839 624531 -686679 -1263801 -1370868 -1438609 -895734 -624415 -665485
15637 -665485 -35360 1364292 2453315 2502566 2659055 2567124 1478595 519968 -183104
15628 -183104 -386397 -520642 -855878 -1184847 -1414203 -1028494 -1516428 -2400584 -2202538 -1794722
15618 -1794722 -1898606 -1678786 -963682 -686024 -1310631 -2356429 -2413382 -1798360 -1547362
15609 -1547362 -1132721 -969419 -933781 -1262780 -1575996 -1333562 -1620451 -2034159 -1938087 -2188867
15599 -2188867 -2924202 -2280755 -1340310 -745948 162517 1001836 1057327 1088286 1073869 1089331
15589 1089331 100965 -628403 -222814 -202525 239247 197560 -738175 -958538 -685712 -144283
15579 -144283 387546 -773657 -1647788 -1715171 -1785835 -967318 -357144 -19309 -74995 -770489
15569 -770489 -1020892 -1214219 -1268217 -1358935 -1651023 -1340462 -1428146 -1818949 -1375101 -684013
15559 -684013 300079 684475 476255 251259 -315915 -1472959 -1953614 -1668014 -1162777
15550 -1162777 -1205261 -832014 -751263 -1456342 -2062964 -1563464 -212167 1158314 2350937
15541 2350937 1580121 -103600 -1266834 -1561561 -1152078 -1572760 -1545820 -816671 -1192100
15532 -1192100 -1637990 -1365795 -263290 434526 184237 -179817 -241806 4555 247041
15523 247041 814740 820885 -209505 -238456 884915 1664065 1184491 69106 -50641 226485
15513 226485 1077406 1661441 1765560 1250992 215299 -926129 -1442264 -1257114 -1572612
15504 -1572612 -1689118 -2056043 -1970394 -1245826 -1135241 -1444855 -1649926 -1914260 -2096551 -2039281
15494 -2039281 -2326810 -2423447 -2113114 -1479256 -675730 -68596 -522990 -1395190 -1546779 -565296
15484 -565296 385947 -252208 -842213 -987840 -891106 88070 644527 -309927 -1202851 -1270955
15474 -1270955 -618401 -269898 -292099 85335 836622 1041586 1524856 2807166 3811763
15465 3811763 4467288 3121961 1677935 1365808 685183 -878342 -1877658 -1606916 -1047517
15456 -1047517 -1140144 -1548699 -1420590 -1719087 -2149756 -2232016 -1738371 -1142793 -345616 919868
15446 919868 1713379 1290726 171636 -216187 386993 791296 672123 528854 21443
15437 21443 -266270 -1239364 -1691978 -1068612 -789055 -1439974 -1404073 -1129475 -1544524 -1224676
15427 -1224676 -205140 555202 237789 375851 478050 305913 45008 -172241 108852
15418 108852 612514 347165 -410468 -1585008 -1218487 -713824 -674381 -759134 -756359 -545653
15408 -545653 -691358 -723031 -476714 310141 686536 618147 958825 695864 -119849 370208
15398 370208 812614 610809 172016 -768973 -786487 -2464 429612 -135249 -577907 -628830
15388 -628830 -559677 -701947 -1337451 -302545 1499558 1322854 708571 -671361 -1560078
15379 -1560078 -406511 1247598 2811958 3166832 2477453 1955903 1687336 908578 -195863
15370 -195863 -909943 -1071739 -608433 -721471 -1304411 -1881203 -1784510 -1033169 73906 1166925
15360 1166925 1780968 2299384 994317 -1081877 -1818548 -1808505 -1189342 -1352715 -1698782
15351 -1698782 -1011022 -573253 44473 88047 -874566 -1418646 -1425288 -1834016 -3012479 -2894002
15341 -2894002 -1419241 -1165926 -1585475 -2070632 -2797598 -2598969 -1471188 -720433 -571831
15332 -571831 -508903 -91860 157166 -1002023 -2149942 -2280486 -1456391 -1488555 -2357665 -2575562
15322 -2575562 -2138537 -1701498 -1853858 -2129382 -1839816 -1050806 -561028 103912 -722402
15313 -722402 -2096546 -1935540 -2209473 -2855814 -2869064 -2019999 -1267581 -289604 1236242
15304 1236242 1368985 -179488 -1896450 -2944205 -2244980 -1040161 -650092 -758093 -740501
15295 -740501 -743265 -1585004 -1554902 -1294430 -1242695 -1441236 -2346357 -3149783 -2568536 -1252424
15285 -1252424 -9499 -45578 -1352047 -2400391 -2657669 -2124182 -1327673 -1606964 -2882017
15276 -2882017 -3298701 -2879223 -2469841 -1401113 -237118 476364 164636 -903053 -1201041
15267 -1201041 -889231 -400978 459913 1064407 1153466 1132882 1060140 350916 -435784 -1257692
15257 -1257692 -2147891 -2174399 -2349377 -2597439 -2045967 -1438340 -1246149 -1131669 -685359 -281578
15247 -281578 -160304 -193702 -287853 -387097 -137326 362724 -236484 -282057 -316491 -381157 296006
15236 296006 39709 -1257057 -1674753 -1336549 -1013688 -1306139 -1963391 -1372000 -350264
15227 -350264 724748 1264963 307514 -459282 -1258781 -2859816 -3750107 -3684385 -2479034
15218 -2479034 -1890735 -1529890 -1561902 -2256596 -2510337 -1546142 -915606 -754698 -350571 -112032
15208 -112032 142355 111459 -426675 -937849 -1413647 -2307955 -3063066 -2788833 -2240914 -1738975
15198 -1738975 -1001698 -295757 119916 -12079 -349958 -461921 394314 1420324 1607504
15189 1607504 910075 -430913 -1428099 -1921237 -2231870 -2215984 -2014337 -1878132 -1882105 -1500669
15179 -1500669 -1485989 -1157256 -1060337 -1749241 -2212914 -2749042 -3354514 -3250585 -2735738 -2255766
15169 -2255766 -1358193 -552859 -817424 -1247911 105493 1504680 1424907 527071 -1031349
15160 -1031349 -2316898 -3395185 -3818534 -3776276 -3312492 -1770872 -1007501 -1053475 -1134210
15151 -1134210 -1058386 54648 1182353 1406254 1147364 835569 520540 744574 1497415
15142 1497415 1447116 -16718 -1265618 -1295628 -555622 -207614 -1028264 -1807314 -1885533 -860712
15132 -860712 301381 199278 272963 232143 -1104007 -1464734 -350195 259912 -271436
15123 -271436 -757975 -515109 237070 1072905 1835460 1968628 1727992 1861614 1792054 844283
15113 844283 492647 234503 130983 -78945 -592066 -1286681 -1644561 -2492460 -3000366 -2435005
15103 -2435005 -1518299 -492549 117095 348056 973582 1537034 1161273 484596 431590
15094 431590 247698 -1054509 -1992605 -1478310 -580708 369776 796693 740685 630765 -190294
15084 -190294 -1125607 -1224502 -1055225 -1280913 -1173521 -324626 -104526 -303606 -297535 -1098400
15074 -1098400 -1788910 -1653602 -948827 -83025 656292 1228426 837251 153305 687203
15065 687203 738166 -48867 -1236360 -2256644 -2548859 -1930979 -1151386 -1471478 -1733063
15056 -1733063 -1749955 -1835299 -1703279 -930933 -132327 -151765 -1320831 -1335636 -849960 -1443003
15046 -1443003 -1641930 -1188462 -570902 -508069 -1170864 -1508216 12395 850849 1498117
15037 1498117 1007749 193290 -310963 -931518 -857582 -155923 767333 1116864 862089 756238
15027 756238 942994 1017489 958176 380392 -30605 -20500 542218 1388933 1589988 1483680
15017 1483680 232946 -333097 549066 956337 1246932 1255393 652987 223607 -334775 -466598
15007 -466598 181307 995341 993086 805083 65412 -717876 -343839 54980 -482080 -965380
14997 -965380 -1198576 -1822088 -2162225 -2345281 -2053310 -2116971 -2682562 -2581862 -1451406 -1960013
14987 -1960013 -2880549 -2177981 -1548223 -1118877 -1033848 -818896 -241136 503689 922557 675264
14977 675264 302610 715004 1851327 2307627 1980005 1347596 801134 914543 231777
14968 231777 -801934 -1689758 -2065167 -639236 1140983 711268 -152569 -290270 -20906
14959 -20906 -6497 -160812 -96632 173526 976191 1284199 687306 -193726 -1056394 -2041868
14949 -2041868 -2301572 -2782952 -2701179 -2056818 -1889067 -1798971 -844068 -91435 -281664 -223326
14939 -223326 418093 230090 -619110 -431516 -414059 -268657 886945 2018373 2005911 1425380
14929 1425380 1090133 689677 -324679 -496513 -198869 -648364 -1955606 -3005729 -2359267
14920 -2359267 -1766673 -1699787 -1802556 -1645476 -764780 -1036659 -1430692 -1537456 -842974 456812
14910 456812 749763 859277 676904 634568 922953 1941329 2231742 1588178 502369
14901 502369 -126948 -746991 -1204279 -862546 -154967 651946 403842 -919317 -1352723
14892 -1352723 -997465 -631615 -969736 -1879707 -2780677 -2842233 -2274355 -1198093 -358466
14883 -358466 -1006862 -1521782 -920272 -685450 -487028 320619 9843 -597392 -1013364 -1981454
14873 -1981454 -3319804 -3650575 -2574668 -1247152 -911613 -731790 -566066 -1326281 -2157983
14864 -2157983 -2292057 -1665859 -1950659 -2421819 -1763396 -1517531 -1126209 -639415 -887073
14855 -887073 -1681022 -2297643 -2606591 -2518669 -2258359 -1395418 -476341 -312984 -96205 629753
14845 629753 1084662 1295986 1417562 1530112 625512 -130947 -313657 -849719 -1059889 -206243
14835 -206243 -29180 -606490 -797698 -508292 140375 416232 761303 1027272 978342 650692
14825 650692 -706281 -1520123 -2000420 -3402909 -3434271 -2498621 -2168273 -2795542 -2814211 -2180293
14815 -2180293 -1373340 -1275236 -1525180 -1352450 -23944 -448911 -1862389 -2174260 -1927147
14806 -1927147 -1939796 -2584122 -3274534 -3733796 -3186341 -2177041 -1332887 -645510 -983246
14797 -983246 -1343117 -1037971 -890274 -339229 -174023 168885 666425 1307482 2224032 2602509
14787 2602509 1915477 1203230 1511311 1853645 2170176 1634766 430950 -812912 -1844586
14778 -1844586 -2349015 -2459513 -2176597 -1858456 -1612066 -1514003 -1094959 -948672 -504268 -97146
14768 -97146 -6271 -329577 -1150185 -2535777 -2858482 -2352639 -1794233 -956459 -270874 -26624
14758 -26624 -172995 -286492 -196833 -500219 -168848 224340 188594 749498 1029507 1204376
14748 1204376 900488 -84243 -1033922 -933419 -30819 1057728 1912072 2131677 2557883
14739 2557883 2752610 2738261 3115823 2521902 1348529 1005300 507979 -1134886 -2430344
14730 -2430344 -2604098 -1694792 -973019 -374551 253399 1397299 1076236 387846 211934
14721 211934 453192 414680 -397730 -1315420 -1374171 -1054410 -1934945 -2662041 -1959935 -1373866
14711 -1373866 -1279567 -965057 357446 1855200 1844367 541342 -489467 -878328 -677573
14702 -677573 -761080 -1572256 -1807757 -1758951 -1417790 -1504682 -1653569 -2214058 -2418425 -1837716
14692 -1837716 -1984044 -2401346 -1268272 -973076 -1578557 -1648697 -1186464 -552119 -549885 -454799
14682 -454799 -163304 692514 1137138 647274 449837 131723 94746 12304 -397137 -692741
14672 -692741 -834855 -1563833 -2077098 -2359426 -2467093 -2511849 -1833293 -1417952 -1557183 -976649
14662 -976649 130517 767197 334859 -272057 -1276771 -1614967 -1677390 -2100842 -1361736
14653 -1361736 -566664 -282693 368716 -427671 -991257 -651609 -265906 310397 955225
14644 955225 785453 500516 261004 517783 896200 1228112 777104 -521599 -668618
14635 -668618 140243 864380 1337101 818655 52716 360680 788106 43863 -626419 -694411
14625 -694411 -943419 -1370785 -1061380 -684489 -943174 -1535300 -1832656 -1315659 -337745 250767
14615 250767 357265 -166863 -496899 -75962 267336 181473 -388201 -997937 -925129 -773786
14605 -773786 -554552 -142153 322198 779836 677138 294334 -408384 -1113127 -644378 241161
14595 241161 -559805 -1168126 -657084 -483749 -500951 -928503 -741782 -552775 -662517 -600147
14585 -600147 -1358881 -1869818 -2323091 -2251566 -2333739 -1908165 -621888 201675 1169396 1590885
14575 1590885 1117221 604184 184305 228262 508901 367349 107037 153888 -187 -378870
14565 -378870 -849257 -1072953 -1427305 -2068711 -2274438 -2107699 -2195488 -1165891 -24451
14556 -24451 122657 55561 48873 168085 207042 -246669 -521801 -684626 -1107925 -1957746
14546 -1957746 -2399961 -2113656 -1518289 -1340928 -1984235 -2782264 -2821789 -2451571 -1823099 -1205888
14536 -1205888 -615449 229091 335836 421282 704509 492726 498864 437819 653005 -156552
14526 -156552 -579422 -449849 -355786 -138929 -103445 591083 1366251 1965462 2006942 1667002
14516 1667002 990680 522242 945256 451777 -541624 -1011937 -830918 -770280 -1667107 -2862356
14506 -2862356 -3552781 -3413652 -2551997 -2372840 -2034529 -2083359 -1386173 66928 965012
14497 965012 1214818 357962 29976 92748 423243 572166 1078547 1842337 2217530 1816448
14487 1816448 1171888 210087 -101778 -421253 -1568948 -1552615 -794245 -1239095 -1878753
14478 -1878753 -1675481 -951629 -1616207 -2855081 -2795654 -2004559 -1228884 -1456431 -1908134
14469 -1908134 -1507502 20842 198191 203301 201944 -46183 380783 908534 532528 1043324
14459 1043324 1145096 -344604 -1359606 -533345 629991 343809 28012 -582831 -661343
14450 -661343 -1202514 -1799123 -2172449 -2508987 -2751560 -2739878 -2614949 -2514866 -2246794 -2538888
14440 -2538888 -2200728 -1338623 119613 1596680 2227361 2516218 1623928 -115479 -1309370
14431 -1309370 -992395 -36032 126477 -311666 -288472 966895 1628482 1248024 698113
14422 698113 -188586 -593823 -1075554 -1066695 -1164902 -964652 -980964 -1424756 -2309312 -2750881
14412 -2750881 -2315339 -1739819 -1777988 -2237332 -2095251 -1926700 -2550773 -3784941 -4011713
14403 -4011713 -3987226 -4732728 -4799624 -3928936 -3149100 -2647992 -2298427 -1734373 -1765017 -2279145
14393 -2279145 -2823862 -3079379 -3076670 -2760132 -2887205 -2341632 -1807387 -2013084 -1917280 -1359556
14383 -1359556 -129442 792816 1370732 1803584 1835821 1496576 1112618 1079090 1043793 1227127
14373 1227127 930819 32354 -445014 -610967 -568680 -355982 -737482 -2043136 -2906282
14364 -2906282 -2421214 -1664626 -2146850 -1651825 -208117 462461 65462 -277519 -700736
14355 -700736 -850125 -110578 918719 1448407 1167489 -177835 -1686022 -2486606 -2475774
14346 -2475774 -2068800 -626866 924927 864719 -78688 132066 871946 1088639 731219
14337 731219 -312889 -850986 -1999897 -3176789 -3263111 -2755861 -1884831 -997166 -1090225
14328 -1090225 -1262222 -1175986 -1676432 -1946196 -1533065 -1007197 -892387 -1046978 -699264 -136953
14318 -136953 -630538 -460832 -41584 -116476 685498 1605366 1868028 2996759 3125335 1871895
14308 1871895 586054 -385462 -849234 -808759 -909593 -990464 -1142979 -951037 -678020 -306420
14298 -306420 379974 753099 496670 13281 -230400 -876819 -1750057 -1994956 -1841085 -2081900
14288 -2081900 -1824066 -585064 -19746 -612567 -1483374 -1616837 -1836598 -2321385 -2702833
14279 -2702833 -2515126 -1013347 866711 1192895 170136 -39669 177798 -617224 -1393961
14270 -1393961 -1006051 -696180 -1538011 -1856178 -1826075 -1018388 -683960 -842034 -507008 394535
14260 394535 592021 -363730 -636668 -657436 -497420 205894 1062787 753103 -110050 -488454
14250 -488454 -761253 -1254080 -1573829 -1822927 -1092051 -920852 -585677 -275122 -544047 -506393
14240 -506393 -573647 -651470 -236087 -561155 -1431462 -2031989 -1447009 -204798 42377 -994752
14230 -994752 -2132946 -1870069 -1195723 -1038886 -1260827 -1447169 -1304710 -1251513 -1732839 -2805572
14220 -2805572 -2790136 -2317222 -2141061 -1681529 -1762338 -1078294 819925 1981246 2848113
14211 2848113 2724284 470319 -1688488 -2176460 -1545292 -1583630 -2101326 -3267366 -3487962
14202 -3487962 -2450168 -1457875 -1407943 -1391439 -1713379 -1826550 -1408330 -893998 -761300 -737635
14192 -737635 -485592 -381694 -165190 -232050 -808700 -866579 -220492 -368254 -558500 -1798553
14182 -1798553 -2640337 -2023208 -1365904 -1223625 -1646690 -2109492 -2098568 -2116746 -3434302 -4363826
14172 -4363826 -3646304 -2334596 -1480151 -1526643 -1274320 -426332 549191 1353775 2972883
14163 2972883 3152076 1804489 790400 -601511 -1371505 -532132 235388 172957 -330644
14154 -330644 512074 1360273 788310 -13850 -340366 460586 -137513 -1929331 -2737491
14145 -2737491 -3007328 -3307412 -3557654 -3327910 -3229162 -2956633 -3005332 -2751357 -2116654 -2445984
14135 -2445984 -2725763 -2109953 -763678 -272766 -1034952 -1965869 -2459579 -1255758 -124775
14126 -124775 131273 -261220 -413894 207578 837461 755473 510331 559904 -68684 -1437510
14116 -1437510 -1676891 -787684 -837642 -1509459 -1293908 -1485670 -1887667 -1307701 -1253243 -1337790
14106 -1337790 -1237903 -793218 31367 -119962 -588523 -1566352 -2063003 -1716638 -1996016 -1942204
14096 -1942204 -1130134 303310 2202135 2809076 1602226 322286 268565 -96848 -808735
14087 -808735 -1101964 -1412152 -987447 -118407 -40480 -800234 -1332118 -782160 -299076 755576
14077 755576 1481395 1824721 2247620 2909804 2180429 634092 152797 49184 -359135
14068 -359135 -1266602 -1067246 -924826 -1697278 -1641978 -1040891 -247911 -167311 -927847 -1724272
14058 -1724272 -1698073 -1273931 -1370801 -2101358 -2865060 -2591723 -2268770 -2175302 -2498462 -2458375
14048 -2458375 -1763254 -916113 -554812 -1144046 -1349065 -604153 -66284 160827 -195190
14039 -195190 -531672 -560173 -272392 411197 976189 716664 408826 58419 206494 539116
14029 539116 115311 -650527 -764375 -977286 -1487751 -902919 -468293 -131614 271369 -128463
14019 -128463 -655146 -815228 -461670 -200311 -811178 -1771440 -1936665 -850545 -342374
14010 -342374 -787430 -984090 -545307 -346933 -513016 -611049 -412635 -381092 -526716 -419128
14000 -419128 -1051115 -1217950 -781391 -566483 -267259 -96028 -287951 94691 380659 -178604
13990 -178604 -1016701 -1248221 -969263 -1269490 -851945 -522109 -789794 -1046049 -1518359 -1572785
13980 -1572785 -1002448 -834371 -1276490 -1505549 -1741950 -1334671 -1278319 -616654 696934
13971 696934 945244 1054734 619475 6219 201272 396705 68423 -134356 -711785 -2028399
13961 -2028399 -2528065 -1865744 -1567961 -1748049 -1709840 -1580057 -852457 -188213 -430489 -389904
13951 -389904 57606 -48878 -290255 -686677 -1276260 -1401546 -1054908 -238803 652063 521591
13941 521591 -322280 -830140 -1291184 -1063903 -586135 1047451 1803663 871817 579521
13932 579521 418640 859843 827324 281908 15732 14813 -202509 -418054 -674952 -743927
13922 -743927 -602775 -865231 -1624962 -2035332 -2327581 -1988349 -1714337 -1498172 -1695612 -2104286
13912 -2104286 -2335839 -2096177 -1546576 -1081377 -615220 -361219 -124524 -62165 62262 533103
13902 533103 146925 -244987 -34579 248241 525584 354441 -618708 -1265195 -994081 -567842
13892 -567842 -436517 -678332 -655205 140131 1750215 2885359 2347720 1674517 733768
13883 733768 -786352 -633145 141666 766358 1184372 1106986 737389 1344155 3003901
13874 3003901 3971623 3943989 3198678 1815544 865229 148213 271641 634373 23863
13865 23863 -203842 357510 1306360 992748 790791 -102037 -1923154 -2620149 -1698535 -937809
13855 -937809 -415303 232013 376793 486864 327679 -704478 -843277 8855 461152
13846 461152 1141207 1665515 1791713 1361640 830673 607976 531945 1042341 1953806 2174016
13836 2174016 2295642 3298581 5470626 8667842 11368955 14651150 18716843 23422437
13828 23422437 28670621 34326350 40875151 47582450 52292518 53602134 50137610 40642066
13820 40642066 29283573 20413979 14583215 10859215 8627607 7260485 6226755 6358770
13812 6358770 6348817 5532108 4766649 3869161 2656925 1837934 1281663 169064 -753700
13803 -753700 -1247276 -1187930 8051 1337473 1753824 933181 159865 -255921 -922739
13794 -922739 -1316069 -1253790 -252047 45196 -556601 -592559 -319137 96042 56926 -370455
13784 -370455 -1046686 -1171812 -333748 1237556 1912239 1806560 2156532 2623408 2423876
13775 2423876 2341272 2617200 2665008 2158990 1651021 1376826 925593 388101 -422736 -184970
13765 -184970 996574 1608835 1616048 1276982 447118 337619 832502 934971 731723 805410
13755 805410 -5567 130265 415767 588732 871413 1398164 2157773 2099568 1571174 1058575
13745 1058575 79595 11984 68242 289900 819923 1621113 2211984 2380655 2175183 2268205
13735 2268205 2894727 3496058 3665602 3939621 5358571 7304335 9883676 13082095 16789458
13726 16789458 19322405 23246337 29608587 38737420 50785143 64396823 78251696 90495869
13718 90495869 99976447 102920798 97455993 85687847 70583322 54339498 41027103
13711 41027103 31524178 24486155 19210961 15386726 12788100 9917288 7296903 4393031
13703 4393031 2694081 3051548 3642557 3313028 2207728 2191654 2700725 2815342 1925275
13694 1925275 1161041 470042 78451 373756 662102 1039001 2207657 2414564 2006475
13685 2006475 1635580 1631088 1371493 918577 -63927 -784544 -123211 762322 835238 -50499
13675 -50499 -74749 1075228 2065969 2093015 1740489 2712071 3299358 3179775 2953622 2288832
13665 2288832 2055718 2138474 1921584 1831836 1434707 179934 -999238 -1237651 177350
13656 177350 1085327 376791 -453615 -74801 375616 734391 1139866 1400922 1479464 2314074
13646 2314074 2810843 3020596 3236633 4343533 5001499 4869220 3748183 2605027 1652630
13637 1652630 984418 518921 352981 175698 503746 554948 -278296 -1123853 -1709482 -1790125
13627 -1790125 -1327588 -856614 -614150 -371856 -401591 -488451 -489149 36808 438436 595146
13617 595146 823653 679832 251899 919451 2414482 2671156 2078694 792226 -496139
13608 -496139 -895261 -1673536 -2100695 -996294 1023965 1722350 1421743 994782 969608
13599 969608 1347297 1905987 966089 -188807 -676660 -696311 -612894 -799479 -1163611 -926322
13589 -926322 -954686 -1546944 -1847631 -1486604 -701091 -173464 -409349 -480697 891363 2727920
13579 2727920 3330176 3528349 3327309 2669608 1361433 1165081 1359594 756273 -63154
13570 -63154 -325336 -658840 -1629729 -1340070 -348975 1043827 2047413 2734733 3354079
13561 3354079 2379938 1693624 1073085 16917 -564657 -281818 274892 -100967 -1015889
13552 -1015889 -1167808 453019 2074094 1746101 632695 29661 220676 810722 768386
13543 768386 981808 1723154 1667449 1334106 721572 -402401 -882001 -965231 -832780 -835605
13533 -835605 -99951 1061329 1569803 1528200 954848 212875 -353914 -1201807 -1732505 -1062247
13523 -1062247 -227409 726015 779172 22493 77785 672883 1508418 1492180 508186 788909
13513 788909 2034750 1930165 960827 14103 352845 1082812 1806374 2126645 1814148
13504 1814148 1621310 2585771 2557882 1114962 288984 -759689 -1332401 -1426620 -1037592
13495 -1037592 -97122 429656 768269 1002849 2121815 3326865 3532363 3150508 2130313
13486 2130313 1061014 415655 482828 1323724 2103784 2108519 2200013 1330063 -2785 -721485
13476 -721485 -1222541 -823623 -523155 29993 1309754 2376514 2464102 1927517 1473862
13467 1473862 1788265 2043394 2237836 2071682 1514093 1922337 2701727 3345662 3188556
13458 3188556 2688168 2721634 2230375 1979503 1882559 1424628 1084449 -268061 -1378983
13449 -1378983 -1192085 -612905 -90437 -708952 -881084 -645239 -379613 -1219791 -1095691
13440 -1095691 -20744 485350 121331 -656935 -509048 435767 491994 -545489 -1465991
13431 -1465991 -2023666 -1065691 -607373 -195566 832021 2511746 3291271 2342097 1112969
13422 1112969 -240448 -893867 -416007 -54164 -666460 -1258121 -1153794 -1274897 -1511673
13413 -1511673 -1302518 17491 937431 954012 780482 395501 -940562 -973851 524956
13404 524956 1798150 1511767 637960 399048 84369 -87778 -8204 12731 -272268 -129618
13394 -129618 -139283 -618536 -1515823 -2053548 -2345971 -2746415 -2382657 -904199 175521 304319
13384 304319 623000 1647405 2927073 2984831 2226502 1218977 734351 439704 443153 607366
13374 607366 347889 354356 146423 161019 520046 1144694 1251181 1360565 1467867 1535526
13364 1535526 674716 -110753 -693789 -735076 534827 1786963 1495598 183304 188282
13355 188282 1360198 1196980 1018868 776831 -355937 -197805 581812 1081118 617461
13346 617461 604840 1734822 1612062 1265269 1475892 1068234 43019 -675425 -1403404
13337 -1403404 -1212727 -492083 -270626 120982 421660 -482975 -1122162 -761421 -774321 -784456
13327 -784456 144105 1684504 2346808 2440047 3011601 3382962 3153071 2080932 955554
13318 955554 346023 131603 -375340 232764 955807 674799 -151780 -885418 -628887 61330
13308 61330 212462 422063 349926 -215248 -581329 -117646 176995 -692878 -1158402 -520256
13298 -520256 216679 669637 698712 666402 630281 -273381 -1130224 -983956 -541475 -343795
13288 -343795 194560 766839 1190158 1335459 1089724 835280 340377 -294563 143984 1176132
13278 1176132 1659784 1837627 1878586 1640854 1147726 173851 -134255 331556 682521 277651
13268 277651 46986 608217 1006749 789972 318248 43627 191620 934336 1446451 761644
13258 761644 129286 341160 1560173 2788717 2915820 2611195 2323479 1051150 734512
13249 734512 1441265 1637050 2219455 1765275 -2872 -1249906 -1058908 -905167 -918933
13240 -918933 -716340 -776053 -397446 41007 55750 -773006 -1485648 -1592595 -1393880 -1067083
13230 -1067083 171756 637950 828583 1063752 1484735 2359257 2775926 3014198 2688706
13221 2688706 1230589 -68694 -718343 -873444 -820054 -1427931 -2221897 -1834387 -1714789
13212 -1714789 -1461908 -696238 -798124 -1031597 -1127528 -817306 -571884 -731873 -32527 646556
13202 646556 488835 -156623 -507488 269420 1501985 2210777 1831863 788777 -164623
13193 -164623 -225500 590625 1702703 2267543 2635017 2489972 2064161 1891217 846758
13184 846758 592709 803211 1356539 1859633 1900476 1291893 547844 551610 32208 -654113
13174 -654113 -784307 -343439 -577507 -1161499 -1712524 -1256345 -12054 459970 1109753
13165 1109753 2317536 2402501 1752165 1879655 1967990 1479408 1413062 1187884 1524779 2620057
13155 2620057 3134313 3163592 2918532 2914887 2689997 2434802 2927671 3991728 4967050 4438903
13145 4438903 3086262 2804053 3195533 3511929 3392751 2836876 2387516 2496382 2036856
13136 2036856 794835 -223441 1190 1472664 2633523 3273121 3315756 3482479 4435374
13127 4435374 4961222 4855694 4759974 5754602 6109592 5202654 3692470 2854941 2880826 3135881
13117 3135881 3205674 2713119 2482056 2971498 3535165 4172609 4637667 4266679 4198334 4432633
13107 4432633 4061558 3087687 2222682 1550789 1504196 2109787 3444460 4691750 5170256
13098 5170256 4946814 3919770 3407755 3773370 3512332 3420064 2788745 2482970 3023864
13089 3023864 2970740 2732916 1752560 1306243 1339449 2399190 3509284 4018549 4474318
13080 4474318 4971492 5726972 5886457 5316888 5073482 5282620 5645001 5206125 5114330 5883047
13070 5883047 6544861 6765113 6828029 6204879 5718448 6215485 6224850 5804366 5902954 6236048
13060 6236048 6277264 6486098 6378694 6852584 7597667 9299617 11379944 12028640 12993352
13051 12993352 14761676 16150210 17929610 20581581 23817702 27018660 29873726 33640205
13043 33640205 37696478 42633618 48524236 54420866 61523369 69473250 76688965 84056642
13035 84056642 92119655 100806868 111241121 123023325 136174280 151289382 168215949
13028 168215949 185178193 200284177 212176422 221870486 231379545 240788697 250305327
13021 250305327 260019069 269319724 277966293 286650554 295211296 301649376 302777514 296365695
13013 296365695 281591514 259428138 232570097 204782195 178580419 154330590 132922673
13006 132922673 115245960 101500771 90284993 80850191 72391600 64992912 58320488
12999 58320488 51735375 45732740 40221135 35541277 32231884 29544247 27496802 26085865
12991 26085865 24676308 22811531 21626195 20720737 19650629 18939218 17014981 15701904
12983 15701904 15785733 15248515 14605227 14623470 15064339 14226910 13236464 12831781 13414428 14990184
12973 14990184 15978119 17161440 17811410 18392521 19621294 20021234 20429672 22356009 25051642
12964 25051642 27469692 28999625 29849476 31118805 33892101 37431959 41534315 46308163
12956 46308163 51073245 55847977 60921970 66366013 71526266 76794900 82977292 89897107
12948 89897107 96525979 103944554 112303034 120917722 132650729 147950229 165063178 182658702
12940 182658702 199908178 215322603 227680391 237176165 246632389 257886804 268901706
12933 268901706 277244683 283818059 290927519 300588169 309848010 314104853 310132511 296178907
12925 296178907 274781069 248097093 218262848 189295567 164137929 142459739 123755638
12918 123755638 108748344 96592060 85922273 76092044 67234261 59635467 53089526
12911 53089526 47528387 43479754 39773801 36326204 33916649 32006947 29559958 26545307
12903 26545307 23595857 21014016 18907030 17692796 16984322 16519680 16486993 16056644 15348912
12894 15348912 14922514 14479611 13870872 13726237 13495238 13320645 13754837 14598963 15029925
12885 15029925 15491520 16068685 16164799 16416507 17411985 18472497 18826374 18483359 19830206
12876 19830206 21357816 22375244 23078923 24446345 26307086 28127006 31512773 36276314
12868 36276314 41374476 46632959 52046019 57731041 64223148 71569368 79267565 87166158
12860 87166158 95370591 104530301 113932301 124514240 136943254 152109382 169107516
12853 169107516 186179684 202765204 217370604 229254488 239505751 249881174 260982623
12846 260982623 271346560 280829977 289317663 297418881 305222393 310749092 309110756 298321051
12838 298321051 279927892 255150723 226872436 197956775 170681531 146544670 125287259
12831 125287259 108579468 95043348 83264225 74015066 66110615 57652816 49067319
12824 49067319 42314069 37416655 32383746 27266883 24141619 21558249 19020243 17772162
12816 17772162 17227362 16350973 15704842 15772318 15042798 14415602 13309034 12180291 11220634
12807 11220634 11012384 10988278 10817897 10401850 10048260 10125084 9986298 8794861 8127926
12798 8127926 7728027 7171825 6470831 5960714 5546073 4989209 4775196 5092843 5750752
12789 5750752 5387270 4861961 4254081 3569977 3149464 2597245 2428370 2998789 3292560
12780 3292560 3729176 4338136 4747298 4098183 3569937 3622449 3663294 3233206 2946177 1987850
12770 1987850 1268610 1537169 1600257 1091166 1229544 1943386 2197860 2910863 3722399 3141520
12760 3141520 2056335 1909468 2330271 2981786 3124812 2449775 1709465 1786161 2950177
12751 2950177 3524177 2652697 1782867 1689269 504316 -428606 -206228 997109 2018286
12742 2018286 1300057 32706 -266955 434928 1210250 1398933 800032 224673 660169
12733 660169 1492294 2789958 3137266 2245964 1301916 1058930 647590 1078932 1433154
12724 1433154 2035285 3141994 4504289 4811699 4101236 3005845 2314138 2104142 2422809
12715 2422809 2864446 2854903 2576226 2465445 2309815 2538925 2851448 1904348 317540 -628975
12705 -628975 -419679 -274221 -46575 865919 1648969 2765886 2744943 2427870 2513414 2379962
12695 2379962 1962084 1542757 2745733 3510042 3382958 2481156 798597 588465 1031227
12686 1031227 1017137 1225694 1445386 542524 -777724 -1316354 -921343 -265782 180959
12677 180959 870643 1222928 1122392 1219008 2000185 1837529 1334920 1425288 1881192 2226123
12667 2226123 2439866 2373826 2143807 3022796 2800971 2286747 2387769 2461964 2790584 2740516
12657 2740516 1709233 668436 460710 983736 901900 1045077 1859368 1630886 1033104
12648 1033104 689449 591773 687012 598727 422776 431111 -193291 73939 1479998 3320504
12638 3320504 4571619 4188519 3080801 2206081 1715566 1560014 1843419 2019404 2098875
12629 2098875 1930457 1663937 2214520 2144247 2045963 2199898 2213324 2673032 2120181 1905865
12619 1905865 2093374 2410538 1802819 2053874 1892357 933491 445479 782059 702693 163125
12609 163125 101997 8759 1220649 3072519 4083107 4041001 3923160 3605648 3330135 3103614
12599 3103614 3175711 2935585 2445985 1874928 1331660 741097 391364 300322 962638 1905784
12589 1905784 2178082 2455114 2619329 1870233 1344000 2088975 3515735 4025013 3471360
12580 3471360 2950762 3564897 5059009 5535492 5358023 5768637 6652463 6647235 6512756 6970372
12570 6970372 7846907 10027772 11688661 13165634 14550717 15147574 15329194 15148977 14187168
12561 14187168 13866347 15221884 16671548 17399038 17734450 18563900 19353199 20411250 21543648
12552 21543648 21793930 22742126 25235100 27677097 28889070 28782177 26703110 23401242
12544 23401242 19557531 15733512 12932944 10395663 8483232 7209581 6525149 6145668
12536 6145668 5819966 4922139 4504277 4223983 3614865 2182900 1291212 1531382 1679791
12527 1679791 1499879 1483077 2280323 3903199 5105476 4887703 3702089 3194047 3456674
12518 3456674 2734972 2177144 1438011 978725 1230286 1546595 1732695 2851556 3703526
12509 3703526 3743434 3747315 3844565 3590462 2941199 2485530 2304416 2119098 2520900 3015952
12499 3015952 3116691 3212966 3058080 2469267 2274093 2505878 3178903 4565976 5215457
12490 5215457 4682137 4533050 4046597 3548693 3772639 5193890 6159225 6802371 8281659
12481 8281659 10072061 12465721 16301516 22268941 30515078 41126856 54722520 74078006
12473 74078006 101153175 132672194 152379400 137452884 100491739 68490525 47440799
12466 47440799 35052576 27004138 20614584 15702703 12910978 10652543 8459629 6917664
12458 6917664 6558621 5958151 5329463 5071087 4598138 4069410 4049182 4139301 4846960 5937713
12448 5937713 6229120 5871095 5228679 3970582 3103370 2870524 2908094 3127184 2933445
12439 2933445 2720201 2660186 3410699 3034587 2099271 1906102 1795990 1945060 2294536 2519513
12429 2519513 2377567 2317294 2095753 1995040 1785682 1265148 1101489 1867278 3249867
12420 3249867 4151952 4777677 5086755 5135457 5140052 4679764 4596728 4933875 5502222 5300548
12410 5300548 4206971 3436262 2945879 2972842 3116758 2338193 1417049 1419184 744273 342856
12400 342856 944341 1401890 1040942 604601 -330783 -1151378 -1266844 -861885 53576 649500
12390 649500 572569 991148 1270893 909868 219586 101659 540580 1006619 1639325 1730289
12380 1730289 1559175 940692 -225323 -844780 -1205651 -1172765 -173695 164080 -36550
12371 -36550 -633271 -93305 829468 480349 487714 1111176 1718721 954617 -979401 -2457579
12361 -2457579 -2199212 -1145032 -55704 910533 1191192 527125 508750 -66518 60279
12352 60279 1049740 1538831 1467945 960869 553507 822885 1387583 1073397 1371112 2450224
12342 2450224 3836550 5933180 6767906 6836807 8091540 9077641 9892011 10662574 11251997
12333 11251997 11860859 12553190 13443858 14560549 15737589 16338971 17495506 18925426 19286459
12324 19286459 18381934 17404842 17857399 18538787 18546083 18930632 19952686 20412324 19338338
12315 19338338 18790813 19853641 20910497 21339875 22157948 23574963 24567610 24737032 24459353
12306 24459353 24677114 24866601 24185454 23767134 23976877 23518106 23126853 24106827 25948877
12297 25948877 27520132 28835167 30477226 32418705 33385267 33881152 34675821 34865946 34333505
12288 34333505 32490988 28827474 25163704 21033980 17009199 13736064 11409962 10279737
12280 10279737 9687761 8783537 7687604 6455645 4934844 3908032 3944776 4172925 3936343
12271 3936343 3115796 1661664 560282 126185 639831 1303824 1453434 1974270 2652542
12262 2652542 2874698 2475322 2292888 2216227 1762327 1298470 1511123 1843069 2063868 1739968
12252 1739968 1653518 2104418 2351670 1994034 1702441 2134233 2746043 2835456 2631644 2048429
12242 2048429 1635479 2233562 3241245 3230622 2013666 1673601 1115646 710476 991602
12233 991602 317079 -875621 -2163382 -2953962 -2358415 -1002366 -634876 169852 1013172
12224 1013172 942236 1090958 472289 -207230 439607 1261624 618177 222453 1278960
12215 1278960 2593171 3106259 3029352 2662574 2001032 2335059 2490748 2127695 1439655
12206 1439655 1011749 795445 14038 -1035441 -832574 -558232 -911591 -362518 1127670
12197 1127670 2445622 2870149 2668633 1900126 604667 -199730 4483 -345005 -169621
12188 -169621 99787 62267 566183 1062537 400690 -132988 924334 1933960 1780066
12179 1780066 443646 -95420 488520 311407 195351 281308 -590723 -1468223 -1987118
12170 -1987118 -1786137 -531386 782549 845684 -30178 -442548 -632287 -1041462 -1213302
12161 -1213302 -1344723 -1395335 -1326022 -1203888 -502093 263736 466097 -150509 -1198635 -794806
12151 -794806 -233804 -21376 -921159 -1417394 -633039 -329117 -135761 -214769 -743971 -1119328
12141 -1119328 -861002 -249637 950886 1525478 1352588 500639 -986836 -1727293 -1343569
12132 -1343569 -716906 -294308 438459 298802 -836962 -1264598 -1273817 -1564334 -1356354 -751686
12122 -751686 -104656 -154432 -362877 -354665 -194330 -23507 833532 1401067 1377541 138504
12112 138504 -1049814 -910814 -486218 -34121 -857095 -1950624 -1521751 -1023162 -1770366
12103 -1770366 -1858128 -1638283 -1163243 -997669 -1307400 -1069666 -651754 254954 982604 752888
12093 752888 304669 -3427 334587 467623 810968 1041866 1199001 2089507 808656
12084 808656 -642667 -349119 362346 772128 305678 -37210 -420690 -614774 -333110
12075 -333110 121607 658394 881767 686921 517988 413486 194710 -45748 243976 429430
12065 429430 752900 -100573 -798023 -731554 -906374 -2125942 -3177474 -3010092 -2342528
12056 -2342528 -1212805 -928460 -1116125 -2075223 -2321822 -1918346 -1427983 -340203 696343
12047 696343 641290 -237718 -640268 -1092773 -1123727 -1351755 -1986670 -1403907 -442477 578168
12037 578168 667142 254941 315074 164250 -618975 -1154621 -1256132 -1594822 -1769044 -1511366
12027 -1511366 -1822344 -2261349 -1498215 -411819 403703 654319 563004 326648 97561
12018 97561 89836 216554 381360 941450 971704 -112703 -350115 -75587 -292202 -520782
12008 -520782 198839 559899 418001 91113 -438347 -1196631 -1919418 -2204252 -1672436 -1056788
11998 -1056788 -1544955 -1724411 -1602746 -1267345 -1407686 -1465426 -1160593 -1207296 -1116982 -2131472
11988 -2131472 -3513940 -3936659 -3412212 -2967512 -2208940 -1362174 -949110 -990793 -1562523
11979 -1562523 -1534168 -369626 211048 -56539 -435508 307770 771493 706816 989463 1340904
11969 1340904 1674474 1644536 1843162 2399588 2894203 2803266 2338276 2061590 2041242 1017920
11959 1017920 520345 549584 376169 160659 -204690 -768791 -1499859 -1713550 -969198 374057
11949 374057 1461991 1453462 572626 435742 842155 508480 218354 40085 53283 -12437
11939 -12437 63711 -178812 -487978 -732975 -1754196 -1466835 -600656 -949353 -889239 -1057235
11929 -1057235 -945540 -820518 -652367 81805 853471 209466 -323983 -787441 -2145209
11920 -2145209 -2359922 -1429682 -321937 709541 1036590 721139 109937 -351530 -727019
11911 -727019 -721603 -1258078 -915287 3210 617587 1089625 1048486 954657 731330 526495
11901 526495 846149 1578078 1703835 1420400 1172668 802342 169030 457296 813539 243157
11891 243157 -462835 -325957 -359160 -1038691 -1387063 -1171744 -615928 -828946 -1022096 -27449
11881 -27449 724560 435167 311511 -271311 -633481 -824068 -393797 -143168 180304 413797
11871 413797 -122176 -567019 -977012 -1228031 -617486 -118236 245815 595572 364196 -387134
11861 -387134 -687307 125207 1642908 2592835 2804002 3102827 2301679 1340277 768159
11852 768159 628290 377376 -522942 -688534 4968 983266 1815454 1906904 978331 -579405
11842 -579405 -1486605 -870789 -672706 -1307000 -2744874 -3750439 -3059482 -1250829 -158466
11833 -158466 -524871 -535205 -257164 -1340391 -1282213 -383052 309071 691494 856162 1121927
11823 1121927 1480416 1725696 -90377 -2040015 -2175723 -1033008 -516156 -890093 -847341
11814 -847341 -1795805 -2237188 -1294488 -1144497 -1254433 -1137549 -1184063 -1341367 -1956918 -2522641
11804 -2522641 -2297083 -2100469 -2062439 -1731878 -1079118 660419 2320397 1700474 -43929
11795 -43929 -1304664 -845893 -950828 -1199605 -1264300 -1294506 -1359633 -1379190 -982258 -340909
11785 -340909 849830 1746027 1768130 1724689 996351 -163531 -122997 262415 218305 231982
11775 231982 95072 -524543 -315089 -492412 -730421 -192001 -250653 -119920 624136 1291006
11765 1291006 360996 -900497 -1652415 -1259699 -222197 439978 156744 83459 454379
11756 454379 827394 1118658 1617180 1422885 1116776 572113 -330548 -92438 288662 533118
11746 533118 559731 2331 16749 338123 1111451 1037514 749735 920085 998595 108090
11736 108090 -689090 -348425 -889848 -1891703 -2587644 -2951366 -2661078 -1787845 -379151
11727 -379151 575854 1352123 1625703 1026535 1103035 1253936 519289 1116371 1926032 2035897
11717 2035897 1876476 1134118 274074 -297050 -553347 -870069 -1456010 -2037125 -2172668
11708 -2172668 -1428424 189220 1143921 720929 -43879 -799337 -1277706 -396499 -167118
11699 -167118 631349 2313691 801282 -2675363 -1720936 1002204 1654210 1200053 301408
11690 301408 -756945 -1257109 -1868911 -1602508 -778902 -1741133 -2122907 -1956794 -1821537
11681 -1821537 -2604709 -2518616 -943944 583415 676574 319136 500008 241813 -334043
11672 -334043 -1103567 -1787710 -1670214 -949251 93410 -173146 -932393 -509003 -355081
11663 -355081 -803841 -1347246 -1161797 -901085 189859 482658 -696155 -1660564 -1511962
11654 -1511962 -607467 409559 865184 497019 140753 514274 803986 315279 -259511
11645 -259511 -1195744 -1632037 -1846678 -1627921 -1090344 -1227157 -810276 -105994 641459 88580
11635 88580 -1427761 -1867554 -910448 207312 869473 753856 -182095 -822666 -770467 -1008868
11625 -1008868 -1550041 -1811044 -1698474 -1000215 -820369 -818138 -862374 -971418 -1467758 -1422545
11615 -1422545 -606391 -725615 -1227510 -1830709 -2354535 -1779719 -767143 -31258 -289547
11606 -289547 -953558 -1064757 -1284580 -1879790 -1704605 -1566285 -1256953 -1100400 -1402520 -1043448
11596 -1043448 169335 1001175 1242540 1552124 462474 -1078784 -1087237 -460542 -409638
11587 -409638 -800553 -759228 -125409 285732 317468 320851 259920 -31840 156263 248339 -149310
11576 -149310 99573 784307 821509 792025 739107 -210128 -1245869 -1466388 -975707 -544579
11566 -544579 -434475 -606240 -986820 -479787 654199 1083665 646298 211635 356545
11557 356545 446608 234920 905995 1792551 2063116 1686453 1457262 2505865 3050279 2881903
11547 2881903 2583414 2498107 2809284 3393308 3714215 3631468 3501329 4074236 5234403 6329016
11537 6329016 7273206 8673691 9588718 10045524 10592074 11134048 11658346 12498867 13901083
11528 13901083 14894650 14792931 14518772 15015365 14933763 14709476 14354103 13906447 13649499
11519 13649499 13495400 14147464 15426910 16551904 17099616 16809421 16362722 16326359 17497267
11510 17497267 17988559 18240633 18219879 18236675 18896902 19660776 20480952 21121796 21387841 22110523
11500 22110523 22872252 22740363 22159926 22148264 22040589 21733890 20595596 19972739 21137728
11491 21137728 22782747 23047055 22958794 23632446 24016051 24773948 25378352 25519901 25806741
11482 25806741 26736905 27148976 27113016 26101772 24277116 22922141 21450720 17960573 14663332
11473 14663332 12699751 10695386 8943048 7541240 6434097 5057415 3400408 1875478
11465 1875478 1305881 950008 300501 -215597 -593654 -103489 726253 358668 -440917
11456 -440917 -463846 -742575 -1251825 -1298756 -367925 -309924 -681934 -451872 570835 1033930
11446 1033930 686618 672940 57764 -323923 -387975 499788 1427795 1367079 690871 -494992
11436 -494992 -1204986 -873039 -833409 -883815 -1538362 -1724893 -1209546 -1019533 -491698 -563720
11426 -563720 -1951927 -3652775 -3816055 -3362959 -3198981 -2424207 -1583124 -1519783 -2227542
11417 -2227542 -2889000 -2589104 -2024596 -2285837 -2477414 -1856101 -1889212 -1864709 -1405640 -685234
11407 -685234 345717 571065 993514 1898085 2346437 1696820 675059 -102505 -371698
11398 -371698 -259387 83434 629041 1923630 2321403 1714028 1277741 439378 115594
11389 115594 274220 209271 32249 -235261 -342622 3107 12856 -292646 -201170 112173
11379 112173 -427828 -2297385 -3461518 -3181765 -990405 1250747 3253170 4027964 3307717
11370 3307717 2514191 1736610 2414647 2227328 1458883 1159169 927008 1227952 1632746
11361 1632746 2050832 1863535 1519184 1427628 1361504 1560270 1140501 604743 667942 904928
11351 904928 1812145 2514887 2698282 2569388 2481188 1818246 892190 528978 1085737 1146169
11341 1146169 1047704 386166 -732362 -520257 -275416 -481947 43140 636486 726075 1009702
11331 1009702 1106935 581058 77133 -507210 -940397 182739 1392609 1915238 2046358
11322 2046358 2263944 2445933 2253083 1866148 1087307 90870 -381904 -231830 445583
11313 445583 72738 -690072 -1169268 -1277461 -860557 -255487 -524692 -1057983 -706732 -545473
11303 -545473 -184285 818810 1984556 1378877 825054 1373375 1449312 1063596 1008100 1637939
11293 1637939 1275953 1223609 943458 1429655 2625300 3539673 4515591 4679519 3704084
11284 3704084 2380186 1302323 513403 1322969 2416237 1361388 74239 54767 -235569
11275 -235569 -442638 -97591 -24353 189259 -347236 -1484297 -1616601 -1109080 -683406 -298595
11265 -298595 348656 1192639 1624386 2094515 1826831 798098 -25715 -223678 -361837
11256 -361837 501490 221828 -391110 -57299 -26318 -279466 -562344 -183909 808577 1238887
11246 1238887 764488 789364 1361370 1907297 1314716 603182 -413721 -986978 -1089486
11237 -1089486 -505784 192339 290906 -82094 -1455323 -2806619 -3068206 -3090371 -2786209
11228 -2786209 -2269481 -1398055 -857888 -1056386 -1656953 -1680922 -1690124 -1769461 -2166468 -2709461
11218 -2709461 -2700352 -2117241 -1342475 -863298 -671696 -265074 430766 929433 797920 191623
11208 191623 -364582 -951498 -775900 -135536 -170150 -404558 -520190 -970634 -798433 363922
11198 363922 1418631 1197246 410930 -289156 -64983 1135593 2397637 2601088 1840301
11189 1840301 1186649 1341136 1814411 1709407 1157339 170132 -459599 -577126 -688225
11180 -688225 -790951 -871836 -624949 343920 1204466 741767 107283 -686186 -1147518 -1041833
11170 -1041833 -1076267 -1004070 -1234927 -315223 611062 -79022 -1149592 -1155578 -686022 -800919
11160 -800919 -880330 -500989 -496316 -1458739 -1599894 -1198959 -1189533 -540873 -112294 -275551
11150 -275551 -860177 -990386 -224926 439962 519890 80332 14955 262050 110226 -283654
11140 -283654 -625497 -679457 -82434 586143 1116171 1895273 1590458 68566 100230 1078195
11130 1078195 2596765 3952289 4067260 3351487 1975088 1179152 1114508 459513 -833511
11121 -833511 -1331661 -839289 -558638 -507225 -249207 191608 582678 1193285 1729271 899297
11111 899297 -465126 -315689 180832 307957 -461146 -1827119 -2454534 -1902225 -553238
11102 -553238 1140065 1819343 1784533 2175861 3003703 2329115 743691 -481872 -421452
11093 -421452 223371 796291 1048367 745037 72176 -244172 -238414 -73217 -121086 -577431
11083 -577431 -837673 -1013405 -1137563 -1294816 -1523517 -1577599 -862467 -804737 -1299614 -1175626
11073 -1175626 -947757 -1007357 -1039761 -491180 -100412 -625217 -1704147 -2766123 -3919421
11064 -3919421 -4557963 -3922454 -2973458 -2735610 -3293936 -3025270 -2485015 -1473241 -676198
11055 -676198 -591387 -643762 -229778 161357 -867047 -1252065 -1007372 -1421912 -1348305 -1389647
11045 -1389647 -1914991 -1948838 -1524313 -1035780 -905285 -233567 589145 1298064 1464255 1362083
11035 1362083 2387895 3507083 3201745 2015050 401978 -1302849 -2634541 -3017386
11027 -3017386 -2703575 -2210351 -1220570 -977108 -1031556 -1025766 -1094545 -977759 -320123 -200482
11017 -200482 -908767 -1767058 -1329458 -781954 -698734 -244778 -27808 -138663 -298757 -1082913
11007 -1082913 -804545 534756 1758662 2533350 2105134 996917 606982 70465 -1391496
10998 -1391496 -1586548 -1243212 -1529489 -634541 136617 -1075436 -2383459 -3157022 -2891467
10989 -2891467 -2279019 -1042823 321375 1130858 1053620 -352109 -486025 174641 384217
10980 384217 -35185 -872343 -916412 -241730 369079 243245 22753 -339723 -869088 -1399720
10970 -1399720 -762400 23729 -368994 -896132 -1389977 -1616720 -578314 460054 1050095
10961 1050095 1354809 1740797 2139929 1871160 1276974 1267826 447998 15252 671442 962403
10951 962403 372254 400607 231426 135395 457216 867646 526284 -150684 -339321 -770605
10941 -770605 -744039 -310233 128521 240617 662899 66537 -1070799 -1788537 -2422476 -2744883
10931 -2744883 -2282608 -1368289 -708006 -644008 -573602 -1134576 -1167501 -26750 606899 -33887
10921 -33887 -334991 -409905 138601 -20314 -1056859 -2347826 -2542997 -1542935 -1022918
10912 -1022918 -525016 114628 -220383 -725924 -717360 -96920 -167673 -89270 -198890 -661575
10902 -661575 -203485 244468 -160575 -489904 -686118 -589845 285749 1081992 1686089 2018321
10892 2018321 2013428 1704681 1819689 1760809 629570 -90482 654692 1167578 1159503 732094
10882 732094 41991 411133 481696 -721043 -1599159 -765071 -85008 -202312 -278393 -261769
10872 -261769 -537735 -823768 -480234 -564953 -743914 -552065 -619668 -949896 -1108156 -478657
10862 -478657 -223414 -1380024 -2513350 -2222933 -1882420 -1663741 -1153960 -699736 -532170
10853 -532170 27247 690170 713840 832319 617047 -439464 -1034770 -462485 207053 865279
10843 865279 1087794 902803 87537 -407127 -1132832 -1802624 -2171239 -2001591 -530103
10834 -530103 84682 932050 1673653 1089759 558073 566745 831326 433165 295825 757284
10824 757284 828805 385625 -969731 -1081070 467812 1344722 796840 667245 400910
10815 400910 -1111484 -2513694 -2941054 -2325168 -1558808 -945925 -195778 457722 1407097
10806 1407097 2121276 1886892 644516 -293121 -861824 -620224 -148433 -542400 -222712
10797 -222712 -71989 -20842 1228180 1741918 674612 694712 526515 25099 146671 135199
10787 135199 -59081 -161984 347879 267485 -277403 121806 1314029 2251590 2379760 1750692
10777 1750692 304292 -607029 -630249 -100381 604164 1226062 1407501 1413897 572595 171730
10767 171730 -227334 -411386 178292 -126819 -1130151 -1646708 -2088986 -1484595 -481384
10758 -481384 -393983 -333889 -1138767 -1986021 -2123205 -1811586 -315259 716961 1165927 2104683
10748 2104683 2228713 2032443 1945533 1522441 1422383 1693869 2883178 3241428 2917709
10739 2917709 2438304 985431 130428 -623636 -1107184 -705988 76238 642380 539805
10730 539805 -175600 -515882 -784154 -1410613 -1666819 -1891995 -2060639 -1473649 -1130708 -1088421
10720 -1088421 -859067 -550827 -904456 -1526446 -1899459 -1465878 -988209 -787847 -24931
10711 -24931 800488 1068375 591243 -277917 -424285 231923 407096 593332 228928 -414427
10701 -414427 -78513 436915 77397 -201329 157114 -413476 -908787 -788098 -626390 -1424838
10691 -1424838 -1293954 -439046 -734155 -1156533 -1773615 -2291448 -1788840 -668276 217453
10682 217453 1158501 1656495 986564 -56638 -747948 -1314261 -1124233 -1196627 -1622308 -2284899
10672 -2284899 -3167042 -3059132 -2483877 -1998391 -1875288 -1771180 -1670333 -2022475 -1758770
10663 -1758770 -1373895 -746573 797096 1842218 1098983 498883 776470 559974 199841
10654 199841 104376 329925 853517 946651 892726 1336939 734210 -280446 -597857 -297214
10644 -297214 251777 612380 111585 -496657 -527622 998468 3078061 3709310 3346494
10635 3346494 3271017 2711956 2498302 2445501 2482583 2002729 996997 527330 332248 399342
10625 399342 -216126 -1627876 -2617760 -1704407 -686494 -413047 -645257 -627890 -307299
10616 -307299 -847052 -2019994 -2746243 -2839498 -2408299 -1418043 -917681 -1446537 -2030995 -2582045
10606 -2582045 -2924242 -3006654 -2094636 -1564818 -1866360 -2218600 -1701285 -1484160 -1853279 -2419078
10596 -2419078 -2379997 -2207375 -1793289 -1506880 -1292110 -529742 276483 309849 869294 2053917
10586 2053917 1967536 288069 -741960 -1443260 -2190408 -2817045 -3815753 -3868474 -3006384
10577 -3006384 -2464926 -1564872 -830888 -901196 -1351753 -1289373 -1487428 -1805389 -1851717 -2589022
10567 -2589022 -2465365 -1560625 -695017 -875794 -1007705 -725544 -915830 -900970 -373591 -624059
10557 -624059 -1190530 -2149651 -2619064 -1937235 -1212711 -1023652 -561762 -238901 456125 1448099
10547 1448099 2207879 3134703 2541419 906381 -88188 -209132 -390077 -380483 -410035 -391258
10537 -391258 376018 1086161 1461262 1393363 964025 1255165 1603061 2557267 2644533 1676352
10527 1676352 591376 457678 652157 450484 846855 1374059 2150350 2404449 2598147
10518 2598147 2358741 1620511 953695 528912 -70633 -821628 -1732840 -1913869 -1127853
10509 -1127853 -426603 -578427 -387534 315856 225323 220000 90620 -454735 -923021 -1683828
10499 -1683828 -2364234 -2252524 -1979967 -1741483 -2211156 -2228352 -2572162 -3074383 -3061514 -2288844
10489 -2288844 -1093244 168706 837085 145708 -1064035 -1995669 -2467038 -1358618 181665
10480 181665 164806 138449 265838 -519313 -1413793 -709079 607927 1007399 369275 -489943
10470 -489943 -1246639 -1792043 -2742289 -3721623 -4255359 -4058480 -3471057 -3115357 -2368695 -975066
10460 -975066 -405559 -546230 -655472 -462026 -611333 -1179245 -1328294 -1467752 -1964079 -2128690
10450 -2128690 -1444550 -817544 -1305257 -2008984 -1521322 -961088 -1047431 -439023 716435
10441 716435 461623 -324424 -286360 -147313 -233606 -943113 -1274507 -1332943 -1989360 -2804232
10431 -2804232 -2364012 -1573474 -904565 -1393086 -1978704 -1669036 -1403212 -1543644 -789912
10422 -789912 -573536 -1211260 -1446317 -2047331 -2122474 -1657803 -1944282 -2446594 -1849990 -1062874
10412 -1062874 -627179 -827294 -2057340 -2841365 -2902855 -2053268 -1527623 -1194660 -473132
10403 -473132 -181179 -877207 -1680855 -2593712 -2897393 -2549746 -1911718 -1091623 -1290219 -1788099
10393 -1788099 -2000588 -1575794 -659167 70498 543976 702402 394241 -70448 -87086 511241
10383 511241 589507 -276839 24890 845627 1931440 1737547 -209956 -1817568 -1783477
10374 -1783477 -1239121 -669344 -16841 -112221 -2698 1193875 1446115 366958 -621073
10365 -621073 -615867 -654454 -653547 -168774 -73134 624675 1448586 1234014 -30171 -1059328
10355 -1059328 -1623817 -2002457 -2460947 -2518167 -1914349 -1786235 -1727764 -1424784 -1473222 -1682778
10345 -1682778 -1616185 -1565563 -1933313 -2043128 -1588203 -1729079 -2128902 -1820756 -1383716 -963255
10335 -963255 -788934 -1665834 -2130341 -1397980 -432415 -29550 -812579 -1223336 -1083216 -1165533
10325 -1165533 -1624749 -1603661 -1401516 -1835768 -2273875 -1770335 -1159956 -205679 298471 703321
10315 703321 377037 120713 296580 454876 164929 -29243 -396694 -499937 -3591 560730
10305 560730 862539 -6788 -1271909 -1030861 -860352 -624927 -746105 -1149966 -1053143 -1497355
10295 -1497355 -1219111 488398 2188103 3648560 4131691 3148497 2714986 2242194 1566717
10286 1566717 1508720 1951257 1759472 1328292 690246 1275978 1796537 638868 -127491
10277 -127491 38366 -16442 -51588 454688 304877 -462714 -803878 -682492 -211346 -577097
10267 -577097 -487576 501270 502684 -926759 -1614345 -1886860 -1713179 -1300860 -1212588 -981813
10257 -981813 -146795 -322343 -2071294 -2605117 -1466768 -1166376 -1653812 -1942584 -1304914
10248 -1304914 -132867 139949 33425 -637973 -965483 -929617 -703824 -813487 -963025
10239 -963025 -383977 480926 347070 283176 -122241 -1108132 -1783907 -2602580 -2850472 -2354135
10229 -2354135 -1865942 -1990130 -1920268 -1468808 -1058439 -345545 718261 1280759 2016977
10220 2016977 2167968 1374155 346611 -352344 -739943 -1119436 -1445060 -886965 190748
10211 190748 1049492 1231292 1701497 2309036 1582723 666903 131804 191330 564073 198649
10201 198649 -923349 -1859260 -2025724 -1928578 -2179502 -2119285 -2696252 -2858710 -2400949 -1691758
10191 -1691758 -1075078 -1231313 -1258500 -1054267 -617715 263232 203830 -161205 329176 1036490
10181 1036490 1482869 1975541 1416171 184595 -369036 -603789 -942822 -1123317 -250066
10172 -250066 -74485 158235 658235 562875 170872 -61276 119428 613470 186877 -460814
10162 -460814 271746 607747 109930 -191206 -663658 -898124 -671774 -1099230 -1245926 -1031871
10152 -1031871 -675603 -150447 733386 570680 280863 60188 -89249 -24143 -36378 19578
10142 19578 422477 830938 1470932 1687183 1467637 1073693 716533 -225611 -990382 -2329562
10132 -2329562 -4489446 -5211659 -4648008 -3756249 -2647275 -1379158 -863346 -1225764 -1031112
10123 -1031112 -449451 -424589 -466326 -1072842 -1388775 -1184259 -1120698 -1300520 -1362346 -1262751
10113 -1262751 -990301 -407454 -210466 -768697 -1780051 -2202288 -1921415 -1841316 -1452606
10104 -1452606 -1064717 -632040 -1312628 -1191582 -87979 -58249 -359413 -245682 228961
10095 228961 385287 -77536 -496713 75018 302069 -560318 -1273204 -769204 -684234 -1072585
10085 -1072585 -1249544 -902362 174544 982681 356778 -526852 -701701 -1017684 -757459
10076 -757459 64490 495033 -357075 -1571543 -2195027 -2047307 -1658596 -1561332 -1398338 -325041
10066 -325041 765361 1428107 2529702 2470846 2298440 1956784 2015416 2197431 2351992 1758630
10056 1758630 1443303 1358701 1880610 2640640 3160584 3015477 1869883 1105024 1644437
10047 1644437 1476634 402014 522266 1077304 1613337 2114849 2737646 3428595 2742596
10038 2742596 1423882 134503 -1090101 -1581906 -1643314 -1178283 -593743 -557427 -255447
10029 -255447 461389 555746 630040 1051853 720002 -117993 -241068 248763 294571 114123
10019 114123 869393 777120 115254 -555484 -41183 631357 556618 392903 629070 1075757
10009 1075757 615791 -366320 -943377 -808085 117459 757314 846387 65387 -1469605
10000 -1469605 -2497617 -1815385 -677832 242250 427793 90400 60936 -1497255 -2824094
9991 -2824094 -1851833 -721372 -805764 -1725767 -2392659 -2534991 -2264040 -1932921 -679744
9982 -679744 693519 1032093 285330 -264351 -780723 -459859 119089 242644 -742074 -1747243
9972 -1747243 -1994394 -1877501 -980950 579172 820176 -69294 -238874 599669 733777
9963 733777 -82517 -365370 269688 1168038 1573630 1936263 1289949 343129 -3250 97670
9953 97670 -208617 -832759 303606 2147585 3324110 2235915 1141233 1133870 771576
9944 771576 380013 139212 -294135 -1220411 -1742988 -1962266 -1573744 -1007058 -693285 -880028
9934 -880028 -684730 -1598436 -2254382 -1662710 -1298803 -1958100 -2475773 -1716801 22211 1486973
9924 1486973 2196543 1742083 801778 307567 279487 677591 688462 925753 325263 -14977
9914 -14977 428889 846793 1006906 614571 346544 203538 22210 -209218 -204934 -551727
9904 -551727 -1247609 -1019729 -876903 -615453 293321 624790 600780 -325640 -994053 -1164655
9894 -1164655 -1763767 -2239767 -1898702 -796557 -844081 -1058009 -498239 104098 8970 57503
9884 57503 -84088 -851561 -1366700 -860649 -354330 -587725 -908788 -1680023 -2868620 -3110672
9874 -3110672 -2763536 -2734324 -2153519 -2112566 -2493369 -2727370 -2222897 -2089434 -2348320 -2203949
9864 -2203949 -1193827 -542000 -436701 -79131 -200551 -843739 -1682831 -2016687 -1409946
9855 -1409946 240622 1122757 1489292 774343 -41781 -171607 282042 982423 1249287
9846 1249287 727676 731989 700931 1080488 1557601 1292533 966875 224211 -1163569 -2100817
9836 -2100817 -1424552 -922082 -1479115 -1683135 -1072443 -711736 -332174 -143798 -337313 -92591
9826 -92591 493668 817771 606359 486524 326260 542366 436343 -20004 164171 385552
9816 385552 51700 -270836 -686968 -529534 -22825 -154949 -180523 -330676 -1156905 -1307980
9806 -1307980 -959147 -747000 35897 173041 638509 991223 1341415 1214518 327638 249732
9796 249732 471336 88939 -518302 -452741 291559 629191 954454 1150756 1387504 906399
9786 906399 -354496 -608027 -551619 -84315 1009333 1681195 1669083 1134966 1175605 1531847
9776 1531847 1492051 1233937 913766 -574553 -1261108 -1078649 -476159 -412840 -499995 -895987
9766 -895987 -1528377 194840 2902026 2938416 752381 79078 96539 -431115 -1109249 -1157077
9756 -1157077 -336582 -166805 -1107752 -1021254 -415624 804699 1418242 514186 188589 378148
9746 378148 -880014 -2578156 -2913001 -2260423 -1374451 -559044 -262839 -984184 -1689525
9737 -1689525 -1546859 -1187672 -1045861 -1180002 -570644 -479628 -1175971 -1625674 -2263614 -2126286
9727 -2126286 -1762213 -1255954 -995838 -696382 -152706 -578970 -1201184 -1186700 -891623 -430148
9717 -430148 53665 985955 1628825 2026244 2113633 1945243 1343225 821793 409623 -143501
9707 -143501 -611570 -1256014 -1737727 -1520822 -1533241 -1861279 -2389619 -2161282 -2042733 -2206102
9697 -2206102 -1736294 -1373629 -1045280 -864209 -695874 -433923 -1456777 -1437641 -638586 -430856
9687 -430856 296604 480474 -826162 -1420656 -275986 446682 339025 962387 2095211
9678 2095211 2530909 2211151 1674232 991663 641715 454686 442580 982508 624295 -955343
9668 -955343 -1565684 -1660474 -1255682 -889693 -1458137 -586362 444427 787999 1223869 1489138
9658 1489138 1469903 584635 -1025959 -1749030 -2242006 -2300231 -1426974 -499509 -1017596 -2162844
9648 -2162844 -2219719 -2178216 -2836510 -3038478 -2573360 -1500274 -123135 648425 251706 -917198
9638 -917198 -2393161 -3406316 -3311618 -2806090 -2082449 -1729012 -2257743 -2298040 -2024113 -1323490
9628 -1323490 -984377 -979537 593790 878338 -441002 -396845 123265 70152 -317243 -897165
9618 -897165 -764135 -618284 -234583 -104639 -92893 79164 685303 1559139 1873677 1832971
9608 1832971 1169644 -136912 -1570262 -2127657 -2224293 -1972892 -1237839 -622972 -490145
9599 -490145 54628 966761 1388025 1204346 686495 28771 -192907 633900 1821167 1845549
9589 1845549 1713735 1965425 2009568 1783875 1982766 2253585 2298120 1267960 441523 596737
9579 596737 874851 644828 -127575 -463337 1396 539858 619790 198581 -374021 -966771
9569 -966771 -1290746 -568641 -522409 191689 1217176 1956769 1729690 119895 -1290877
9560 -1290877 -713432 434403 88650 -515935 -840375 -303013 500309 1357212 1991632
9551 1991632 2628556 2531467 2693173 4042828 4358232 4338907 4012404 3631485 3942811 3115273
9541 3115273 2480494 2428383 2696010 3770014 4427667 4016786 3252143 2532437 2148759 2007629
9531 2007629 2043301 2299258 2724443 3212910 3955756 4590966 5270752 5620340 4721607 3628094
9521 3628094 3197152 3823662 3651620 3347471 4185032 4669573 4769326 4715541 5356073 5940453
9511 5940453 5299581 4689557 4412666 5172619 6664524 7383640 7362252 7012843 7037157 7003459
9501 7003459 7086123 7297415 6423565 5591146 4782357 4364188 4646279 5201474 5196090 4809527
9491 4809527 4045095 3766865 3992508 3860703 4448844 5634334 6687204 7005298 7416179
9482 7416179 8412282 8605006 7197094 5269215 3744336 3796809 4075224 3586262 3044635
9473 3044635 1971887 1834970 3211588 4061232 3415041 3179802 3697327 4460156 4999211
9464 4999211 5050856 5844392 6746154 7263730 6673612 6204571 6173523 6350402 6492739 6761248
9454 6761248 6813782 6468972 6191436 6281586 5962088 5347708 4768357 4145507 4305408 3547264
9444 3547264 2817061 3255809 3490402 2970267 3283695 4489453 4728460 4518947 4728365
9435 4728365 4931840 4967263 5063724 4882545 5100112 5064769 4313191 3577977 3726638 4432135
9425 4432135 5597811 6508989 6887242 6919380 5600385 4703911 5672403 6684768 6115071
9416 6115071 5535542 6911453 7763416 7237086 6855430 6368607 6099536 6266284 5831546
9407 5831546 6003548 7527847 8091325 7441984 7085309 7037780 7335294 7853532 7377966 7270613
9397 7270613 7320585 6385729 5362180 5040353 5029862 4874528 5742429 6495702 6116873 6179760
9387 6179760 7175418 7569706 7639470 6804415 5858570 5006745 5275928 6872861 7692517 7718471
9377 7718471 8187068 9005213 9463251 9195207 8413428 7961530 7913035 7642715 7176003 7507866
9367 7507866 7370920 6912562 7115972 8062613 8671557 8294582 7448877 8153075 8856002 8686009
9357 8686009 8514904 8153789 7390575 7048383 7435648 8186870 8719704 8727056 8336917 8429361
9347 8429361 9247865 9815374 9361286 8253272 7490485 7774041 8750974 9123288 9953418
9338 9953418 10778479 10406034 9114306 8255201 8340280 8692342 8635818 9516569 11229280 13359346
9328 13359346 16178597 17987106 18949468 20394470 20857354 20640916 21996573 23692796 25151333
9319 25151333 27060278 29330970 31519513 33026018 34426037 36395775 38798092 42519240
9311 42519240 46265510 48400105 49424682 48281035 45413955 43501564 42826768 42602151
9303 42602151 41799764 41098374 40806785 41479437 43103097 45670986 47949905 50336172 52974921
9294 52974921 54781764 56484545 59082224 62478718 64989526 63150424 55302240 43810695
9286 43810695 33153641 25293427 19718402 16082887 13429852 11847876 10818971 9267955
9278 9267955 7552276 5385006 3227936 2512595 3325957 3905527 4113171 3041724 1410716
9269 1410716 670272 979074 1200230 793197 365079 544209 324160 216572 871490 914124
9259 914124 504352 706848 1090229 1066990 907998 892602 1909398 2762040 2619802 1613922
9249 1613922 361889 -227487 113558 545290 333454 1010651 1805213 2167388 2332306
9240 2332306 2374376 1541941 1204450 1219264 524998 617251 967380 1036827 1707014 2920853
9230 2920853 3139680 3265205 3473918 3830116 4008313 4271921 3711576 3044652 2831545 2116454
9220 2116454 1569281 1231115 1755786 2736023 3233665 2903857 2024630 1362337 527816 380024
9210 380024 1658554 2128519 1937424 1583723 1149745 548910 332594 1054592 1787569 2000049
9200 2000049 2287332 2403455 871155 -358930 -674956 276345 1040996 832684 960476
9191 960476 1836737 2175779 1761793 1935678 1952777 1160062 811617 1933569 2361985 1749350
9181 1749350 1828615 2468767 2970410 3199264 3848192 3696199 3071024 3349654 3732123 3377514
9171 3377514 2910675 3422456 5143972 7667514 10657524 12148591 13663005 16118806 18879919
9162 18879919 21462940 24286569 27224693 30148379 33622061 36834938 40314443 43004246
9154 43004246 44426427 43635224 38566846 30559567 22599725 17110668 13159613 10004367
9146 10004367 6795453 4274810 2844566 1922786 1480384 1811592 1314321 612914 580504
9137 580504 10938 145183 1355356 1485037 577468 740475 1023204 734205 817788 552827
9127 552827 213976 352906 1011046 1396511 2131682 2345811 756129 -251988 609658
9118 609658 782065 757771 748029 1423104 1825956 1560905 1655935 2954795 3911513 3089307
9108 3089307 2751535 2798625 3163789 3200563 3406110 3625232 2824371 1883972 1142906 993722
9098 993722 1980348 2485216 2952728 2659606 2339634 2674124 2912142 2641046 2521126 1725509
9088 1725509 1452177 2022590 2271888 1496632 1088630 1653246 1447689 1204789 1216432 680091
9078 680091 -740390 -1307226 -216857 1578003 3559378 4616022 4765612 3947978 2886612
9069 2886612 3197806 4218914 5255484 6251200 5843485 5657096 6985246 7496498 7912171
9060 7912171 9201524 11712213 15165281 18834212 21949716 23983450 25847402 28420654
9052 28420654 30772328 34086415 37957690 41215245 43244802 42638137 39287537 32871572
9044 32871572 25285933 19745072 15724534 11494123 8592967 7388187 6101102 4447078
9036 4447078 3664093 3585595 3316245 2332341 2039706 2482073 2727576 2330323 2252091 2671634
9026 2671634 2732163 2217666 1674110 1950098 2312879 2791441 2973294 2013671 1249990 1374542
9016 1374542 1227830 494178 106328 61193 47582 671276 1827333 1813758 1217388 1082358
9006 1082358 1344854 996915 129259 -84922 82787 1105809 2180090 2276313 2320953 1842796
8996 1842796 1637067 1610085 1407384 1424721 218713 -1331733 -1153482 201731 1561222
8987 1561222 1654785 991087 973665 1586052 2251848 2058588 1630526 1120140 1145850 831254
8977 831254 769734 1533082 1670157 1615554 897385 1096737 1462711 1877942 1722905 1725185
8967 1725185 2175355 2285587 2682286 3022322 3376093 3211275 2608869 1318323 474668
8958 474668 776528 970088 993249 1154019 1559385 1658415 1786373 2795066 3124675 2741703
8948 2741703 2822538 2289297 1418080 1299584 1813154 2274185 2248502 919348 250301 890323
8938 890323 1050859 680109 428357 1047320 1582424 1213235 6322 -1073563 -1401133
8929 -1401133 -1303301 -1012423 -985630 -1019901 -1044226 -661576 -467838 -384613 226772 406178
8919 406178 69717 143888 107890 633542 1334229 1222714 1156218 874136 854994 406119
8909 406119 861491 1149196 1372149 1267922 1282291 1513601 858547 786504 1033395 1403891
8899 1403891 1993860 1785502 1091586 521342 284636 -61600 5977 311076 985093 1215560
8889 1215560 326854 352288 1031988 1538751 2475886 2782041 2737674 2758123 2171710 2409963
8879 2409963 3525353 4607341 5742238 7169404 7945371 8149161 7628141 7113918 7618950
8870 7618950 9106139 10669845 13135016 15141397 15698596 16752633 18651365 21473791
8862 21473791 24928900 27853827 31090775 35711343 39394278 42492284 45920190 48755892
8854 48755892 50579547 51939165 53870299 56567993 58664433 60133691 60786471 59843566
8846 59843566 58208921 58444146 60125210 62175475 64933152 67883370 71362775 73590213
8838 73590213 74409322 73969872 73143880 72289046 71070418 70455690 70981037 72035822 72620332
8829 72620332 71460087 66525096 57926786 49479931 41634527 34818764 29119853 25018758
8821 25018758 21503436 17633713 14721192 12955093 12856635 12782949 12817644 13107511 12868014
8812 12868014 12540705 11919069 11128152 10718647 11566349 13244345 15256262 17798523 21132946
8803 21132946 26842508 32817037 37887647 44316629 51003886 56905390 62602231 68543563
8795 68543563 74179870 79333338 86150036 94800832 104091504 112385299 119108179 124480563
8787 124480563 130204213 137749551 144053125 142371034 127839190 106989873 88755404 74810220
8779 74810220 62530926 50202209 40124000 32247566 26514074 22621565 19653899 17071588
8771 17071588 14662440 13101710 11450559 10094263 9366243 9322828 8626784 8058341 7961110
8762 7961110 7893447 7175334 6219036 5630142 5518690 6086774 6155303 6128435 6319207 5516745
8752 5516745 4595277 4971625 6728089 7278267 5894218 4667308 4385877 4876510 5883205
8743 5883205 6915025 6636348 5919545 5904704 6116940 5669985 5406399 5710416 5363746 4567505
8733 4567505 4353386 3953439 3619261 3764232 3804902 2593697 1215833 207488 466430
8724 466430 721251 748222 765503 766109 850798 1206178 2328776 2745724 2383399 1733305 1785839
8713 1785839 2395762 2213992 1950296 1657562 1699332 1314147 694696 310118 207491 510546
8703 510546 1527457 2683842 2820393 1795710 441963 -875496 -1771334 -2194615 -1888616
8694 -1888616 -1724997 -2024940 -2011334 -961741 -617470 -1251721 -2311825 -2245543 -1383322 -1160353
8684 -1160353 -728769 -1143655 -2294599 -2459091 -3152756 -3571251 -2065546 -485145 -87104
8675 -87104 -520490 -1567686 -2211444 -2111245 -2477959 -2793072 -2628183 -1955243 -1084449 -12964
8665 -12964 345413 404029 669382 152539 -799943 -1200471 -1003120 -1101401 -1440506 -776594
8655 -776594 36110 -85062 -710566 -717017 -1256742 -2235921 -2316582 -1796864 -1219683 -189051
8645 -189051 -137346 372899 1284834 2244448 2832865 1996691 1484286 1224847 1167120 1359836
8635 1359836 1312350 318525 -645122 -338992 558389 1044000 631718 -155920 -933143 -1429325
8625 -1429325 -1109251 -543073 -588199 -1123795 -273537 708362 678756 -201482 -900128 -595168
8615 -595168 183121 382956 278834 -411601 -494000 688939 714228 611505 850105 798434
8605 798434 698580 348347 845140 2013602 1568218 1176469 762598 -150516 -827503 -856237
8595 -856237 -735528 -800336 -292418 90822 -374532 -1000643 -1624130 -2058924 -1705628 -1550897
8585 -1550897 -2227806 -1904031 -1180209 -1040909 -458498 221210 465220 817526 753372 313477
8575 313477 331655 -405630 -122627 1216490 2362011 3266149 2678996 1029757 1026867 1772051
8565 1772051 1668420 932158 740050 1294427 2024132 1916805 1311911 867666 984726 672131
8555 672131 261503 -48403 -554991 -696226 -650449 66869 1378480 2691075 2929608 2709020
8545 2709020 2791800 2792007 1921565 1434235 1816274 1900144 1398277 95763 -568968 262574
8535 262574 538444 525276 265983 178285 -172532 -1282642 209957 1963231 1848805 1919796
8525 1919796 2273166 2092541 1603523 938023 558312 778837 791712 1055951 918358 634036
8515 634036 828462 1264730 1262386 1068690 33216 -38136 426943 799182 80777 -365752
8505 -365752 -325589 -260586 -270655 242506 1103593 1211696 1256931 495954 318680 856127
8495 856127 591438 620700 201421 -67486 484602 1492408 1369469 635150 1258399 1841329
8485 1841329 1567898 261829 -709804 -648698 -897236 -1215315 -802029 -427596 -900156 -775590
8475 -775590 -318611 49047 1338915 2562703 3280010 3852293 3617514 3163075 3051238
8466 3051238 1858219 1111032 452005 102306 451005 268719 -318973 -492270 208077
8457 208077 688497 919673 1285638 1198922 1419115 1405882 434514 125463 696253 204763
8447 204763 -698748 -1247227 -1708718 -2260560 -2451082 -2575574 -1985074 -585837 492603
8438 492603 736284 1537450 2994855 3068487 1601020 -290998 -822794 -619061 3552
8429 3552 946378 1105052 684685 293980 191442 -137708 -47198 780844 107735 -212525
8419 -212525 -270859 -568454 -1686110 -1597976 -1408057 -1465729 -933767 -475378 129358 455043
8409 455043 440375 1104208 1980582 2472017 2638675 2065320 1933848 1826953 1788141 1757808
8399 1757808 357975 -402899 -593362 -27073 1601642 2107746 2262249 2170214 1603876
8390 1603876 1123231 403578 502024 1624124 2332567 3049424 2907301 2341475 2346021 1778478
8380 1778478 906186 428672 1282251 1988188 1683853 2134149 3164138 2964761 2437555
8371 2437555 2498810 2338353 2513328 2880318 2539631 1945613 1592390 1053617 1072097 1725174
8361 1725174 2099380 1973235 2160486 2309588 2394389 2345868 2344545 2321513 1764799 995077
8351 995077 889867 1310177 1246916 519418 464288 1302628 1111755 662105 1949683 3734162
8341 3734162 5357016 6958232 8299426 9370563 10853474 12920154 14128787 15053465
8333 15053465 17150819 19900969 22105577 23787551 25286158 28199021 31474176 34367845
8325 34367845 36863221 39145208 41184966 42631534 42009393 38600211 32585202 26132694
8317 26132694 21415137 17915108 15414240 12612231 9856149 7786673 6672671 5383346
8309 5383346 5101253 4714532 3346708 2419076 3068063 3567434 2616849 1995108 2295738
8300 2295738 2995754 3621648 3644780 4417709 4364525 4494411 4507648 5073273 6410655 7572734
8290 7572734 8007352 9147003 10796889 13877338 17206608 20839018 26090995 33641700
8282 33641700 43589554 56564137 72942500 94464397 119122031 138576136 132258071
8275 132258071 101159423 70562056 49919859 36579295 27618889 21367534 16474187
8268 16474187 13445644 10984355 9997633 9955533 9082699 7573195 6858015 7108780 6899898
8259 6899898 6387350 5861777 5541307 5755232 5942173 6491004 5698387 3720735 2474243
8250 2474243 2373284 2487646 1993179 1560388 1241820 208348 -297876 -241682 379201 -647193
8240 -647193 -1291063 -330317 593614 1249571 1073052 171677 -441922 840541 2261853
8231 2261853 2618494 2141648 617807 -275762 -694379 -846573 -910364 -518925 979211
8222 979211 2387126 2770681 1997263 1737507 1429959 465171 -122989 -552636 -761695 -712021
8212 -712021 -781856 -1142040 -1385695 -796672 -479202 -150375 147932 562241 222249 -823081
8202 -823081 -1363478 -1574564 -1816755 -1752836 -1818529 -2310444 -2342990 -2346706 -3182726 -3197419 -2099184
8191 -2099184 -1602128 -1553903 -1518005 -858186 -437549 -566912 -1469680 -1696947 -848320 -756625
8181 -756625 -1442154 -1128497 -943826 -982562 314979 1172514 839924 110708 181384 652605
8171 652605 772634 131412 -215806 -323633 -630612 -608988 -432534 -232424 77097 74565
8161 74565 -109054 77669 819402 1978816 2440650 2129277 1313722 834052 409496 792560
8151 792560 1109527 1547230 1562083 1199929 270984 -792314 -1478784 -2100809 -2849107 -3489680
8141 -3489680 -3891667 -3288136 -2143042 -1253296 -815947 587797 2180840 3312850 3360627
8132 3360627 3505164 4046324 3576243 3234119 2990977 2923288 3154044 3077510 2471788 2528056
8122 2528056 2493628 1123584 165855 497364 1543847 2298725 2199951 1420020 898637 857672
8112 857672 60632 -783224 -875298 -490245 -541007 -758578 -959313 -561198 -744474 -1863811
8102 -1863811 -3132422 -3308297 -3224871 -3289234 -3236275 -3082725 -2365299 -2035731 -1425923 -240525
8092 -240525 112488 -108668 -68469 165924 1039586 1421358 354237 -930649 -1394339 -1336283
8082 -1336283 -737815 -328384 -311449 246731 669382 1799900 2476069 1725231 584390
8073 584390 -66883 -157510 -241056 -491113 -718686 -1301574 -1198728 -447728 144758 1034805
8063 1034805 1074790 -3094 -311989 208998 -385374 -253615 500809 954475 185776 -577144
8053 -577144 116526 1181604 2186875 3361471 3844197 3207801 2268751 791205 -751961
8044 -751961 -1798190 -1536139 -168284 1100270 960958 -318694 -651767 -102569 758765
8035 758765 1319349 550454 -581004 -753871 -475245 -193470 125094 -105193 -28199 691066
8025 691066 1244367 1862888 2371216 2932252 3238133 2765757 2574307 2552759 2655175 2735662
8015 2735662 2695317 2986736 3199423 3170493 3560327 3906672 5043595 6744372 7805154
8006 7805154 7601431 7584138 8166791 8730080 10146998 11937368 13867785 14905521 16159669
7997 16159669 18016119 19907270 20740386 20928884 21068908 21028269 20118630 19052651 17904694
7988 17904694 15981639 13642032 11910889 10373266 8080091 5534459 4052624 5171930
7980 5171930 5712081 5265013 5616717 5560263 5430629 5352742 4726541 4497039 4798841 3867345
7970 3867345 2821817 3167772 4524454 5470883 5815611 4884547 4353542 4191474 4336126
7961 4336126 4632053 4143390 4123863 4823276 4754794 5034621 6013576 7207068 8535562 9723884
7951 9723884 11998517 14817794 18476825 21786794 24946681 28184866 31747011 35711522
7943 35711522 39109786 42877829 47710050 52390864 57928372 63032561 66075755 66746126
7935 66746126 66022898 63816125 60345876 55808602 49586478 42191926 35351956 29229906
7927 29229906 23902342 20565020 17676840 14746979 13092724 11971427 10980731 10142242
7919 10142242 9419889 9002707 9389976 10373486 9978536 9434220 9124079 8729583 8329884
7910 8329884 8429863 8941607 8527053 7916429 8091326 8994984 9635704 10013052 10469723 10920408
$$ [...]
##END NTUPLES=NMR SPECTRUM
##END=
