##TITLE=C13_SL65-SePh-f10
 CDCl3,22000 sc

 29.4.2019
##JCAMPDX= 6.0         $$ Bruker NMR JCAMP-DX V2.0
##DATA TYPE= NMR SPECTRUM
##DATA CLASS= NTUPLES
##ORIGIN= UXNMR, Bruker Analytische Messtechnik GmbH
##OWNER= root
$$ XWIN-NMR		Version 3.5
$$ Tue Apr 30 13:40:09 2019 Russian Standard Time (UT+4h)  she@DPX200
##.OBSERVE FREQUENCY= 50.3278965144739
##.OBSERVE NUCLEUS= ^13C
##.ACQUISITION MODE= SIMULTANEOUS
##.ACQUISITION SCHEME= undefined
##.AVERAGES= 22000
##.DIGITISER RES= 17
##SPECTROMETER/DATA SYSTEM= spect
##.PULSE SEQUENCE= zgpg30
##.SOLVENT NAME= CDCl3
##.SHIFT REFERENCE= (INTERNAL, CDCl3, 0, 225.262)
##AUDIT TRAIL= $$ (NUMBER, WHEN, WHO, WHERE, WHAT)
$$ ##TITLE= Audit trail, XWIN-NMR		Version 3.5
$$ ##JCAMPDX= 5.01
$$ ##ORIGIN= Bruker BioSpin GmbH
$$ ##OWNER= she
$$ F:/spectra/data/she/nmr/c13/1/pdata/1/auditp.txt
$$ ##AUDIT TRAIL=  $$ (NUMBER, WHEN, WHO, WHERE, WHAT)
(   1,<2019-04-30 13:38:51.56 +0400>,<she>,<DPX200>,
      <created by zg, POWCHK disabled, PULCHK disabled
       terminated by command 'halt'
       configuration hash MD5:
       00 E9 B6 7A A2 85 ED C7 34 08 36 98 17 FE 4E 26
       data hash MD5: 32K
       9F 5A 17 5E F6 6D 9B FB B0 9C 2C E6 90 C9 88 08>)
(   2,<2019-04-30 13:38:55.90 +0400>,<she>,<DPX200>,
      <Start of raw data processing
       efp BC_mod = 2 LB = 1 FT_mod = 6 PKNL = 1 PHC0 = -373.3702 PHC1 = 30.60641 SI = 32K 
       data hash MD5: 32K
       1D 0F 7E F7 A6 8A D8 7B 7F 87 BA 58 52 0B 56 52>)
(   3,<2019-04-30 13:38:58.59 +0400>,<she>,<DPX200>,
      <abs ABSG = 5 
       data hash MD5: 32K
       F0 EF 55 F2 2E 8C F1 5C 24 29 36 58 E2 9C 1F 07>)
(   4,<2019-04-30 13:39:31.48 +0400>,<she>,<DPX200>,
      <pk PHC0 = 2.350613 PHC1 = -3.6 
       data hash MD5: 32K
       D8 A9 4F E7 65 0A 4C 2C C9 49 46 21 B8 6E F1 E9>)
(   5,<2019-04-30 13:39:34.21 +0400>,<she>,<DPX200>,
      <abs ABSG = 5 
       data hash MD5: 32K
       5F FB 66 FB B1 01 6E 93 30 58 BE 5A CA 00 67 54>)
$$ ##END=
$$ 
$$ hash MD5
$$ 92 78 79 49 D0 BB 4E 38 9A 05 3B 9C E6 64 69 05
##$RELAX= 
##$RELAX= 
##$RELAX= 
##$RELAX= 
##$RELAX= 
##$RELAX= 
##$RELAX= 
##$RELAX= 
$$ Bruker specific parameters
$$ --------------------------
##$DU= <F:/spectra>
##$EXPNO= 1
##$NAME= <c13>
##$PROCNO= 1
##$TYPE= <nmr>
##$USER= <she>
##$AMP= (0..31)
100 100 100 100 100 100 100 100 100 100 100 100 100 100 100 100 100 100 
100 100 100 100 100 100 100 100 100 100 100 100 100 100 
##$AQSEQ= 0
##$AQ_mod= 1
##$AUNM= <au_zg>
##$AUTOPOS= <>
##$BF1= 50.322709
##$BF2= 200.13
##$BF3= 50.322709
##$BF4= 500.13
##$BF5= 500.13
##$BF6= 500.13
##$BF7= 500.13
##$BF8= 500.13
##$BYTORDA= 1
##$CFDGTYP= 0
##$CFRGTYP= 5
##$CHEMSTR= <none>
##$CNST= (0..31)
1 1 145 1 1 1 1 1 1 1 1 1 1 1 1 1 1 1 1 1 1 1 1 1 1 1 1 1 1 1 1 1 
##$CPDPRG= <waltz16>
##$CPDPRG1= <>
##$CPDPRG2= <waltz16>
##$CPDPRG3= <>
##$CPDPRG4= <mlev>
##$CPDPRG5= <mlev>
##$CPDPRG6= <mlev>
##$CPDPRG7= <mlev>
##$CPDPRG8= <mlev>
##$CPDPRGB= <>
##$CPDPRGT= <>
##$D= (0..31)
$$ [...]
##$SUBNAM4= <"">
##$SUBNAM5= <"">
##$SUBNAM6= <"">
##$SUBNAM7= <"">
##$SUBNAM8= <"">
##$SUBNAM9= <"">
##$SW= 239.972172938263
##$SWIBOX= (0..15)
0 1 3 0 0 0 0 0 0 0 0 0 0 0 0 0 
##$SW_h= 12077.2946859903
##$TD= 32768
##$TD0= 1
##$TE= 0
##$TE2= 300
##$TE3= 300
##$TEG= 300
##$TL= (0..7)
120 120 120 120 120 120 120 120 
##$TP= (0..7)
150 150 150 150 150 150 150 150 
##$TP07= 0
##$TPNAME0= <>
##$TPNAME1= <>
##$TPNAME2= <>
##$TPNAME3= <>
##$TPNAME4= <>
##$TPNAME5= <>
##$TPNAME6= <>
##$TPNAME7= <>
##$TPOAL= (0..7)
0.5 0.5 0.5 0.5 0.5 0.5 0.5 0.5 
##$TPOFFS= (0..7)
0 0 0 0 0 0 0 0 
##$TUNHIN= 0
##$TUNHOUT= 0
##$TUNXOUT= 0
##$USERA1= <user>
##$USERA2= <user>
##$USERA3= <user>
##$USERA4= <user>
##$USERA5= <user>
##$V9= 5
##$VALIST= <valist>
##$VCLIST= <CCCCCCCCCCCCCCC>
##$VD= 0
##$VDLIST= <DDDDDDDDDDDDDDD>
##$VPLIST= <PPPPPPPPPPPPPPP>
##$VTLIST= <TTTTTTTTTTTTTTT>
##$WBST= 1024
##$WBSW= 4
##$XGAIN= (0..3)
0 0 0 0 
##$XL= 0
##$YL= 0
##$YMAX_a= 143077799
##$YMIN_a= -36254065
##$ZGOPTNS= <>
##$ZL1= 120
##$ZL2= 120
##$ZL3= 120
##$ZL4= 120
##$ABSF1= 225.2625
##$ABSF2= -14.73494
##$ABSG= 5
##$ABSL= 3
##$ALPHA= 0
##$AQORDER= 0
##$ASSFAC= 0
##$ASSFACI= 0
##$ASSFACX= 0
##$ASSWID= 0
##$AUNMP= <proc_1d>
##$AZFE= 0.1
##$AZFW= 0.5
##$BCFW= 0
##$BC_mod= 2
##$BYTORDP= 0
##$COROFFS= 0
##$CY= -3
##$DATMOD= 1
##$DC= 0
##$DFILT= <>
##$DTYPP= 0
##$F1P= 0
##$F2P= 0
##$FCOR= 0.5
##$FTSIZE= 32768
##$FT_mod= 6
##$GAMMA= 0
##$GB= 0
##$INTBC= 1
##$INTSCL= 4.134877e-10
##$ISEN= 128
##$LB= 1
##$LEV0= 0
##$LPBIN= 0
##$MAXI= 10000
##$MC2= 0
##$MEAN= 0
##$ME_mod= 0
##$MI= 0.1934396
##$NCOEF= 0
##$NC_proc= 2
##$NLEV= 6
##$NOISF1= 120.0001
##$NOISF2= 80.00006
##$NSP= 0
##$NTH_PI= 0
##$NZP= 0
##$OFFSET= 225.2625
##$PC= 1.4
##$PHC0= -371.0196
##$PHC1= 27.00641
##$PH_mod= 1
##$PKNL= yes
##$PPARMOD= 0
##$PSCAL= 0
##$PSIGN= 0
##$REVERSE= no
##$SF= 50.3225993700027
##$SI= 32768
##$SIGF1= 140
##$SIGF2= 120
##$SINO= 11.81781
##$SIOLD= 32768
##$SREGLST= <13C.CDCl3>
##$SSB= 0
##$STSI= 32768
##$STSR= 0
##$SW_p= 12077.2946859903
##$SYMM= 0
##$S_DEV= 0
##$TDeff= 32768
##$TDoff= 0
##$TI= <>
##$TILT= no
##$TM1= 0
##$TM2= 0
##$TOPLEV= 0
##$USERP1= <user>
##$USERP2= <user>
##$USERP3= <user>
##$USERP4= <user>
##$USERP5= <user>
##$WDW= 1
##$XDIM= 32768
##$YMAX_p= 482412569
##$YMIN_p= -2415911
$$ End of Bruker specific parameters
$$ ---------------------------------
##NTUPLES= NMR SPECTRUM
##VAR_NAME=  FREQUENCY,     SPECTRUM/REAL,   SPECTRUM/IMAG
##SYMBOL=    X,             R,               I
##VAR_TYPE=  INDEPENDENT,   DEPENDENT,       DEPENDENT
##VAR_FORM=  AFFN,          ASDF,            ASDF
##VAR_DIM=   32768,         32768,           32768
##UNITS=     HZ,            ARBITRARY UNITS, ARBITRARY UNITS
##FACTOR=    0.368581032318806, 1,           1
##FIRST=     11335.7943870128, 0,            0
##LAST=      -741.500298977453, 0,           0
##MIN=       -741.500298977453, -2415911,    0
##MAX=       11335.7943870128, 482412569,    0
$$ Real data points
##PAGE= N=1
##DATA TABLE= (X++(R..R)), XYDATA
$$ [...]
15725a61845r655o70374n04728j03812L85148O47261O40452J60997q5157j81002
15715A17285L3415l0106o28195k70121J42713j48693p2673K7509J30662J41604
15705e56600K1610M85748Q89800M53030k28800m75803n13964n30061k12369j4376
15695f81785J55669J63931J51459O4936k44531P4287K83563K30533R5070R8120
15685C91252k70686j53497j7029J29396K26946j57344l02428l14172k17819J51915
15675e33466K04892N27882M02054K9700m9798j91554k73427k6469O995P9910K8678
15664B05397Q7960K21360o6106P8431J37951m2373K4795j49908k932K62967J31206
15653H88748l0922j86514p08318q42580o2235M88941R4470P6757L03495L29927
$$ y = [-161845, -171500, -841874, -1346602, -1450414, -1065266, -418005, 222447, 383444, 298287, 117285, 150700, 120594, -507601, -777722, -635009, -783702, -856375, -828866, -698204, -556600, -534990, -49242, 840558, 1293588, 1064788, 588985, 75021, -455040, -667409, -681785, -526116, -362185, -210726, -145790, -390321, -316034, -32471, 198062, 293132, 391252, 120566, -32931, -49960, 79436, 306382, 149038, -153390, -467562, -685381, -533466, -328574, 199308, 601362, 631062, 581264, 389710, 116283, 89814, 96809, 176719, 205397, 293357, 514717, 448611, 527042, 664993, 622620, 647415, 497507, 494575, 757542, 888748, 857826, 671312, -37006, -879586, -941821, -452880, -358410, -281653, 21842, 351769]
15643C51769j02735k90883J33849J2382j91945Q838M6569p2059K02558J44658
15633B43001J78794J09148k21704n33664j70996O12198P01207k30647n66112m6348
15623G4877l335j5544n6573J64801M75580k0587q49499o92935J641K69997P737
15612f43840K3993J69664M47672J94792j82231k79656l48536j68064O6482J20173
15602e99551L98965J68036k6680j05586m62716l00212k78329J45290M73428k09264
15592g96619m65718j13265K20047J65855o0944J77725O48335K39025n1486l95575
15582d32620L5763M61999k3664o4580q7014o2055K24601L93563O8961L9514m34343
15571A20125k98253k37677k55379J96629P0711K24031M98839M1290q04218o05838
$$ y = [351769, 249034, -41849, 92000, 104382, -87563, -78725, -32156, -104215, 98343, 243001, 421795, 530943, 309239, -224425, -395421, 216777, 917984, 687337, 121225, 74877, 71542, 55998, -575, 164226, 639806, 619219, -230280, -923215, -921574, -651577, -643840, -619847, -450183, -2511, 192281, 10050, -269606, -618142, -786206, -719724, -599551, -200586, -32550, -59230, -164816, -627532, -927744, -1206073, -1060783, -587355, -796619, -1262337, -1375602, -1155555, -989700, -1050644, -872919, -224584, 14441, -37045, -432620, -396857, 65142, 41478, -23102, -110116, -172171, 52430, 445993, 514954, 554468, 120125, -178128, -415805, -671184, -474555, -403844, -179813, 319026, 360316, -443902, -1049740]
15561a049740P8929J84291J37538q346N9650j35708m14971k79448n3209J00958
15551a380056J4010N20178Q81215P97865O411k36999J37844J5948n45192p38528
15541e27304m89565m0083J61693L82469M51257j2175l24975n113j34193k90111
15531h28100K81317J32312l92048J95331K11023J80850J8374j15070J51427j66010
15521c30594m12485j81260l4865K63899N78078K20622J66694M56546K65441n5250
15511I36826K04698K66443p9666l15518l72680q22929n37571L41179P7902J34082
15501a67234L62805J01010J74607m9778n12841n9040J11198j8341P5418J09624
15491A27428J65141Q288l9625p5074K8356M59776K17381l81498l76956k80094
$$ y = [-1049740, -970811, -786520, -648982, -657328, -597678, -733386, -1148357, -1427805, -1481014, -1380056, -1366046, -845868, 35347, 833212, 839623, 602624, 740468, 756416, 211224, -527304, -1016869, -1056952, -895259, -512790, -61533, -73708, -398683, -403796, -537989, -828100, -546783, -414471, -806519, -611188, -400165, -219315, -200941, -316011, -164584, -330594, -743079, -924339, -959204, -695305, -117227, 103395, 270089, 726635, 992076, 936826, 1141524, 1407967, 1328301, 1012783, 640103, -182826, -720397, -379218, -301316, -167234, 195571, 296581, 471188, 421410, -91431, -150471, -39273, -57614, 17804, 127428, 292569, 300857, 261232, 186158, 214514, 674290, 891671, 510173, 133217, -146877]
15481a46877n08218L511M93112M57108Q4362p0035L20629J4887J55500P1879j31416
15470G44442j64610R1173L17257K01418j98770n15645n44893m70931j99427R2655
15460f47331Q6764K16802J12089n9213n6522l11799l2219J73945j19679Q9740
15450e47423N30023M26982M7591N3631k61958k18128M2550M8682K6m27910k94097
15439f00031L0061o4675j28761R5498J82017o9224K24102O86687L82129J15629
15429H53432k45760m14660k98067l27176j1249J28318K73331l9635m21071P9309
15419d23228M88793J32602n44162m72111J34076L76517K64207j98289L74508R3297
15409B26210j68808m54248k35547M60115J49695l38345k95657M5891J77595J92358
$$ y = [-146877, -655095, -651584, -158472, 298636, 382998, 312963, 633592, 648479, 803979, 875858, 744442, 579832, 671005, 988262, 1189680, 990910, 475265, -69628, -540559, -739986, -647331, -560567, -343765, -231676, -290889, -347411, -659210, -691429, -517484, -637163, -547423, -17400, 409582, 457173, 510804, 248846, 30718, 73268, 121950, 121976, -305934, -600031, -569970, -634645, -763406, -667908, -485891, -555115, -331013, 355674, 737803, 853432, 607672, 193012, -105055, -432231, -443480, -315162, -41831, -81466, -502537, -423228, 65565, 198167, -345995, -818106, -684030, -307513, -43306, -241595, 132913, 226210, 57402, -396846, -632393, -172278, -22583, -360928, -656585, -610694, -433099, -240741]
15399b40741o2607j04140l6586l90410n57378l3635Q32292P94562N1117N2069
15389C04543J43872j30522m58862k67427K12664N86876J89038m64154o68587l68978
15379i21537K66881N04728K58564J68563L17363K43631K05542Q3988m14633m29992
15369B83098l15675l35027k58691J7464J01504K47693L18444L48111M41457L12230
15359A160608n30282q31556l19753L28834N40513k75892o51282k88330N07362
15350c59778n0013p25263j01353N97293O56773K32107Q523J725j53390j90810
15340h4186M83246P8676p11079n45530m07752J36933N55424L37378k62062m9525
15330d68477O3515j08611k7440J61635N37088J50011m2662l62844m25179j47677
$$ y = [-240741, -303348, -407488, -444074, -834484, -1391862, -1425497, -593205, 201357, 252474, 304543, 448415, 317893, -140969, -408396, -195732, 391144, 580182, 116028, -552559, -921537, -654656, -149928, 108636, 277199, 594562, 838193, 1043735, 1127723, 713090, 283098, -32577, -367604, -626295, -608831, -507327, -259634, 58810, 406921, 848378, 1160608, 630326, -201230, -520983, -192149, 348364, 72472, -578810, -867140, -359778, -409791, -1135054, -1236407, -639114, 17659, 249766, 258289, 260014, 106624, -84186, 399060, 477736, -233343, -778873, -1186625, -1049692, -494268, -156890, -418952, -468477, -404962, -513573, -541013, -379378, 157710, 307721, 265059, -97785, -522964, -670641]
15320f70641K95294N81261r917l50656j04438K56868J15273Q6514L40029K05358
15310G44945k52657p76689m61742M95010J64832j11839K10599l22505k66641j13045
15300f89732r0505L65503J29234K76650N63434R0963l62142k57580P8786k24214
15290a19603l70377N3382M10178N4135l43523m8545J81474j94951Q906J90127
15280a78797m80088j14531M09870L77353J05525K8940j69844m46297k33273J99167
15270e01975M26991M32635J5035k48063n2770Q1837K50852o4239j77159k87623
15260a24479k19377m67690l56346L19919L47022K18311K96203K1006l73121j15827
15250d54379L4175K64686K02968k09512j43234K25730l4587j46378M3265M3867
$$ y = [-670641, -375347, 205914, 195997, -154659, -259097, -2229, 113044, 199558, 539587, 744945, 492288, -284401, -746143, -251133, -86301, -198140, 12459, -310046, -576687, -689732, -780237, -414734, -285500, -8850, 554584, 645547, 283405, 25825, 104611, -119603, -489980, -436598, -26420, 27715, -315808, -364353, -182879, -377830, -368924, -178797, -658885, -773416, -363546, 13807, 119332, 148272, -21572, -467869, -701142, -501975, -74984, 357651, 372686, 124623, 71853, 153690, 404542, 340303, 163144, -124479, -343856, -811546, -1167892, -847973, -500951, -282640, 13563, 34569, -338552, -454379, -420204, -155518, 47450, -162062, -305296, -79566, -114153, -260531, -217266, -173399]
15240a73399J10211O9648M9078j90569o87534q7513O93321K24871j78099K89356
15230A19371M46790K65008J11928L06068J57742j46752k8968J28275P9254l71145
15220A067571l23486J53764j14448p08889k96120o4576N8824K60141J06537K00799
15210C40117L32448n4037j61859J43763K40379q0240l57843j77033k1144Q6307
15200B90858j99017k43185j23883j1492J88192L27220J76970L98142L01252k38287
15190H66770k96894k72603m79076j07549j55138m22870R3885K42066P3517Q5025
15180c72867L29839M38840k33742l87220p4118Q5588N9061J91632J61863j07129
15170I1747o3553Q5385O639j29885j56147M1384j75109n01222l77956n463M31014
$$ y = [-173399, -63188, 6460, 55538, -135031, -822565, -910078, -216757, 8114, -169985, 119371, 566161, 831169, 943097, 1249165, 1406907, 1260155, 1231187, 1359462, 1438716, 1067571, 744085, 897849, 783401, 74512, -221608, -286184, -227360, 32781, 139318, 340117, 672565, 618528, 456669, 600432, 840811, 760571, 402728, 225695, 204551, 290858, 91841, -151344, -275227, -286719, -98527, 228693, 405663, 803805, 1105057, 866770, 569876, 297273, -181803, -289352, -444490, -867360, -773475, -531409, -457892, -372867, -43028, 395812, 162070, -225150, -299268, -213680, -154619, 37013, 198876, 91747, 28194, 113579, 120218, -9667, -165814, -124430, -299539, -800761, -1178717, -1184180, -753166]
15159g53166O92427M35103J87625M47227j44760k93889m62764j46622K60334L80663
15149F02178L92078R6649r3570J35483k43296m55410k12761j80173n5470j07251
15139a21543j09943j59160J93371J12982k38627j37669K73802K15690m8818m24524
15129d44439m0958K65270l55295J33314N22872k61478j73186L77134J12256j67228
15119c1738j410j4323j72564j26652o3022L3904j2459N5069K36479L85363J78435
15108D67082l99782o48630j8854M90601J05506m03855j1025J57279K59777J05429
15098A03528J28310j4105k11020n53374m60844k04257K68965M47160J02398L21534
15088g1705K37007j43847k24397j58609J31336M73526r647m86976l24512Q5949
$$ y = [-753166, -60739, 374364, 561989, 1009216, 864456, 570567, 107803, -38819, 221515, 602178, 994256, 1090905, 997335, 1132818, 889522, 434112, 221351, 41178, -14292, -121543, -231486, -390646, -197275, -84293, -322920, -460589, -186787, 28903, -19915, -444439, -485397, -220127, -575422, -442108, 80764, -180714, -353900, 23234, 135490, -31738, -33148, -47471, -220035, -346687, -409709, -375805, -388264, -333195, -96716, 288647, 467082, 67300, -581330, -600184, -109583, -4077, -407932, -418957, -261678, -1901, 103528, 231838, 217733, 6713, -546661, -1007505, -1211762, -942797, -495637, -393239, -71705, 165302, 21455, -202942, -361551, -230215, 243311, 233664, -253312, -577824, -491875]
15078d91875j52087K62450L85520N3670l14678k19771r52k31857K523K31806J94692
15067b80559m18205k81165j46082o38966k79178K43356M45510N46406Q11722P10456
15057G13295K8190o17782l37895k76000k66158J40643O3089p4425J41853J64570
15047c20620j42085j7543K71089K83177L49516J80752k06166l03905j81685K39428
15037A51958M28573K06204j77686j36256k02889J90559N8629m64692m16598m29103
15027g91301k71418J02465N26729K85803k1581N1134q0649K71251O7628j63586
15017b3525j12856K49290L81495Q6285k83859k31280l02291l79301J24225j20536
15007f12353k25523J03995J25084J57594K85394K65635R5383j33064j7749j33417
$$ y = [-491875, -643962, -381512, 4008, 57678, -257000, -476771, -477723, -709580, -707057, -475251, -280559, -698764, -979929, -1126011, -1764977, -2044155, -1800799, -1355289, -808883, 2839, 713295, 741485, 123703, -214192, -490192, -756350, -615707, -552618, -627043, -485190, -320620, -462705, -480248, -209159, 74018, 423534, 604286, 398120, 94215, -87470, 151958, 580531, 786735, 609049, 472793, 269904, 460463, 519092, 54400, -362198, -791301, -1062719, -960254, -433525, -147722, -169303, -118169, -198818, 72433, 140061, -23525, -136381, 112909, 494404, 580689, 296830, 65550, -236741, -616042, -491817, -612353, -837876, -733881, -608797, -451203, -165809, 99826, 195209, 62145, 44396, -89021]
14997h9021n13952m677K10945L42938N51903K78281k67024n95898k31348M27322
14987A09469L26689K20593M64761J90441j75499l33413k13519J81817o7743p723
14977F95873M4473q3207k36979k28706M6238M6190j05102n39853k33047L7427
14967e56693J01409M86150j2746N7324K41820K64084L95098O0369k50640j77774
14957F08401l52305n21880j63165J88302j83690l83459L84426N72035L76848J60381
14947F85894k54822n95595n52312j59662J96554j70K42581K18465l42425k96663
14937h58155j23171J89025K44129L66672J93315j73922k47510l50706m31224j29231
14927a320778L49961M40090n3023k45371l8495j18948l72189j61020m8656N60105
$$ y = [-89021, -602973, -607650, -396705, -53767, 498136, 776417, 509393, -86505, -317853, 109469, 436158, 656751, 1121512, 1311953, 1136454, 803041, 589522, 771339, 703596, 695873, 740346, 657139, 420160, 191454, 237692, 283882, 178780, -361073, -594120, -556693, -455284, 30866, 18120, 75444, 317264, 581348, 976446, 1036815, 786175, 608401, 256096, -265784, -428949, -240647, -424337, -807796, -423370, 148665, 525513, 685894, 431072, -164523, -716835, -876497, -679943, -680113, -437532, -219067, -561492, -858155, -981326, -792301, -548172, -181500, 11815, -162107, -409617, -760323, -1191547, -1320778, -970817, -530727, -583750, -829121, -867616, -986564, -1358753, -1519773, -1568429, -1008324]
14917a008324P95100K18968L23191n4855n35064n99776n0246K15959j12714j89967
14907i97728o90554l67309L65259O10043O74239M15011j62366p5683j48655j81285
14897e59028N0843l64766k5133J73357k17630j64048m3102m1192J28681j29349
14887a191367J65411J93025N0494J11631L70559M97773K89540j03735J82678J54788
14877G20797j14614l69797o04764k93179L63077J75276j26592k83718m33437l63541
14867a330492n7794L48905M69796N45771L34611O0036j03437O1231o6106k66757
14857d236j17379k70617j41908l42077k44880O9924M14474J88722J16420Q8571
14847b42986l15766l53019L7052r5806k45860k19712J09820L92281O8603K60768
$$ y = [-1008324, -213224, 5744, 328935, 274080, -260984, -860760, -911006, -695047, -807761, -997728, -1688282, -2055591, -1690332, -1080289, -406050, 8961, -153405, -229088, -377743, -559028, -508185, -872951, -898084, -724727, -942357, -1106405, -1149507, -1190699, -1062018, -1191367, -1025956, -832931, -782437, -670806, -300247, 197526, 487066, 383331, 566009, 720797, 606183, 236386, -368378, -661557, -298480, -123204, -249796, -533514, -966951, -1330492, -1388286, -1039381, -569585, -23814, 310797, 370833, 267396, 328627, 262521, -4236, -121615, -392232, -534140, -876217, -1121097, -1051173, -636699, -447977, -331557, -242986, -558752, -911771, -874719, -970525, -1216385, -1436097, -1326277, -933996, -865393, -604625]
14837f04625N231n10966j53004Q449K61363M65777M49947k95749j88809K19117
14827c43269m3719k74527l38147j0673O18016M88987J52869l24456j53659Q4874
14817a43704J01922J61453n7259q1755j59155n6434j88199m08907j06789M53482
14807d85345N64986K61137j08869r5205R5913K50412j30257n3051L78347N39208
14797A217276J08791l16893o37229l30782p2558R6608J64575M183j39070m03600
14787c08699k13148k1696J29782P565j73122J23384M76560L32331L01932K00208
14777H55097K80701R1671l31107k84548o05685o24476k12552K49797J06137O0317
14767d14648K1854L5943J68173p2483O9121K11386J53216r9390j38232j42239
$$ y = [-604625, -599394, -1110360, -1263364, -1254915, -993552, -527775, -77828, -373577, -562386, -343269, -386988, -661515, -999662, -1010335, -392319, 96668, 249537, -74919, -228578, -143704, -41782, 119671, 62412, -19343, -178498, -234932, -423131, -832038, -938827, -485345, 79641, 340778, 231909, 136704, 232617, 483029, 352772, 299721, 678068, 1217276, 1326067, 1009174, 371945, 41163, -31395, 65213, 229788, 233971, 94901, -308699, -521847, -543543, -413761, -406196, -579318, -455934, 20626, 352957, 654889, 855097, 1135798, 1227469, 896362, 611814, 6129, -618347, -830899, -581102, -474965, -414648, -392794, -356851, -188678, -261161, -192040, 19346, 172562, 73172, -65060, -207299]
14757b07299r149k87523O1528K0267l5904J61144j47863j25091j6326J6438O2407
14746e07371j69098k74550L07609M78142L5811l26147l83806n00986j48397k8446
14736a517239J0177K35395O42082L00009k19248k317L87646N6972l35056m84794
14726i26373n26018k13708j49329J72659N94784M96852l5612m22265m40310J75574
14716a273746J46473o8590M13523N41248Q4012l0043J88512M9957m00179p2841
14706d21674J03139k61545Q8064K42167K38192o4646o7918J87269Q0663l7977
14696H5734J62314K07366O7932R0307j58429l35805K5651J12061J12711j12189
14686B57653l30744j27525l3246K64127J83498r9854j36655k31388j46769j90398
$$ y = [-207299, -216448, -503971, -442443, -422176, -458080, -296936, -444799, -569890, -586216, -569778, -507371, -676469, -951019, -643410, -165268, -129457, -455604, -839410, -1340396, -1488793, -1517239, -1507062, -1271667, -629585, -329576, -548824, -551141, -163495, -106523, -441579, -926373, -1452391, -1666099, -1815428, -1642769, -1047985, -551133, -586745, -1009010, -1449320, -1273746, -1127273, -1195863, -782340, -241092, -157080, -187123, 1389, 51346, -348833, -421674, -318535, -580080, -492016, -249849, -11657, -76303, -144221, 43048, 123711, 85734, 248048, 455414, 523346, 613653, 455224, 119419, 145070, 257131, 369842, 257653, -73091, -200616, -233862, 30265, 213763, 113909, -22746, -254134, -400903, -591301]
14676e91301l74140K27242K93027M07817N68240n007k07553l04368k75397j04334
14666c65774L21303R2714k28644m03833l30046o3649M99j47589L85259L93520
14656c46240K29966Q8608r0272m8910N7527J60641K01663k63470n03570l66704
14646h80761L4207L02656L26237L03707J98343k41220k84169q7918J86149J55744
14636A2975O810l6258k22954l41297n3458M17473N3848j2428k9283r2494p0633
14625c67699j39730L78620L45574Q7150n23606m62676L04599N00858L02093M11527
14615H36710L04230k56827j41796j00693l5168j08935K53619l47978q60199l07159
14605g64196m2346j0335j24987N296j44489k52431O3177L44922L04363j22634
$$ y = [-591301, -965441, -738199, -445172, -37355, 530885, 525878, 318325, 13957, -261440, -365774, -44471, 48243, -180401, -584234, -914280, -977929, -977430, -1125019, -739760, -346240, -116274, -27666, -117938, -166848, -109321, 51320, 252983, -10487, -514057, -880761, -846554, -543898, -217661, 86046, 284389, 43169, -241000, -328918, -142769, 12975, 19785, -16473, -239427, -580724, -634182, -216709, -162861, -175289, -204572, -297066, -367699, -507429, -128809, 216765, 303915, -219691, -682367, -377768, 123090, 425183, 836710, 1140940, 884113, 742317, 641624, 606456, 497521, 751140, 403162, -457037, -764196, -806542, -816877, -941864, -936568, -1081057, -1333488, -1270311, -925389, -621026, -743660]
14595g43660j57034L60785J24234m9635L78786r4632m81045P8860L89039K42635
14585D8333P4912J86155Q2424l74514j66512p0696J27931O3206o0286M15944J88039
14574E14936L4900K60554J05331K55597J0567n28166l34988o6962j03962k88432
14564a40625l48405p9545K77782K259j43070k0677J07438j2106r8609J38326M14361
14553I7129M23856N1607k2871K64174j39337k75593l6436o741p2015j60999P6144
14542A98918n5246k88854l80537l70826m6996m9862K0087J27260J2714L86937
14532d46405L91077l79874k81094M97595L21878k89789m14810l11523J63126J14686
14522f35133O9327J2989m34669l9541J98810J91468J16201J43637J79926L94673
$$ y = [-743660, -900694, -539909, -415675, -465310, -86524, -181156, -662201, -583341, -194302, 48333, 123245, 309400, 391824, 17310, -149202, -219898, -91967, -28761, -89047, 326897, 514936, 549836, 810390, 915721, 1171318, 1181885, 653719, 318731, 251769, 147807, -140625, -489030, -568575, -290793, -288534, -431604, -452281, -344843, -356949, -455558, -317232, 97129, 520985, 572592, 549721, 813895, 674558, 398965, 362529, 355788, 283773, 122774, 198918, 143672, -145182, -525719, -896545, -943541, -993403, -973316, -846056, -833342, -446405, -55328, -435202, -716296, -218701, 103177, -186612, -601422, -912945, -749819, -635133, -565806, -552817, -987486, -1027027, -828217, -636749, -520548, -376911, -196985, 197688]
14512A97688O20998K83372k88235j90203j3005j88076k31941N9562j2153j89424
14502D8583N5692L30924K80203K36750j66191o09291k55217J54328n34448n53661
14492a012328j78438k52051L99795N48695J7768K64633K64291K6226J32997P6847
14482B88435k6790j31039m4220l09063n81036n62362q7941L78766J52705K22674
14472f99871L03259K47636K2813J0521L5500k5051o1514m86649n73733l29865
14462a556954J46527P9290Q99M40909L31081N225k967K23321q1534r0233l0183
14451e34619j9264K73257R8963J48645K85401N50844J83375P3874j72295m14504
14441D73677o43155k23422J64019P6839J36948K66832J6893p16269o06306L48750
$$ y = [197688, 818686, 1102058, 813823, 623620, 610615, 422539, 190598, 250160, 238007, 48583, 104275, 435199, 715402, 952152, 785961, 176670, -78547, 75781, -458667, -1012328, -1190766, -1442817, -1043022, -494327, -476559, -211926, 52365, 78591, 211588, 288435, 261645, 130606, 86386, -222677, -803713, -1366075, -1454016, -1075250, -922545, -699871, -396612, -148976, -126163, -115642, -80142, -105193, -166707, -653356, -1227089, -1556954, -1410427, -1331137, -1330238, -889329, -558248, -553023, -555990, -332669, -414203, -504436, -534619, -553883, -280626, -181663, -33018, 252383, 803227, 986602, 1060476, 888181, 473677, -169478, -392900, -228881, -152042, -15094, 251738, 268631, -447638, -1053944, -705194]
14431g05194N36023K10749L04452J53741j87304l33801n36299j41552L70329j37009
14421d65865j58013N2439J21411K24274p7014n33260m8077O9586K4583P3989J72702
14410e43245j48937l55131j34519N03730N74705L34608M71398O62120J46433m96281
14400A014881k44431l00115k89666k41667j34118L1143J33420K61833K647j24721
14390A09206K48396N52307M3798j48901p729j25581j04578J02033O3144K05899
14380I37994J18339k65736k75005q9691o5949j33141m45699m40418J47491O88369
14370A76554N62077R1838k63426m98857l08433m7610J99830q2963j34133J72345
14360a32778l07804n84768J93270N87964O3664k03820p5351R4952K93289L85474
$$ y = [-705194, -169171, 41578, 346030, 499771, 312467, -21334, -557633, -699185, -328856, -465865, -623878, -571439, -450028, -225754, -302768, -836028, -884105, -814519, -789936, -715947, -543245, -692182, -1047313, -1181832, -678102, -103397, 231211, 702609, 1364729, 1511162, 1014881, 770450, 470335, 180669, -60998, -195116, -163973, -30553, 231280, 233927, 109206, 357602, 909909, 953707, 804806, 797077, 671496, 566918, 668951, 732095, 937994, 1056333, 790597, 515592, 425901, 359952, 226811, -218888, -659306, -511815, 176554, 738631, 830469, 567043, 68186, -240247, -287857, -88027, -170990, -305123, -132778, -440582, -1025350, -832080, -244116, -180452, -384272, -459623, -364671, -71382, 314092]
14350C14092N48970K43762k81092k93850J10383J25152k1147K07808O04872n0654
14340A508296m21019m2190l21011J14915P3372m41352r0168J17406j60126k03013
14330A35110K33216N29436J16506J7556l55884j067219o42536j43190o1660J29771
14320a108894j9164m5637R9568K28737R5860J95079J90384l59137l22709k47943
14310a293856L66666O92326L07674k44910m41717k58546J23649J28866J33688
14301d86160K48684k09984j41403M26593J36162K07873J90315j2504J48356J6183
14291E24115j44842j97510j80544j816k26941l70512k80708q7330o3756j35824
14281a165668n3862K78264k12140o07545J53587Q46918L76055J81264J76622K162
$$ y = [314092, 863062, 1106824, 825732, 531882, 642265, 767417, 746270, 954078, 1558950, 1508296, 1087277, 1045087, 724076, 838991, 912363, 471011, 380843, 498249, 338123, 135110, 368326, 897762, 1014268, 1031824, 675940, -391279, -1033815, -1177005, -1238665, -1108894, -1128058, -1173695, -1074127, -845390, -749530, -554451, -364067, -723204, -1045913, -1293856, -927190, -234864, 72810, -172100, -613817, -872363, -748714, -619848, -486160, -237476, -447460, -588863, -162270, -26108, 181765, 372080, 359576, 507932, 524115, 379273, 181763, 1219, -597, -227538, -598050, -878758, -966088, -1029844, -1165668, -1219530, -941266, -1153406, -1760951, -1607364, -760446, -384391, -203127, -26505, -24343]
14271b4343L4939L9973K69634K14811L77436K10575m83454o87021m45199O9764
14261d22885M06471L83788J31262j88074k25003l27461j47536k01486q1001l7041
14251g08966m7562J77065P8783k67110j03728P0506j37242j46469K30464L56574
14241d97685L20523j86213r8769j30619P9899L73581j63492K38747M05454k08638
14231A32788m64405k33775k10330n734J57644J62880K38338L17190M14p891K7460
14220A14579J72891J9304j47495j18447k92030K45770N10966J33468k26997j15909
14210B96100M13340K06247r4247k87787n11436m7094o425j70631K42250L42401
14200C82718L3723k13471n66169n76674P2947N44786J16875r3215M01302L89179
$$ y = [-24343, 10596, 50569, 320203, 535014, 912450, 1123025, 639571, -47450, -492649, -422885, -16414, 367374, 498636, 310562, 85559, -241902, -389438, -590924, -671925, -708966, -756528, -579463, -500680, -767790, -871518, -801012, -938254, -1084723, -854259, -497685, -177162, -363375, -462144, -592763, -512864, -139283, -302775, -64028, 341426, 132788, -331617, -565392, -775722, -781456, -623812, -460932, -222594, 94596, 95010, 87119, 114579, 287470, 306774, 159279, 40832, -251198, -5428, 505538, 639006, 412009, 296100, 709440, 915687, 821440, 533653, 22217, -24877, -31302, -201933, 40317, 382718, 416441, 202970, -363199, -939873, -866926, -322140, -205265, -298480, 102822, 492001]
14190D92001l80265m86406j21326m374J50907L24425j06908l04934j68432j01334
14180g06646J24976J51874M20377o0329m48288o848j35070l51239J71337L61525
14170d78331J73751o5378k08458j78192O05658R70247K62807m33840n37283n9631
14160E1350k8064K75543M6135j46771K3463k6293J36277P76807J71357p39841
14150E39963n30178j24400n8081L6417J7535J58031R7900r2169j643L6217J77426
14139B57018j47732o23505k16546P49952Q30641m651j82236j84176m94202l45285
14129c60722J25074p450J5320J46035k51221j08379J28955m70611l84911l702
14119a171612L77400l8819O3995M30552L27876R6725k65311j42074J83249l437
$$ y = [492001, 111736, -374670, -495996, -500370, -349463, -25038, -131946, -436880, -605312, -706646, -581670, -429796, -9419, -69748, -518036, -524884, -659954, -1011193, -839856, -478331, -304580, -369958, -578416, -756608, -150950, 819297, 1082104, 648264, 110981, 51350, 23286, 298829, 344964, 198193, 221656, 195363, 331640, 1108447, 1279804, 539963, 9785, -114615, -172696, -136279, -118744, 39287, 137187, 45018, 43375, 79592, 257018, 109286, -514219, -730765, 19187, 849828, 845177, 662941, 478765, -15437, -360722, -235648, -243098, -227778, -81743, -332964, -441343, -312388, -782999, -1167910, -1171612, -794212, -833031, -769036, -338484, -10608, 86117, -179194, -321268, -138019, -141456]
14109a41456m15539j36932L03532J87967K53621L43238M8958J00294r5108n65420
14099a16845l41459o6083R4226r3265L5118K42340J08840K48676M0979j15433
14089C7094l43908n64374O7617K90817J96684L9687J40708p814L5535j65741j05933
14078c79628O01328N54094o1055n48486n40117n25448l25557J92599L39058K26732
14068d66480J69244J20022m7230k77181m1444J92961M09926O27319L86766m3011
14058A030892m53932o90282l5233k56143j68626n11141k9044L92776M66093L09782
14048E5142J19060K55291M25649M6641k93472k91912m88443o10278k13966J65018
14038h31270J03351r589J65227M06987K16509K9831r3205K11857L24706L6785
$$ y = [-141456, -556995, -693927, -390395, -202428, 51193, 394431, 443389, 543683, 448575, -116845, -458304, -524387, -430161, -523426, -488308, -245968, -137128, 111548, 152527, 37094, -306814, -871188, -803571, -512754, -316070, -276383, -135675, -143489, -107954, -273695, -379628, 221700, 775794, 714739, 166253, -373864, -899312, -1224869, -1032270, -693212, -466480, -297236, -177214, -224444, -501625, -543069, -350108, 59818, 687137, 1073903, 1030892, 576960, -113322, -148555, -404698, -573324, -1084465, -1113509, -720733, -254640, 55142, 174202, 429493, 855142, 901783, 608311, 316399, -172044, -782322, -996288, -831270, -727919, -737508, -572281, -165294, 51215, 81046, -12159, 199698, 524404, 561189]
14028E61189j79796q3443L8920m4890Q8206j61305J27103M2253k70291j68426
14018e0480k78228O6688L69584M70182L30582L5044n4209J32618J9696l44591
14008F96886k6952K54637j08774j37547o3718q4216j14911k17091R9740O65028
13998I63082K32747k33310n69301n97930j8810K43701O41378L89252K21163m19603
13988H52369n89296J3734J80580o49l8977k08828k09160j42624j03136L07294
13978F1307J64878N8470k7720N982J33560L5592L76389K34646J9026j6602L32693
13967A378221M79446M93076N16078J278383J412864J607450J474229K456824M204201
13958A5300772N688598Q923038J2119808L391575r887428j0319575p318430n405086
$$ y = [561189, 381393, 297950, 336870, 291980, 380186, 218881, 345984, 388237, 117946, -50480, -328708, -262020, 107564, 577746, 908328, 943372, 889163, 1021781, 1041477, 696886, 669934, 924571, 815797, 678250, 614532, 530316, 415405, 198314, 298054, 963082, 1195829, 962519, 393218, -204712, -223522, 20179, 661557, 1050809, 1271972, 852369, 263073, 276807, 457387, 456738, 417761, 208933, -227, -142851, -245987, 61307, 226185, 284655, 256935, 262917, 396477, 432069, 808458, 1043104, 1062130, 1045528, 1378221, 1857667, 2350743, 2866821, 4145204, 5558068, 7165518, 8639747, 11096571, 15300772, 20989370, 29912408, 42032216, 45423791, 35536363, 25216788, 17898358, 12493272]
13950A2493272l781468k237124j454499j870130j080249j41581m90597n99841
13942H37783j91692J04705M067m92362m52624J35708K71237J05579R904K01804
13932E34109M56075K35107j97547m072K17869J55817n6466m69552m76718m54849
13922f0227l44233j27545J98164M78718L86489j28015m27039k30164J19075N17428
13912C82651O15170j51340l29926k56449k7933K88385k78818l52858l94463L16279
13902a89302N75759j99259Q2201M74283j33679k35304q8844L81843K66070j25074
13892H08694k66726L534K22801r7200o9440l69816m42323p8530K09612R5733j49124
13881a32785n22678m2449J25799J09176M23832M03192L17406N8088K11048J32189
$$ y = [12493272, 8711804, 6474680, 5020181, 3150051, 2069802, 1928221, 1437624, 837783, 646091, 750796, 754863, 262501, -190123, -54415, 216822, 322401, 332305, 534109, 990184, 1225291, 1027744, 1023672, 1241541, 1397358, 1340892, 871340, 394622, -60227, -404460, -532005, -333841, 144877, 531366, 403351, -23688, -253852, -134777, 382651, 997821, 846481, 516555, 260106, 232173, 520558, 241740, -111118, -505581, -189302, 386457, 187198, 269399, 743682, 610003, 374699, 285855, 667698, 933768, 808694, 541968, 545502, 768303, 671103, 601663, 231847, -210476, -289006, -79394, 16339, -132785, -655463, -697912, -572113, -462937, -39105, 364087, 681493, 739581, 950629, 1082818]
13871A082818l89160o92778l57259m37606k92653K17432J13969R6456L06561L95005
13861D2785M98304J92970k08765k61271K007L05563K11108l09655m77721L2060
13851B7385J34575p5796k91873j20382L19774J60818K7869O9772j75038L4387
13841A11491j40866j79588L93161P2532k93281j64632M7684k7861j70604k13137
13831e65101m50502l09440J39801L59002Q5419J70915O65536M5995k98580l26822
13821d83777q6857Q5483L5286O5138O92764P27453k8966l22588l6239J73145J76261
13810I97103R1180J48907M47675j74246q01048r36216l03426j7308L93943M65173
13800C11737J73063L11191m4770k28391j68545j23954J43218J5849k16163K18728
$$ y = [1082818, 693658, 880, -356379, -793985, -1086638, -869206, -755237, -658781, -352220, 42785, 541089, 734059, 525294, 264023, 266030, 571593, 782701, 473046, -4675, 27385, 161960, 86164, -205709, -326091, -6317, 154501, 182370, 252142, 77104, 111491, -29375, -208963, 184198, 256730, -36551, -201183, -153499, -181360, -351964, -565101, -1015603, -1325043, -1185242, -826240, -740821, -569906, 95630, 141625, -156955, -483777, -570634, -485151, -449865, -384727, 308037, 1035490, 1006524, 683936, 647697, 820842, 997103, 1088283, 1237190, 1684865, 1510619, 709571, -226645, -530071, -547379, -153436, 311737, 484800, 795991, 751221, 522830, 354285, 230331, 373549, 389398, 173235, 391963]
13790C91963K06176O0527l4279P5289M9365k25887q7019n4148k27863j8311k59745
13779a23932o17052k66859K35548M12057L74099M23128K91161k99708j73945J84765
13769D39262k15564l75482N9885K29533M05449m0880k42000R5951M70296M87137
13759A313587J41955n08038k90621j154Q8831l2294m07687p3469O9474m7241j44323
13748A09020p3063L61358K20268K4530j07565J15720N48953j4960n91618n51145
13738D1498j40963l0784J15683L1267L6537l26520j67830K89132l1941j81107
13728c65028M8108L43167N9831k84980k20125j49209J21538J94758k59653j60934
13718f72527L79937N32974L24149k56981l61473o7745k09600p0088N35146K18647
$$ y = [391963, 598139, 658666, 624387, 699676, 749041, 523154, 436135, 381987, 154124, 135813, -123932, -740984, -1007843, -772295, -360238, 13861, 436989, 728150, 428442, 254497, 439262, 223698, -151784, -91899, 137634, 543083, 502203, 260203, 356154, 826450, 1313587, 1455542, 947504, 656883, 655729, 744560, 712266, 304579, 231110, 300584, 253343, 109020, 35957, 397315, 617583, 642113, 534548, 650268, 1199221, 1184261, 592643, 41498, -99465, -130249, -14566, 16701, 53238, -273282, -441112, -151980, -183921, -365028, -316920, 26247, 86078, -198902, -419027, -568236, -446698, -251940, -511593, -672527, -292590, 240384, 564533, 307552, -53921, -121666, -331266, -401354, 133792, 352439]
13708C52439q4959j08056l2084L67109J82748j22683M9440l7808K6205L81668
13698I74019j41351m21490n86042k76969M77268K43021l54734l45014j79188J96295
13688d14185J30489J31741K44190k63881n37601m01022K57277N36711L06626n7793
13678f7448P280K54950J5537j44444q3157J95373L18513K66704q6395l06830o93558
13667c23475m67997O8383j4017j44132o014K96849L39720L26260O8032m05483
13657b61874m55146O9996O8827j97648p660L8148Q7076L24177K81967L49698K3217
13646C20778k55992q921K57421K36980L33938K98480O7085j36208r2298J72204
13636A193467K05767n8825k26878l26242j68086j48197J2701j57505j14158k89510
$$ y = [352439, 267480, 159424, 127340, 494449, 677197, 554514, 603954, 566146, 592351, 974019, 832668, 411178, -174864, -451833, 25435, 268456, -86278, -431292, -610480, -414185, -283696, -151955, 92235, -171646, -709247, -1110269, -852992, -316281, -9655, -67448, -60168, 194782, 210319, 65875, -17282, 178091, 496604, 763308, 676913, 370083, -323475, -791472, -723089, -737106, -881238, -887252, -590403, -250683, 75577, 143609, -261874, -717020, -647024, -578197, -775845, -783505, -745357, -658281, -334104, -52137, 297561, 320778, 64786, 55865, 313286, 550266, 884204, 1182684, 1249769, 1113561, 1021263, 1193467, 1399234, 1340409, 1113531, 787289, 619203, 471006, 483707, 326202, 212044, -77466]
13626g7466l14447M8569K11511J89219J64098R6427j58003l52245L4637J51856
13616e844J62211k065J762K27819K68973J49770R765K47435K73409m38881r84944
13605i0590r21068l08742K27613L10941K36385O6267O5963K38768L33967K94420
13595D53924J4447l75606k56691o3519j92740N2224L12080r0819J9868N22822
13585C95990M45177O7028k82343l37295p6257p6387k10129K2154J17796j89543
13575a23809l53472l72094k71838m7293M30545N24573O25618K28139k20362K30392
13565F50399L97148j45453j11218j21507q1005J9331n9993k53908l45530j07295
13555a59031K19274L83379J84028J95719L85085Q0590r2517m8972m8732J29646
$$ y = [-77466, -391913, -343344, -131833, 57386, 221484, 317911, 159908, -192337, -157700, -5844, 156367, 154302, 156064, 383883, 652856, 802626, 812391, 1059826, 1333235, 894354, -90590, -1011658, -1320400, -1092787, -781846, -545461, -479194, -413231, -174463, 159504, 453924, 468371, 92765, -163926, -227445, -420185, -367961, -55881, -146700, -126832, 395990, 841167, 908195, 625852, 288557, 212300, 135913, -74216, -52062, 65734, -123809, -477281, -849375, -1121213, -1168506, -737961, -213388, 412230, 640369, 420007, 650399, 1047547, 902094, 790876, 669369, 588364, 607695, 547702, 293794, -51736, -159031, 60243, 443622, 627650, 823369, 1208454, 1289044, 1196527, 1147555, 1098823, 1228469]
13545A228469l31217k70249M1599K01783K6675k75512j65814j56298k24717k78777
13535b04058k42443l28063k53902K95423J44503M27573J97861P6026M71542K18042
13525H02504J834J69K90326K29642n7581l67931k17590j01354Q9219O4676j71898
13514E62016m79254k42459J84437M21023L71391L10334R8510l32283j65207K64427
13504I92935J42404O5506K8995n29444j91875J19141k83450n2570L40605J79519
13494H11766K05130m261j46840l25467l54939m18152n3951L12741q7569l05287
13484c66829k24566o26651n58501J58750O31478P44966M61446K88626K01223M9746
13474G59688l19072m85257m19084m77345m91990L4823L20342M56014K11786j35658
$$ y = [1228469, 897252, 627003, 668602, 870385, 897060, 621548, 455734, 299436, 74719, -204058, -446501, -774564, -1028466, -733043, -588540, -160967, 36894, 112920, 584462, 802504, 804338, 804507, 1094833, 1324475, 1266894, 898963, 681373, 580019, 669238, 733914, 562016, 82762, -159697, 24740, 445763, 817154, 1127488, 1225998, 893715, 728508, 992935, 1135339, 1200845, 1229840, 700396, 508521, 627662, 344212, 291642, 632247, 811766, 1016896, 1012635, 865795, 540328, 185389, -232763, -286714, 26027, -61542, -366829, -591395, -1218046, -1776547, -1617797, -986319, -241353, 220093, 508719, 709942, 759688, 440616, -44641, -463725, -941070, -1433060, -1398237, -1077895, -621881, -410095, -545753]
13464e45753J7889K86179L84500J83068K87287Q9132l84349p1062M1040J1568
13454B99499K22732J20388j48646Q4239M33629m1908n67626m50904j21238L97704
13444B27869N00406K55148k44057q22615p02034q6366R1788L24710K71842J40778
13434d2531K78787L60876Q8263r8026k95878j4423K49854K18724O4045j39083
13424F70608k01422n15924l905L87065O0255k84148n62725m73582L70189N72684
13414A9095J40102j7141l7268j56838J2656K17718K66734L48151j44493o16031
13404C2685j34060K25956j54435j3441K14693L52932k0266O4916j11362k45030
13394B12588O9620j4266m3501J4333K70324j38761j71824N34657M61679J80900
$$ y = [-545753, -527864, -241685, 142815, 325883, 613170, 702302, 317953, 246891, 287931, 299499, 522231, 642619, 493973, 578212, 1011841, 969933, 402307, -48597, -169835, 227869, 728275, 983423, 739366, -83249, -785283, -871649, -779861, -455151, -183309, -42531, 236256, 597132, 685395, 587369, 291491, 277068, 526922, 745646, 809691, 670608, 469186, -46738, -50643, 336422, 396677, 112529, -450196, -923778, -553589, 19095, 159197, 142056, 104788, -52050, -39394, 178324, 445058, 793209, 648716, 32685, -101375, 124581, -29854, -43295, 171398, 524330, 504064, 568980, 457618, 212588, 282208, 267942, 224441, 238774, 509098, 370337, 198513, 733170, 1194849, 1375749]
13384A375749o397j2138K4342K02637j72136k07017J83313Q8856J99427k61528
13374A415108m13781p0220O4394m26316k33853j30294j46511p2310N9845J77897
13364B23959K18553L82956K27913M37605N40095N71068L98419O23152J272578
13355D896298P59795p36478j210385r76185q43322m61782J78201j72005l29203
13346A104934k1684N0275n7263m8929J65376l71437p0840M39292O20297k0070
13336A789951j96311N7227R7637p79703o23561K1758J55288k5211j34034K09783
13326E72824N2845j47562o4727q7598Q5049K5598j02717j9315M36857O20958o6780
13315A305432m27246j48010L13055J58336j24859K1847J41865n12324m94954j66608
$$ y = [1375749, 1369352, 1357214, 1381556, 1584193, 1412057, 1205040, 1388353, 1477209, 1676636, 1415108, 1001327, 931107, 995501, 569185, 335332, 205038, 58527, -13783, 46062, 223959, 442512, 825468, 1053381, 1490986, 2031081, 2602149, 3000568, 3623720, 4896298, 5656093, 4919615, 3709230, 2733045, 1889723, 1427941, 1606142, 1434137, 1104934, 1083250, 1133525, 1076262, 1027333, 1192709, 821272, 750432, 1189724, 1810021, 1789951, 1593640, 1650867, 1748504, 968801, 345240, 366998, 522286, 497075, 363041, 572824, 625669, 478107, 413380, 325782, 410831, 436429, 333712, 314397, 751254, 1372212, 1305432, 878186, 730176, 1043231, 1201567, 1076708, 1098555, 1240420, 728096, 233142, 66534]
13305F6534j93535o89688n67932J89303O41364O71226M16038N60757N8564n94455
13295E58176l95122r6377J70137K90371n5296r2889j93457j10531J72346K78892
13285E26250j8387j60067k00097J92917J08169j43394J75444K28778L27327K02138
13275A239078L2315M5136J23160R1780L3126m45784l98730k0212k1218l6094L9512
13264F82069j25479j10411j9266J35936K59064J06151R6288R82151O34897k40653
13254B400747l90297l23205p6508j0436l63254m33987k68742K070R2195m4198
13244E84385k33619k09912j80085j85051L49408L04254J6122j83026k36341k90248
13234b64113K00938J24604Q3646J03398l6376j80541j96106K39581J00868j36777
$$ y = [66534, -127001, -816689, -1384621, -1195318, -553954, 117272, 533310, 1094067, 1152631, 558176, 163054, 66677, 236814, 527185, 471889, 379000, 185543, 75012, 247358, 526250, 507863, 347796, 147699, 340616, 448785, 305391, 480835, 709613, 1036940, 1239078, 1271393, 1316529, 1439689, 1531469, 1564595, 1118811, 720081, 699869, 678651, 642557, 682069, 556590, 446179, 426913, 562849, 821913, 928064, 1024352, 2006503, 2641400, 2400747, 2010450, 1687245, 1610737, 1600301, 1237047, 803060, 534318, 536388, 628583, 584385, 350766, 140854, -39231, -224282, 125126, 429380, 445502, 262476, 26135, -264113, -63175, 61429, 145075, 248473, 212097, 31556, -164550, 75031, 175899, 39122]
13224C9122k00843J14163N07498M11605L05407J01828j69402m53357k18614J16589
13214E53996J63023j934K27518J55996J3271j28975J39771n0986k68867j53491
13204F49322j68751K27048P3807k60079j90657Q7379K39450K91741J03695K29970
13194A282925M681k62513l4478j07434j77714p02124k23699N44290L81458L67476
13184A072868j21521j15024J44443K62874N6865j07650l27977k78067j97964o42
13174C88205J93076L59956L69772m9211j0327L64160Q1409l11092k2621J87748
13164A551075l4057O1354K66239N3370l63497k28948L42382q7978p19238l62044
13154D78658L7227K52272K72252j20043k53258Q1990J77108J17631K90423L91991
$$ y = [39122, -161721, -47558, 459940, 871545, 1176952, 1278780, 1109378, 656021, 437407, 553996, 717019, 715085, 942603, 1098599, 1111870, 982895, 1122666, 1071680, 802813, 649322, 480571, 707619, 781426, 521347, 330690, 418069, 657519, 949260, 1052955, 1282925, 1287606, 1025093, 990615, 883181, 705467, 3343, -220356, 323934, 705392, 1072868, 951347, 836323, 980766, 1243640, 1300505, 1192855, 864878, 586811, 388847, 388205, 581281, 941237, 1311009, 1261798, 1251471, 1615631, 1697040, 1385948, 1363327, 1551075, 1517018, 1578372, 1844611, 1897981, 1534484, 1305536, 1647918, 1559940, 840702, 478658, 515885, 768157, 1040409, 920366, 667108, 749098, 926206, 1043837, 1334260, 1726251]
13144A726251N4294j9431Q8124k6361M4695p8982k19501j46041j90977J93796
13134A425867J33970J26842n0453j46403J03693j16024p15784n01478m01L7097
13124B96926K53067K62426K52392M30291J79326N2131k851j59354l01518j14092
13114A148744l6798J00116J56175J20142j55510k34961K2038K25059l9149K29187
13104A535043N4593m17109n04088j260L91837K53753l1342k83860J69380J87944
13094A354891P6052l4746j12760O8321P7052K54401K06498Q8884L9530J65912
13084B184035p3949k68032J06112J52562K6797o0927K14887J96195L12642p7109
13074B713213m07630K0619n6790J28870K98852J50433l45990o00224k29573J87212
$$ y = [1726251, 1780545, 1761114, 1849238, 1822877, 1867572, 1788590, 1569089, 1423048, 1232071, 1425867, 1559837, 1686679, 1636226, 1489823, 1593516, 1477492, 761708, 260230, 259829, 296926, 549993, 812419, 1064811, 1495102, 1674428, 1726559, 1723708, 1564354, 1262836, 1148744, 1111946, 1212062, 1368237, 1488379, 1332869, 1097908, 1119946, 1345005, 1305856, 1535043, 1589636, 1172527, 668439, 667179, 1059016, 1312769, 1281427, 997567, 1166947, 1354891, 1430943, 1396197, 1283437, 1351758, 1428810, 1683211, 1889709, 1978593, 2018123, 2184035, 2110086, 1842054, 1948166, 2100728, 2127525, 2066598, 2281485, 2477680, 2790322, 2713213, 2305583, 2326202, 2269412, 2398282, 2697134, 2847567, 2501577, 1901353, 1671780, 1858992]
13064A858992K10316J79414K91931O9681m1966K15960K62533J65502J60042l44896
13054C027509n71545l20508Q9088M28203O45659M18771K87338j83724m07646J86702
13044C599847L91108q4262l46561k7874j9654j82719K13250K57368k03671m15958
13034C180874k20057j44709P7977L70639J5386q7997N51238N41846O8267Q2868
13024D436332J87379K01521J3784k34193k55212l00547k64722M4294N3765J18969
13014D001370L81820K75821K52336L79089M41670N78092K23877J63592M55227
13005G152894J71035N596O47109P94168O32176N89705N9866J03637N36026R59072
12995A1651284J295297P86835L82379R98012J310092J345044J613197K148192
$$ y = [1858992, 2069308, 2248722, 2540653, 2610334, 2568368, 2784328, 3046861, 3212363, 3372405, 3027509, 2455964, 2135456, 2224544, 2652747, 3298406, 3717177, 4004515, 3820791, 3413145, 3599847, 3990955, 3906693, 3560132, 3532258, 3512604, 3329885, 3543135, 3800503, 3596832, 3180874, 2960817, 2816108, 2894085, 3264724, 3280110, 3192113, 3743351, 4285197, 4353464, 4436332, 4623711, 4825232, 4839016, 4604823, 4349611, 4049064, 3784342, 3828636, 3882401, 4001370, 4383190, 4659011, 4911347, 5290436, 5732106, 6310198, 6534075, 6697667, 7152894, 7323929, 7329525, 7976634, 8770802, 9402978, 9992683, 10052549, 10156186, 10692212, 11651284, 12946581, 13733416, 14115795, 15113807, 16423899, 17768943, 19382140, 21530332]
12987B1530332K799538L060334L666111M647508O231415Q092108R911742J3108797
12979G3047885J7505159K2926259L0401244M1633247N6655311P3992938Q3875228
12972D00037271O4121614N065731n5703934q0684638p4730132n9323259m4924847
12965A53857806l2597575k4005453j8005063j3456040j0142189p911362o499194
12958D1240930m996241l533472l244469k995650k183349j929747j831654j833466
12950A8692882j286993j140058r58239o46418m66731n48438m24030o14630o01778
12941A2005567m81290p16134n65918l31551k82289j7156k58305k64245r8737J77297
12931I167239Q0383j02245j37639m078K80001J01453l15858k37839K3812N36584
$$ y = [21530332, 24329870, 27390204, 31056315, 35703823, 41935238, 50027346, 59939088, 73047885, 90553044, 113479303, 143880547, 185513794, 242169105, 316162043, 400037271, 464158885, 469224616, 413520682, 332836044, 258105912, 198782653, 153857806, 121260231, 97254778, 79249715, 65793675, 55651486, 47740124, 41240930, 36244689, 32711217, 29466748, 26471098, 24287749, 22358002, 20526348, 18692882, 17405889, 16265831, 15307592, 14661174, 14194443, 13646005, 13221975, 12607345, 12005567, 11524277, 10808143, 10242225, 9910674, 9628385, 9611229, 9352924, 9088679, 8989942, 9167239, 9247622, 9145377, 9007738, 9003660, 9283661, 9385114, 9069256, 8831417, 8855229, 9391813]
12921I391813Q56358R47310Q06638O31414J254474K284574L072337K818996J996077
12912B4059991K2899j425550j858181j393663n31905k17520j67177L02121J025382
12903A9816397J366120J891561K250622K475080L165183L753526M557872O238207
12895D5514568Q052496J0331535J4165385J8660758K4815604L3899025M6123300
12888B01562671O2162248Q0188479Q5741639N2757532j6098771p1169031q4045591
12881C11099176p1946148n4980679m0754265k9780940k1751195j6400279j2547076
12874F2938594r717531p401102n748389m887002m112265l616391k791141k655710
12866B2009063k165922j479593j527250j280874q02572m02460m83178q46441l60983
$$ y = [9391813, 10248171, 11195481, 12002119, 12633533, 13888007, 16172581, 19244918, 22063914, 24059991, 24082890, 22657340, 20799159, 19405496, 18873591, 18656071, 18488894, 18791015, 19816397, 21182517, 23074078, 25324700, 27799780, 30964963, 34718489, 39276361, 45514568, 53567064, 63898599, 78063984, 96724742, 121540346, 155439371, 201562671, 263724919, 343913398, 429655037, 482412569, 466313798, 395144767, 311099176, 239153028, 184172349, 143418084, 113637144, 91885949, 75485670, 62938594, 53221063, 45819961, 40071572, 35184570, 31072305, 27455914, 24664773, 22009063, 19843141, 18363548, 16836298, 15555424, 14752852, 14350392, 13867214, 13020773, 12659790]
12857A2659790p6564o43919j005977q90423m91120j36016k51766j84744Q9877
12848I069138p0940K2695K49849k81594m76130n88821m80059M86833M96320J2026
12838H439317r2336j97149L11878N20272K38510o4057n3019L55641L42670M54322
12828A0256049M34855M35663L24047K61057J20337K27294R00520J052819R59321
12819A4971962J094397J019224J355398J996139J963360K024150K547751L310131
12811C0282512M582804N592286P072386Q922003J1545022J5168227J9971633K6795440
12803A29932313L6368371M9649393O6920930Q1659788P7432498L3348038l3567762
12796D41743569p5442484p9510059o5676658m9939997l7184960k7713353k0884646
$$ y = [12659790, 12583226, 11939307, 10933330, 10042907, 9551787, 9415771, 9164005, 8979261, 9069138, 8998198, 9020893, 9270742, 8989148, 8513018, 7924197, 7444138, 7930971, 8427291, 8439317, 8346981, 8149832, 8461710, 8981982, 9220492, 9156435, 9103416, 9459057, 9801727, 10256049, 10690904, 11126567, 11450614, 11711671, 11832008, 12059302, 12959822, 14012641, 14971962, 16066359, 17085583, 18440981, 20437120, 22400480, 24424630, 26972381, 30282512, 34865316, 40457602, 47529988, 56451991, 67997013, 83165240, 103136873, 129932313, 166300684, 215950077, 282871007, 364530795, 441963293, 475311331, 441743569, 366301085, 286791026, 221114368, 171174371, 133989411, 106276058, 85391412]
12789H5391412j5077740j1334363r287536p507289o047507m827116l480381k780314
12781B5049166k575724k232519k081404j815472j407012j057947j026417q75120
12773A1977551j110036o81776K7539l20813o56631o87321n66138m91204m47668
12764G043503k77564j47708m17822o15462o11726n01957j76981J15805O9724j55664
12754D324148n8890J2418o21360k53463J01728k17018k10532Q9723J37191j65101
12744C138844q0238l57002o51534J2067N01217J07129p6353j83899k59159k41696
12734A909376K37321M36321K50608n95695p69080K14615O29761J70923k81866
12725B202284m27680m93059n14761J11497J64878j59997n8566K3959J57234r3084
$$ y = [85391412, 70313672, 58979309, 49691773, 42184484, 36136977, 31309861, 27829480, 25049166, 22473442, 20240923, 18159519, 16344047, 14937035, 13879088, 12852671, 11977551, 10867515, 10185739, 10213278, 9892465, 9235834, 8548513, 7982375, 7491171, 7043503, 6765939, 6618231, 6200409, 5584947, 4973221, 4471264, 4294283, 4410088, 4479812, 4324148, 4265258, 4277676, 3656316, 3402853, 3504581, 3287563, 3077031, 3166754, 3303945, 3138844, 3058606, 2701604, 2050070, 2062137, 2563354, 2670483, 2594130, 2410231, 2151072, 1909376, 2146697, 2583018, 2833626, 2237931, 1468851, 1683466, 2313227, 2484150, 2202284, 1774604, 1281545, 766784, 878281, 1043159, 883162, 824596, 848555, 1005789, 912705]
12715I12705L17752M54744L8305j81727j10194J94391R0165m2899k53459J12216
12705A531999N10178l435m40043k3177J03710J0061p0369l15516n5075J0633N3873
12694A312839k88491o83039k83928K41232L68461M1485l05536k2851p5715J78226
12684D82683K67615P1642m46528l66182j33903K04836L42091K34774j54000l8396
12674D64632k38808R8511J58873j11028M2741L9084J71445L21383k89287j39987
12664E17559J90729Q9304P0359j3743K6422K1506j17062k33143o3910J96660J27949
12653H12630J0163j35614l36670l53969k36539o6870k58318k53834N07574N75277
12643B63830K38885K52059k8560K7268N5790K04757J17654K12437K3824j61318
$$ y = [912705, 1230457, 1685201, 1723506, 1541779, 1431585, 1625976, 1716141, 1673242, 1419783, 1531999, 2042177, 2038742, 1598699, 1575522, 1679232, 1689293, 1618924, 1303408, 1248333, 1258966, 1312839, 1024348, 341309, 57381, 298613, 667074, 708559, 403023, 380172, 304457, 482683, 750298, 821940, 375412, 9230, -124673, 80163, 422254, 657028, 503028, 464632, 225824, 324335, 483208, 372180, 414921, 454005, 625450, 946833, 657546, 517559, 708288, 797592, 867951, 854208, 880630, 902136, 785074, 551931, 488021, 684681, 812630, 822793, 687179, 350509, -3460, -239999, -306869, -565187, -819021, -311447, 263830, 502715, 754774, 726214, 753482, 809272, 1014029, 1131683, 1344120, 1367944, 1206626]
12633A206626l90462m93870l21229j65323M8124P9653J1582j01798j13371N37864
12623B97796L81112j80156l90277j52135J07810M2082J20526K08044L77340M46875
12613A259017l7133k66701j63587k79619m5728J76364k14929n54260j09781M07
12603b35950l28118J69954Q27086Q47083j17305k57877j54958l22175o5565K04796
12593E66971l34591n14197n29966k66687O22098M00255j43382m19817J90221M11406
12583a7689m4488K12614K35726O0413K06173J10048j69241k52353m54983k28810
12573c42590K48460P25198N28534J78130J4824m50640k25101O8986Q5499L62094
12563A193394K46578M7656k49156j45840j2001P05388R16665L68184L66142Q3281
$$ y = [1206626, 816164, 322294, 1065, -164258, -116134, -36481, -24899, -126697, -240068, 297796, 678908, 498752, 108475, -43660, 64150, 106232, 226758, 434802, 812142, 1259017, 1221884, 955183, 791596, 511977, 466249, 642613, 427684, -126576, -236357, -235950, -564068, -394114, 432972, 1280055, 1162750, 904873, 749915, 427740, 362175, 566971, 232380, -281817, -811783, -1078470, -456372, -56117, -199499, -619316, -429095, -17689, -62177, 150437, 386163, 446576, 652749, 762797, 593556, 341203, -113780, -342590, -94130, 631068, 1159602, 1337732, 1352556, 901916, 676815, 745801, 831300, 1193394, 1439972, 1487628, 1238472, 1092632, 1080631, 1786019, 2702684, 3070868, 3437010, 3520291]
12553C520291m69133L11358R12331J230480J373815Q56151J079949K477062M131487
12544A5423791P039153J0771912J2796729r61167j2665184j0519644p375122m396597
12536A0113871k941595j872211j397948p59708m49079L9802j75407l94016n11323
12527A652386j41060K05219J03334l78131m32840J17496J00694l53454m69506
12518D04138l84190l89358m65183J57445M28230o7383k15044J64186M10157O02564
12508F45562K12281m93537p19466j32349l2344r7030O3194l21100k25782j0619
12498a111190L37452L89135L42967M20899J53221j36897j39226P6217l242j4457
12488C14879k31532m31743o04683j70102P9970K74663L75883K34554n7879r0628
$$ y = [3520291, 3051158, 3362516, 4274847, 5505327, 6879142, 7735293, 8815242, 11292304, 15423791, 22462944, 33234856, 46031585, 45070418, 32405234, 21885590, 14510468, 10113871, 7172276, 5300065, 3902117, 3142409, 2693330, 2733132, 2557725, 2163709, 1652386, 1511326, 1716545, 1819879, 1441748, 1008908, 1126404, 1227098, 873644, 404138, 19948, -369410, -834593, -677148, -248918, -316301, -531345, -367159, 42998, 645562, 857843, 364306, -355160, -487509, -519853, -616883, -553689, -874789, -1100571, -1111190, -773738, -384603, -41636, 379263, 532484, 395587, 256361, 332578, 329336, 314879, 83347, -348396, -953079, -1123181, -1043211, -768548, -392665, -158111, -215990, -306618]
12478c06618K06151N59592P05753O23998m1668n54487q34525l32832L60602N94822
12468I80788M55927j3074m7471J64654k63545l72779m25616j8746m6487k95958
12458A17693Q1922k54662J6675J94151j50513R0019J27366l87786j2690N43593
12448C65768N25557K67896K33394K12070j22078k60244k19602j36977k54911n51062
12438E9811m57842M2528N72732N21984J19617j54818R0293K3241O0222J09291
12428I87059J95454K15281l69659m43676l38666q9558L56712L11333M02279k6648
12418A199911k1713n8465J21240J9477k12430l43847k33240L37979N92888L42989
12408A744789L51338L05168m85152n23816l36844o32775q03553r0665M69164L79230
$$ y = [-306618, -100467, 459125, 1164878, 1788876, 1747208, 1192721, 358196, 25364, 385966, 980788, 1436715, 1423641, 1376170, 1540824, 1277279, 904500, 478884, 460138, 413651, 117693, 199615, -55047, -38372, 155779, 5266, 95285, 222651, -165135, -177825, 365768, 891325, 1159221, 1392615, 1604685, 1482607, 1222363, 1002761, 865784, 610873, 59811, -398031, -355503, 217229, 739213, 858830, 704012, 794305, 817546, 877768, 987059, 1182513, 1397794, 1028135, 584459, 245793, 156235, 512947, 824280, 1226559, 1199911, 1178198, 1119733, 1240973, 1260450, 1048020, 704173, 470933, 808912, 1401800, 1744789, 2096127, 2401295, 1916143, 1392327, 1055483, 422708, -380845, -471510, -2346, 376884]
12398C76884K99971P5376K43043J85774p2948l49454m14862j63535J07221j23397
12388A64073r3871J74317n1775J72464l2106J36948J90807m900l82211n15137
12378b41391M78687J230356N20975P7396J08111L39150j40887l63762m4992n06636
12368A457007m25716l60275k59989j47548l425R8848j01361k3590L25880L60855
12358I20686M632l17685q2657j97703l29756o6212J54560J70086k04642m08160
12348c56851k43670K36760M85441K15548k27767l52142n8627M35340K76551o3342
12338C47241K80820J43576o64468k92273K30096J8204N5162o3170J97494L74258
12328F26940M4828L17273p1412m89001l50451M12965O39752J12701J60494o5510
$$ y = [376884, 676855, 752231, 995274, 1181048, 1108100, 758646, 343784, 180249, 287470, 164073, 70202, 244519, 192744, 365208, 333102, 470050, 660857, 655957, 273746, -241391, 237296, 1467652, 1988627, 2066023, 2174134, 2513284, 2372397, 2008635, 1963643, 1457007, 1031291, 671016, 411027, 263479, 260054, 358902, 257541, 233951, 559831, 920686, 925318, 607633, 524976, 327273, -2483, -68695, 85865, 255951, 51309, -356851, -600521, -363761, 121680, 337228, 109461, -242681, -301308, 134032, 410583, 347241, 628061, 771637, 107169, -185104, 44992, 63196, 118358, 55188, 252682, 626940, 671768, 989041, 917629, 428628, 78177, 491142, 1130894, 1243595, 1404089, 1338579]
12318A338579m50515o76416l71113K21420R3239k79078j10881K82731N53528l0104
12308E71390l09163m2234J4462J84824L5136p2925P893n5380J29603m2957l01653
12297A18996k85370K22937N39409O7091l84004j06688K32459j5825n50109k33958
12287c95062m27194m61395j10684J45598O56234M81777N2576l85632K5459N31210
12277A12887L16656o8554j59076Q4644J78318K09261l54278n47270k43780m07396
12267h78588k35210M30561P24447K14446j82946k46787K37127J83727M5265l1027
12257B61015k2803J71652M25419Q7486j11386j55444q0983J78507Q8962M621m21561
12246D25485m96650j66891L14417M82943M20429J96996j39429l59884l53054k31020
$$ y = [1338579, 888064, 211648, -159465, 61955, 155194, -123884, -234765, 47966, 601494, 571390, 262227, 219993, 234455, 419279, 454415, 381490, 389383, 334003, 463606, 420649, 118996, -166374, 56563, 595972, 663063, 279059, 172371, 404830, 389005, -161104, -395062, -822256, -1283651, -1394335, -1248737, -592503, -110726, -58150, -443782, -418323, 112887, 429543, 360989, 201913, 286557, 464875, 674136, 319858, -227412, -471192, -878588, -1113798, -683237, 41210, 255656, 72710, -174077, 63050, 246777, 292042, 261015, 238212, 409864, 835283, 922769, 811383, 655939, 574956, 753463, 842425, 847046, 425485, -71165, -238056, 76361, 559304, 979733, 1176729, 1037300, 677416, 324362, 93342]
12236I3342j24977M7465K42503N07091M90652P7721l64054j14300J46161l58994
12226F42610o32218m05576L1732j95675k28506Q7588m17762p4947M17153M26226
12216c49375M73037L52925K50879r3632m17654j69228k486l64913l38385q2916
12206g41748l84241Q0852M00217O3994l13166l89125N1467J75211j74919j27906
12196a359364o7136M01546R62021N42098k295n4789J77162N47087K6648k51217
12186I21761j25226j24536O603j94813l93317j11207L53820j48o72158n41602
12176h80823j8563J84541M33574K30779J90484l02257j97610K14959J23396N0507
12166B8987K93650L69782J54952J80983J68359m1688J4522l2377J26865K50112
$$ y = [93342, -31635, 15830, 258333, 765424, 1256076, 1333797, 969743, 855443, 1001604, 642610, 10392, -395184, -363452, -559127, -787633, -700045, -1117807, -1192754, -775601, -349375, 123662, 476587, 727466, 633834, 216180, 46952, 44466, -320447, -658832, -741748, -1125989, -1045137, -644920, -580926, -894092, -1283217, -1231750, -1056539, -1231458, -1359364, -1426500, -1024954, -62933, 479165, 476870, 422081, 599243, 1146330, 1172978, 921761, 796535, 671999, 678602, 483789, 90472, -20735, 333085, 332937, -339221, -880823, -899386, -714845, -281271, -50492, 139992, -162265, -359875, -144916, -21520, 28987, 322637, 692419, 847371, 1028354, 1196713, 1155025, 1169547, 1137170, 1264035, 1514147]
12156A514147K07631J43596k82849o50291n27990l89856k81472k43559n9783J71174
12146c99252K0975L48701N35073L48657J16355P7692k75485o5356j66502l78154
12136A62704j39413Q2177n1078M8143K66450M62832K71867l57605l64189J2106
12126C93994J68906k26295q7927J89848k88699k76791l92510n30923k10056L36056
12116i24397P54004L71623j1146j18891N1904L26413K83862L63955J62644l69995
12106H89976n48737o72694m43811k23137K8615K70838j75840j79796L27522L92303
12096c34761n4248J09051J26168l46099k9490O63802Q47076N56744j17965n06613
12086I13665k04231N756k23614l87320p5345O0545L89287k01148m76119J39607
$$ y = [1514147, 1721778, 1865374, 1582525, 932234, 404244, 14388, -267084, -510643, -570426, -399252, -378277, -29576, 505497, 854154, 970509, 1048201, 772716, 707360, 540858, 162704, 23291, 105468, 54390, 102533, 368983, 831815, 1103682, 746077, 381888, 393994, 562900, 336605, 248678, 438526, 149827, -126964, -519474, -1050397, -1260453, -924397, -170393, 201230, 190084, 71193, 123097, 449510, 733372, 1097327, 1259971, 889976, 341239, -331455, -775266, -998403, -969788, -698950, -874790, -1054586, -727064, -334761, -389009, -279958, -153790, -499889, -529379, 134423, 981499, 1538243, 1420278, 913665, 709434, 715190, 491576, 104256, 28911, 89456, 478743, 277595, -198524, -58917]
12076e8917L03929K45358j51720n03946m96233j33859J45455j70017k76696m853
12066a101499j27903L30819K66843J98325k5758l01769j60253l12767l3955O16526
12056f51391M75616J55218J00029J08403m478j7296J28068K23927j30027m87974
12046i9905l34479k39273J23366O9509j68855L7739n3929r9339N0387j43522R4957
12035g63344J62356J25551r746L71240K5483Q6943K78154M3017O5710l44015k17394
12024a76045k5882k94481l46167J36930M18640J66022J30581L64M8967J02904
12014A61833J05435j20338m0285K26295l1874m72232o36815J3481k698l36361
12004a133559K7859N75013N09857K07664q233q49734m56974M37060J60022L0693
$$ y = [-58917, 245012, 490370, 338650, -165296, -661529, -795388, -649933, -819950, -1096646, -1101499, -1229402, -898583, -631740, -433415, -459173, -760942, -921195, -1233962, -1267917, -651391, -175775, -20557, 79472, 187875, 183397, 166101, 294169, 518096, 388069, -99905, -434384, -673657, -550291, -480782, -649637, -611898, -665827, -765166, -714779, -858301, -763344, -600988, -475437, -485183, -113943, -88460, -1517, 276637, 319654, 385364, 41349, -176045, -201927, -496408, -842575, -705645, -287005, -120983, 9598, 9962, 58929, 161833, 267268, 146930, 106645, 332940, 301066, -171166, -807981, -794500, -797198, -1133559, -1105700, -530687, -20830, 186834, 178601, -671133, -1128107, -691047, -531025, -500332]
11994e00332p1739m7617r9706k76139J45941N13981o1349k19282K00890L03080
11984a12272M40155L19416n7474r4941j04118j75079j9180L2145K19824r3345
11974C55131l42245l57392P4626O15184O23152k68939o81704q4271m0523k98453
11964d05434j21202N36582L80209n32858o15629j75836M26070O05838L90222n9858
11954D28104o7359j73594r3933M18637m6423l30702M5262J69245Q4994K11005
11944F45236J33507m44301q43352k87710j30196q6954N87666O46748L61486j08184
11934D73946r8704P2130j62419k24171J41344k94527j92158J32086J91448K08900
11924B47875l24252m72233o11186K30973L70643k88162L8646M46525k49925p4689
$$ y = [-500332, -572071, -619688, -719394, -995533, -849592, -335611, -396960, -616242, -415352, -112272, 327883, 647299, 589825, 494884, 390766, 215687, 196507, 228652, 448476, 355131, 12886, -344506, -269880, 345304, 968456, 699517, 17813, -66458, -106981, -405434, -526636, 9946, 390155, -142703, -758332, -934168, -508098, 97740, 487962, 428104, 360745, 187151, 93218, 511855, 465432, 134730, 179992, 349237, 434231, 645236, 778743, 334442, -508910, -796620, -926816, -1013770, -426104, 220644, 582130, 473946, 375242, 447372, 284953, 60782, 202126, -92401, -284559, -152473, 38975, 247875, -76377, -548610, -1159796, -928823, -558180, -846342, -807696, -361171, -611096, -685785]
11914f85785M27897K96288p1344o4902Q0925K53878J7971K56637K09357j38896
11904E82026J54380j90480j60986P6494L36564N16019J63293m34111o97221q28193
11894d82215j53305M4271L07198L17025P7733m2601J49260K28093j49564J71660
11884D67555J18577n20378m95588J41301J16220n05484n09052m11612N5504M69149
11874a073808K31347k16322l4585L16754L49063M01315K9984o183L21196K43428
11864E62189M4199J9145L88371l8565l89482k71963l40787j4584J87677l6972
11854A09228k15959m07960l61074j08943p226q781L41313K91108j07524J80185
11844b95633K82197J24400j5112J327l20452n73649k30193K35991M42813K30927
$$ y = [-685785, -257888, 38400, -32944, -97846, -16921, 236957, 254928, 511565, 720922, 582026, 736406, 545926, 384940, 461434, 797998, 1314017, 1477310, 1043199, 345978, -482215, -635520, -591249, -284051, 32974, 110707, 68106, 217366, 445459, 295895, 467555, 586132, 65754, -429834, -288533, -172313, -677797, -1186849, -1598461, -1542957, -1073808, -842461, -1058783, -1093368, -776614, -427551, -26236, 3748, -2435, 318761, 562189, 606388, 625533, 1013904, 975339, 585857, 313894, -26893, -41477, 146200, 109228, -106731, -514691, -875765, -984708, -991934, -1000715, -659402, -368294, -475818, -295633, -13436, 110964, 95852, 97179, -223273, -796922, -1027115, -791124, -348311, -117384]
11834a17384j8720j54707M982M7012k46074k23683k03074K24662O06672O15991
11824E35677k97336p17328l41814l54683j10580O07862P01756K42399l20416j45682
11814b00145Q1519J6047n02456j12975L51034J75354j4713r0084p7879J31295
11804b43003N34008L80264K35948L72773j0375l44653l52311k09038j23872j9767
11794B19974o3273r8327j87977k67997k06968o4259J50451K35539K79525M73703
11784D70391r7910p45997m67962o2194k6404N5404K04209K13638K57606N43649
11774C44430M45009J35382j63327l41876j74958j31341M63019K33559m98782l14443
11764c328J51450J75525j71461n65204J6131P8397l63303j77267N7509M44020
$$ y = [-117384, -136104, -290811, -285829, -238817, -484891, -708574, -911648, -686986, -80314, 535677, 238341, -478987, -820801, -1175484, -1286064, -678202, 23554, 265953, -54463, -200145, -118626, -102579, -605035, -718010, -366976, -191622, -206335, -296419, -374298, -243003, 291005, 671269, 907217, 1279990, 1269615, 924962, 572651, 363613, 239741, 219974, 156701, 58374, -129603, -397600, -604568, -668827, -518376, -282837, -3312, 470391, 372481, -373516, -841478, -903672, -930076, -874672, -670463, -456825, -199219, 344430, 789439, 924821, 761494, 419618, 244660, 113319, 576338, 809897, 311115, -3328, 148122, 323647, 152186, -413018, -396887, -318490, -681793, -859060, -801551, -357531]
11754c57531L44654J79958r662j45235R4374N07130L84698J08120l328n92816
11744E10362n14945k07326j73434L66711K06346m43848o08820j86429M02882K19026
11734d29475j80092K11742L5951P0475P02979N74300J91262l57909o63545l43775
11724a88087k08904K25934O54184J72646n48014n53029j22827j7550L06339Q12984
11714E33676J426090N60677J28910J13211M64874O31955r83250j384523m81955
11705A009665l39558m01488l60346j18698J95571K99712J78208O3194P5057p3294
11695E28023n85669o53772k22009j29535n7132K70922L78365J77621Q1808O06786
11685C95408M34050L2932k1459o6484l0316k21337j49387j74672p9390K91321
$$ y = [-357531, -12877, 167081, 157419, 12184, 106558, 613688, 998386, 1106506, 1103178, 510362, -4583, -211909, -385343, -18632, 187714, -256134, -864954, -1051383, -648501, -429475, -609567, -397825, -361874, -291399, 411580, 985880, 1177142, 819233, 155688, -188087, -396991, -171057, 483127, 655773, 107759, -445270, -568097, -585647, -279308, 533676, 1959766, 2520443, 2649353, 2762564, 3227438, 3859393, 2876143, 1491620, 1009665, 670107, 268619, -91727, -210425, -14854, 284858, 463066, 526260, 601317, 528023, -57646, -711418, -933427, -1062962, -1120094, -849172, -470807, -293186, -211378, 395408, 829458, 862390, 840931, 774447, 744131, 522794, 373407, 198735, 119345, 410666]
11675D10666P0070R2098O39068M72232k47197o60697n51768K5386N17712J99253
11665I66823J05091l9686m77417n57358j18936K74658L19518J56140j56145j91907
11655B80781j46116j10283j54601k6818J41899Q3693k84766l11634L37855n9041
11645b49031m84021P4916L07943J22223J83607j56537j26767L55657Q965l17908
11635b80953m68608k81938J87124J13979K53883J11825k83029q9679J06127r127
11625f40396J49449L68820o9894j91567j8059J66257M15850M38411J70791n22909
11615B66753o31224n21075k4647j24340l847N05738P40331N10605J68053m21636
11605D64711n19365k91161k55558j96449N3148M18224M75660J60525k45132k87919
$$ y = [410666, 480736, 572834, 1211902, 1684134, 1436937, 776240, 224472, 249858, 767570, 966823, 1071914, 1032228, 554811, -2547, -121483, 153175, 472693, 628833, 472688, 280781, 134665, 24382, -130219, -157037, -15138, 68555, -216211, -527845, -189990, -249031, -733052, -658136, -350193, -227970, -44363, -200900, -327667, 27990, 36955, -280953, -749561, -1031499, -844375, -730396, -476513, -364688, -647717, -737396, -631269, -640396, -490947, -122127, -192021, -383588, -401647, -235390, 180460, 618871, 789662, 266753, -364471, -885546, -910193, -1034533, -1038380, -532642, 207689, 718294, 886347, 464711, -54654, -345815, -601373, -797822, -744674, -326450, 149210, 309735, 64603, -223316]
11595b23316o24866p97251j61763O9572k22861l29248l3334K98517K09004L79262
11585a436284M80307N82194K91686l0226j4309P4502L33327M18474k67384l96733
11575C5554q4015n7761J96300l9070j27744k9998j16748J42468K09531J82820
11565C11337k7763J88724L07650P7347k10304j90242K66741J20947m12878n30301
11555i8742k45187k10425k47151l01413m83716L2877Q6032q7352K04339M17499
11545i33239j19410j27514K13172M02068K64159J28920J4409r149P954J87573
11535B8943K64683k33515k81057J60669M97529K62999k80602j58058k11652R3144
11525A43083M37750Q969l78976p9180L01673O0665o4271L7065j04708m53496o67606
$$ y = [-223316, -848182, -1645433, -1807196, -1737624, -1960485, -2289733, -2323067, -2024550, -1815546, -1436284, -955977, -373783, -82097, -112323, -126632, -52130, 281197, 699671, 432287, 35554, -48461, -106222, 90078, 51008, -76736, -106734, -223482, -81014, 128517, 311337, 283574, 472298, 779948, 857295, 646991, 456749, 723490, 844437, 431559, -98742, -343929, -554354, -801505, -1102918, -1586634, -1553757, -1467725, -1555077, -1350738, -933239, -1052649, -1180163, -966991, -564923, -300764, -171844, -157435, -166584, -158630, 28943, 293626, 60111, -220946, -60277, 437252, 700251, 419649, 261591, 49939, 143083, 580833, 589802, 210826, 131646, 433319, 493984, 429713, 466778, 362070, -91426, -759032]
11514g59032N2791L51334J65516K3186P4487r9249k47463J15519K40695O3457
11504a8759J33423M25899L20888J5930l9452k30403r2956K38641j41732o23586
11494a2107n80855n6010M08411Q15820L48524j764L9866K84420L07190j12769
11484A440726m82937p46556k88184j88298m12231k57776K02476L88529K23944
11475a20307k04204j95287M32256L11630K39345J12976m13262m94683K00780L94851
11465B64095K6409K1022J80466m02167o04674m16454O4608J81602J83187J84353
11455c17553J20853K04953K2808J1866j15316M6081J55521J37796m14869k58664
11445d06524J18391M5325K35579L77867j60710j99042L85912J88822J22835j26757
$$ y = [-759032, -706241, -354907, -189391, -166205, -91718, -190967, -438430, -322911, -82216, -18759, 114664, 540563, 861451, 877381, 837929, 607526, 514570, 753211, 611479, -12107, -592962, -648972, -240561, 575259, 923783, 922019, 961885, 1246305, 1553495, 1440726, 957789, 211233, -76951, -265249, -677480, -935256, -732780, -344251, -120307, -324511, -519798, -87542, 224088, 463433, 576409, 163147, -331536, -130756, 264095, 290504, 311526, 491992, 89825, -514849, -931303, -866695, -685093, -501906, -317553, -196700, 8253, 31061, 42927, -72389, -26308, 129213, 267009, -147860, -406524, -288133, -242808, -7229, 370638, 209928, 10886, 396798, 585620, 708455, 581698]
11435E81698j13219M2694J75077O1766j45240k3815j3128k73609L1548L69530
11425F93302J09833j79242l78826n019N0588l45294k81560k34443k17862j1120
11415g99643N69943K98095M35426M18668M59210O96085R38187J106774R44998
11406E067743j03516j031440j387977k130453j150391j70002K51550L03414m82866
11397h33938o05801L53232J141379L02050r7955K63679M83226l37743q23786o12191
11387g67848L99792L93080k1418k04943m9745K537J501K80547K99856J62032q7059
11376D08332k82541k05028N09596M11559k12705o28446m70856k90169q7791J78064
11366f69985N8384l00058J30010J27808P9175K424K3792L8634K88222K77412K28235
$$ y = [581698, 468479, 511173, 686250, 748016, 602776, 578961, 565833, 292224, 323772, 693302, 803135, 623893, 245067, 240048, 290636, -54658, -336218, -570661, -788523, -799643, -229700, 68395, 503821, 922489, 1381699, 2077784, 3015971, 4122745, 5067743, 4964227, 3932787, 2544810, 414357, -736034, -906036, -654486, -351072, -833938, -1439739, -1086507, 54872, 356922, 258967, 522646, 1005872, 668129, -155657, -767848, -368056, 25024, 3606, -201337, -251082, -248545, -247044, 33503, 333359, 495391, 408332, 125791, -79237, 430359, 841918, 629213, 767, -470089, -760258, -848049, -669985, -611601, -911659, -781649, -653841, -574666, -572242, -548450, -509816, -221594, 55818, 284053]
11355B84053j53069k52531J98243K35658o6425J20710K46833J2962m00271m31954
11345b05791k56368J04986K52953J90891m0024j45791j74815j00999K06005r2761
11335b61714o2697L29408K69014M6389J90211L1652k74927J38952P3238k99422
11325A80104k63652k40614l850j36862l32898m85674l44557l75578j32080M63658
11315a672003K27351L03192K10928j0339L05773M38984M88173N74106K11674o13471
11305D64368o43812j6188J21386K26846L82006j78212r1695j68173k17581J55435
11295C4380J26130m9589j15984k28176l62085p7897k01660l67577j8645J65687
11285a095416J14994K43466K04937K03148k82221J29015O10063K95472j71461
$$ y = [284053, 130984, -121547, 76696, 312354, 245929, 366639, 613472, 626434, 226163, -205791, -462159, -357173, -104220, 86671, 46647, -99144, -273959, -374958, -168953, -261714, -324411, 4997, 274011, 320400, 510611, 542263, 267336, 406288, 479526, 180104, -83548, -324162, -328012, -464874, -797772, -1283446, -1628003, -2003581, -2135661, -1672003, -1444652, -1141460, -930532, -940871, -635098, -196114, 292059, 866165, 1077839, 464368, -179444, -195632, -74246, 152600, 534606, 356394, 264699, 96526, -121055, 34380, 160510, 110921, -5063, -233239, -595324, -673221, -874881, -1242458, -1261103, -1095416, -980422, -736956, -532019, -328871, -611092, -482077, 127986, 423458, 251997]
11276B51997r4298R0561L04287N3482j41662r3668j44690k14323k60684r6620
11266c45618o9129j53461j25201M53534P48054M30132J07152j48740k52434j73211
11256D71078r0587K19906O14447K96807j77353l59663l45020k98527k36359K5497
11246A20226j21438L59015L26439j7455m45488l53912m562J81984J39535N6468
11236B40812J22324p1275K7618M8402l74503m86012K3066L30265L07903K41084
11226D09684R1408p1467l27300l89070K5656M74718L27805l78542k28488K36710
11216A71114N0827j31457K92578O67873L93146N6901j4478j89362k91416l77197
11206F28529N3285k50658p17058m54508J24156N29693K68441M9329N58274N05494
$$ y = [251997, 157699, 248260, 552547, 606029, 464367, 370699, 226009, 11686, -248998, -345618, -414747, -568208, -693409, -239875, 508179, 938311, 1045463, 896723, 644289, 471078, 380491, 600397, 1214844, 1511651, 1334298, 974635, 629615, 331088, 94729, 120226, -1212, 357803, 684242, 666787, 221299, -132613, -137175, 44809, 184344, 240812, 363136, 291861, 319479, 367881, -6622, -492634, -469568, -139303, 168600, 409684, 501092, 429625, 102325, -286745, -261089, 213629, 541434, 162892, -65596, 171114, 221941, 90484, 383062, 1050935, 1444081, 1500982, 1486504, 1297142, 1005726, 628529, 681814, 431156, -285902, -740410, -616254, -86561, 181880, 231209, 789483, 1294977]
11196A294977q8239k44959k29977O6842K76181N0885J29622m19488n98083j90058
11186D7703j79219L99147J06493o67331p32513n34345k17412M14213Q19646K84485
11176b59133j38926k4637J21691J80078l22935r4773M99837N05852J49616j13030
11166E03640J35514J85804m71407p68124l30538j49054j51246K53138J56783J3848
11156f21642K73484K69106K47398o3486M4080k50653o29116k17144k9576J30016
11146h47533L73672L33105M8156L01519L10747j66045m17897N4611O8839j37123
11136g7949n3127j8136k63337k51165p9195j4719m7143L0848q7473K54371O84400
11125G7375N99066R8748l83889m26589k49961J6961L99992L92259N5049j69327
$$ y = [1294977, 1206738, 961779, 731802, 798644, 1074825, 1125710, 1255332, 835844, 237761, 47703, -131516, 267631, 374124, -293207, -1025720, -1560065, -1777477, -1363264, -543618, -259133, -398059, -422696, -301005, -120927, -443862, -538635, -38798, 467054, 616670, 503640, 639154, 824958, 353551, -414573, -745111, -894165, -1045411, -792273, -635490, -621642, -348158, -79052, 168346, 104860, 148940, -101713, -730829, -947973, -977549, -847533, -473861, -140756, -92600, 208919, 519666, 353621, -64276, -9665, 59174, -77949, -131076, -149212, -412549, -663714, -742909, -757628, -804771, -773923, -861396, -607025, 77375, 676441, 775189, 391300, -35289, -285250, -268289, 131703, 523962, 579011, 409684]
11115D09684n03874Q129K45190m5904m8234k14816j33829Q4439K92618N1548m38866
11104b93915j13235L15164K4575M5411k08152p08518k40815O5200L5332J63021
11094i15932M99209P10953K03942l25946j03171K76275n7503k74169K02782M2988
11084B59428m07974k60746j27111K54086M82265J14815j53666L7772j57132k04793
11074a63056n412P6820p0972J8538K9393J75867N02773J42079l15199n35837l61762
11063e06768k27804k43917l63452J06285J07877l7074K41760J58236K16062J07184
11053d41611k23685J93625O78349L89873l01385J16243L48914J04424j38866l64570
11043C61311k77257l27981O1530L41118o4363k03588k11291m02552j53629K2155
$$ y = [409684, -94190, -86061, 159129, 113225, 64991, -149825, -283654, -199215, 93403, 144951, -293915, -407150, -91986, -67411, -22000, -230152, -938670, -1179485, -1114285, -1078953, -915932, -416723, 294230, 498172, 172226, 69055, 345330, 287827, 13658, 216440, 259428, -148546, -409292, -536403, -282317, 199948, 314763, 161097, 198869, 41737, -163056, -168468, -91648, -162620, -144082, -114689, 61178, 563951, 706030, 390831, -145006, -506768, -734572, -978489, -1341941, -1235656, -1127779, -1164853, -923093, -764857, -548795, -441611, -665296, -471671, 206678, 596551, 295166, 411409, 760323, 864747, 725881, 361311, 84054, -243927, -182397, 158721, 94358, -109230, -320521, -723073, -876702, -854547]
11033h54547M33776L86811j86216p11251k55879J06494Q5641p5286n38195n18452
11023b127104M13238O04969L50713N06169O00236K90924l00286o12759j82388
11014d56288O47275L65782L7193M32650K15351j72163k46444j34419N1792J86635
11004I27364P313l50710n20782o05892K30419O10495M4746l30353k96272j14787
10994c98459j01805o54J17040l42709l25423k54571K15095M49559K67792R3761
10984b80374K14302N83970K07692k77180n95841n51021q6966P9197l5796l75038
10974a117055n8767N6354m8359j58878k79612k47906L14755K68262K24073P81514
10964b65619M13051j73872m05807j83000j12693k57723k22558K93654L86496J77341
$$ y = [-854547, -420771, -33960, -220176, -931427, -1187306, -1080812, -995171, -1070457, -1608652, -2127104, -1713866, -1108897, -758184, -252015, 348221, 639145, 338859, -273900, -456288, 190987, 556769, 593962, 1026612, 1241963, 1069800, 823356, 688937, 740729, 927364, 934677, 583967, 63185, -542707, -312288, 298207, 342953, 12600, -283672, -398459, -500264, -500918, -383878, -726587, -1052010, -1306581, -1091486, -641927, -374135, -280374, -66072, 517898, 725590, 448410, -147431, -698452, -785418, -706221, -742017, -1117055, -1175822, -1119468, -1167827, -1326705, -1606317, -1854223, -1539468, -1271206, -1047133, -265619, 147432, -26440, -432247, -615247, -727940, -985663, -1208221, -914567, -528071, -350730]
10954c50730P8850M7505o6594J04578k93344m45864J49778k32460k9114O78507
10944c58888J12071k49956K05429O75896L63667m97200o25465j90051J74727j4893
10934d04663k7141l25825r328M95683M73944k09396j89097J94835O1878l2309
10924B8581j81959Q9487N09473L43947j79849l53743n72703l2948J42535r9389
10914c06568j45112j25923j24212J0623n8232r7290J24615L50357J54760j04086
10904c21068N6043k96954m1064J87309M9048j00833K28380M32314n1319J5649
10894A57505P9964j42560n8687L28418P3357n06741j35473K85582J10842k22496
10884c0289l26919m68616j60022K98255P8449p0131M54116L66707m4082L32900
$$ y = [-350730, -271880, -224375, -290969, -186391, -479735, -925599, -775821, -1008281, -1037395, -358888, -246817, -496773, -291344, 384552, 748219, 251019, -374446, -564497, -389770, -404663, -431804, -757629, -766957, -271274, 202670, -6726, -195823, -988, 60890, 28581, -153378, -63891, 445582, 789529, 609680, 255937, -316766, -349714, -207179, -306568, -451680, -577603, -701815, -691192, -749424, -846714, -722099, -371742, -216982, -321068, -265025, -561979, -603043, -415734, -366686, -467519, -239139, 193175, 141856, 157505, 237469, 94909, 36222, 364640, 437997, -68744, -204217, 81365, 192207, -30289, -357208, -825824, -985846, -687591, -609142, -679273, -225157, 141550, 97468, 430368]
10874D30368M06180K17354o32109p37109J25392L75079j12394j61111m3623K20063
10864H8090K75788O0649K09431L79578O3698o48759o17857l6346J21926j95883
10854b99685k14442j24002J84850J55344M16676J95476j79023L3260j86324n15120
10844e32990k08444J70274m92078j14474L43306K74235P02043K44823j04783j4208
10834B67704l02896j29219j88996q2398Q4860J19035J6744k25556J36652J03225
10824b00845k23555J76622L87604K47293L85173N8074m4385M5316J56672j7038
10814I70931M1763m7792k20074k16641j11382k70515j70105k9006J47830K83492
10804C78501l00145n16054m550L04234j37649r9356j35169j62108M955Q8410K20816
$$ y = [430368, 836548, 1053902, 421793, -315316, -189924, 185155, 72761, -88350, -131973, 88090, 363878, 424527, 633958, 1013536, 1077234, 428475, -189382, -225728, -103802, -299685, -514127, -638129, -453279, -297935, 118741, 314217, 135194, 168454, -17870, -532990, -741434, -571160, -1063238, -1177712, -834406, -560171, 141872, 386695, 281912, 267704, -35192, -164411, -353407, -435805, -350945, -231910, -215166, -440722, -304070, -200845, -424400, -247778, 139826, 387119, 772292, 830366, 785981, 831297, 987969, 970931, 1012694, 964902, 744828, 528187, 416805, 146290, -23815, -52821, 95009, 378501, 78356, -437698, -442248, -138014, -275663, -375019, -510188, -672296, -667341, -578931, -358115]
10793c58115N18133k09882k69636r048N3650L70207J67753O4075J93428j8337
10783E02228j13295j29084J65289r209l38212j24375J18402M20501M84387j7061
10773I59571p546o22740p77962j16001m5233j61305j82543M79852M12489M7600
10763a3818l91856j68356p4579j874j75400L3228Q18096J61108n60018m64301
10753h37770j96160K06925P245k5100J6876J22341L73103K35090R8677M1858n671
10742C7414j20166k21511k95755k46424J60202K42643k4216K91071J10733j18370
10732a84379k05806k26500k38882N7342M09646R3190k61539j57402K00770L66725
10722a46835M76939N16124R1983m76242n77813j72966r5684k33166o1985j06331
$$ y = [-358115, 160018, -49864, -319500, -328548, -274898, 95309, 263062, 327137, 520565, 502228, 388933, 259849, 425138, 415929, 77717, -46658, 71744, 492245, 976632, 959571, 952025, 329285, -448677, -564678, -609911, -771216, -953759, -473907, -61418, -13818, -405674, -574030, -648609, -650483, -825883, -792655, 25441, 186549, -373469, -837770, -1033930, -827005, -819760, -844860, -827984, -705643, -332540, -97450, 1227, 43085, 37414, -82752, -304263, -600018, -846442, -686240, -443597, -467813, -176742, -66009, -184379, -390185, -616685, -855567, -798225, -388579, -295389, -556928, -714330, -513560, -146835, 330104, 846228, 938211, 461969, -115844, -288810, -384494, -617660, -679645, -785976]
10712g85976j67721j89534J47233L20264M18411L28881K81478r9180j38141j46399
10702c0684l00717K54297M36917k79280m68096j85113k16789l89849q6927K85810
10692i80431J56122L3733K28529K00575p4289k4024J84944J79529R9189j47423
10682a43546m45952j27153J15765Q0360l9599M7956J3489j7543j98033j09590
10672h23846r6421K62955M85064J24812j04330j624J21523J14954Q2162M81494
10662F46743L73507J29719j59802k53106l56337n39230n31924j55798K21111J13465
10652e11652N2651o8935L43629N66152Q4737j44601k39747m9210M4937j35805
10642e7844j98914R7321J64884j53136j71753r073j55138m91874k28833K7557
$$ y = [-785976, -953697, -1143231, -995998, -675734, -257323, 71558, 353036, 253856, 115715, -30684, -331401, -77104, 359813, 80533, -387563, -572676, -789465, -1179314, -1266241, -980431, -824309, -790576, -562047, -361472, -435761, -459785, -274841, -95312, 3877, -143546, -589498, -716651, -600886, -520526, -560125, -512169, -498680, -516223, -714256, -823846, -920267, -657312, -172248, -47436, -151766, -153390, -31867, 83087, 165249, 646743, 1020250, 1149969, 990167, 737061, 380724, -158506, -690430, -846228, -625117, -511652, -459001, -527936, -184307, 381845, 466582, 321981, 82234, 33024, 77961, -57844, -256758, -159437, 5447, -147689, -319442, -328515, -483653, -975527, -1204360, -1176803]
10632a176803N4569J92311J21666n4297p4102j45757J34817K09898L43447M1225
10622c53026m63003k79305M8138K90504J10669L63398L16521L15801M86416K1720
10612H57833j35924k06089J17602J8098m21491l10566j92616l34516k17949J69986
10602f55632J87292l35667k76652j84020J70122N42378P17555L04012k34673j15143
10592A19572M2500j4352l07662l49894K39437L61507l02549n84112k16532L64260
10582f47825k9843m40654k38238J65255J00813j11026P6686k75211k92647J27287
10572a565403K62374k7974K6392Q8535J89353J40646L27738L05736K44479J01654
10562I3530M67660n4077m54806J68766L52147L21350M3599m67001o50564l13928
$$ y = [-1176803, -1122234, -929923, -808257, -862554, -936656, -1082413, -947596, -737698, -394251, -353026, -816029, -1095334, -1047196, -756692, -646023, -282625, 33896, 349697, 836113, 857833, 721909, 515820, 633422, 651520, 230029, -80537, -273153, -607669, -825618, -655632, -468340, -804007, -1080659, -1264679, -1094557, -552179, 165376, 469388, 234715, 119572, 162072, 147720, -159942, -509836, -270399, 91108, -211441, -795553, -1012085, -647825, -677668, -1118322, -1356560, -1191305, -1090492, -1201518, -1124832, -1400043, -1692690, -1565403, -1303029, -1331003, -1304611, -1216076, -1026723, -886077, -558339, -252603, -8124, 93530, 561190, 507113, 52307, 221073, 573220, 894570, 938169, 471168, -179396, -493324]
10552d93324J68265o0479j48804l305m5328j09401l07655J18391L39157j52623
10542f95106j31478O467J13331M80855J25689k47184M8867L02999j75305k28754
10532c99619m04935j48075N78692L83465j69356p8842J68996J57412j63294m86409
10522e61965j15951L41753L7851j27883L6695k0988k52073J17609K38245J33685
10512a73022j37761k68772m7258k2444n3714J80475L22873K42821k88808m83389
10502g28999M503K31707M35846L95702R5203j94686o53633n68502k11609k89198
10492a483666j90835K19764L05630K23468M25534M23084J26252q8936J11091Q4911
10482A56297k16568r3733j26709k27272l69196j38274J75147K6533l68072q8010
$$ y = [-493324, -325059, -385538, -534342, -537647, -582975, -692376, -1000031, -881640, -542483, -695106, -826584, -820117, -706786, -225931, -100242, -347426, -298559, 4440, -170865, -399619, -804554, -952629, -373937, 9528, -159828, -238670, -69674, 87738, -75556, -561965, -677916, -336163, -298312, -426195, -389500, -410488, -662561, -544952, -306707, -173022, -310783, -579555, -626813, -649257, -702971, -522496, -199623, 43198, -245610, -728999, -724496, -492789, -56943, 338759, 433962, 239276, -414357, -982859, -1194468, -1483666, -1674501, -1454737, -1149107, -925639, -500105, -77021, 49231, -39705, 71386, 156297, -60271, -154004, -280713, -507985, -877181, -1015455, -840308, -813775, -1181847, -1269857]
10472a269857L00137J11930K16659l4969j42687P3243K56669M34533j45423k79563
10462d79328n45959o96048n24801K97299P01544P20514O85725K57132k1869j41348
10452B52861k49196k21564j23219m21039k61869J0575m4727K22417l8635l37620
10442a212016l78298J12130K40058l9241J94601M34750N12221N56448M41407j18656
10432G43404k01185j34453j60218k59142p9588l08707n04679m33422M6117J79321
10422a112552L76714M9471j28805N183j74203Q8241P4117j80570l46891J90625
10412a158670N63322Q3863j87980J59851L28790j90242m79682K58240K09425k41482
10402f54565m1732K61126L20664M31007K82814N2137M764m28676l77352K35723
$$ y = [-1269857, -969720, -857790, -641131, -676100, -818787, -745544, -488875, -54342, -199765, -479328, -1025287, -1721335, -2246136, -1948837, -1247293, -526779, 158946, 416078, 394209, 252861, 3665, -217899, -341118, -762157, -1024026, -1013451, -1058178, -835761, -874396, -1212016, -1590314, -1478184, -1238126, -1277367, -1082766, -648016, -135795, 420653, 862060, 743404, 542219, 407766, 247548, -11594, -91182, -399889, -904568, -1337990, -1291873, -1112552, -735838, -686367, -815172, -809989, -984192, -895951, -821834, -1002404, -1349295, -1158670, -595348, -511485, -699465, -539614, -210824, -401066, -880748, -622508, -413083, -654565, -696297, -435171, -114507, 316500, 599314, 651451, 656215, 227539, -149813, 85910]
10392H5910K93590o2467k33911l52112j47930j58387j60422J94102N77864K37360
10382B73597k49683m63659j03105K36057J840P7737J4475l110p1260j51954j09454
10371e48519l0580j2573M99229L66068m7797j49629j88576K44387M46438J77273
10361G55721P7908k04123m53005k06246J94982J22020j42317K66157J28322l23009
10351B16410m73739j99908K42623J87649J4431J38061j69163k08091k4228p1506
10341c47461m40254m67719k69004m06466n1015K58583K41085M54946J21234L0230
10331h75841M02894K98052j81978j52283Q7692m29547M5480N63342K96954j9033
10321C5732k20041p8467O2947K38829J74400l36130k99640k21168n0045J67616
$$ y = [85910, 379500, 317033, 83122, -268990, -416920, -575307, -735729, -541627, 36237, 273597, 23914, -439745, -542850, -306793, -304953, -227216, -212741, -215851, -287111, -439065, -548519, -579099, -591672, -92443, 273625, 225828, 76199, -112377, 132010, 578448, 755721, 833629, 629506, 176501, -29745, 165237, 287257, 144940, 411097, 539419, 216410, -257329, -457237, -214614, -26965, -12534, 125527, -43636, -251727, -275955, -347461, -787715, -1255434, -1524438, -1930904, -1981919, -1723336, -1482251, -1027305, -906071, -875841, -472947, -174895, -356873, -509156, -421464, -851011, -805531, -242189, 54765, 35732, -184309, -262776, -199829, 39000, 213400, -122730, -422370, -643538, -693583, -525967]
10311e25967K39595J46431j17722L2402J42370K63889K83926k34353m98540j85816
10301d53785Q9123J37881p751r1214l0541M00145L97186r261j60807O7856l49163
10290a0331k98603M47364M99912l5764l96077m11722J45078K07875j08372J23415
10280A62775J80960L30842K03148k59466m46975k16918K50616j14936k53237J78924
10270A5733J81451J8865m52954j25137k35941k80442L4092N57763P45176L39920
10260G98526j53280n24047k40307k26504m6710J08342J61513J2547r1677k34014
10250d35611j01626J49687j68037k60160j38608J56133M23400M36545M18241O9810
10240E49774l02479m17081l93793J05509j78902j12444K41903L21669L52106m7778
$$ y = [-525967, -286372, -139941, -257663, -225261, -82891, 180998, 464924, 230571, -267969, -453785, -364662, -226781, -234532, -325746, -356287, 43858, 441044, 431783, 270976, 338832, -10331, -308934, 138430, 638342, 602578, 206501, -205221, -60143, 147732, 39360, 162775, 343735, 674577, 877725, 618259, 171284, -45634, 204982, 90046, -163191, 15733, 197184, 216049, -236905, -362042, -597983, -878425, -844333, -286570, 458606, 798526, 645246, 121199, -119108, -345612, -392322, -283980, -122467, -109920, -201597, -435611, -537237, -387550, -555587, -815747, -954355, -798222, -374822, 61723, 479964, 549774, 247295, -169786, -563579, -458070, -636972, -749416, -507513, -185844, 166262, 118484]
10230A18484j76479K38572L92282r6509o41077k46121R8839J64345N601j06454
10220b48517l31792o9536L4019J51402n2998j70567K75524L75184o67j0362K89756
10209B41446Q3518J12110l87766q01074l42791K1023L19127J53111l37557k32612
10199a171465J63402L64569j39877q8782p9098O783K37852N96061K51096j6246
10189A24295k35479K4973K43694K62758R6887p7255K02468j1946k66935l78350
10179a4890r5334L25441K43073j63135j05879K98039Q8944o95367n85551N6116
10169f48543J81880J33722l95353m50885J12527O6048R7089L11878J88526N73377
10159A70266K23313k89835m46047m22050k83090L78843L84491J72325k75999k25958
$$ y = [118484, -57995, 180577, 572859, 476350, -164727, -410848, -312009, -147664, -142063, -248517, -580309, -649845, -615826, -464424, -517422, -687989, -412465, -37281, -37948, -48310, 241446, 324964, 437074, 49308, -751766, -1094557, -1073534, -754407, -601296, -938853, -1171465, -1008063, -643494, -783371, -872153, -951251, -944468, -706616, -110555, 140541, 124295, -111184, -86211, 157483, 420241, 517128, 439873, 642341, 630395, 363460, -14890, -110224, 215217, 458290, 295155, 189276, 487315, 576259, -119108, -704659, -648543, -466663, -332941, -728294, -1179179, -1066652, -1000604, -903515, -591637, -403111, 170266, 393579, 103744, -342303, -764353, -1047443, -668600, -284109, -111784, -387783, -613741]
10149f13741j37274k30146O8306M3848K64501M8168j81330K8280r9238q6291r3433
10138i88350L83140Q3157k90280j09199J40081J14526M59219O1995j39321J52689
10128a32343L23065j75562l89338N16N12772M0283n72705l18747k64384k0033
10118i96476J70392N85499K13414l35963j63380J43979J64907r5386m30515l40251
10108a083780N7788L72190M82597K17811r3624J72825J52153J12709J22600M5264
10098E58533k18235r9466j20590K9625J31198J22647j12498j78548m33488l40280
10088f61102k5103j3542j03555J12716J33617L24885P29129L65693M6343m0904
10078H68177l09698j39217Q0674k15344j15855K9375j40576j08135q6451K29774
$$ y = [-613741, -751015, -981161, -912855, -869007, -604506, -556338, -737668, -709388, -808626, -894917, -988350, -605210, -522053, -812333, -921532, -781451, -666925, -207706, -145711, -285032, -132343, 190722, 15160, -374178, -373662, 139110, 179393, -393312, -712059, -976443, -996476, -826084, -240585, -27171, -363134, -526514, -382535, -217628, -313014, -743529, -1083780, -1025992, -653802, -171205, 46606, -47018, 125807, 277960, 390669, 513269, 558533, 340298, 240832, 120242, 149867, 281065, 403712, 291214, 112666, -320822, -661102, -686205, -699747, -803302, -690586, -556969, -232084, 497045, 862738, 909081, 868177, 558479, 419262, 499936, 284592, 168737, 198112, 57536, -50599, -137050, 92724]
10068I2724J88362l61030l68917L64110P13839j6149k64759K62941J59972j3961
10058G57132o7401m14150o60789k3889K50342J18545M7018j61698J31476J72607
10048A49193l92530j79463K8484N6339J00121r0155k15717L7076M52521J89972
10038A35841j13191o15598q34301L4327K35644P3369j82186k0043J53565K82624
10028h49949L30051J8897R8196J76793q8888j97297l49718j91477k61673l43493
10018a658558j7618L26975L92582Q8658r3303J02353L10622L73515N49283M85077
10008H59586L15601L2584l84825k93936k86240J9040P40807K2847p97885p57995
9998e30416k50265K14993K23564q2140k04317n1859J7146K94244K47765J65514
$$ y = [92724, 281086, -79944, -448861, -84751, 629088, 612939, 348180, 611121, 771093, 757132, 689731, 275581, -385208, -409097, -158755, -40210, 6808, -154890, -23414, 149193, -243337, -422800, -394316, -337977, -237856, -328011, -543728, -506652, -54131, 135841, 22650, -592948, -1427249, -1392922, -1157278, -1083909, -1266095, -1286138, -1132573, -849949, -519898, -501001, -402805, -226012, -314900, -512197, -861915, -1053392, -1315065, -1658558, -1676176, -1349201, -956619, -867961, -961264, -858911, -548289, -174774, 374509, 859586, 1175187, 1207771, 822946, 529010, 242770, 261810, 1002617, 1025464, 227579, -530416, -780681, -565688, -342124, -424264, -628581, -680440, -663294, -369050, -121285, 44229]
9988D4229n6831k16808j22564J9540j98290q8648M13389K64054o5116q801K41840
9977B25994q9213o15948j46855j77204l09508r1757j03737K20422K99983l31435
9967a119258n00289j62355r1494O2796J90409j19821j39405j5840M17716N66233
9957i11308M55287K10768J64618K45432J47682j31360m06211k98527k07143L71990
9947c58772L79153O8087N6853j9036j45284k4909J91640j53912l62660J2864j25346
9936d81322o70548q7985M19841L69175J11418R604j12289K7930l5472P7721Q040
9925c63887K3715K79850J03573L38341M08295q9588k40090m51997j31519N67075
9915D43768O88056L09511n44272m93144l09809k6188j2870J10730L4900J14963
$$ y = [44229, -12602, -229410, -351974, -332434, -530724, -619372, -205983, 58071, -7045, -15846, 225994, 136781, -479167, -626022, -803226, -1112734, -1204491, -1308228, -1087806, -787823, -1119258, -1619547, -1781902, -1873396, -1810600, -1620191, -1740012, -1879417, -1895257, -1477541, -911308, -456021, -245253, -80635, 164797, 312479, 181119, -225092, -523619, -730762, -358772, 20381, 88468, 145321, 126285, -18999, -43908, 147732, -6180, -368840, -355976, -481322, -1151870, -1239855, -820014, -450839, -339421, -329817, -442106, -414176, -449648, -371927, -363887, -340172, -60322, 43251, 381592, 789887, 700299, 460209, 8212, -123307, 443768, 1131824, 1441335, 897063, 403919, 94110, 67922, 55052, 165782, 200682, 315645]
9905C15645j7512k5452L32652K85814k75888o62912o10142q5976j40163k45307
9895a129241m6661j19294O8494J59807J78771k04442m22175j09768Q7556M57238
9885a079715N60788O04505M97834L43151K78510k62543m92543n34295l27846J11514
9875c00640O3468J16003l36157J6154N01329O95416M56882l27616m04783l99173
9865H0883K2866n501j57090l20388m11062j2244L22571L79992J69308n4636j10390
9854i5691j01195j1910R1734L86419l523n04363l38081R7839N27223K79053k88359
9843C9146m73341o17130r0647J32276p0572J57368L19003m1956m08820J12516
9833i42157M76240K64065j79883k41324l8863O08162N67281l2234m24842k21523
$$ y = [315645, 298133, 272681, 605333, 891147, 615259, -47653, -657795, -743771, -883934, -1129241, -1175902, -1295196, -1226702, -1066895, -888124, -1092566, -1514741, -1624509, -1536953, -1079715, -518927, 85578, 583412, 926563, 1205073, 942530, 449987, -84308, -412154, -300640, -237172, -121169, -457326, -441172, 60157, 755573, 1212455, 884839, 480056, 80883, 103749, 98248, -58842, -379230, -790292, -802536, -479965, -99973, 69335, 14699, -95691, -196886, -208796, -117062, 269357, 265834, -238529, -576610, -478771, 48452, 327505, 39146, -434195, -1051325, -1141972, -1009696, -1080268, -922900, -603897, -645853, -1054673, -942157, -465917, -201852, -381735, -623059, -661922, -53760, 513521, 481287, 56445, -165078]
$$ [...]
##END NTUPLES=NMR SPECTRUM
##END=
