##TITLE=C13_SL65-DAU(rechrom)
 CDCl3, 19900 sc

 17.10.2022
##JCAMPDX= 6.0         $$ Bruker NMR JCAMP-DX V2.0
##DATA TYPE= NMR SPECTRUM
##DATA CLASS= NTUPLES
##ORIGIN= UXNMR, Bruker Analytische Messtechnik GmbH
##OWNER= root
$$ XWIN-NMR		Version 3.5
$$ Tue Oct 18 12:01:18 2022 Russian Standard Time (UT+4h)  she@DPX200
##.OBSERVE FREQUENCY= 50.327896
##.OBSERVE NUCLEUS= ^13C
##.ACQUISITION MODE= SIMULTANEOUS
##.ACQUISITION SCHEME= undefined
##.AVERAGES= 19901
##.DIGITISER RES= 17
##SPECTROMETER/DATA SYSTEM= spect
##.PULSE SEQUENCE= zgpg30
##.SOLVENT NAME= DMSO
##.SHIFT REFERENCE= (INTERNAL, DMSO, 0, 222.653)
##AUDIT TRAIL= $$ (NUMBER, WHEN, WHO, WHERE, WHAT)
$$ ##TITLE= Audit trail, XWIN-NMR		Version 3.5
$$ ##JCAMPDX= 5.01
$$ ##ORIGIN= Bruker BioSpin GmbH
$$ ##OWNER= she
$$ F:/spectra/data/she/nmr/c13/1/pdata/1/auditp.txt
$$ ##AUDIT TRAIL=  $$ (NUMBER, WHEN, WHO, WHERE, WHAT)
(   1,<2022-10-18 11:59:35.07 +0400>,<she>,<DPX200>,
      <created by zg, POWCHK disabled, PULCHK disabled
       terminated by command 'halt'
       configuration hash MD5:
       00 E9 B6 7A A2 85 ED C7 34 08 36 98 17 FE 4E 26
       data hash MD5: 32K
       E5 8F F2 D8 83 7D 41 AF A3 D5 A4 A6 4E 99 46 FE>)
(   2,<2022-10-18 11:59:38.60 +0400>,<she>,<DPX200>,
      <Start of raw data processing
       efp BC_mod = 2 LB = 1 FT_mod = 6 PKNL = 1 PHC0 = -312.2695 PHC1 = 34.88469 SI = 32K 
       data hash MD5: 32K
       BA 3E 58 B2 9E D0 1A E8 E1 7E 0D 18 F0 5D 5D 1A>)
(   3,<2022-10-18 11:59:41.65 +0400>,<she>,<DPX200>,
      <abs ABSG = 5 
       data hash MD5: 32K
       4F 06 FE EC 05 36 D4 4B 67 55 E3 FC C6 DE 8F 26>)
(   4,<2022-10-18 12:00:25.21 +0400>,<she>,<DPX200>,
      <pk PHC0 = -1.609488 PHC1 = 0 
       data hash MD5: 32K
       88 5D 5A CB BC 0A 23 7B 23 D7 07 36 AE 7A CC 0F>)
(   5,<2022-10-18 12:00:29.79 +0400>,<she>,<DPX200>,
      <abs ABSG = 5 
       data hash MD5: 32K
       82 90 C3 27 42 F8 7A 78 7B F8 FC 61 EE 58 9B 12>)
$$ ##END=
$$ 
$$ hash MD5
$$ 4D ED 52 A3 A9 29 A8 D0 69 55 31 3A B0 55 47 FF
##$RELAX= 
##$RELAX= 
##$RELAX= 
##$RELAX= 
##$RELAX= 
##$RELAX= 
##$RELAX= 
##$RELAX= 
$$ Bruker specific parameters
$$ --------------------------
##$DU= <F:/spectra>
##$EXPNO= 1
##$NAME= <c13>
##$PROCNO= 1
##$TYPE= <nmr>
##$USER= <she>
##$AMP= (0..31)
100 100 100 100 100 100 100 100 100 100 100 100 100 100 100 100 100 100 
100 100 100 100 100 100 100 100 100 100 100 100 100 100 
##$AQSEQ= 0
##$AQ_mod= 1
##$AUNM= <au_zg>
##$AUTOPOS= <>
##$BF1= 50.322709
##$BF2= 200.13
##$BF3= 50.322709
##$BF4= 500.13
##$BF5= 500.13
##$BF6= 500.13
##$BF7= 500.13
##$BF8= 500.13
##$BYTORDA= 1
##$CFDGTYP= 0
##$CFRGTYP= 5
##$CHEMSTR= <none>
##$CNST= (0..31)
1 1 145 1 1 1 1 1 1 1 1 1 1 1 1 1 1 1 1 1 1 1 1 1 1 1 1 1 1 1 1 1 
##$CPDPRG= <waltz16>
##$CPDPRG1= <>
##$CPDPRG2= <waltz16>
##$CPDPRG3= <>
##$CPDPRG4= <mlev>
##$CPDPRG5= <mlev>
##$CPDPRG6= <mlev>
##$CPDPRG7= <mlev>
##$CPDPRG8= <mlev>
##$CPDPRGB= <>
##$CPDPRGT= <>
##$D= (0..31)
$$ [...]
##$SUBNAM4= <"">
##$SUBNAM5= <"">
##$SUBNAM6= <"">
##$SUBNAM7= <"">
##$SUBNAM8= <"">
##$SUBNAM9= <"">
##$SW= 239.972175391363
##$SWIBOX= (0..15)
0 1 3 0 0 0 0 0 0 0 0 0 0 0 0 0 
##$SW_h= 12077.2946859903
##$TD= 32768
##$TD0= 1
##$TE= 0
##$TE2= 300
##$TE3= 300
##$TEG= 300
##$TL= (0..7)
120 120 120 120 120 120 120 120 
##$TP= (0..7)
150 150 150 150 150 150 150 150 
##$TP07= 0
##$TPNAME0= <>
##$TPNAME1= <>
##$TPNAME2= <>
##$TPNAME3= <>
##$TPNAME4= <>
##$TPNAME5= <>
##$TPNAME6= <>
##$TPNAME7= <>
##$TPOAL= (0..7)
0.5 0.5 0.5 0.5 0.5 0.5 0.5 0.5 
##$TPOFFS= (0..7)
0 0 0 0 0 0 0 0 
##$TUNHIN= 0
##$TUNHOUT= 0
##$TUNXOUT= 0
##$USERA1= <user>
##$USERA2= <user>
##$USERA3= <user>
##$USERA4= <user>
##$USERA5= <user>
##$V9= 5
##$VALIST= <valist>
##$VCLIST= <CCCCCCCCCCCCCCC>
##$VD= 0
##$VDLIST= <DDDDDDDDDDDDDDD>
##$VPLIST= <PPPPPPPPPPPPPPP>
##$VTLIST= <TTTTTTTTTTTTTTT>
##$WBST= 1024
##$WBSW= 4
##$XGAIN= (0..3)
0 0 0 0 
##$XL= 0
##$YL= 0
##$YMAX_a= 124002475
##$YMIN_a= -28767730
##$ZGOPTNS= <>
##$ZL1= 120
##$ZL2= 120
##$ZL3= 120
##$ZL4= 120
##$ABSF1= 222.6533
##$ABSF2= -17.34351
##$ABSG= 5
##$ABSL= 3
##$ALPHA= 0
##$AQORDER= 0
##$ASSFAC= 0
##$ASSFACI= 0
##$ASSFACX= 0
##$ASSWID= 0
##$AUNMP= <proc_1d>
##$AZFE= 0.1
##$AZFW= 0.5
##$BCFW= 0
##$BC_mod= 2
##$BYTORDP= 0
##$COROFFS= 0
##$CY= -3
##$DATMOD= 1
##$DC= 0
##$DFILT= <>
##$DTYPP= 0
##$F1P= 0
##$F2P= 0
##$FCOR= 0.5
##$FTSIZE= 32768
##$FT_mod= 6
##$GAMMA= 0
##$GB= 0
##$INTBC= 1
##$INTSCL= 4.134877e-10
##$ISEN= 128
##$LB= 1
##$LEV0= 0
##$LPBIN= 0
##$MAXI= 10000
##$MC2= 0
##$MEAN= 0
##$ME_mod= 0
##$MI= 0.1934396
##$NCOEF= 0
##$NC_proc= 3
##$NLEV= 6
##$NOISF1= 120.0001
##$NOISF2= 80.00006
##$NSP= 0
##$NTH_PI= 0
##$NZP= 0
##$OFFSET= 222.6533
##$PC= 1.4
##$PHC0= -313.879
##$PHC1= 34.88469
##$PH_mod= 1
##$PKNL= yes
##$PPARMOD= 0
##$PSCAL= 0
##$PSIGN= 0
##$REVERSE= no
##$SF= 50.322730123286
##$SI= 32768
##$SIGF1= 140
##$SIGF2= 120
##$SINO= 11.81781
##$SIOLD= 32768
##$SREGLST= <13C.CDCl3>
##$SSB= 0
##$STSI= 32768
##$STSR= 0
##$SW_p= 12077.2946859903
##$SYMM= 0
##$S_DEV= 0
##$TDeff= 32768
##$TDoff= 0
##$TI= <>
##$TILT= no
##$TM1= 0
##$TM2= 0
##$TOPLEV= 0
##$USERP1= <user>
##$USERP2= <user>
##$USERP3= <user>
##$USERP4= <user>
##$USERP5= <user>
##$WDW= 1
##$XDIM= 32768
##$YMAX_p= 269462918
##$YMIN_p= -1062908
$$ End of Bruker specific parameters
$$ ---------------------------------
##NTUPLES= NMR SPECTRUM
##VAR_NAME=  FREQUENCY,     SPECTRUM/REAL,   SPECTRUM/IMAG
##SYMBOL=    X,             R,               I
##VAR_TYPE=  INDEPENDENT,   DEPENDENT,       DEPENDENT
##VAR_FORM=  AFFN,          ASDF,            ASDF
##VAR_DIM=   32768,         32768,           32768
##UNITS=     HZ,            ARBITRARY UNITS, ARBITRARY UNITS
##FACTOR=    0.368581032318806, 1,           1
##FIRST=     11204.5221812756, 0,            0
##LAST=      -872.772504714734, 0,           0
##MIN=       -872.772504714734, -1062908,    0
##MAX=       11204.5221812756, 269462918,    0
$$ Real data points
##PAGE= N=1
##DATA TABLE= (X++(R..R)), XYDATA
$$ [...]
16083H46640J31348J17260m8322l94464l80827M6564J50321m8754n8311j507O8505
16072D28453J00836P7126L4403O3128q8250n4491k063q7084K1602k7942n7359
16061D08359n064J19409P2468l18040m36040r8288J65188J42646O5198L2430q5241
16050F3025l837j9932n5839Q445l4004k8943j13244J22946J89194J06803O3363
16039B97977k5772Q9457R1017P6656j02912k94351j66405j45243p809J17939J45047
16028G5601J34527K52347Q3071l5627p4053n362M9055l008j45518k18813R807
16017A22027J7125J44689J45335N920j38129j76975l3158K73948K38800J76250
16007G75832j22925k75135j34322M7483j25259j56066r8185K7628J72298J13060
$$ plain form
16083 846640 977988 1095248 1046926 652462 271635 318199 468520 419766 361455 359948 428453
16072 428453 529289 606415 640818 703946 615696 561205 559142 472058 493660 465718 408359
16061 408359 403295 522704 595172 277132 -158908 -257196 -92008 50638 115836 148266 63025
16050 63025 59188 39256 -16583 -8138 -42142 -71085 -184329 -61383 127811 234614 297977
16039 297977 272205 361662 452679 529335 426423 132072 -34333 -179576 -187385 -69446 75601
16028 75601 210128 462475 545546 509919 435866 430504 479559 476551 331033 112220 122027
16017 122027 139152 283841 429176 435096 296967 119992 86834 360782 599582 775832
16007 775832 652907 377772 243450 290933 165674 9608 -88577 -60949 111349 224409
15997B24409m0984p3587J15899Q3653k15331k15284p177q644j93203o0195K73472
15986a16972L02884J1864r8211N9583o983j29015m2029n5440P6653K93103R6763
15975C92200N118q3667j49368j00284p0815m0148j07514j74419k6636K8575O6552
15964b60406N3078n7243l7060j45513k28986Q9720J1838l922k08517o5734K09855
15953f42890L07786K39936J93796N5952j67791j33076k1212Q218o3163j06280
15943c28724L5335L20518K34790j81961p7419J80504J35380r3887k49407j66778
15933a91649j44583J3617K58142J71644n6037o1306P6623k0317j63668j69932
15923b87466Q5805K97751O9339o6349J16787J41359p2884j96193j38032p4565
$$ plain form
15997 224409 183425 109838 225737 309390 94059 -121225 -128402 -137046 -330249 -390444 -116972
15986 -116972 185912 197776 99565 159148 152165 23150 -18879 -74319 2334 295437 392200
15975 392200 397318 313651 164283 63999 -6816 -46964 -154478 -328897 -355533 -326958 -260406
15964 -260406 -207328 -264571 -301631 -447144 -676130 -586410 -574572 -578494 -787011 -852745 -642890
15953 -642890 -335104 -95168 98628 154580 -13211 -146287 -167499 -159281 -222444 -328724
15943 -328724 -293389 27129 261919 79958 2539 183043 318423 224536 -24871 -191649
15933 -191649 -336232 -322615 -64473 107171 51134 -10172 66451 46134 -117534 -287466
15923 -287466 -201661 96090 165429 99080 215867 357226 284342 88149 -49883 -124448
15913a24448j348L458K15777J41545r4560L5822p2661j66657J77962J80759j69505
15902A26144p4031M921P7343O1658M0277N302q5793j99661j50420J05425J94371
15891A05536K6157j04836N4710m5958j2818K9484j0038k09684j25252K9531j02386
15880c65554p246J30761J67468J12257P6921P3816J42690J20246M5607j36120
15870C60846k77241j91856o4798J09907l8398k28430k68027j23326M6298m3713
15860g18738p2516Q5548J98149J47701N7958k8656p106J85241J17858N8984J84943
15849B09366J59102k174j39513P8172k1501l7724k23542j85215K6442J832J60861
15838B6106L19754P404k03148k03232j11184j19524K7625R8569P0492N7759K58210
$$ plain form
15913 -124448 -125796 -122338 93439 234984 140424 176246 103585 -63072 114890 295649 126144
15902 126144 52113 57034 134377 196035 236312 241614 155821 -43840 -194260 -88835 105536
15891 105536 131693 26857 81567 35609 22791 52275 42237 -167447 -292699 -263168 -365554
15880 -365554 -372800 -242039 -74571 37686 114607 188423 331113 451359 496966 360846
15870 360846 83605 -108251 -173049 -63142 -101540 -329970 -597997 -721323 -675025 -718738
15860 -718738 -791254 -705706 -507557 -359856 -301898 -330554 -337660 -152419 -34561 24423 209366
15849 209366 368468 366294 226781 304953 283452 245728 22186 -163029 -136587 -134755 26106
15838 26106 345860 353264 150116 -53116 -164300 -283824 -256199 -157630 -87138 -29379 228831
15827B28831J49788o2384j15696j72704j50263q9263j05746p0550R5336J70319
15817a22332K11901O1614j18701j62362k09204P8100P7919n9169j00001j10419
15807d52654N8215J27229J87308J63247Q8330R4853J01017q1270k08803l8019
15797C9453L7269L0571Q9252K08308R8453p7864n3735Q600k7377Q1176L2194j06627
15785C59673m0748n8962o4560q1952k57665p8567N6258j232J2520L51029K49013
15774D44807l1681k20638j79886J33807p4971j75102J00927J24921j18167j5813
15764a1796J36938J30313O2228l4739j73363j98142r6728J78269P5116j85059
15754a16963j5028J29040J56802K99233K11486p4509k23289k13012q7968j91809
$$ plain form
15827 228831 378619 316235 200539 27835 -122428 -211691 -317437 -387987 -292651 -122332
15817 -122332 89569 151183 32482 -129880 -339084 -260984 -183065 -242234 -342235 -452654
15807 -452654 -394439 -267210 -79902 83345 171675 266528 367545 286275 77472 39453
15797 39453 76722 107293 196545 404853 503306 425442 371707 380307 352930 434106 466300 359673
15785 359673 318925 259963 195403 113451 -144214 -222781 -166523 -167755 -155235 195794 444807
15774 444807 413126 192488 12602 146409 71438 -103664 -2737 122184 4017 -11796
15764 -11796 125142 255455 317683 282944 109581 -88561 -185289 -7020 68096 -116963
15754 -116963 -131991 -2951 153851 453084 664570 590061 366772 153760 65792 -126017
15744a26017j64619J19383J79299j3527N0954p9973k08391o3059J60139L80991
15734B35180K32963j41146l80318m12604k25382m8223J59979K90415J65291J6250
15724a07595q951J07186J05337l6663l53947k00780J76757K24382J05779q1254
15714f9749j20279J54648Q6929j14767k53611n1607J84843Q9227p5474J0256r0593
15703b50177O6905J91528J5487J21564L8433j23001j25554R9824K70362k9995
15693B75376j86563j01747j62928o7828M9723J85846J08453O1362k3351J20582
15683B58925Q735j48892j77860j45225R2564K13009K24044M2697J6218p2176p8541
15672B33498l21415q8035P5844O7869J20479K9723M7137J89099l6164j07401O9285
$$ plain form
15744 -126017 -290636 -171253 8046 -5481 45473 -34500 -242891 -305950 -145811 235180
15734 235180 468143 326997 -53321 -465925 -691307 -739530 -579551 -289136 -123845 -107595
15724 -107595 -116546 -9360 95977 59314 -294633 -495413 -318656 -94274 11505 -69749
15714 -69749 -190028 -35380 51549 -63218 -316829 -368436 -183593 -94366 -169840 -159584 -250177
15703 -250177 -183272 8256 23743 145307 183740 60739 -64815 35009 305371 275376
15693 275376 88813 -12934 -175862 -243690 -193967 -8121 100332 161694 138343 258925
15683 258925 267660 118768 -59092 -204317 -111753 101256 325300 367997 384215 312039 233498
15672 233498 -87917 -175952 -100108 -32239 88240 117963 165100 354199 318035 210634 279919
15661B79919J3783J8534j6668j59023q9399L5209K8361n438m2463j05385j24183
15650a66753J6972j02200l4179J08021m1884J05185J82354Q5794l2842J87011
15640C07479K41116j80496k87260j38850J8197N0033L1696j25234k65739o9168
15630d18226J44805J81018k3186j8030r6547j30964J19846Q6700j51750j67346
15620d73680O6990N3980j82812l5216K00455J09535n826l5432M6801M3227J38068
15609g3910N1611L6274j46733k12091J67690L92174J05090l29565k23937r9903
15599c33300j60766J82R0268J24716J76137J26511J59906J5194k62698k76756
15589c40606j01920Q4762J97585O9627m1049j64013k16741J43500K90606R9013
$$ plain form
15661 279919 293702 312236 295568 136545 47146 82355 110716 105278 62815 -42570 -166753
15650 -166753 -149781 -251981 -286160 -178139 -220023 -114838 67516 153310 120468 307479
15640 307479 548595 368099 80839 -58011 -39814 10219 41915 -83319 -349058 -418226
15630 -418226 -273421 -92403 -115589 -133619 -230166 -361130 -241284 -154584 -306334 -473680
15620 -473680 -406690 -352710 -535522 -570738 -370283 -260748 -266574 -302006 -255205 -211978 -73910
15609 -73910 -22299 13975 -132758 -344849 -177159 215015 320105 -9460 -233397 -333300
15599 -333300 -494066 -493884 -403616 -278900 -102763 23748 183654 198848 -63850 -340606
15589 -340606 -442526 -357764 -160179 -90552 -131601 -295614 -512355 -368855 -78249 20764
15579B0764l8136r8599p5134J768j0299j68081K20063K47689j76016j72440M3153
15568b05268K8855j4146l0099o8624N9172R0507R1946L8841M7150P0271K910j81071
15556f9556j15503J77518O2014P9905R370j1416j23901k12641j62202j31567k6998
15545e24977R4538J60651J99342K25817K25225N4677k15012j11151j76135j30841
15535a97866M0782J44658J88294J57733K0979j28103k09518m8360j01998k4067
15525a57466N173J35968K41324J59275J33586j91496l39009k03692j23221l05484
15515f45042j81106J27525J22916K56554L50632j29083l08614o6684Q0112J44747
15505b48043J30090n337m9414l2047k4068j01527m2958K10490M0026j26392j16245
$$ plain form
15579 20764 -17372 -115971 -191105 -189337 -199636 -367717 -147654 100035 -75981 -248421 -205268
15568 -205268 -176413 -190559 -220658 -289282 -230110 -139603 -47657 -8816 38334 108605 111515 -69556
15556 -69556 -185059 -7541 54473 134378 143748 132332 8431 -204210 -366412 -497979 -524977
15545 -524977 -430439 -269788 -70446 155371 380596 435273 220261 109110 -67025 -197866
15535 -197866 -157084 -12426 175868 333601 354580 226477 16959 -31401 -133399 -157466
15525 -157466 -152293 -16325 224999 384274 517860 326364 -12645 -216337 -339558 -645042
15515 -645042 -826148 -698623 -575707 -319153 31479 -97604 -406218 -472902 -392790 -248043
15505 -248043 -117953 -123290 -172704 -204751 -228819 -330346 -373304 -162814 -122788 -249180 -365425
15494c65425o3059o1595J76968K08562O9810j9049j06387j03907r6542j75220
15484e35844k6553J19842R3128O0960M919N1372J70129O9462j73737j09279K7537
15473b48064k816L5573J81991P6395j14037k21335j12544p512j20561p0828J62932
15462d40806L24546O2527k59462q6420O5193K25784K67652J57462o0927k65936
15452a0387j9226L22762K5242j78674k89517j56947o789o6921k2402N9740P3828
15441b69291J38740J41343K25836J96530Q667k12612l37542k19588j71140P2261
15431d26796J06957J02561j23116k60967J26784K23612J87113J43894j17630j77860
15421b15448l8540O417R8880j3369l684O044j91944M8292K46995L345j12489R3478
$$ plain form
15494 -365425 -428484 -490079 -313111 -104549 -34739 -53788 -160175 -264082 -360624 -535844
15484 -535844 -562397 -442555 -349427 -288467 -283548 -232176 -62047 7415 -166322 -275601 -248064
15473 -248064 -250880 -215307 -33316 43079 -70958 -292293 -404837 -412349 -532910 -603738 -440806
15462 -440806 -116260 -53733 -313195 -399615 -334422 -108638 159014 316476 255549 -10387
15452 -10387 -29613 293149 318391 139717 -149800 -306747 -313536 -380457 -402859 -343119 -269291
15441 -269291 -130551 10792 236628 433158 441825 229213 -108329 -327917 -499057 -426796
15431 -426796 -319839 -217278 -340394 -601361 -474577 -250965 -63852 80042 -37588 -215448
15421 -215448 -253988 -247571 -148691 -162060 -165744 -159700 -351644 -303352 -56357 -53012 -165501 -72023
15409g2023K28801J6221j87326j27487j06013P4762J24470K980j40615j33445
15399c19675J34281J00520j00404m7925J00899K51431J29805j6421j6431j7581
15389A98499K17253K02150q1063p7155J82303l7345l46835j76723J6781j32410
15379c4545o5547r1907j83462Q3990L70922J26571j92476j19509K5353k6062k1754
15368a28426M6461L6175J72093k19912k96681q2741K109j89009k29107M3775J86270
15357f58993R5405L3965L1285K43648L40118M3517q5057O6586L6699j44584j54206
15346a51617k24844j08670J42280J12472J10544J77541J37399J19084m1119j06408
15336A66662k5628K5599k25918k34981J23726k3323j92144J0257M3488J02302
$$ plain form
15409 -72023 156778 172999 -14327 -141814 -247827 -173065 -48595 -45615 -186230 -319675
15399 -319675 -185394 -84874 -185278 -233203 -132304 119127 248932 232511 216080 198499
15389 198499 415752 617902 536839 459684 641987 604642 257807 81084 97865 -34545
15379 -34545 -100092 -191999 -375461 -291471 79451 206022 13546 -105963 -80610 -106672 -128426
15368 -128426 -81965 -45790 126303 -93609 -390290 -473031 -470922 -659931 -889038 -845263 -658993
15357 -658993 -563588 -529623 -498338 -254690 85428 128945 43888 110474 147173 2589 -151617
15346 -151617 -376461 -485131 -342851 -230379 -119835 57706 195105 314189 273070 166662
15336 166662 141034 166633 -59285 -294266 -170540 -193863 -386007 -375750 -332262 -229960
15326b29960J94473J4665o5866L8897q8800n4663k4677n5275K38636J56372R2662
15315B16464j9206n4239k71890k45586o6279J05244K67587K10377M8936q6845
15305A04563j07914N101J07701J00198J2314j76314k78991j87690K2702p3986
15295d72316j25688K55548K67607P5787J19359O3610J39671R7607j38986j86894
15285I5305m9637j80616k51200n5691J32442R2999l4772k19302q7471J45298J93122
15274b19523O5518n723R6884J7393k02170n8729O8920J69190M6480j80112L8950
15263a62922K6013p0484J20319q569M3848o1907j04468J5064K8593Q7525O5098
15252b1890n8120j7124J55226K32161L7203o9004N1352J5783k54858j65927o7051
$$ plain form
15326 -229960 -35487 -20822 -86688 -47791 -136591 -191254 -215931 -271206 -32570 123802 216464
15315 216464 197258 143019 -128871 -374457 -440736 -335492 -67905 142472 191408 104563
15305 104563 -3351 1750 109451 209649 221963 45649 -233342 -421032 -398330 -472316
15295 -472316 -598004 -342456 -74849 938 120297 183907 323578 421185 282199 95305
15285 95305 45668 -134948 -386148 -441839 -309397 -216398 -251170 -470472 -557943 -412645 -219523
15274 -219523 -154005 -159728 -62844 -45451 -247621 -306350 -237430 -68240 -21760 -201872 -162922
15263 -162922 -136909 -207393 -87074 -95643 -51795 -113702 -218170 -203106 -174513 -86988 -21890
15252 -21890 -80010 -97134 58092 290253 327456 258452 309804 325587 70729 -95198 -162249
15241a62249j57514J68884J32086K8597O1216L7258n6013o8415l7438J00647J7368
15230F4427L666J62372L1565k84950j50040J1757O568n2781K50832K75043l6107
15219B82352o4416j8096j07000k00062J0736J93060J21535j5649j67766j26938
15209i2244p6678K9213J43606K69716J08756j24796j71658j18072j757L4537J94782
15198A95405J17446M4895J7104l7435O296q0200L5651j9329q3768m1597J752R291
15186A65511r3166J79732N3245l28198j79203Q3948J43069K4865j51704p7845
15176a79746K1625L6343L2016M9335J61154J07555j16942k16979k41470o626K25841
15165a27894J58844J18259R8226j6773q9150j47040j45871m4330K1502J44461
$$ plain form
15241 -162249 -319763 -150879 -18793 9804 71020 108278 52265 -16150 -53588 47059 64427
15230 64427 68093 230465 262030 -22920 -172960 -161203 -154635 -207416 43416 318459 282352
15219 282352 217936 199840 92840 -107222 -96486 96574 218109 202460 34694 -92244
15209 -92244 -168922 -139709 3897 273613 382369 257573 85915 -32157 -33914 623 195405
15198 195405 312851 357746 374850 337415 343711 263511 299162 279833 196065 154468 156220 165511
15186 165511 72345 252077 305322 -22876 -202079 -118131 24938 49803 -101901 -179746
15176 -179746 -158121 -121778 -89762 -40427 120727 228282 111340 -105639 -347109 -353735 -127894
15165 -127894 30950 149209 247435 230662 141512 -5528 -151399 -195729 -174227 -29766
15155b9766J95816k3795l02609j55195J6918Q9735J12494K809p2049k45537l5736
15144d46915J48884N2576J85527K78576P6632l07696k34288o2514o4757L9486
15134c34489n5274k6339O362n5203M7427J32886J85525K11825o7926k09823j0132
15123a75161j17712k30511J1127K48167L86918K19048P6203Q5820j21264j87381
15113A95254K0180M3204j12199k24067r2999m8271R8121j07329j02711M8483K4209
15102b58125O6647o9421q592j9628k017L1626L2885P1275J44643J81161J327j05765
15090F6016k37758j1477J99070k2761j67947j21813m5833j63331J5272J07249
15080c83313j13893j05756R5698J22303K66350K19714J39423J0898P6781N5625
$$ plain form
15155 -29766 166050 142255 -160354 -315549 -298631 -208896 -96402 -93593 -165642 -411179 -446915
15144 -446915 -298031 -245455 -59928 218648 295280 -12416 -246704 -309218 -373975 -334489
15134 -334489 -389763 -416102 -409740 -464943 -417516 -284630 -99105 112720 44794 -165029 -175161
15123 -175161 -292873 -523384 -512257 -264090 122828 341876 418079 503899 382635 195254
15113 195254 215434 258638 146439 -77628 -170627 -218898 -120777 -228106 -330817 -282334 -258125
15102 -258125 -191478 -260899 -269491 -289119 -291136 -259510 -226625 -155350 -10707 170454 171781 66016
15090 66016 -171742 -183219 15851 -6910 -174857 -296670 -342503 -505834 -490562 -383313
15080 -383313 -497206 -602962 -507264 -384961 -118611 101103 240526 251424 328205 383830
15070C83830o4994K7995J00694O1074p8341j81770q6262j06340j71787J4184K04047
15059A02330J60889K3242o7364k18491j55792R860K43729J0763k48075k46138
15049c85047j86577J45567K83734J46894O4889J8667j22670m3446J72794J93398
15039B88203r977j10432K6790k27672l30609r9513P7744k7492o3125J40343M2457
15028b93283p0311P3557j3765L2861L18879K61678J53123O1251k29273l16885
15018b2168j11034J8126K02141J52548m9313J0472k61451j66341J1214J20919
15008i4887J85520Q5149j9874m9316M1079O7548j72228k24718m6979J12822J7089
14997i8795q9931N5390P6636J8129p1076j07923P7552J13184j38483k34087k4799
$$ plain form
15070 383830 318836 346831 447525 508599 430258 248488 162226 55886 -115901 -101717 102330
15059 102330 263219 286461 219097 606 -155186 -145326 98403 109166 -138909 -385047
15049 -385047 -571624 -426057 -142323 4571 69460 88127 -34543 -77989 94805 288203
15039 288203 278226 167794 194584 -33088 -363697 -463210 -385466 -412958 -476083 -335740 -293283
15028 -293283 -363594 -290037 -303802 -270941 47938 309616 462739 523990 294717 -22168
15018 -22168 -133202 -115076 87065 239613 190300 200772 -60679 -227020 -215806 -94887
15008 -94887 90633 175782 155908 106592 147671 215219 42991 -181727 -228706 -115884 -98795
14997 -98795 -188726 -133336 -56700 -38571 -109647 -217570 -140018 -26834 -165317 -399404 -424203
14986d24203J72188p6929j73620N8311R0764O985J00429N5023M6635Q8843O2723
14975G149J50914J105j14855l8422j29346j34697L8418R8618P0662M8242R1559
14964H9347L67758J96581k58984j48307k0087p9295l2349o9753p230J47626J44013
14953C29320J0920j33792j73137q4767j43995j34945j4674J19315l2275l6759
14943b94789n7263k9787J3255P7647K60777L52351J66931j32877j71772k9649
14933A54824L3194j29689j13679M0495M4963P4178K2757P3721K0844j1396K6171
14922B36383L9249R3971n1442p1022j48479k62365j94902J59685K21297K18520
14912B40895J81301J47296M8633k31651l98768j12202L5652j88549m8179P4684
$$ plain form
14986 -424203 -252015 -328944 -502564 -444253 -353489 -346504 -246075 -191052 -144417 -55574 7149
14975 7149 158063 159168 44313 5891 -123455 -258152 -219734 -121116 -50454 -2212 89347
14964 89347 457105 653686 394702 246395 226308 147013 114664 44911 37681 185307 329320
14953 329320 340240 206448 33311 -51456 -195451 -330396 -345070 -225755 -258030 -294789
14943 -294789 -352052 -381839 -368584 -290937 -30160 322191 489122 356245 184473 154824
14933 154824 188018 58329 -55350 -14855 30108 104286 127043 200764 221608 210212 236383
14922 236383 275632 369603 318161 247139 98660 -163705 -358607 -198922 22375 240895
14912 240895 422196 569492 618125 386474 -12294 -124496 -88844 -277393 -325572 -250888
14902b50888M1830K3801J8065L3948p0152J9273n601j53307o7201J51705K71640
14891A3113K4994r7485K7233K674J53964K24450J23361J70707J20775o0679k23651
14880D79456j95963k10187k01615K3839K67024j8320k02184P4597P3990j93120
14870a02483l10627j51200q187p7535k9538J54009R3070J14862O5208J89553K18066
14859A55198O5454o7554j87594k04963k50657k08297K9535J14266J284N862N2670
14848d94796m84p8528O7649O4513q0805Q130J14168J52708Q7477q9233k05276
14837d54477j0604J72040J67149o5775M4901O1438l3553r3836j68863J01283J88802
14826i1495q5714j73027n2067q1503K2333K18216J44865n703p2107M1749l4759
$$ plain form
14902 -250888 -209058 -185257 -167192 -133244 -203396 -184123 -189724 -343031 -410232 -258527 13113
14891 13113 38107 -59378 -32145 -29471 124493 348943 472304 643011 763786 703107 479456
14880 479456 283493 73306 -128309 -104470 162554 144234 -57950 16647 90637 -102483
14870 -102483 -413110 -564310 -572497 -650032 -679570 -525561 -432491 -317629 -252421 -62868 155198
14859 155198 220652 153098 -34496 -239459 -490116 -698413 -668878 -554612 -553328 -547466 -494796
14848 -494796 -495280 -573808 -506159 -441646 -522451 -514321 -400153 -247445 -159968 -249201 -454477
14837 -454477 -465081 -293041 -125892 -191667 -146766 -85328 -118881 -212717 -381580 -280297 -91495
14826 -91495 -177209 -350236 -402303 -483806 -461473 -243257 -98392 -104095 -176202 -134453 -169212
14815a69212j0187P5526J50920K63764Q6931r9668j61726j8546p4063Q788J1791
14804F4318m2234n8826Q2795J57744j32758k72408K2643J72555J27674J44170
14794B65673J10771l8684j29356l6202L1916l3009j31131P637J54986k9445j28313
14783D4843J09101O6407r2637j42482L8546L44781K28739q8449k30417M0274j12879
14772B05827k21218L39139L28409O7011j0601j85036l12481l26755k21484K5311
14762c11878K16809M1907o5207M4754m5869k35029l2973K39290K58468L5639j13979
14751C1932J4089l2795j06155j06923r9238M4199J64343K26895m0909k4420M2777
14740A13795J00045J66809K7641p2600j70526j77566j24039n7287J19896q037
$$ plain form
14815 -169212 -179399 -103873 47047 310811 397742 298074 136348 117802 43739 52527 64318
14804 64318 22084 -36742 46053 203797 71039 -201369 -178726 -6171 121503 265673
14794 265673 376444 337760 208404 172202 204118 171109 39978 47615 202601 173156 44843
14783 44843 153944 220351 127714 -14768 23778 368559 597298 508849 278432 318706 205827
14772 205827 -15391 323748 652157 719168 708567 523531 211050 -115705 -337189 -311878
14762 -311878 -95069 -53162 -118369 -73615 -119484 -354513 -387486 -148196 110272 145911 31932
14751 31932 46021 13226 -92929 -199852 -299090 -254891 -90548 136347 95438 71018 113795
14740 113795 213840 380649 408290 335690 165164 -12402 -136441 -193728 -73832 -81869
14730h1869j75333k2947N8714j7347k9248J46220R2903j04940J27476J82055J14029
14719B89713M8545J6579o2571j54492j26344R0354K84069M9232o3322K76955j6385
14708F32333k87416k21473m1398p4230j33485o8866K0904K028J1440J2680L1943
14697a15540J20111P2107l2977r3096j15433j29967o4258R1696m602j90209L2263
14686d29905J11245m5555l3382J49075K4133j9689L954J10536J36005N9298p4087
14675h372m3730k0587j8310j36140r9893p140L8993k5229K51471L98042K35674
14664E64779j37201j57527k06772l09726q5211l0052m9785j22078J19083J57458
14654b57032J13074R9859j3015n8416m7451j01483k0899K39011K45798j40253
$$ plain form
14730 -81869 -257202 -280149 -221435 -238782 -268030 -121810 -28907 -133847 -6371 175684 289713
14719 289713 338258 354837 292266 137774 11430 101784 385853 435085 371763 648718 632333
14708 632333 344917 123444 82046 7816 -125669 -194535 -173631 -171603 -160163 -147483 -115540
14697 -115540 4571 76678 43701 -49395 -164828 -294795 -359053 -267357 -271959 -462168 -429905
14686 -429905 -318660 -364215 -397597 -248522 -224389 -244078 -240124 -129588 6417 65715 -8372
14675 -8372 -52102 -72689 -90999 -227139 -327032 -334172 -295179 -320408 -68937 329105 564779
14664 564779 427578 270051 63279 -246447 -331658 -361710 -411495 -533573 -414490 -257032
14654 -257032 -143958 -44099 -57114 -115530 -162981 -264464 -285363 -46352 199446 59193
14644E9193q0651l8011Q4153O866j05641k6839j01399j54461p4448N6446K02428
14633a72364Q2381J17491K84061J20660m1898k66655j35597J8196m0054J7526
14623a6253k6908p1371j8884j13660m6309j58171k4771L56298L3430l35071R4512
14612c27158J47415P5533k6256j49965K06480R3613N5993O8099j47231R0J763
14601a624m1493l7359j96196n3291K15917L3532J5675K6789O0483o4646n393N7922
14589A0316m602J28826J36607J47125j44839k37026j6387O1836q500p0902r6114
14578i3660k36965j98449M8982K05366K31953j0740j06479M7719N775n6597J17579
14567d5516J10421m7804n7009K3479J30785J09561j157j59880k12499j20878j7368
$$ plain form
14644 59193 -21458 -59469 24684 31550 -74091 -100930 -202329 -356790 -431238 -374792 -172364
14633 -172364 -89983 27508 311569 432229 390331 123676 -11921 6275 -33779 -16253
14623 -16253 -43161 -114532 -133416 -247076 -293385 -451556 -476327 -120029 -86599 -421670 -327158
14612 -327158 -179743 -104210 -130466 -280431 -73951 19662 75655 143754 -3477 -3387 -1624
14601 -1624 -43117 -80476 -276672 -329963 -114046 -80514 -64839 -38050 22433 -42213 -47606 10316
14589 10316 5714 134540 271147 418272 273433 36407 20020 81856 73356 2454 -93660
14578 -93660 -330625 -529074 -480092 -274726 -42773 -53513 -159992 -112273 -106498 -163095 -45516
14567 -45516 64905 17101 -39908 -16429 114356 223917 222760 62880 -149619 -270497 -287865
14556b87865l0293j46302j63256Q9088M2201k6306j0184J31948J69201K3556M184
14545b04028p5961M0737J26026J58571Q6091J03166k2456k65536k38078O3373
14535b28095J40201J11928k707k19584m9345J38914Q4119j6932n2510L882k685
14524i2814p7322j3851j36746k22811o7726J82300J91494J51311J28734q438P6734
14513A10865J17696j29963j17228R4703K58142N3660N3894j67758r7265J86586
14503C63332J80259J7589n5089q7435p8225J08568r2554k00938m3539J83541N9642
14492C55151P2114O7484n1966O1624l3287k52280o7243N9729K8767m0881p1418
14481A27794P4119K56892J57582r5547j63912j29466n430p4478k01302j40157
$$ plain form
14556 -287865 -318158 -464460 -627716 -538628 -496427 -522733 -532917 -400969 -231768 -208212 -204028
14545 -204028 -279989 -239252 -113226 45345 131436 234602 212146 -53390 -291468 -228095
14535 -228095 -87894 24034 21327 -198257 -247602 -108688 -24569 -41501 -94011 -90129 -92814
14524 -92814 -170136 -183987 -320733 -543544 -611270 -428970 -237476 -86165 42569 34131 110865
14513 110865 228561 98598 -18630 76073 334215 387875 441769 274011 176746 363332
14503 363332 543591 561180 506091 418656 340431 448999 356445 155507 111968 295509 355151
14492 355151 427265 494749 442783 504407 471120 218840 151597 211326 240093 199212 127794
14481 127794 201913 458805 616387 520840 356928 227462 222032 147554 -53748 -193905
14471a93905J09395K85226J02898j10087k37446k32957r2629O7682N7307J42746
14461a01770K99052J57526n1194j42433q8034J00690Q9795N8375J91497j33462
14451C80042l05350j46146Q0341j9559j83849j0668K51404O165j94184k86250
14441d28054j02893k372r6376J28838R1535j4069k3632J40038K21908J54661P1755
14430A41339j35468l25729l04059J33170L43928r9105k70594j02569L16494J69099
14420a33494k4528L3708Q6223L9376K8030O2903J9848j08482k62442k49185j0375
14409e18418J23153K32514L3932j15919L1901L03431J03518k7032l9211k1747
14399A06122m9120r7672J878l33K23044J51305Q9068L47404L45967K2684j83354
$$ plain form
14471 -193905 -84510 200716 303614 193527 -43919 -276876 -369505 -301823 -244516 -101770
14461 -101770 197282 354808 303614 161181 73147 173837 263632 322007 513504 380042
14451 380042 74692 -71454 8887 -10672 -194521 -205189 46215 52380 -141804 -428054
14441 -428054 -530947 -533319 -629695 -500857 -409322 -423391 -447023 -306985 -85077 69584 141339
14430 141339 5871 -319858 -623917 -490747 -146819 -245924 -516518 -619087 -302593 -133494
14420 -133494 -158022 -124314 -38091 1285 29315 92218 112066 3584 -258858 -508043 -518418
14409 -518418 -395265 -162751 -128819 -244738 -212837 90594 194112 167080 127869 106122
14399 106122 57002 -40670 -38792 -39125 183919 335224 424292 771696 1117663 1140347 956993
14388I56993K2063K80480K61764K94037L7092j19465k44800l81385m48782k50022
14378D07975M4161K3269q8212k3326J14984l5133k06433j97127L3913J43279q1056
14367A36294k16407p8044k2358J10451K73670J67211o8530j8902R4024k5452j31136
14356B20821o1500J03055j71081k10545Q8888m0591p1312J766j0499L3096j7561
14345a35463j91638M0778K83157K50446J66475j15203k77008m2875J14209R6973
14335A89851L7166j75980O792m7725J8354j23515l25952R2991J43268r0943l00661
14324e76354k10635j31266J02673K76818K72267J99041P0111Q7765N0326L5645
14314A76391P7349k4355o3574M1488Q8788J33517j58265m8983j01084l38531j20271
$$ plain form
14388 956993 979056 1259536 1521300 1815337 1852429 1732964 1488164 1106779 657997 407975
14378 407975 452136 475405 387193 363867 478851 443718 237285 40158 74071 217350 136294
14367 136294 -80113 -158157 -180515 -70064 203606 370817 302287 283385 377409 351957 220821
14356 220821 159321 262376 91295 -119250 -30362 -70953 -142265 -140499 -150998 -117902 -135463
14345 -135463 -327101 -286323 -3166 247280 413755 298552 21544 -21331 92878 189851
14335 189851 227017 51037 57829 10104 28458 -95057 -421009 -328018 -184750 -275693 -576354
14324 -576354 -786989 -918255 -815582 -538764 -266497 -67456 2655 90420 140746 176391
14314 176391 253740 229385 165811 207299 296087 429604 271339 222356 121272 -217259 -337530
14303c37530J11383J5598L0681N3563o7233k0968M3776j12706k34006L9921K68537
14292b08984K62088L39428R1896l03469o6472L03294J41112k29086j15105K3840
14282B38542k24295k13898l8677j1725j0230k7640j02322J9878K41739K66627
14272A37999L2262o6370j23609o2839J14804J05933k531q5038j23524m9921j48620
14261b71454k71648P8528J91947J36673J83533J91667J63022J56663k4045j54846
14251C80040k28239j34178J1969L6195Q7685K4583N0300n0960k28935j81360j49799
14240c82699P613J59363p9251k35873k3561M7577l7010j72263j20887K5404J17114
14229f94473l1409n338J11981o391J3859L68749L90790J4157j11081J02254J41853
$$ plain form
14303 -337530 -226147 -210549 -179868 -126305 -193538 -214506 -170730 -283436 -517442 -477521 -208984
14292 -208984 53104 392532 484428 180959 114487 417781 558893 329807 214702 238542
14282 238542 14247 -199651 -238328 -250053 -260283 -287923 -390245 -370367 -128628 137999
14272 137999 170261 103891 -19718 -82557 32247 138180 135649 50611 -72913 -122834 -271454
14261 -271454 -543102 -464574 -272627 -135954 47579 239246 402268 558931 534886 380040
14251 380040 151801 17623 29592 65787 153472 178055 228355 177395 -51540 -232900 -382699
14240 -382699 -375086 -215723 -294974 -530847 -554408 -506831 -543841 -716104 -836991 -811587 -694473
14229 -694473 -725882 -731220 -619239 -625630 -611771 -243022 147768 161925 50844 153098 294951
14218B94951J11361J62060m2809l9905L7888q2622j15249J574L0031j78261j79753
14207g34M7749l5315m5596J15729J41165n7771p9819Q4702J73435q2899k19290
14196D1356j75872N484N8117j13710k5427J77951J41442Q2352j05505j36815k53438
14185c04065o8226K19986L61565J71947j79058j44986j00695j0237j2308j46347
14175b12424k15187j62566N9218J94241K37940Q6171k9023J24693O8419o5207
14165H6275k38025j38210O2610N5775O0997K87410J42852J43724q9730j55546
14155B18132p8130K8692K27848K48818o637j73700o1056o8645p202p8916j02944
14144A46260R4848m9023j96236q4746k3167q7659L3502J62771K34481R6258j70240
$$ plain form
14218 294951 406312 568372 525563 485658 523546 440924 325675 327249 357280 179019 -734
14207 -734 47015 11700 -33896 81833 222998 165227 85408 170110 343545 260646 41356
14196 41356 -134516 -129032 -70915 -184625 -210052 -32101 109341 191693 86188 -50627 -304065
14185 -304065 -372291 -152305 209260 381207 202149 57163 -43532 -53769 -66077 -212424
14175 -212424 -427611 -590177 -530959 -336718 -98778 -12607 -41630 83063 151482 86275
14165 86275 -151750 -289960 -227350 -171575 -110578 176832 319684 463408 373678 218132
14155 218132 140002 168694 396542 645360 638723 465023 403967 335322 328120 249204 146260
14144 146260 241108 192085 -4151 -88897 -112064 -199723 -166221 -3450 231031 327289 157049
14133A57049k06619o0465M7409J8575j05051k92018j69768K2612L2285J61992
14123c93999N1167j93703p3089O6515K0690j71323Q5199M05978J38779m7006k1604
14112a32396M6937O7172K05822J26531j75137k11054o3343J95681K50091O9677
14102C79981o9714j02091j57542J16698L50185o3745k72729j13825J04122J60427
14092C31767j1943j58639p0719J67398j8150n6382l2254l1414j61634j14982Q4452
14081g2500J10873J33433j3673k34762j2945J13563J33038J80295j03844k75555
14071d2077j9745o1615J6792K15534J27663K3465j34551j24416J64154K15397
14061C80601R668m7696M75460M89665K24217N61588N93158L2097k40493k76712
$$ plain form
14133 157049 -49570 -110035 -62626 -44051 -149102 -441120 -610888 -588276 -555991 -393999
14123 -393999 -342832 -536535 -609624 -543109 -522419 -693742 -608543 -202565 -63786 -110792 -132396
14112 -132396 -85459 -18287 187535 314066 138929 -72125 -135468 60213 310304 379981
14102 379981 310267 208176 50634 167332 517517 453772 181043 67218 171340 331767
14092 331767 319824 161185 90466 257864 239714 183332 151078 119664 -41970 -156952 -72500
14081 -72500 38373 171806 158133 -76629 -89574 23989 157027 337322 233478 -42077
14071 -42077 -61822 -123437 -106645 108889 236552 260017 125466 1050 165204 380601
14061 380601 390269 342573 818033 1307698 1531915 2093503 2686661 2718758 2478265 2201553
14051B201553m04451l53194k96169l95151o18212j65890J44412J07490k2563j52073
14041D5752j97256O7321J43891K32011P6541K5953R1073O196n6641k1813J29879
14030E42907P2322J00381O6498K44440N45557P39699O95235N11930P91181J228301
14020E538451J453876J471037Q66539m19228j348906j479733j302716j152576
14012C626744q48594l60387k21511k15974l20595k83127j84718l13309l06352
14003E72177k52728k95067j46688K44166K30241J16668J34000j13907l56911k3185
13993A08766M01161K46706j8466j83922k02861J12489J54546O345R281J35644
13983G69689O2298j00523j67052o1093n1346k34956k09222R7498R0622J28682
$$ plain form
14051 2201553 1797102 1443908 1147739 752588 134376 -31514 112898 220388 197825 45752
14041 45752 -151504 -84183 59708 291719 368260 394213 485286 491482 434841 413028 542907
14030 542907 615229 715610 782108 1026548 1572105 2311804 3007039 3518969 4310150 5538451
14020 5538451 6992327 8463364 9329903 8910675 7561769 6082036 4779320 3626744
14012 3626744 2778150 2417763 2196252 1980278 1659683 1376556 1191838 878529 572177
14003 572177 319449 24382 -122306 121860 352101 468769 602769 488862 131951 108766
13993 108766 509927 756633 738167 554245 351384 463873 618419 624764 634045 769689
13983 769689 831987 731464 564412 503319 451973 217017 7795 105293 195915 324597
13973C24597k8018j08465j1625K8027J16296J23920k3177j38723j06421P043K2268
13962B05722r1147j20900j25061m4006M9830J75488R8868o9580j98338r5838q767
13951b23729R308J40995J98883k3717J60249J3390k28197k89069j22186J17941
13941b46132Q4267J21724J78519R3319j73810j96519J29452K57610J27569p7318
13931B98681j25589j56123j34235J11267L27374k3289k64725r6603o6377j89791
13921c19410k82726M1896L49311J15282j32158j97694j13872k7804J38142P0333
13911c58700j2221m4022L9749R4609o074J45693K61954Q1136n3149p5961k50926
13900a77912k73059O5047K31549J55556j7315o9564n1517m9746p219O4997L1422
$$ plain form
13973 324597 296579 188114 176489 204516 320812 444732 421555 282832 176411 183454 205722
13962 205722 114575 -6325 -131386 -175392 -125562 49926 148794 79214 -119124 -214962 -223729
13951 -223729 -214421 -73426 125457 101740 261989 275379 47182 -241887 -364073 -246132
13941 -246132 -161865 -40141 138378 231697 57887 -138632 -9180 248430 375999 298681
13931 298681 173092 16969 -117266 -5999 321375 298086 33361 -63242 -129619 -319410
13921 -319410 -602136 -560240 -210929 -95647 -227805 -425499 -539371 -567175 -429033 -358700
13911 -358700 -370921 -414943 -375194 -280585 -286659 -140966 120988 202124 148975 73014 -177912
13900 -177912 -450971 -385924 -154375 1181 -16134 -85698 -137215 -186961 -194180 -129183 -97761
13889i7761l9781J12747M03l15348k35953M655K07712N3137r3144N752n355J9895
13877c83041p5141r866M9989l563l1919r1437M2088L23280L24737J37355M6750
13866C29232J17844n3875l26414k77152j7956K88907K67779P8355l9700N3030
13856D20050n4810k47085l0297J00096R5312k9608o3254L9905J953j495J29827
13845C60594O022l2324j23742r0113M9852J3991j29636j37643j38178j0023K1040
13834b10160J27811L03364l560j83359j85409j01169K259M099j5551Q9077J42133
13823c0465L1195r5841n6721N1449J24411k0098j53014J6868Q5292K60832J12966
13812C26874k05369p0948P6931j09679k12535r3733n5101J33499K92333K05249
$$ plain form
13889 -97761 -137542 -24795 -24392 -339740 -575693 -571038 -363326 -310189 -403333 -397581 -402936 -383041
13877 -383041 -458182 -468048 -418059 -421622 -453541 -544978 -502890 -179610 145127 282482 329232
13866 329232 447076 393201 66787 -210365 -228321 60586 328365 406720 367020 420050
13856 420050 365240 118155 87858 187954 283266 253658 190404 230309 232262 230767 360594
13845 360594 366616 334292 210550 120437 170289 184280 54644 -82999 -221177 -231200 -210160
13834 -210160 -82349 221015 217455 34096 -151313 -252482 -250223 -246124 -261675 -172598 -30465
13823 -30465 730 -95111 -151832 -100383 24028 3930 -149084 -132216 -46924 213908 326874
13812 326874 121505 50557 127488 17809 -194726 -288459 -343560 -210061 82272 287521
13802B87521j6661k35931k05228r3017k49031j78026J03642J73665J96621O8530
13792a47915J19512P3473O3777p2275j0866K49130K6395K0073m7837j75460k33270
13781a35263j61463K4979J22103O2407o1509J09995M3322Q512j00896o0324o4922
13770b13059n9461K381K0926q757k5954P3142R6624l7345P6549O7813j4816J34117
13758A12160J11806K07487j07238l72468j86920J4570J94711J87463K6557k3822
13748A64306k8240M7230N264q8038j23849j23143m652K7354j21435j57357P3398
13737c29162R5253l9175Q3652J49618J43960J35418j32654j44338j15045j38507
13727b90980j50016m7964J04716J61250Q3215P4499J09884o8908j7451o4660J02668
$$ plain form
13802 287521 270860 34929 -170299 -263316 -512347 -690373 -586731 -413066 -216445 -147915
13792 -147915 -28403 45070 108847 36572 25706 274836 301231 321304 273467 98007 -135263
13781 -135263 -296726 -271747 -149644 -87237 -148746 -38751 4571 13083 -87813 -148137 -213059
13770 -213059 -272520 -270139 -249213 -257970 -283924 -210782 -114158 -151503 -74954 -7141 -21957 112160
13758 112160 223966 431453 324215 -48253 -235173 -220603 -25892 161571 188128 164306
13748 164306 136066 183296 188560 100522 -23327 -146470 -151122 -123768 -245203 -402560 -329162
13737 -329162 -233909 -273084 -189432 -39814 104146 239564 106910 -37428 -152473 -290980
13727 -290980 -440996 -488960 -384244 -222994 -139779 -65280 44604 -24304 -41755 -106415 -3747
13716c747J78607O8067N6058m260k43415k49958k18246R9122Q9563j2369J71747
13705f8831K24272N4589r1937p0440N2462m6433k04534j22920R4705n3700j65295
13694c98062N3826P4479j18888L5452J70344P9565r300K745p2170J75955J73199
13683A67145o3782K6738m1241k17701k12319J3551J43559j6902m0028R1809J90875
13672D1704Q4987R3319j60705j02057R0307j38082j91186j4736K11017L02627
13662B17195j27217j60033J16847O5014r9696j93506m2281p1267q077J12352K96879
13651A06210K18070j39838j42544n9310m7400K25682J51239j77847k95346M164
13641a56920K27114J13582J1293p6002j2380l5668n8558J9176j01741j15840J3987
$$ plain form
13716 -3747 174860 242927 298985 294725 51310 -198648 -416894 -317772 -228209 -240578 -68831
13705 -68831 155441 210030 118093 47653 100115 53682 -150852 -273772 -179067 -232767 -398062
13694 -398062 -344236 -269757 -388645 -353193 -182849 -103284 -112584 -109839 -182009 -6054 167145
13683 167145 103363 130101 88860 -128841 -341160 -327609 -184050 -200952 -240980 -149171 41704
13672 41704 126691 220010 59305 -42752 47555 -90527 -281713 -296449 -85432 217195
13662 217195 89978 -70055 46792 111806 12110 -181396 -223677 -294944 -303021 -190669 106210
13651 106210 324280 184442 41898 -17412 -64812 160870 312109 134262 -161084 -156920
13641 -156920 70194 183776 195069 119067 106687 71019 12461 31637 -70104 -185944 -171957
13630a71957L84894K96735K5602k73166k54414Q3460J56423J9630j03400j91199
13620b7392m8959J74592J44017o3192Q2343r0097j71789j87735j68948r5592L08609
13609a44143L87908N8393r2037j47705j86598p7948j7120l0652m0558J486Q432
13598b80542o445n8746j09081J8656J43806K59235K79821J75283N4487L3190k03103
13587C06561k82112k13978p3270P1681Q357p3689n4891j41343j01411q057J25289
13576d36863J88565J15857J24429J5956l2144K41767L08961P3019j40059j00021
13566C59467n7331j30891j05448o8216j57624n1007P8886J6975j0055l6866j7835
13555a79945k3733J82386J00472l07956l17340J12739K60751M1819k2351j61836
$$ plain form
13630 -171957 212937 509672 535274 262108 7694 91154 247577 267207 163807 -27392
13620 -27392 -76351 98241 242258 179066 261409 171312 -477 -188212 -357160 -452752 -144143
13609 -144143 243765 302158 210121 62416 -124182 -202130 -219250 -249902 -290460 -288974 -280542
13598 -280542 -286987 -345733 -454814 -436158 -292352 -33117 246704 421987 476474 509664 306561
13587 306561 24449 -189529 -262799 -191118 -182761 -256450 -311341 -452684 -554095 -562152 -436863
13576 -436863 -248298 -132441 -8012 7944 -24200 217567 526528 599547 459488 359467
13566 359467 302136 171245 65797 -2419 -160043 -211050 -132164 -115189 -125244 -162110 -179945
13555 -179945 -203678 -21292 79180 -228776 -546116 -433377 -172626 -130807 -153158 -314994
13545c14994k82435j25330P1569L37568K63312O8334r7944p0412N6128J07589
13535A3385L6274o8632k46314k56144M8966K05125n5290M013J33942K8287q2952
13524b39340j32199N2750J98987J56142k4981O2569K8561r6868R9624L7243m3254
13513I9234j97290j38032n9458l4948o8048k04779j38660N0080J02581J38365
13503d50955J9705j26934J00714L31577K11398j9804k29704j30417N9324p7382
13493c12478j9030l7582M3912K27776K54527P4789J18897N6541j74235j72707
13483F0410L0674N6287L6131O3253k85250k55257J87334K05149J18089j63154
13473E3666k50947j38318j98658j18651K37295J18124N2930J90363J77655R6570
$$ plain form
13545 -314994 -597429 -722759 -651190 -313622 -50310 18024 -79920 -150332 -94204 13385
13535 13385 49659 -18973 -265287 -521431 -472465 -267340 -322630 -318617 -184675 -156388 -239340
13524 -239340 -371539 -318789 -119802 36340 11359 73928 102489 5621 105245 142488 99234
13513 99234 -98056 -236088 -295546 -330494 -398542 -603321 -741981 -691901 -589320 -450955
13503 -450955 -431250 -558184 -457470 -125893 85505 65701 -164003 -294420 -235096 -312478
13493 -312478 -331508 -369090 -325178 -97402 157125 231914 350811 407352 233117 60410
13483 60410 91084 147371 183502 246755 -38495 -293752 -106418 98731 216820 53666
13473 53666 -197281 -335599 -534257 -652908 -415613 -297489 -244559 -54196 123459 220029
13463B20029j65195K4999k989j06484P8180J37262P9095P9772j48520k23596m0906
13452f8353K29047J53436j14919m5644R0628J5438k0816o6194k31310n9238j3760
13441a31685o3630o1714q9257j6458L4349j4666Q0004M4017k5828K1092Q9867
13430a33909j56658j3324L04056R4359Q71J2540j64373P0028N5839j37140J27160
13419E9449R5724j6362K2720q6026M3887M8467j30434R5754k8757k42978k23443
13408c61999o6043J96127K55221J22101P6730N982j46508m2165P4269Q1898K6310
13397B21923k01176n0722O3591R3749J88964J62279J91210J05066k20047j94820
13387C60017k84654j39220q715N3563J10286J62130O5633j39966L929J03986q79
$$ plain form
13463 220029 54834 79833 76844 -29640 48540 185802 264897 344669 196149 -27447 -68353
13452 -68353 160694 314130 199211 153567 244195 259633 238817 172623 -58687 -117925 -131685
13441 -131685 -195315 -257029 -346286 -362744 -328395 -343061 -263057 -219040 -244868 -223776 -133909
13430 -133909 -290567 -303891 165 94524 95395 107935 -56438 13590 69429 -67711 59449
13419 59449 155173 138811 161531 75505 119392 167859 37425 133179 104422 -138556 -361999
13408 -361999 -428042 -231915 23306 145407 222137 228119 81611 39446 113715 195613 221923
13397 221923 20747 -29975 33616 127365 316329 478608 669818 774884 554837 360017
13387 360017 75363 -63857 -72572 -19009 91277 253407 319040 179074 183003 286989 286110
13376B86110j29957j42169l57229o3822L20173Q0234j08024j60639j23318j32582
13366e31223r1410K02332L60598J4790j46645M0799J02791Q3498j0446j39533
13356a14449j27532K26J5811J38397J55148J24093J21702J24853j57144k75365
13346E740l51411J11777L80266R1776j55858K7686O5107K9827N4588j81905j42001
13335f4408K1539J63904K39527M9525j13938k34372m916N9109N6659n8298k45072
13324a30741j79214j0827N3816Q2634N4691J39993J02748P1053l3308k45207k03626
13313b97988P2805j2141j9931L4603J604N7172K470J02540K42345J08709P026
13302B99214j10349k42090r9140r4452j52862q774J11814R5145o4627m2804L6858
$$ plain form
13376 286110 156153 13984 -343245 -407067 -86894 -6660 -114684 -275323 -398641 -531223
13366 -531223 -622633 -420301 -59703 -44913 -191558 -150759 -47968 35530 25084 -114449
13356 -114449 -241981 -241755 -225944 -87547 67601 191694 313396 438249 281105 5740
13346 5740 -345671 -233894 146372 238148 82290 109976 175083 204910 259498 77593 -64408
13335 -64408 -42869 121035 360562 410087 296149 61777 56861 115970 172629 114331 -130741
13324 -130741 -309955 -320782 -266966 -184332 -129641 10352 113100 184153 150845 -94362 -297988
13313 -297988 -225183 -237324 -257255 -222652 -221048 -163876 -161406 -58866 183479 292188 299214
13302 299214 188865 -53225 -152365 -246817 -399679 -408453 -296639 -201494 -266121 -308925 -272067
13291b72067K38234O6496j44514j42100J68216K56428K7192q192m5549r5947J9304
13280F7501j7641p1478p8999n3343J2299n7334Q8026K88442R627k98427j14017
13269b25344l1802J43240J56205j23288j78477j6860j9991P4423o4034J100J03428
13258a81400P1323J62105L82637J56279k94265j81036J67990K14915o9728j22413
13248C06407N710j29488j36108l678K6722o9364k46398J0284J10092J25372J09678
13237A09229N8601m2858k5975J48693J74151P9395k9288J2088K8871n7281q8279
13226C67347j31077j72469q5140R6035m8912j65954O199K0789J54067J41937j483
13215A81339k7287R445L7936j2729J265K2264J26286M425r5998J07920K50519
$$ plain form
13291 -272067 -33833 32663 -111851 -253951 -85735 170693 197885 189693 144144 48197 67501
13280 67501 49860 -21618 -100617 -153960 -141661 -198995 -110969 177473 187100 -111327 -225344
13269 -225344 -257146 -113906 42299 -80989 -259466 -276326 -296317 -221894 -285928 -284828 -181400
13258 -181400 -110077 52028 434665 590944 296679 115643 283633 498548 428820 306407
13248 306407 312117 182629 46521 42843 69565 201 -246197 -235913 -125821 -449 109229
13237 109229 167830 124972 98997 247690 421841 501236 471948 484036 512907 455626 367347
13226 367347 236270 63801 -21339 74696 25784 -140170 -133971 -113182 40885 182822 181339
13215 181339 154052 163497 201433 188704 189969 212233 338519 342944 246946 354866 605385
13204F05385P6536j38767j95149j99762k1676p2329m7265J5036K18787n1449l38655
13193a49308k2306J81671J67408J65378j39164k67043o0036j28962j99462K5673
13183d26151N1577K38394K20942K39738J04321J09644Q4948N4057n1743j42109
13173D83618j75041j43779R4785L80237K26162j09827j47310L2054J18183J17987
13163H77069n7129j76466N9048K12301j6566k12182k77333q9536J29265K7593
13153D76064j34338j64161l2977M731r3345M0491K09971J61758J95168J42953
13143H06315m4277j57858j29136l2743m1036O2137M3765j25317p5771J5742R6785
13132D18606J53670K04621J95551J83494r5833k26181k44783k03926j90969j54252
$$ plain form
13204 605385 681921 543154 348005 148243 126567 54238 6973 22009 240796 189347 -149308
13193 -149308 -171614 10057 177465 342843 203679 -63364 -123400 -252362 -451824 -426151
13183 -426151 -374574 -136180 84762 324500 428821 538465 623413 677470 625727 483618
13173 483618 308577 164798 259583 639820 865982 756155 608845 640899 759082 877069
13163 877069 819940 643474 702522 914823 898257 686075 408742 319206 448471 476064
13153 476064 341726 177565 144588 149319 55974 96465 306436 468194 663362 806315
13143 806315 762038 604180 475044 442301 401265 463402 507167 381850 306079 321821 418606
13132 418606 572276 776897 972448 1155942 1060109 833928 589145 385219 194250 39998
13122C9998j32157k7262K00902L04698J40700l1937K4603J40398k4419j73453
13112D62071P3007M038n1182m5791r545J60189J03666J39423J49831p1146O346
13101I20907q7642p3006J29809K34694M5426J14790Q1710r8354R7932J62584l1134
13090A497716j46848k02474k59960l24562k00575R1646K37255K37376R8140j46933
13080H80781k20613j9081L7504K08857J56170J91701K6985m31545j12003J76658
13070H95414J08796O9349n6164R1893K93168L18313J24952J555j38101j58875
13060A550300j42594m763K81920J91511N0855j43164k92293K2921M17518K47602
13050B179813p0664r973L8745M3005m8637J54943J05059q5398P7830M5976k81990
$$ plain form
13122 39998 -92159 -119421 81481 386179 526879 494942 519545 659943 635524 462071
13112 462071 535078 539116 487934 442143 432598 592787 696453 835876 985707 914561 920907
13101 920907 833265 760259 890068 1124762 1170188 1284978 1366688 1268334 1366266 1528850 1497716
13090 1497716 1350868 1148394 888434 563872 363297 454943 692198 929574 1027714 880781
13080 880781 660168 641087 678591 887448 1043618 1235319 1262304 830759 718756 895414
13070 895414 1004210 1073559 1017395 1109288 1402456 1720769 1845721 1847276 1709175 1550300
13060 1550300 1407706 1402943 1684863 1876374 1927229 1784065 1491772 1514693 1932211 2179813
13050 2179813 2109149 2099176 2137921 2180926 2132289 2287232 2392291 2306893 2384723 2430699 2148709
13039B148709l37392j88608J0861J29044J23596M5907J69909K58232O8324N8352
13029B486934J05788L8541r5240K7185J93020J49929O604J52074J82276L490m5352
13018C205249j63292j1334J52889J98646N22506N60287L18807O1497O5966k8604
13008D882617j66837J06344M41727N09863N35853M41499L35349L23849K17283
12999G627547K44466N54190J014830J204782J337444J285151J748907K253194
12991A7270511K372040K919851L752490M690586N781576O989785Q532397J0968895
12983F3278131J4284838J8627814K4525189L2044853L9952390M2232096K7262972
12976B62208283n825819l4814228m3421375l8201502k9635508k2107955j6649497
$$ plain form
13039 2148709 1811317 1622709 1633570 1762614 1886210 1932117 2102026 2360258 2428582 2486934
13029 2486934 2592722 2631263 2536023 2563208 2756228 2906157 2912761 3064835 3247111 3250601 3205249
13018 3205249 3041957 3030623 3183512 3382158 3904664 4464951 4783758 4845255 4911221 4882617
13008 4882617 4715780 4822124 5263851 5773714 6309567 6751066 7086415 7410264 7627547
12999 7627547 7872013 8426203 9441033 10645815 11983259 13268410 15017317 17270511
12991 17270511 19642551 22562402 26314892 31005478 36787054 43776839 52309236 63278131
12983 63278131 77562969 96190783 120715972 152760825 192713215 234945311 262208283
12976 262208283 256382464 221568236 178146861 139945359 110309851 88201896 71552399
12969G1552399j2790966r572839p453416o071039m828773m010932l389846k661078
12961B0773510k103174j795001j558579j471353j164655r25396q91285o70632
12953A0193435m44273m16135n86788p68234n16679k27356r0402j72954n06306
12944F464308o24161l09766j38366j19478r2188j15864O270M8925K4994k2384
12934E122290l8737J78571K69854J23161J75710K60402J70749N8150K10416M58874
12924F989440M90828M68453P36231J081080J231584J452983J295086L55647q32660
12915A3268672j101869o68697j68412K11043L61290N93425P49751R99584J164844
12906A5409631J601359K055721K445568K821091L375983M494970N864075P197329
$$ plain form
12969 71552399 58761433 49188594 41735178 35664139 30835366 26824434 23434588 20773510
12961 20773510 18670336 16875335 15316756 13845403 12680748 11755352 10864067 10193435
12953 10193435 9749162 9333027 8746239 7978005 7461326 7233970 7143568 6970614 6464308
12944 6464308 5840147 5530381 5392015 5272537 5180349 5064485 5070755 5119680 5144674 5122290
12934 5122290 5083553 5262124 5531978 5655139 5830849 6091251 6262000 6320150 6530566 6989440
12924 6989440 7480268 7948721 8684952 9766032 10997616 12450599 13745685 14101332 13268672
12915 13268672 12166803 11498106 11329694 11540737 11902027 12495452 13245203 14244787 15409631
12906 15409631 17010990 19066711 21512279 24333370 27709353 32204323 38068398 45265727
12898D5265727R101412J1752687J5173537J9866942K6561578L4843890M2805807
12891B05371580M2501859K1589479j4757683m0581486m4638380l7146466k8124944
12884A04213959k0894711j5482855j1598616q952850p242122n611898m331447
12877C0099460l541265k810958k295469j877432j578441j222488q86690k84745
12869A5601972K64654O95852J343290J329291Q49697J794685J588186k386355
12861B1081272m241943l113302k140490j436387q83045q42237o59954n11236m38884
12852F813794m05294l93964j93723L1765P4402j80160j78951l6660N4184m4292
12842E541101P6708J99211K7724J4070K34053K71847J62319L06154L48374M07830
$$ plain form
12898 45265727 54367139 66119826 81293363 101160305 127721883 162565773 205371580
12891 205371580 247873439 269462918 254705235 214123749 169485369 132338903 104213959
12884 104213959 83319248 67836393 56237777 47284927 40042805 34430907 30099460
12877 30099460 26558195 23747237 21451768 19574336 17995895 16773407 15886717 15601972
12869 15601972 15866626 16562478 17905768 19235059 20084756 21879441 23467627 21081272
12861 21081272 16839329 13726027 11585537 10149150 9266105 8423868 7763914 7252678 6813794
12852 6813794 6408500 6014536 5820813 5852578 5926980 5746820 5567869 5531209 5585393 5541101
12842 5541101 5617809 5817020 5844744 5858814 6092867 6364714 6527033 6833187 7181561 7589391
12832G589391N15542N12131N66940M52057M5122K0696K50270M02220O70170P96659
12822A1821198R58294R78341J201283J786493K180746K618701L158415L987884
12814B8691355N117362O224466P529739R510240J2321661J6180956K1497760K8255075
12806A35328614L5983991M2067577L7450918J2545108k1827523m1524984m2176598
12799A57847103l4543331k6172786j9443758j4491640j1031435q564117o801678
12792C6798358n331985m100017l312682k828226k469298k111901j925411j706496
12784A3012342j162380r78143j009955j121987j023807n01735k27548l57451m63703
12775F165633n73559q65226p00227m06149K2258r7303j52745k46353l58214j34564
$$ plain form
12832 7589391 8104933 8617064 9184004 9636061 9681183 9701879 9952149 10354369 11024539 11821198
12822 11821198 12779492 13757833 14959116 16745609 18926355 21545056 24703471 28691355
12814 28691355 33808717 40033183 47562922 57073162 69394823 85575779 107073539 135328614
12806 135328614 171312605 213380182 250831100 263376208 241548685 200023701 157847103
12799 157847103 123303772 97130986 77687228 63195588 52164153 43600036 36798358
12792 36798358 31466373 27366356 24053674 21225448 18756150 16644249 14718838 13012342
12784 13012342 11849962 10871819 9861864 8739877 7716070 7214335 6986787 6629336 6165633
12775 6165633 5592074 4726848 4026621 3620472 3642730 3545427 3392682 3146329 2788115 2653551
12765B653551q7478j74881j52692o0046j62311r6569J68949J23941r2875j08708
12755B010881j58394j32050j02438j88433j30768M646k0852k3919L7031j7070
12745A278634k7033l2417q1704j03024j19423j30520p6001l2509Q5115R6042n6990
12734H00170k0150n9417k5253P65N7398q0859q9180p7395M2521J4205q9507K0327
12722D93625P576q2937j31926p1184J80498J72674J07302n8917j93748q0080K46368
12711E89251K06203k7632j10297j07371r1234j68445p0650Q6909P277M7891K19807
12700E81709j8377j23895j53070j30645j30049m7140J20410J24733K4283O2821
12690C10780J9536m8273M9165N1815m3210k4340J64112J54456J867K09759J05875
$$ plain form
12765 2653551 2566073 2391192 2238500 2178454 2016143 1919574 2088523 2212464 2119589 2010881
12755 2010881 1852487 1720437 1617999 1429566 1298798 1303444 1282592 1258673 1295704 1278634
12745 1278634 1251601 1219184 1137480 1034456 915033 784513 708512 676003 761118 857160 800170
12734 800170 780020 720603 695350 696115 753513 672654 583474 506079 548600 562805 473298 493625
12722 493625 501201 418264 286338 215154 395652 568326 675628 616711 422963 342883 589251
12711 589251 795454 767822 657525 550154 458920 290475 219825 306734 314011 361902 581709
12700 581709 563332 439437 286367 155722 25673 -21467 98943 223676 247959 310780
12690 310780 330316 282043 331208 383023 339813 315473 479585 634041 635908 845667 951542
12679I51542k64228k93077Q997l1510j74636j4632P2890L0495J38928J47473J01428
12668F73670K6167p3441j04620j75203k16660k67963j90769j18757j2144L05357
12658a54363K91345R4927Q6743R2085l5067k86210j57407L1854l6123j4878O535
12647h0559J16328K5344j44468j56344O7780N7760j10685r0024J42977K21961
12637E0070p3721j83310r8619L0312L4257k4284P5494J91663N7320m0563J22478
12626A41097K21913Q9435R2768J33912l9445j14503m8078j05381j11782k5057
12616B34879K2754j07592j29740j53077M4250J94003K24736J35566L2454j57838
12606C40395l36409j25943L4688J6054l2647o4084k0616J61841K65261R5457j2812
$$ plain form
12679 951542 687314 394237 403234 371724 197088 182456 255346 285841 424769 572242 673670
12668 673670 699837 626396 521776 346573 129913 -138050 -328819 -447576 -459720 -154363
12658 -154363 136982 231909 318652 410737 375670 89460 -67947 -36093 -72216 -87094 -80559
12647 -80559 35769 61113 -83355 -239699 -171919 -114159 -224844 -314868 -171891 50070
12637 50070 -23651 -206961 -305580 -275268 -241011 -265295 -189801 1862 59182 18619 141097
12626 141097 363010 452445 545213 679125 639680 525177 477099 371718 259936 234879
12616 234879 257633 150041 20301 -132776 -88526 105477 330213 465779 498233 340395
12606 340395 3986 -121957 -87269 -71215 -103862 -167946 -188562 -26721 238540 333997 321185
12595C21185l7462l1140M4736R5666o185R235q4386j72802j32633k1520J85854
12584A70548K79939J37025k4979k01988k25713M1375J01340J23171J78842M5729
12574F25289L5682J41493K95316J72165N2684L68175N27119M56701O21590L52868
12564C649082m58850q13923o65771o45986n09412k18147j17127o6190r8487O3110
12554A18299K53514J72409K01932M6988o1122q0161J253P8175Q0403j26019J41505
12543H27176K05903P8418K44416K29016L96977M18467M27869P64961R16634J311679
12533E821516K192739K645145J566529j142177k695697k284692j538964j009309
12525C555090p54067p01622n40224L655M495k32197k59307k09289K0823j18748
$$ plain form
12595 321185 283723 252583 297319 392985 386800 396035 311649 138847 6214 -15306 170548
12584 170548 450487 587512 562533 360545 134832 176207 277547 400718 579560 625289
12574 625289 660971 802464 1097780 1269945 1322629 1690804 2217923 2674624 3296214 3649082
12564 3649082 3190232 2376309 1710538 1064552 555140 336993 219866 153676 55189 118299
12554 118299 371813 544222 746154 793142 732020 651859 653112 731287 811690 685671 827176
12543 827176 1033079 1111497 1355913 1584929 1981906 2400373 2828242 3593203 4509837 5821516
12533 5821516 8014255 10659400 12225929 11083752 8388055 6103363 4564399 3555090
12525 3555090 2801023 2099401 1559177 1562832 1567327 1335130 1075823 866534 887357 768609
12515G68609j23290L9936j09517q8566p0222j34484o705l6695r3019j05528N0486
12504I1005J90257J59177J4335k38794j83547j47615j02685J42373J25110K9866
12494G9482Q341N5169J53688j37747n9741J65536o0182k77319M9792K29372J19828
12483C26219q683J4843o5785l1275o0506k34364k17055j57176p9317r9785n2569
12472f65453K11476M62701K16135n9320j13762j7147N6116P2052p3764j41709
12462e2675q1832K6058K15311L12603M8684k47255k94140P9235J47378j27579
12452B5788j50976j89331j48796J51530J65453J64237K91017J6961k1948K33686
12442E37621J77208o6869j20581j38897j41222k5748k5742j15885J1790K9438
$$ plain form
12515 768609 645319 685255 575738 487172 416950 282466 275761 239066 146047 40519 91005
12504 91005 281262 440439 454774 215980 32433 -115182 -217867 -75494 49616 79482
12494 79482 87823 142992 296680 158933 99192 264728 204546 -72773 -22981 206391 326219
12483 326219 317536 332379 266594 235319 174813 -59551 -276606 -433782 -513099 -612884 -665453
12472 -665453 -453977 8724 224859 165539 51777 34630 90746 162798 89034 -52675
12462 -52675 -134507 -108449 106862 419465 468149 220894 -73246 5989 153367 25788
12452 25788 -125188 -314519 -463315 -311785 -146332 17905 308922 325883 303935 537621
12442 537621 714829 647960 527379 388482 247260 221512 195770 79885 91675 121113
12432A21113K2883J125l5789j28092k78999r4123J73375J51618L9482J3749j83435
12421a97093j60521K6633J20766l0899J71086J04167j38889P4314j56104M9609
12411a36931K60946J45860J22464j9129L8846J56729K09347m0024k66622k08896
12401B62590l4081J70111L62622K84755N0793j64838k19093j57695r2660m6961
12391D15543R3670q8497j24666M9769o315j06010k18022q0539j71171r4854J69250
12380a61842J86047R1105q425l1549j2198j4437P8718J46925R244J09126N0812
12369D43526J21767K11955L9800J10224J45172o1503l77142m33606j11956R2036
12359A80273J00186J98195J8741l01772k28658K2196J78115P4445o4481k73190
$$ plain form
12432 121113 143996 145121 109332 -18760 -297759 -391882 -218507 -66889 -27407 -13658 -197093
12421 -197093 -357614 -330981 -210215 -241114 -70028 34139 -104750 -30436 -186540 -136931
12411 -136931 124015 269875 392339 373210 412056 568785 778132 738108 471486 262590
12401 262590 228509 398620 761242 1045997 1096790 931952 712859 555164 462504 415543
12391 415543 509213 420716 296050 345819 339504 233494 15472 -65067 -236238 -331092 -161842
12380 -161842 24205 115310 106885 75336 63138 48701 127419 274344 283588 392714 443526
12369 443526 565293 777248 817048 927272 1072444 1010941 633799 200193 88237 180273
12359 180273 280459 478654 497395 195623 -33035 -10839 167276 241721 177240 -95950
12349i5950j42112n903p9621L396J08359J02098m1023j24705L4520P2918Q0483
12338h7540J90103K15314J39146P9945p5656M0813J50437K9246j70560j74419
12328C36829k18076L8812J11208r7611j86610m16242j19209J21953Q8966M1000
12318b98980K9830j8534L1083K27284j33913k50333r191J18992Q7522k7755j66493
12307d10488m340P2386j2063o3895o1204P8859J33792J58826L44O9003k221m1739
12295h2740m4415K43563J80180q9892j41874n1176O6096M5849p2502j27353j741
12284g6005j02253n9086O1274M6823j18683j23146k605J16947J67947K55054J03127
12273B69394k32483k81401j4631n9012r3994j63951r2692K15651J94153J38752
$$ plain form
12349 -95950 -238062 -243965 -323586 -320190 -211831 -109733 -150756 -275461 -240941 -168023 -87540
12338 -87540 102563 317877 457023 536968 461312 502125 652562 681808 511248 336829
12328 336829 118753 157565 268773 171162 -15448 -431690 -550899 -428946 -339980 -298980
12318 -298980 -269150 -287684 -256601 -29317 -163230 -413563 -422754 -303762 -216240 -243995 -410488
12307 -410488 -414828 -342442 -354505 -418400 -479604 -400745 -266953 -108127 -107783 -38780 -41001 -82740
12295 -82740 -127155 116408 296588 206696 64822 13646 79742 125591 53089 -74264 -76005
12284 -76005 -178258 -237344 -176070 -129247 -247930 -371076 -373681 -256734 -88787 166267 269394
12273 269394 36911 -244490 -259121 -318133 -412127 -576078 -668770 -453119 -258966 -120214
12263a20214K75576K72563N4372r0844j98857l46975l16989j03322K63241K19177
12253i2272P2969J09430n447l3943l2239j12031j01269j42821j09297o6338K13935
12242b99323L61986K00335O2364J1292j7449k3436l25658l06658j6095j2471j53747
12231e18860R1423K64363O8978j56624j12208n1565j16867R6227M19340J19976
12221A04183p9938j00257n1268J03072Q9031J0550j53779j07544r6818j08936
12211c91704J18704J2514L1257J3191N557q063j91392M751J38273K92345J39409
12200A64842q4014j89632k43194j39746M6531K17833K72072M8736J3592j31597
12190b4577k23526k27267j10522J30607L28876J83628n7837j01859j6498J88649
$$ plain form
12263 -120214 155362 427925 482297 391453 192596 -154379 -471368 -574690 -311449 -92272
12253 -92272 -19303 90127 84680 50737 18498 -93533 -194802 -337623 -446920 -513258 -299323
12242 -299323 62663 262998 325362 336654 319205 295769 -29889 -336547 -352642 -365113 -518860
12231 -518860 -427437 -163074 -94096 -250720 -362928 -414493 -531360 -435133 -15793 104183
12221 104183 24245 -76012 -127280 -24208 64823 75373 -78406 -185950 -282768 -391704
12211 -391704 -273000 -260486 -229229 -216038 -210481 -218544 -409936 -405185 -266912 25433 164842
12200 164842 80828 -108804 -351998 -491744 -445213 -227380 44692 93428 107020 -24577
12190 -24577 -248103 -475370 -585892 -455285 -126409 57219 -618 -102477 -118975 69674
12180F9674K52233q1780j97819k92005j07418J12618L22315K1490k32821j83062
12170c16575q2763R0753J16240J17187K23223K18730P292j93211m5553k15196
12160g9873l8393J48074j4077N9904P6391j1660l9037J01156K05211N7975o3348
12149D02323j03941j73158l31804K2402K20347L6324M8001J8188P9221Q9124O3300
12138C70327M4870l04322j47132R8422K735K5192q967J06213M1049j80674j66481
12127a18768j70463r9203K04520K30467J37321J96134O9281l22725k56184J29789
12117A69K11518J66681J04963r2235j45847n3433L5797j0942P1637J18668K0917
12106D27893j84866j27906J45622k6703j63802J26314L64630J26735j49575q7462
$$ plain form
12180 69674 321907 240127 42308 -249697 -357115 -244497 77818 99308 -133513 -316575
12170 -316575 -399338 -308585 -192345 -75158 148065 366795 374087 180876 135323 -79873
12160 -79873 -118266 29808 15731 75635 152026 140366 101329 202485 407696 465671 402323
12149 402323 298382 125224 -206580 -184178 36169 72493 120494 138682 217903 307027 370327
12138 370327 415197 110875 -36257 62165 64900 90092 81125 187338 228387 47713 -118768
12127 -118768 -289231 -388434 -183914 46553 183874 380008 449289 126564 -129620 169
12117 169 211687 378368 483331 391096 245249 191816 227613 216671 288308 406976 427893
12106 427893 243027 115121 260743 234040 70238 196552 561182 687917 538342 450880
12096D50880L2292J67625l172l62698k37343K4805J12431k89K9145J16232k8669
12085C01239q4345j71181r0291j06904j45243j19931R9485R9253l6204R6229K1546
12074a36347j46918j4323J49602J30277J24913L6680j19382p7105r7524j64821
12064c14948J77155R6838n9962q0262q1469J96246K96001Q7767j48582k71712
12054a02928r9874K20845Q6361k5898K4198k67894k49081K2386J87061Q6198J23793
12043E167J76362K06562j5839k41536k06629J49618l9784j96963j32367n1445
12033c46854O3973j18353k94819r0338J92066K92786K07364K35770J33575o4718
12023B10452j27994j30767j87611o1791P2671m9686q1451P9592K64934K3714L3395
$$ plain form
12096 450880 483172 650797 647625 284927 47584 72389 184820 184531 213676 329908 301239
12085 301239 216894 45713 -44578 -151482 -296725 -416656 -317171 -217918 -254122 -157893 -136347
12074 -136347 -283265 -297588 -147986 -17709 107204 143884 24502 -52603 -150127 -314948
12064 -314948 -137793 -40955 -100917 -181179 -262648 -66402 229599 317366 168784 -102928
12054 -102928 -202802 18043 104404 78506 102704 -165190 -414271 -391885 -204824 -118626 5167
12043 5167 181529 388091 372252 130716 -75913 73705 33921 -163042 -295409 -346854
12033 -346854 -282881 -401234 -696053 -786391 -594325 -301539 -94175 141595 275170 210452
12023 210452 82458 -48309 -235920 -297711 -225040 -274726 -356177 -276585 -11651 12063 45458
12012D5458K2613j53863p6162j0085J758O3456M8263j10704n6657R0061j00452
12001b36314k6140N9914Q0905K13866P0323j95763j21715O750K19885J58971r9074
11990A31608k19973L3113O2109j51951o9209J46551Q1984k13024j0405J26639
11980h2558J6635J00702j9435j14956o1845P883j0031J00525Q5143j17797k0862
11969a16596O8190J2711j01971j08098K8112l9207j11663p1594K36441L19985
11959A16310O9744O3583J97089M0871k4726J8060j21821j53454O7100K03275K82815
11948G58846r9050r361m5138j36543j88998k60760j80878p5247J83697K53118
11938A99686K37917K49754L18273L73664K80580K01944L31236N27887N68824O50921
$$ plain form
12012 45458 68071 -85792 -161954 -172039 -170281 -106825 -58562 -169266 -225923 -135862 -236314
12001 -236314 -262454 -202540 -121635 92231 162554 -33209 -154924 -148174 71711 230682 131608
11990 131608 -88365 -55252 6857 -145094 -214303 -67752 14232 -198792 -209197 -82558
11980 -82558 -65923 34779 15344 -99612 -161457 -153574 -163605 -63080 22063 -95734 -116596
11969 -116596 -48406 -35695 -137666 -245764 -217652 -256859 -368522 -440116 -203675 116310
11959 116310 186054 249637 446726 487597 462871 480931 359110 205656 272756 476031 758846
11948 758846 659796 650435 605297 468754 279756 18996 -161882 -237129 -53432 199686
11938 199686 437603 687357 1005630 1379294 1659874 1861818 2193054 2720941 3289765 3940686
11928C940686P88080J073206J197105J051278O47023k27145n88769q64402r97035
11919F020027p78368p44156q65662n28461m08131l91596k03650k04009l31498
11910A564496l60748k89254k09437r1450Q9041l1252j56187q9259p3748j77360
11900A74842p2093O2530J94328J69854l622j4334K9235m654n4657Q8008l010K8746
11888E95173j02826j49793K8193J38961N722j9863l8785j11448m4843M3765J38111
11877D82367J59624P2099j22023R4701L51696M81868N28742K83399R0967J2803
11867B436243j61984p83049p00807l10746k9520o172J52686J09736j64542k08126
11857C33719j91410o6911l4015L9649L8461K76772K57674Q7281m1530K0853j26254
$$ plain form
11928 3940686 4728766 5801972 6999077 8050355 8697378 8470233 7881464 7017062 6020027
11919 6020027 5241659 4497503 3631841 3103380 2695249 2303653 2100003 1895994 1564496
11910 1564496 1203748 914494 705057 613607 702648 671396 515209 425950 352202 174842
11900 174842 102749 165279 359607 529461 525839 511505 540740 536086 481429 569437 566427 595173
11888 595173 492347 342554 370747 509708 515430 495567 456782 345334 300491 344256 482367
11877 482367 641991 714090 592067 686768 1038464 1520332 2049074 2332473 2423440 2436243
11867 2436243 2274259 1491210 790403 479657 450137 443965 596651 706387 541845 333719
11857 333719 142309 75398 41383 81032 119493 396265 653939 741220 699690 720543 594289
11846E94289k09443j47457r6500j25622j14673m2212K5888K8861n8484m3860L259
11835a85954O58q2463R6738R8854J8409o9289J7400J05404M181o6159L3536j3473
11823d2158j07081L8049M7853j3548K4588L8327J57533Q3333L4276K0833k8943
11812B53062q0809j28053k37634k27365p0659k0038J04061J14321K03364J88845
11802I9095N8491m6764l6095j94415k07521j7641K39490L80590j3502k67981j19848
11791a26101r996K76595K01321J41727J59414J47743q2108j45829j69243j45361
11781B48162j98049j62396K3689J74028K43749k8795j77653K6701K46228K09703
11771F05367Q3080N2902K07292J59434J8168o15949o37720j26424J20272l2923
$$ plain form
11846 594289 384846 237389 140889 15267 -99406 -141618 -115730 -86869 -145353 -189213 -185954
11835 -185954 -185296 -267759 -171021 -72167 -53758 -123047 -105647 -243 3938 -62221 -28685 -42158
11823 -42158 -149239 -111190 -63337 -76885 -52297 -13970 143563 226896 261172 282005 253062
11812 253062 172253 44200 -193434 -420799 -491458 -511496 -407435 -293114 -89750 99095
11802 99095 157586 110822 74727 -119688 -327209 -344850 -105360 275230 261728 -6253 -126101
11791 -126101 -136097 140498 341819 483546 642960 790703 708595 562766 393523 248162
11781 248162 50113 -112283 -88594 85434 329183 300388 122735 149436 395664 605367
11771 605367 688447 741349 948641 1108075 1126243 510294 -127426 -253850 -133578 -166501
11761a66501o4796O6001J44312J84658M642r7342j31114K3627J72080J26075M5075
11750C06717Q9702J13635j16391j84055k18418j74048J2802k215J053O1350L4802
11739g5066m8467J65471J83877L6053J00046k5228j14492j33297J39300L0968
11729B59165n4303M7138q0957p6893j434M6008r780r0948k9744M2303N9178k3568
11717H6165j50588o2170o2211k14295k49477l238P4398J64426k0238j49627o765
11706e93620J45668J69082K34644J05595m5406P2820J27936P4915r4225j35943
11696F1466o2156J39737J35609k73518l21238k288K45221K89331K12941m0629
11686C84476l6858j04205J3019k8293j12071p9813q9084l1979J01368J15624o9775
$$ plain form
11761 -166501 -231297 -165296 -20984 163674 168316 70974 -60140 -36513 135567 261642 306717
11750 306717 396419 510054 393663 209608 -8810 -182858 -170056 -172271 -171218 -109868 -75066
11739 -75066 -123533 41938 225815 261868 361914 336686 222194 88897 228197 259165
11729 259165 204862 252000 171043 94150 92716 138724 128944 37996 8252 50555 109733 86165
11717 86165 -64423 -126593 -188804 -403099 -652576 -655814 -581416 -416990 -437228 -586855 -593620
11706 -593620 -447952 -278870 -44226 61369 15963 88783 216719 291634 197409 61466
11696 61466 -690 139047 274656 1138 -320100 -322388 -77167 212164 425105 384476
11686 384476 347618 243413 256432 228139 116068 36255 -52829 -84808 16560 132184 62409
11675F2409o7780j24696J83386Q4226j81310k8374o4753j85717J28513K23173
11665B9077j4167n5828P9975P9131K05090R5558r2820J8587J53286m6273j64385
11654B87231m1439j10972k58080j28307J22137K25920J67530n1493j69462o1995
11644a8930m5746j09628j73504M2010K05854O1674J20880J91100K45425J89345
11634G08480j26590k04838q7105l03227j58173Q7302O6240J50440k1805k66858
11624a56134l83040j51466K07856J62075J88314P6064N6623Q9617o7781j10131
11614h8003J22352R2807k08158k50795J90187M18533J06276j71822j61943j89614
11604a40180m969J04799j11129k2466R8921J39694o5121k570J62651O2029n8112
$$ plain form
11675 62409 -5371 -130067 53319 137545 -43765 -72139 -136892 -322609 -194096 29077
11665 29077 14910 -40918 39057 118188 323278 418836 326016 344603 497889 451616 287231
11654 287231 245792 134820 -123260 -251567 -129430 96490 264020 212527 43065 -18930
11644 -18930 -64676 -174304 -347808 -305798 -99944 -38270 82610 273710 519135 708480
11634 708480 581890 377052 289947 -13280 -171453 -84151 -17911 132529 110724 -156134
11624 -156134 -539174 -690640 -482784 -320709 -132395 -56331 292 89909 22128 -88003
11614 -88003 34349 127156 -81002 -331797 -141610 276923 383199 211377 49434 -140180
11604 -140180 -145149 -40350 -151479 -173945 -75024 64670 -451 -3021 159630 221659 163547
11593A63547K7723J52749K7870q9000j21978p1096l1020K26802J87688k80382
11583A92903l75766k69833j40574J90397K79847K12957J10143K12j9121j35915
11573D5250j39448n0187M2834R7731K98816J45588j44009j86145p0832O6668p216
11562I9050j06401j0260q830q177O5249K41815N4301j48304r7655k300j8639o1280
11550a431p3474q0774o1241R4382J87024J86213R3385L189n787j8603M0645O0727
11538D24255J57460L51788N47520M76118L51107L93989J99640L33365N18173O05174
11528D358589O62087J004958J180070Q95146L01688m17232r42742j060144q31686
11519E150734o17191o04705l61627k07346m69219m63214l68298l70032j49465
$$ plain form
11593 163547 191270 344019 371889 282889 160911 89815 58795 285597 473285 192903
11583 192903 -182863 -452696 -593270 -402873 -123026 89931 200074 200286 181165 45250
11573 45250 -94198 -144385 -101551 -3820 294996 440584 296575 110430 39598 106266 99050
11562 99050 -7351 -17611 -26441 -34618 30631 272446 326747 178443 80788 78488 59849 -1431
11550 -1431 -74905 -155679 -216920 -122538 64486 250699 344084 347273 341486 322883 363528 424255
11538 424255 581715 933503 1481023 1957141 2308248 2702237 2901877 3235242 3753415 4358589
11528 4358589 5020676 6025634 7205704 8100850 8402538 7985306 7042564 5982420 5150734
11519 5150734 4533543 3928838 3567211 3359865 2890646 2427432 2059134 1689102 1539637
11510A539637K2655P3289p2449k26781q7315r6589k14348o3006L59163K31459
11500A465715J99971Q9119J25531P8863N7078J7881J77959L90973L78953N78078
11490C560121P23841P14838J154529J342590J064700L40189k10043p04476j121692
11481F864597j198458r83987p51249p10691n85279l66227m41273m28909r1003
11472A307521l1166j74225n1387l1573K42248j06624l24711j69184n9068J08934
11462G10765K09000J01725m6417j9401q2719k56044j08876R4985K03808J33809
11452I40635r9496j31851k24879r5316j6723l1081J19583J20266p3607Q3864R8371
11441F89766n6656j74967k32587j50114o2212L3543J14215L769j30895n2750J51967
$$ plain form
11510 1539637 1562292 1635581 1563132 1336351 1249036 1152447 938099 875093 1234256 1465715
11500 1465715 1665686 1754805 1880336 1959199 2016277 2034158 2212117 2603090 2982043 3560121
11490 3560121 4283962 4998800 6153329 7495919 8560619 8900808 8690765 7986289 6864597
11481 6864597 5666139 4682152 3930903 3220212 2634933 2268706 1827433 1398524 1307521
11472 1307521 1276355 1102130 1050743 1019170 1261418 1154794 830083 660899 601831 710765
11462 710765 919765 1021490 975073 955672 872953 616909 508033 603018 806826 940635
11452 940635 841139 709288 484409 389093 372370 341289 460872 581138 507531 591395 689766
11441 689766 633110 458143 225556 75442 13230 46773 160988 164757 33862 -18888 133079
11430A33079J9308k8887m5596j35795j61935m2563J06465N9743n4562N8179P8288
11419a4276L765J92979J98060O3330p7123n0657K19257J47853k27545k58343n7454
11408A39846J58055J82232L0302J79933Q4865L3968j02371j61975j72454N0463
11398D22864O4636k42290j38440N0062n8146o2168l5875J6358K34288Q0886J2026
11387C44201P0749O4767j96137k51873j80133J1988K32191J49782P6552R1496
11377D13583r8013k11422j1626J15739O739J53182L0469j73759q1758p5685J39040
11366B06489K32745J36236K65076M55081M56697L95720L05778K4123l86907o30516
11356A460522m05978j07255k17510q8599J6678j58735k33515K0323J16222k7902
$$ plain form
11430 133079 152387 123500 77904 -57891 -219826 -262389 -155924 -96181 -150743 -92564 -14276
11419 -14276 -10511 182468 380528 443858 366735 316078 535335 683188 455643 197300 139846
11408 139846 297901 480133 510435 690368 775233 809201 706830 544855 372401 422864
11398 422864 487500 245210 106770 156832 98686 36518 643 17001 251289 332175 344201
11387 344201 414950 479717 283580 31707 -148426 -136438 95753 245535 322087 413583
11377 413583 315570 104148 92522 208261 215000 368182 398651 224892 143134 67449 206489
11366 206489 439234 575470 840546 1295627 1752324 2148044 2453822 2477945 2091038 1460522
11356 1460522 1054544 947289 729779 641180 657858 499123 265608 285931 402153 374251
11346C74251j77610j43089o989P9324L9531o1395q4234M9364J14916J94441o999
11335C71511j85577r1624J0882K845n3924j67083j56835K5727J05191l2406j2569
11324a83862K48563J64957J54737j1389l12018k77810m6493R9739M4435P2114
11314d7027N7015Q0633R9468R0222k4263m4288R831j12136k24950p5452L1098
11303a59849J96108P3332l8758l6125j83106j83324J6497K38475j0690j89167
11293b76607q3620m6006P3615J72432Q9937P0861Q562j85939k45118m5583J33746
11282c33720J31034K14488j08131k29775O2027l8261j12547L1550l801j34822
11272e21958j43678Q8212J77384k1753j1832P3024J00313J49033J2890r2313k6258
$$ plain form
11346 374251 196641 53552 46563 125887 165418 104023 19789 69153 184069 378510 371511
11335 371511 185934 94310 105192 108037 54113 -112970 -269805 -244078 -138887 -171293 -183862
11324 -183862 64701 229658 384395 373006 60988 -216822 -263315 -163576 -119141 -47027
11314 -47027 9988 90621 190089 280311 256048 211760 221591 109455 -115495 -190947 -159849
11303 -159849 36259 109591 70833 34708 -148398 -331722 -315225 -76750 -87440 -276607
11293 -276607 -360227 -406233 -332618 -160186 -70249 612 9174 -176765 -421883 -467466 -333720
11282 -333720 -202686 11802 -96329 -326104 -264077 -302338 -414885 -383335 -387136 -521958
11272 -521958 -665636 -577424 -400040 -421793 -433625 -360601 -260288 -111255 -98365 -190678 -216936
11261b16936J55878K15615m7902j10660r4784p7625j95503j03701P2945P9194
11251c23479J71352K55827K43938K6293p5416k39780l15365r2398m3209j63569
11241e55806j16868J99267J77968M4451J14145J29299q9830k15110O5951M7963
11231a98570R9231J44647O56j72399k27663j50493j8847j5514o5838j41052p4765
11220h20607J75151K87634J32239J44364L17452j11458j89355N0079M6047q1833
11210e0287j73369q5646N2604j7834L5056J09416J12469R9406K05245J43421j52464
11199B78017l51462j37862K20598l2030J20314K26918Q1011n9118k10430j73796
11189c7840j07376r4155j64436k5521j0912L0420J25697K16478J88028J11882
$$ plain form
11261 -216936 -61058 154557 106655 -4005 -98789 -176414 -371917 -475618 -402673 -323479
11251 -323479 -152127 103700 347638 373931 298515 58735 -256630 -349028 -392237 -555806
11241 -555806 -672674 -473407 -295439 -250988 -136843 -7544 -97374 -312484 -246533 -198570
11231 -198570 -99339 45308 45964 -126435 -354098 -504591 -523438 -538952 -604790 -745842 -820607
11220 -820607 -645456 -357822 -225583 -81219 236233 124775 -64580 -14501 31546 -50287
11210 -50287 -223656 -309302 -256698 -274532 -239476 -130060 -17591 81815 287060 430481 278017
11199 278017 -73445 -211307 9291 -22739 97575 324493 405504 346386 135956 -37840
11189 -37840 -145216 -239371 -403807 -429328 -440240 -409820 -284123 -67645 120383 232265
11179B32265M5827L009j36869q8047j5866J48959K04445m055P173m8057R1825
11168D40609J51992K0930J96655K50272L18709L47097o070m58809o17614j93001
11158D50770P9854N018l8110j36573j33354j97698j19365l5164j68350p467J88171
11147a12268N0213j11270P2622L84207J61554k21803j71808k2564n3721k79944
11137c04782k75093K0901J86369J87515J54848J43152k5076J6147J31407R7137
11127C32525j08100j36139M3552P6996J50930J58043m3663l03417j38729J12236
11117A44234k4020k48590k32984j03647k1082R7297M7051J48778K31771j17140
11107g8332p3869M5103j4135k55864q0103J26566J09444J52140Q1814j1178P2620
$$ plain form
11179 232265 278092 281101 144232 56185 40319 189278 393723 389668 396841 348784 440609
11168 440609 592601 613531 810186 1060458 1379167 1726264 1720194 1261385 643771 450770
11158 450770 530624 535642 497532 360959 227605 29907 -89458 -124622 -292972 -300439 -112268
11147 -112268 -62055 -173325 -100703 283504 445058 223255 51447 28883 -24838 -304782
11137 -304782 -579875 -558974 -372605 -185090 -30242 112910 87834 103981 235388 332525
11127 332525 224425 88286 131838 208834 359764 517807 474144 170727 31998 144234
11117 144234 120214 -128376 -361360 -465007 -486089 -388792 -341741 -192963 38808 -78332
11107 -78332 -152201 -107098 -121233 -377097 -457200 -330634 -221190 -69050 12764 1586 74206
11096G4206k24076l10509j53808n4479J62426N3032P7317P9347N9174N9913o3870
11085b41327m1600J19809K32355J59906L7218q0525j65373j15385n3368j15465
11075b63755M3009K8967R1468K97455N0480k26629j28596J07494L1244J4795R6869
11064A42801J53949J42376o872q3739j6258R2355R4246k04718l50859k49401k27566
11053e13686j6736N2054Q9940J79967K34336L96495J71185j72571l61071k05109
11043a45196q6394j46966l6993J85593K09446J4936j18025j53845j85040j35019
11033e97503M0166J06818N9974j9375l98J06770K7844M162l466J04500J16187
11022e4321R6934K11700J03829j22152o1098l9792P8421J31600P4249R6142p5956
$$ plain form
11096 74206 -149870 -460379 -614187 -668666 -506240 -453208 -375891 -296544 -237370 -177457 -241327
11085 -241327 -282927 -163118 69237 229143 266361 185836 20463 -94922 -148290 -263755
11075 -263755 -220746 -191779 -100311 197144 247624 20995 -107601 -107 31137 45932 142801
11064 142801 296750 439126 432254 348515 332257 424612 518858 314140 -36719 -286120 -513686
11053 -513686 -530422 -478368 -388428 -208461 25875 422370 593555 420984 59913 -145196
11043 -145196 -231590 -378556 -415549 -229956 -20510 -5574 -123599 -277444 -462484 -597503
11033 -597503 -557337 -450519 -390545 -409920 -410318 -303548 -275704 -271542 -275008 -170508 -54321
11022 -54321 42613 254313 358142 235990 174892 135100 213521 345121 419370 515512 439556
11011D39556j45011L7368o1373q6134q8713j77355J8933O202j38323j54261O7522
11000b81589O5695N315Q1458j8327j99866k20473J8653J22272M8614K6841l4568
10989c85975K13292M10084O5573k36537j7241K2100j21467j64735j02177j01238
10979d18321o2257n5631r5288M7198J00311L1627N8504r0796o0837O7451j5477
10968d93516k7519O6053M398J38882K26929R6273J9241j61049k15302r4360J11774
10957c28196M7925n1065J42282K11968L0280k11342j14825J3841J3205M6045K49233
10946D9351K42310J56223q1296k44933j29756k84170k49528j03534R7846K37579
10936c09908J41165M3923M4652L7135K09908K44765j27337k26240r1186R8850
$$ plain form
11011 439556 294545 331913 270540 184406 95693 -81662 -62729 -56527 -194850 -349111 -281589
11000 -281589 -215894 -210579 -129121 -147448 -347314 -567787 -549134 -426862 -378248 -351407 -385975
10989 -385975 -172683 237401 302974 66437 49196 71296 -50171 -214906 -317083 -418321
10979 -418321 -480578 -536209 -631497 -584299 -483988 -452361 -393857 -484653 -545490 -478039 -493516
10968 -493516 -521035 -454982 -450584 -311702 -84773 11500 30741 -130308 -345610 -439970 -328196
10957 -328196 -280271 -331336 -189054 22914 53194 -158148 -272973 -259132 -245927 -199882 49351
10946 49351 291661 447884 366588 121655 -8101 -292271 -541799 -645333 -547487 -309908
10936 -309908 -168743 -124820 -80168 -43033 166875 411640 284303 58063 -33123 65727
10926F5727K41735P882J32382K63266K7321m8815j79145k36338j54471p4858N2847
10915I7533K0077l1353K895j19355k23633L3863L50365K25469j3148j36245o7369
10904A39099j41384k92659j87506n9398N0578p4225j10453J29650K49626j0673
10894c07345k4151q4555M3655P2507P0138M0289K3999k483J38378K0063r4745
10883a04250j63190p6338J180J23431J870j9468N974J22934L67460M20747J07236
10872G87586j10908k79554k84909j90979j84809l10982k6575L04473R0033j46282
10862c52906m6450R6572J37437p3243j5167K5916R1615J60152K00910K235j88262
10851C8809j15644M7230J79118l4479j94163l11337m9289K48597J42705J50139
$$ plain form
10926 65727 307462 315344 447726 710992 738313 689498 510353 274015 119544 44686 97533
10915 97533 117610 86257 89152 -30203 -253836 -219973 130392 355861 342713 206468 139099
10904 139099 -2285 -294944 -482450 -541848 -491270 -565495 -675948 -546298 -296672 -307345
10894 -307345 -331496 -416051 -372396 -299889 -229751 -189462 -165463 -167946 -29568 -9505 -104250
10883 -104250 -267440 -343778 -342598 -219167 -217297 -236765 -230791 -107857 259603 680350 787586
10872 787586 676678 397124 112215 -78764 -263573 -574555 -601130 -296657 -206624 -352906
10862 -352906 -399356 -302784 -165347 -238590 -253757 -227841 -136226 23926 224836 227071 38809
10851 38809 -76835 -29605 149513 115034 -79129 -390466 -439755 -191158 -48453 101686
10841A01686J45388L1383o4142J4547m6796l93762j80067R156J63060J71924q4847
10830a32470m6747O4763M296p5456p598m1330k6916L9857j98485n3650K57237
10819b16499K52233M2287j46180K03467J43537q6674j9663P3706n0692k35236
10809c9714j35735j05872j37028o8973Q5856L0462j4396L8851J04124k7157m2153
10798c11735j73975M5603j09604o2286K48992K29565J07759O6720q0607o5692
10788a05260O8175R6970j24024j31379j04248Q7653O0680l1607l8596m5244K3133
10777b43747J13956J6605k1772l7455N447o7855J18356P6685r3792J3489K616
10766a17467j32199r9099j6745q3541O1072J49617J049q7337J29439J90483J76530
$$ plain form
10841 101686 247074 278457 214315 228862 182066 -211696 -391763 -382607 -219547 -47623 -132470
10830 -132470 -179217 -114454 -110158 -185614 -193212 -234542 -261458 -221601 -420086 -473736 -216499
10819 -216499 35734 78021 -68159 135308 278845 192171 172508 246214 195522 -39714
10809 -39714 -175449 -281321 -418349 -487322 -401466 -371004 -385400 -346549 -242425 -269582 -311735
10798 -311735 -485710 -440107 -549711 -611997 -363005 -133440 -25681 41039 -39568 -105260
10788 -105260 -37085 59885 -64139 -195518 -299766 -212113 -151433 -183040 -221636 -266880 -243747
10777 -243747 -129791 -113186 -134958 -172413 -166966 -234821 -116465 -39780 -133572 -120083 -117467
10766 -117467 -249666 -348765 -365510 -449051 -387979 -238362 -237313 -324650 -195211 -4728 171802
10755A71802K73340M5216m7298j38956J8402J08124M492J21780J30768p35J1331
10744F98266K951q7368p3825j04043q8318j80342l8512J71970p6687k10304j42071
10733a28283k49997k40726r9129j30027Q7778K74155J04228n5672K10767K36604
10723I698K32681J4144p6781N0250j46621k25780j11913j8592L3603R0218R0894
10712e8199j5151j12174l8087p49m6060q2780k8822l3834r7815m2201o4722k1139
10700f41733Q2135J51657J15098P322M8670N4263j07973p8863J41614R4092j23726
10689b57444j76230R0131L87452L39089p4677j96821k80190k58673m6535J17969
10679c55929J91147J08055N4993K4674m8772k00010j54828L6771j3843L9M1572
$$ plain form
10755 171802 445142 490358 443060 304104 322506 430630 435122 556902 687670 686935 698266
10744 698266 701217 613849 540024 435981 347663 167321 128809 300779 224092 13788 -128283
10733 -128283 -378280 -619006 -718135 -848162 -760384 -486229 -382001 -437673 -226906 9698
10723 9698 242379 256523 179742 229992 83371 -142409 -254322 -272914 -239311 -149093 -58199
10712 -58199 -73350 -185524 -223611 -224360 -270420 -353200 -382022 -415856 -513671 -555872 -620594 -641733
10700 -641733 -559598 -407941 -292843 -285521 -236851 -182588 -290561 -369424 -227810 -133718 -257444
10689 -257444 -433674 -343543 43909 382998 308321 111500 -168690 -427363 -473898 -355929
10679 -355929 -164782 -56727 -1734 22940 -25832 -225842 -380670 -343899 -357742 -357703 -316131
10668c16131J52724J37245j9453M6736J14274Q3143k13657J9273L31911J68155
10658E04220j97270k21721K01488K14001K37047N956r5967Q8548o5370j6770N0167
10647G04329j90270p0529J23431L5528j5927o0589k73072j45822J92200Q0402
10637C79681m916R2262Q6411N8972Q1262J2886P5020K74732K25639N02672N69459
10626B354080K41127K69785N32236R14642J584877K340126L467980N262249N807067
10617B2774169N58162n677306n939135l875833k157308j313352p22302n27497
10609C119598n37865o35598n15877k14820j46889j20741O1133K01530L14399R3917
10599A618787k02522l72722j37473q9600k75312j49629l19361k16412q0403M6591
$$ plain form
10668 -316131 -163407 -26162 -45615 1121 115395 198538 -15119 4154 336065 504220
10658 504220 306950 85229 286717 500718 737765 743721 647754 736302 670932 654162 704329
10647 704329 514059 443530 566961 602489 586562 525973 252901 107079 299279 379681
10637 379681 374765 467027 553438 612410 693672 706558 781578 1056310 1281949 1784621 2354080
10626 2354080 2595207 2864992 3397228 4311870 5896747 8236873 11704853 16967102 22774169
10617 22774169 23332331 17655025 11715890 7840057 5682749 4369397 3647095 3119598
10609 3119598 2581733 1946135 1430258 1215438 1068549 947808 1008941 1210471 1524870 1618787
10599 1618787 1416265 1043543 906070 816470 541158 391529 72168 -144244 -224647 -178056
10589a78056Q198l0502j6510J7031K00658K92206L17794K3400k09597l00801r4910
10578B8911j7822j67160q1578m8516J36255J48584K49016M3842j49447k91925
10568a49840k2685Q7295j8906p7745N5892R5298k0946L2558O078J03648P6461
10557A67108k05487j07513Q4428N0667j59838n9300K71845K93483k2161j28488
10547A84744k4762k6692J77502J69990k43292j08550p2740l34276j22869J53775
10537b47170K17645J41007j07825l00405l4811K25220K05901J32901P8268p1080
10527B39651l46204l04306j90446j11934R076j47623J7320J79446J17602J76903
10517c60515L29162R1034k71088n4520J78878K29895J37185O9156p9153k34812
$$ plain form
10589 -178056 -169858 -200360 -216870 -199839 819 293025 610819 634219 424622 123821 28911
10578 28911 11089 -156071 -237649 -286165 -149910 -1326 247690 291532 142085 -149840
10568 -149840 -172525 -85230 -104136 -181881 -125989 -30691 -51637 -19079 -13001 90647 167108
10557 167108 -38379 -145892 -61464 -10797 -170635 -229935 41910 335393 313232 184744
10547 184744 159982 133290 310792 480782 237490 128940 56200 -278076 -400945 -247170
10537 -247170 -29525 111482 3657 -296748 -331559 -106339 99562 232463 310731 239651
10527 239651 -106553 -410859 -601305 -713239 -704163 -851786 -834466 -655020 -537418 -360515
10517 -360515 -31353 59681 -211407 -265927 -87049 142846 280031 349187 270034 35222
10507C5222j76410q9273K98O0115q5800j32144M596J34443j72826j70322P2067
10496e20034R489J95778K33669P4418k1067j53195k25515j61145P1361N109q2366
10485e73498o994J77432J49211K0044m5907p9221P3244L04307J58353k20556q9822
10474a33407Q5914P9271J07100O7540p7985j28772k8782J30548K52642J4517l01392
10463F7194k51950j5136J84011L59265K91431r9927k19233n2511Q7087J34532
10453D84763j7479o7728k21368k94047j43249J67561K57651K57713j8829k63803
10443A41185l9603K8550J72316K48891q7277j81013K28859L24349l9893p8846
10433G17518J47217L60188M73230N52450N77083K99949k77798p30108o15175m93383
$$ plain form
10507 35222 -141188 -230461 -230163 -170048 -255848 -387992 -383396 -248953 -421779 -592101 -520034
10496 -520034 -510545 -314767 -81098 -6680 -27747 -180942 -406457 -567602 -496241 -491132 -573498
10485 -573498 -580492 -403060 -253849 -233805 -279712 -358933 -285689 18618 176971 -43585 -133407
10474 -133407 -47493 31778 138878 206418 128433 -339 -29121 101427 354069 368586 67194
10463 67194 -184756 -199892 -15881 343384 634815 534888 315655 263144 350231 484763
10453 484763 467284 399556 178188 -115859 -259108 -91547 166104 423817 404988 141185
10443 141185 101582 130132 302448 551339 464062 283049 511908 836257 796364 717518
10433 717518 864735 1224923 1698153 2250603 2827686 3127635 2849837 2119729 1504554 1011171
10423A011171m58532j88865j72429L1053J28523K7643j09807j57935p8825k14721
10413a82724k66648j64890j09191m5599J65860J0723J484J85351J58867J7499
10403b29268K73130J88414j15659j01013m8413J51300L8291o7964j69528k41537
10393c22247l8380M2492R78R0989P6656J25977j30867j56395Q2438L3795n769
10382b00333k6288m3839O8918J43627J7367k8134k5276j85867j81658N524J12048
10371c43911O9668N4104K51461J29659j43006j54072N4549J26200j57018j58638
10361b71004J49814J33666O9575l1629l25423l19660o4629J1645L61465L37394
10351E1214j32374j65238J5588Q9741J5669n3605J9159O063j57263q4626J84732
$$ plain form
10423 1011171 552639 363774 191345 222398 350921 378564 268757 110822 31997 -182724
10413 -182724 -449372 -614262 -723453 -769052 -603192 -592469 -590985 -405634 -246767 -229268
10403 -229268 43862 232276 116617 15604 -32809 118491 156782 88818 -80710 -322247
10393 -322247 -360627 -318135 -317157 -226168 -149512 -23535 -154402 -310797 -228359 -194564 -200333
10382 -200333 -226621 -270460 -201542 -57915 -40548 -68682 -93958 -279825 -461483 -455959 -343911
10371 -343911 -274243 -220139 31322 160981 17975 -136097 -81548 44652 -112366 -271004
10361 -271004 -121190 12476 82051 50422 -275001 -594661 -659290 -647645 -286180 51214
10351 51214 -81160 -246398 -230810 -141069 -125400 -179005 -159846 -153783 -311046 -395672 -210940
10340b10940L60946L64520n4421k86193o8072J19346j04986j37907j16259M906
10330a29060J05615J14593J10929J03171o9791j84585j21870j10716k23661J0046
10320c95329R8090p3757j4352K56206J85100K153N2900J02946j4945j14819o5886
10309A8307n0387O1089J18300J09920k9181k42123k23057J69684K61757J07085
10299C01394J60144R0113J069j8302j22948l55221l18826p0392J8563P3992o986
10288b47400j38757j65029L5452K66399L57879O5593p8897k21513k73593q0358
10278d80224q6311o221l975J93050L16650o0181k25418l56065j73600J15639L98509
10267c68147M67688K39657N8557r3142r3644j14921k89777p0577M10820J80205
$$ plain form
10340 -210940 150006 514526 460105 173912 105840 225186 120200 -17707 -133966 -129060
10330 -129060 -23445 91148 202077 305248 235457 50872 -70998 -181714 -405375 -395329
10320 -395329 -297239 -370996 -385348 -129142 55958 58111 111011 213957 199012 84193 18307
10309 18307 -32080 29009 147309 257229 228048 -14075 -237132 -67448 194309 301394
10299 301394 461538 551651 552720 534418 411470 56249 -262577 -332969 -314406 -240414 -247400
10288 -247400 -386157 -551186 -515734 -249335 108544 174137 95240 -126273 -399866 -480224
10278 -480224 -566535 -572756 -576731 -383681 -67031 -127212 -352630 -708695 -882295 -766656 -368147
10267 -368147 99541 339198 397755 304613 210969 96048 -193729 -264306 146514 326719
10257C26719K6245J43673j64925k74833k3730k69j71143j69339k6040L7045K29109
10246f7488K39302j01433j09528L5603J04936J44100j4583L6159J51588J0105
10236D28761j02996m9265r5984j63113p2990q1034l00190j58707L01971M56845
10226A63298Q7397Q3779J63550j23997k48447o6913o9006K7676J47668p3168j67887
10215g6050p6302J13587J58823J07116Q2439j7091j13301k22711j79485j21064
10205c44039j70647N1079K51731m4109k17902O4514K34135Q3651P467O101O6008
10194a2011O4599m5639K5379J08447k5725k20422j22263P5560M49m2922q8640
10183b83188k20086j059J86755j776M3363J91741k9883k35801k6098J26344K03713
$$ plain form
10257 326719 352964 496637 331712 56879 33149 32880 -138263 -307602 -333642 -296597 -67488
10246 -67488 171814 70381 -39147 -3544 101392 245492 230909 267068 418656 428761
10236 428761 325765 276500 180516 17403 -55587 -136621 -436811 -595518 -293547 163298
10226 163298 250695 334474 498024 374027 125580 58667 -10339 17337 165005 91837 -76050
10215 -76050 -152352 -38765 120058 227174 309613 292522 179221 -43490 -222975 -344039
10205 -344039 -514686 -463607 -211876 -255985 -473887 -409373 -175238 -91587 -84120 -78019 -12011
10194 -12011 52588 6949 32328 140775 115050 -105372 -227635 -152075 -151626 -194548 -283188
10183 -283188 -503274 -504333 -317578 -319354 -275991 -84250 -114133 -349934 -376032 -249688 -45975
10172d5975r723k4668L24739L52230L1202N196R4824n1028j35800j16962j50503
10161B73532k55556l14787j99822m0145m0807J44555M34018O6191k31205p0245
10151b34271J92677J27232j01170m9947Q416Q2775j29747K9370R7418N7582p1809
10140H526Q7698J19716N854j29203j16001J63592J69499K45182J11928l6445o4283
10129E66063r9177N6915n5359k00974O2870J00410L1054l0153J8628l644J66397
10118F13030M39202L64487K46027J39962K47541L71672M03054N93008Q14058J247073
10108E479114J770958K215743K694169K771455K30060k596484k939934k152814
10100G472267j382979q43275p17191o80351k42086m7171p0290j22287J14552K16469
$$ plain form
10172 -45975 -55698 -80366 244373 596603 627805 633001 727825 676797 540997 424035 273532
10161 273532 17976 -296811 -496633 -536778 -577585 -433030 988 67179 -164026 -234271
10151 -234271 -41594 85638 -15532 -65479 -57063 25712 -104035 -74665 22753 80335 8526
10140 8526 96224 215940 221794 92591 -23410 140182 309681 554863 666791 630346 566063
10129 566063 466886 523801 468442 267468 330338 430748 461802 431649 450277 446633 613030
10118 613030 1052232 1416719 1662746 1802708 2050249 2421921 2824975 3417983 4232041 5479114
10108 5479114 7250072 9465815 12159984 14931439 15161499 12565015 9625081 7472267
10100 7472267 6089288 5246013 4528822 3848471 3606385 3559214 3488924 3366637 3481189 3697658
10090C697658J15036l2289m20358n14839n43967n25403l33747j83477m2102j52749
10080A063763k31596j11552j01215L2759R7520J62063J70368j44257n3663N1031
10070I35221k80424l18736n9486M0183k7925j10406L1732R6571o4581o5098R726
10059A86777K7206J32093J562j36080j72384j68179k01453O3481L8674j33530
10049c61833j7185J62113J45385k4729p2668J80399K36030Q6927J4348j58477
10039A90310k59112j78240J18996N7875j45515j22917J8956K7917J13529J48146
10029c0055R1107O1341N5545n4778o2177j58678j05149L62831L36925k00436k99944
10018c468j21717r0089J7602K08528j57271l34416M5625K36985O3344N4271K08857
$$ plain form
10090 3697658 3812694 3780405 3360047 2845208 2301241 1775838 1442091 1258614 1216512 1063763
10080 1063763 832167 720615 619400 652159 749679 911742 1082110 937853 884190 935221
10070 935221 654797 336061 276575 316758 288833 178427 210159 306730 242149 177051 186777
10059 186777 213983 346076 347638 211558 39174 -129005 -330458 -266977 -228303 -361833
10049 -361833 -379018 -216905 -71520 -96249 -168917 11482 247512 334439 348787 190310
10039 190310 -68802 -247042 -128046 -70171 -215686 -338603 -319647 -291730 -178201 -30055
10029 -30055 61052 122393 177938 123160 60983 -97695 -202844 159987 496912 296476 -3468
10018 -3468 -125185 -215274 -197672 10856 -146415 -480831 -435206 -198221 -134877 -80606 128251
10007A28251J05752j43116p5105L8748k08996j12346J55969l5857k04377k72111
9997f23188k02869k6075J45848K92247M19306K49384L0858n6627j02366j00544
9987B5974q7321J02128Q3009k1235n1040m3880P1602J12843L0573L9835n9976
9976B02512j82240j68449k07182k21690N646P2985L01917K11764k65680j16754
9966c67171Q8413J45074K96308J40756k30593j13214K08368J79462O129m0124
9956C13408n4766k87224k08516J40683K05462Q2285j37441k26669m2750J38879
9946g6649Q6060k913J16989L3223n6212j24728r8442k5924J33590j32776j9612
9935a67394K4568o8245k8030o0874j07650m1747P8876L34907L04398K46565Q8851
$$ plain form
10007 128251 234003 90887 15782 54530 -154466 -266812 -110843 -146700 -351077 -623188
9997 -623188 -826057 -852132 -706284 -414037 5269 254653 285511 228884 126518 25974
9987 25974 -61347 40781 123790 102555 51515 7635 79237 192080 222653 262488 202512
9976 202512 20272 -148177 -355359 -577049 -571403 -498418 -196501 15263 -250417 -367171
9966 -367171 -278758 -133684 162624 303380 72787 -40427 167941 347403 353532 313408
9956 313408 258642 -28582 -237098 -96415 109047 191332 53891 -172778 -215528 -76649
9946 -76649 9411 6498 123487 156710 100498 -24230 -122672 -148596 -15006 -147782 -167394
9935 -167394 -142826 -211071 -239101 -299975 -407625 -449372 -370496 -35589 268809 515374 604225
$$ [...]
##END NTUPLES=NMR SPECTRUM
##END=
