##TITLE=C13_SL64-SPh(1)-f3-4
 CDCl3, 27200 sc

 14.11.2019
##JCAMPDX= 6.0         $$ Bruker NMR JCAMP-DX V2.0
##DATA TYPE= NMR SPECTRUM
##DATA CLASS= NTUPLES
##ORIGIN= UXNMR, Bruker Analytische Messtechnik GmbH
##OWNER= root
$$ XWIN-NMR		Version 3.5
$$ Tue Jan 15 14:50:40 2019 Russian Standard Time (UT+4h)  she@DPX200
##.OBSERVE FREQUENCY= 50.32789651
##.OBSERVE NUCLEUS= ^13C
##.ACQUISITION MODE= SIMULTANEOUS
##.ACQUISITION SCHEME= undefined
##.AVERAGES= 27200
##.DIGITISER RES= 17
##SPECTROMETER/DATA SYSTEM= spect
##.PULSE SEQUENCE= zgpg30
##.SOLVENT NAME= CDCl3
##.SHIFT REFERENCE= (INTERNAL, CDCl3, 0, 222.661)
##AUDIT TRAIL= $$ (NUMBER, WHEN, WHO, WHERE, WHAT)
$$ ##TITLE= Audit trail, XWIN-NMR		Version 3.5
$$ ##JCAMPDX= 5.01
$$ ##ORIGIN= Bruker BioSpin GmbH
$$ ##OWNER= she
$$ F:/spectra/data/she/nmr/c13/2/pdata/1/auditp.txt
$$ ##AUDIT TRAIL=  $$ (NUMBER, WHEN, WHO, WHERE, WHAT)
(   1,<2019-01-15 14:49:00.31 +0400>,<she>,<DPX200>,
      <created by zg, POWCHK disabled, PULCHK disabled
       terminated by command 'halt'
       configuration hash MD5:
       00 E9 B6 7A A2 85 ED C7 34 08 36 98 17 FE 4E 26
       data hash MD5: 32K
       24 74 69 64 1A 8D B4 55 B0 A8 2B 14 54 70 33 12>)
(   2,<2019-01-15 14:49:04.79 +0400>,<she>,<DPX200>,
      <Start of raw data processing
       efp BC_mod = 2 LB = 1 FT_mod = 6 PKNL = 1 PHC0 = 1447.826 PHC1 = 20.02154 SI = 32K 
       data hash MD5: 32K
       E4 56 FB 41 21 B0 E9 90 D6 BC 93 67 E8 C8 68 47>)
(   3,<2019-01-15 14:49:12.59 +0400>,<she>,<DPX200>,
      <abs ABSG = 5 
       data hash MD5: 32K
       AB FA E2 37 E9 82 72 06 E5 84 F9 01 FB 5B 29 2D>)
(   4,<2019-01-15 14:49:40.73 +0400>,<she>,<DPX200>,
      <pk PHC0 = -4.362989 PHC1 = 0.8000004 
       data hash MD5: 32K
       58 0D 0D 59 28 43 3B 2D 1A D3 54 16 8D EF 06 FC>)
(   5,<2019-01-15 14:49:43.87 +0400>,<she>,<DPX200>,
      <abs ABSG = 5 
       data hash MD5: 32K
       8D A9 D8 9E 92 CA FE 51 91 2B 68 FB 7F E8 3E 82>)
$$ ##END=
$$ 
$$ hash MD5
$$ 4E 85 C2 36 74 D6 37 56 17 3F 47 A1 13 8D 41 9E
##$RELAX= 
##$RELAX= 
##$RELAX= 
##$RELAX= 
##$RELAX= 
##$RELAX= 
##$RELAX= 
##$RELAX= 
$$ Bruker specific parameters
$$ --------------------------
##$DU= <F:/spectra>
##$EXPNO= 2
##$NAME= <c13>
##$PROCNO= 1
##$TYPE= <nmr>
##$USER= <she>
##$AMP= (0..31)
100 100 100 100 100 100 100 100 100 100 100 100 100 100 100 100 100 100 
100 100 100 100 100 100 100 100 100 100 100 100 100 100 
##$AQSEQ= 0
##$AQ_mod= 1
##$AUNM= <au_zg>
##$AUTOPOS= <>
##$BF1= 50.322709
##$BF2= 200.13
##$BF3= 50.322709
##$BF4= 500.13
##$BF5= 500.13
##$BF6= 500.13
##$BF7= 500.13
##$BF8= 500.13
##$BYTORDA= 1
##$CFDGTYP= 0
##$CFRGTYP= 5
##$CHEMSTR= <none>
##$CNST= (0..31)
1 1 145 1 1 1 1 1 1 1 1 1 1 1 1 1 1 1 1 1 1 1 1 1 1 1 1 1 1 1 1 1 
##$CPDPRG= <waltz16>
##$CPDPRG1= <>
##$CPDPRG2= <waltz16>
##$CPDPRG3= <>
##$CPDPRG4= <mlev>
##$CPDPRG5= <mlev>
##$CPDPRG6= <mlev>
##$CPDPRG7= <mlev>
##$CPDPRG8= <mlev>
##$CPDPRGB= <>
##$CPDPRGT= <>
##$D= (0..31)
$$ [...]
##$SUBNAM4= <"">
##$SUBNAM5= <"">
##$SUBNAM6= <"">
##$SUBNAM7= <"">
##$SUBNAM8= <"">
##$SUBNAM9= <"">
##$SW= 239.972172959595
##$SWIBOX= (0..15)
0 1 3 0 0 0 0 0 0 0 0 0 0 0 0 0 
##$SW_h= 12077.2946859903
##$TD= 32768
##$TD0= 1
##$TE= 0
##$TE2= 300
##$TE3= 300
##$TEG= 300
##$TL= (0..7)
120 120 120 120 120 120 120 120 
##$TP= (0..7)
150 150 150 150 150 150 150 150 
##$TP07= 0
##$TPNAME0= <>
##$TPNAME1= <>
##$TPNAME2= <>
##$TPNAME3= <>
##$TPNAME4= <>
##$TPNAME5= <>
##$TPNAME6= <>
##$TPNAME7= <>
##$TPOAL= (0..7)
0.5 0.5 0.5 0.5 0.5 0.5 0.5 0.5 
##$TPOFFS= (0..7)
0 0 0 0 0 0 0 0 
##$TUNHIN= 0
##$TUNHOUT= 0
##$TUNXOUT= 0
##$USERA1= <user>
##$USERA2= <user>
##$USERA3= <user>
##$USERA4= <user>
##$USERA5= <user>
##$V9= 5
##$VALIST= <valist>
##$VCLIST= <CCCCCCCCCCCCCCC>
##$VD= 0
##$VDLIST= <DDDDDDDDDDDDDDD>
##$VPLIST= <PPPPPPPPPPPPPPP>
##$VTLIST= <TTTTTTTTTTTTTTT>
##$WBST= 1024
##$WBSW= 4
##$XGAIN= (0..3)
0 0 0 0 
##$XL= 0
##$YL= 0
##$YMAX_a= 149104409
##$YMIN_a= -35913067
##$ZGOPTNS= <>
##$ZL1= 120
##$ZL2= 120
##$ZL3= 120
##$ZL4= 120
##$ABSF1= 222.6608
##$ABSF2= -17.33601
##$ABSG= 5
##$ABSL= 3
##$ALPHA= 0
##$AQORDER= 0
##$ASSFAC= 0
##$ASSFACI= 0
##$ASSFACX= 0
##$ASSWID= 0
##$AUNMP= <proc_1d>
##$AZFE= 0.1
##$AZFW= 0.5
##$BCFW= 0
##$BC_mod= 2
##$BYTORDP= 0
##$COROFFS= 0
##$CY= -3
##$DATMOD= 1
##$DC= 0
##$DFILT= <>
##$DTYPP= 0
##$F1P= 0
##$F2P= 0
##$FCOR= 0.5
##$FTSIZE= 32768
##$FT_mod= 6
##$GAMMA= 0
##$GB= 0
##$INTBC= 1
##$INTSCL= 1.329259e-09
##$ISEN= 128
##$LB= 1
##$LEV0= 0
##$LPBIN= 0
##$MAXI= 10000
##$MC2= 0
##$MEAN= 0
##$ME_mod= 0
##$MI= 0.9312502
##$NCOEF= 0
##$NC_proc= 3
##$NLEV= 6
##$NOISF1= 120.0001
##$NOISF2= 80.00006
##$NSP= 0
##$NTH_PI= 0
##$NZP= 0
##$OFFSET= 222.6608
##$PC= 1.4
##$PHC0= 1443.463
##$PHC1= 20.82154
##$PH_mod= 1
##$PKNL= yes
##$PPARMOD= 0
##$PSCAL= 0
##$PSIGN= 0
##$REVERSE= no
##$SF= 50.3227302600002
##$SI= 32768
##$SIGF1= 140
##$SIGF2= 120
##$SINO= 35.31775
##$SIOLD= 32768
##$SREGLST= <13C.CDCl3>
##$SSB= 0
##$STSI= 32768
##$STSR= 0
##$SW_p= 12077.2946859903
##$SYMM= 0
##$S_DEV= 0
##$TDeff= 32768
##$TDoff= 0
##$TI= <>
##$TILT= no
##$TM1= 0
##$TM2= 0
##$TOPLEV= 0
##$USERP1= <user>
##$USERP2= <user>
##$USERP3= <user>
##$USERP4= <user>
##$USERP5= <user>
##$WDW= 1
##$XDIM= 32768
##$YMAX_p= 364135131
##$YMIN_p= -1207680
$$ End of Bruker specific parameters
$$ ---------------------------------
##NTUPLES= NMR SPECTRUM
##VAR_NAME=  FREQUENCY,     SPECTRUM/REAL,   SPECTRUM/IMAG
##SYMBOL=    X,             R,               I
##VAR_TYPE=  INDEPENDENT,   DEPENDENT,       DEPENDENT
##VAR_FORM=  AFFN,          ASDF,            ASDF
##VAR_DIM=   32768,         32768,           32768
##UNITS=     HZ,            ARBITRARY UNITS, ARBITRARY UNITS
##FACTOR=    0.368581032318806, 1,           1
##FIRST=     11204.8992329031, 0,            0
##LAST=      -872.395453087158, 0,           0
##MIN=       -872.395453087158, -1207680,    0
##MAX=       11204.8992329031, 364135131,    0
$$ Real data points
##PAGE= N=1
##DATA TABLE= (X++(R..R)), XYDATA
$$ [...]
16055B43824N5228J48707L7149j07339j32979j03783j06902j1376L3232J33369
$$ 243824 299052 447759 484908 377569 244590 140807 33905 22529 55761 189130
16045A89130L8738l59921l31832j36764j47276n2087j7932K78313K98784P005
$$ 189130 227868 -132053 -463885 -600649 -747925 -800012 -817944 -539631 -240847 -233842
16035b33842M0387M663J7121K02075K10758K6862j41751j08637J6979m9714p7088
$$ -233842 -193455 -188792 -171671 30404 241162 268024 126273 17636 34615 -15099 -92187
16024i2187j06836r8217K40389J46318n8208O5812k1554J0913J27975J62824j72529
$$ -92187 -199023 -297240 -56851 89467 31259 97071 75517 86430 214405 377229 204700
16013B04700k65823L4742K70405K33174N8109l7776j90399m10160m57715l21798
$$ 204700 -61123 -26381 244024 477198 535307 497531 307132 -103028 -560743 -882541
16003h82541j98112J28280J44782J23510J43007J5324P454J39071J88564M6477
$$ -882541 -1080653 -952373 -807591 -684081 -541074 -525750 -518296 -379225 -190661 -144184
15993a44184o8467J60548K69306k8701j69687r6914J96498p2275o7605j36324
$$ -144184 -212651 -52103 217203 188502 18815 -78099 118399 46124 -21481 -157805
15983a57805j88173M4575J7161j73409J76437L98696L00934Q0632j74964Q3388
$$ -157805 -345978 -301403 -284242 -457651 -281214 117482 418416 499048 324084 407472
15973D07472l6726j30442M6064M352m0399Q9231J10633r2105r9064J2877p859
$$ 407472 370746 240304 286368 290720 250321 339552 450185 358080 259016 271893 264034
15962B64034k10471j44018O7516J63562N0894J22596J00629k36403o9121J48393
$$ 264034 53563 -90455 -22939 140623 191517 314113 414742 178339 109218 257611
15952B57611j9493J5095o9295j68547k70683j91942J2357j62997j2558L81091
$$ 257611 238118 253213 183918 15371 -255312 -447254 -434897 -597894 -610452 -229361
15942b29361l5843k16894J81350P2965m0957q2104j29288j63485k11380O5053
$$ -229361 -265204 -482098 -300748 -227783 -268740 -350844 -480132 -643617 -854997 -789944
15932g89944K11285J246M1225L36838J34562k20780O1560J57466M8091K4225Q3629
$$ -789944 -578659 -577413 -536188 -199350 -64788 -285568 -224008 -66542 -18451 5774 89403
15921H9403p3353l7478R3100L9374j92216l35616k2082J58784K26860J22709J62749
$$ 89403 16050 -21428 71672 111046 -81170 -416786 -438868 -280084 -53224 69485 232234
15910B32234Q0615j77687j78496j00463l01050k66875J61015K39702K77024K74261
$$ 232234 312849 135162 -43334 -143797 -444847 -711722 -550707 -311005 -33981 240280
15900B40280J6631o633p6293p5944p5188l1571n4597l04624k27105J24363L19801
$$ 240280 256911 250278 173985 98041 22853 -8718 -63315 -367939 -595044 -470681 -150880
15889a50880K00365J74555M5315L7080q2440l00858j97487K09520J13798l0433
$$ -150880 49485 224040 269355 306435 223995 -76863 -274350 -64830 48968 18535
15879A8535k9378m5236K04338K03935K67071J55006j94399j96173o0528J6583
$$ 18535 -10843 -56079 148259 352194 619265 774271 579872 383699 323171 339754
15869C39754j7236l5261L2417k05457m3964K25405L7792J09315J1468j64388j98690
$$ 339754 322518 287257 319674 114217 70253 295658 333450 442765 454233 289845 91155
15858I1155j95823j53412L6006L3886r2709q3995n1657J59728K03790J71655j98477
$$ 91155 -104668 -258080 -222074 -188188 -280897 -364892 -416549 -256821 -53031 118624 -79853
15847g9853k28851J4346r8201L9999K32637J71051J87152n7710j27001j11754
$$ -79853 -308704 -294358 -392559 -352560 -119923 51128 238280 180570 53569 -58185
15837e8185j03937l4779p4291j28091N2457K59181J04532j84299r8670q0978J3747
$$ -58185 -162122 -196901 -271192 -399283 -346826 -87645 16887 -167412 -266082 -347060 -333313
15826c33313J49751J02964M1404J94742M0188l38074l66063k50660l7224J48374
$$ -333313 -183562 -80598 -39194 155548 195736 -142338 -508401 -759061 -796285 -647911
15816f47911K34347M9943j66148k25189k1573J93477K14915J63536K2274m9760
$$ -647911 -413564 -363621 -529769 -754958 -776531 -583054 -368139 -204603 -182329 -232089
15806b32089L4483R9135J00422j09514n0373Q5787J93173J18116j63165j69559
$$ -232089 -197606 -98471 1951 -107563 -157936 -72149 121024 239140 75975 -93584
15796i3584K7184j2445n2410j59195m2796Q9031l022R2229R6608R8676n6203j13886
$$ -93584 -66400 -78845 -131255 -290450 -333246 -244215 -247237 -155008 -58400 40276 -15927 -129813
15784a29813n6473j26588j12511P8358R5792l6840J18251K96321N9471j9393N6647
$$ -129813 -186286 -312874 -425385 -347027 -251235 -288075 -169824 126497 185968 166575 223222
15773B23222J45637J05997J06584J80219R502m12236m98572j67718r200J8369
$$ 223222 368859 474856 581440 761659 771161 358925 -139647 -307365 -316565 -298196
15763b98196K24216J46017j11046k9540K08438l4837k39291k92065j01568J10918
$$ -298196 -73980 72037 -39009 -68549 139889 105052 -134239 -426304 -527872 -416954
15753d16954L4744j2074Q3284M01240L73609J14240l5123P6643o1665l97242l78880
$$ -416954 -382210 -394284 -311000 90240 463849 578089 542966 619609 557944 160702 -218178
15742b18178m5712K12838l3341r0673m4759j1364L8133J58985k7552m0080n3962
$$ -218178 -263890 -51052 -84393 -175066 -219825 -231189 -193056 -34071 -61623 -101703 -155665
15731a55665p9786j33371k18382P4210K16247J81509J5273o3244j80369k26756
$$ -155665 -235451 -368822 -587204 -512994 -296747 -115238 -99965 -163209 -343578 -570334
15721e70334j62421O591R0389J18722J93564K76678J86452K13905J98568N2719
$$ -570334 -732755 -726164 -635775 -517053 -323489 -46811 139641 353546 552114 604833
15711F04833q4002j61551k47717r3791r6222j06503j48842L472J24318K09147
$$ 604833 520831 359280 111563 17772 -78450 -184953 -333795 -330323 -206005 3142
15701C142l1388m3047j31529o7111j6347l4400j92049Q2141N05169K08767M7418
$$ 3142 -28246 -71293 -202822 -269933 -286280 -320680 -512729 -430588 74581 283348 330766
15690C30766J36663O9070n4723o5140k10136n54753k12765J22190J83746K94388
$$ 330766 467429 536499 481776 416636 206500 -348253 -561018 -438828 -255082 39306
15680C9306L9820j64863N6520j6146q8222J67894L3942k0766K4375k67781j04467
$$ 39306 79126 -85737 -29217 -45363 -133585 34309 68251 47485 71860 -195921 -300388
15669c00388J9266R3226K74019K06662j15223m50733l47186P967M2476r7026N0137
$$ -300388 -281122 -187896 86123 292785 177562 -273171 -620357 -612390 -569914 -666940 -616803
15658f16803J37919J40368n1417j59452J12649M9243K5565K72370J44849k1585
$$ -616803 -478884 -338516 -389933 -549385 -436736 -387493 -361928 -89558 55291 33706
15648C3706j2328j88701k37800j81759O76L7437J39029M05935J85273j09620p3443
$$ 33706 21378 -167323 -405123 -586882 -586206 -548769 -409740 -3805 181468 71848 -1595
15637a595j23083R4043K62618P1264j94102k16361n9364P2180K51405J90733J6443
$$ -1595 -124678 -30635 231983 303247 109145 -107216 -166580 -94400 157005 347738 364181
15626C64181q8388j65291j58634o6321R7320L10071P117N3686K26688q8819k28224
$$ 364181 275793 110502 -48132 -114453 -17133 292938 300055 353741 580429 491610 263386
15615B63386r6502j67343q15l3389l856J87576J02793J71868M4698j43856k20574
$$ 263386 166884 -459 -1274 -34663 -38519 149057 251850 423718 468416 324560 103986
15604A03986n8120o7508k0092J14069p160j6409j42411l7706L03964K41800Q1252
$$ 103986 45866 -21642 -41734 72335 65175 48766 -93645 -131351 172613 414413 495665
15593D95665J39652j01163j54838k91008j41296L6990K1665K929j63883k32492
$$ 495665 635317 534154 379316 88308 -52988 -15998 5667 8596 -155287 -387779
15583c87779l3119J8556K50597K70507J84090J21375j03357k33965J92955M22686
$$ -387779 -420898 -402342 -151745 118762 302852 424227 320870 86905 279860 702546
15573G02546J14462j33426k18330k342R1587j7669N4916L0902l45170l59099j94790
$$ 702546 817008 683582 465252 462910 554497 536828 591744 622646 277476 -81623 -276413
15562b76413M706P9842n0884J95978L51037K81690m2448j54224j56374l67712
$$ -276413 -271707 -191865 -242749 -46771 304266 585956 543508 389284 232910 -134802
15552a34802j57076M885J09736O9946p9500q8333q627K23481J85456M8346J08133
$$ -134802 -291878 -286993 -177257 -107311 -186811 -275144 -283771 -60290 125166 173512 281645
15541B81645k6709j34592l65186j25298J04866j02545j35209L5602N9447N0913
$$ 281645 254936 120344 -244842 -370140 -265274 -367819 -503028 -467426 -407979 -357066
15531c57066J30902k3314J38820N3192k13007Q5123J13585j62384k40126p3430
$$ -357066 -226164 -249478 -110658 -57466 -270473 -185350 -71765 -234149 -474275 -547705
15521e47705J8160j3647Q2080K7228J36681K61502J51220j69164j54998J94196
$$ -547705 -529545 -543192 -461112 -433884 -297203 -35701 115519 -53645 -208643 -14447
15511a4447R4490j2850J0128j03805J27630J95318n4597j06446M1259L25083J93402
$$ -14447 80043 67193 77321 -26484 101146 296464 241867 135421 176680 501763 695165
15500F95165k2987m8885l45561k30612K1148N2656j5298q4788j09111J29692O5291
$$ 695165 672178 623293 277732 47120 68268 120924 105626 20838 -88273 41419 106710
15489A06710J94341J59435J6670j40971k55598J27994J25623j44868n7152N7626
$$ 106710 301051 460486 477156 336185 80587 208581 334204 189336 132184 189810
15479A89810k971j23120k52472j84434P4850K38884K32058p1347k66691j7297
$$ 189810 186839 63719 -188753 -373187 -298337 -59453 172605 101258 -165433 -182730
15469a82730R1067L9513j07380J5847K45303J48894M318k7072l8256K4875o6580
$$ -182730 -91663 -52150 -159530 -143683 101620 250514 254832 227760 189504 214379 147799
15458A47799k3301m3762j07575J59776J92389j35287m5893L8341J9753q8557k11349
$$ 147799 124498 80736 -26839 132937 325326 190039 144146 182487 202240 113683 -97666
15447i7666q7994N953P2149J60154K76744K81342l688j15689k9755k55618j57928
$$ -97666 -185660 -179707 -107558 52596 329340 610682 606994 491305 461550 205932 48004
15436D8004N2644p2746Q6335j12863j72581J15068p7259j31180K30090L83852
$$ 48004 100648 27902 114237 1374 -171207 -56139 -133398 -264578 -34488 349364
15426C49364J60880J05647N0932j34883m8658j8504j98126k80851k58233R3568
$$ 349364 510244 615891 666823 531940 483282 464778 266652 -14199 -272432 -178864
15416a78864K00293O4403J5555p0599n0207K9771j9679j43157K4325J21225J52620
$$ -178864 21429 85832 101387 30788 -19419 10352 -9327 -152484 -128159 -6934 145686
15405A45686Q7924L2642M333j05230m3367m5385J30578k73756k12349J57540J43055
$$ 145686 233610 266252 270585 165355 121988 76603 207181 -66575 -278924 -121384 21671
15394B1671M4773j29957j64783j17749k3782K81790L33210J65184L8644o6817
$$ 21671 66444 -63513 -228296 -346045 -369827 -88037 245173 410357 449001 382184
15384C82184j05739j17650O6338j15479j15563K3117R2670j9772o606n4998k10028
$$ 382184 276445 158795 225133 109654 -5909 17208 109878 90106 83500 28502 -181526
15373a81526j0935K06927Q9385j73042k83993p9003K27630J06352l936J30307
$$ -181526 -192461 14466 103851 -69191 -353184 -432187 -204557 -98205 -102141 28166
15363B8166k0816K2418J37357Q2519m5019R8858J66936o9895j01510p3331M9103
$$ 28166 7350 29768 167125 249644 204625 303483 470419 400524 299014 225683 274786
15352B74786L4827J3422K01379j29115l97367j09471j12370k09337j39141J08071
$$ 274786 309613 323035 524414 395299 -2068 -111539 -223909 -433246 -572387 -464316
15342d64316J24619R1365j3693j60957j21372L0390J51287J68691J8195J8275
$$ -464316 -339697 -248332 -262025 -422982 -544354 -513964 -362677 -193986 -175791 -157516
15332a57516j986Q5518K7095j48388K5199J98319j5761J2787P7069q534m3956
$$ -157516 -159502 -73984 -46889 -195277 -170078 28241 12480 25267 102336 93802 49846
15321D9846r4190p9108k54172l14649L2777J69726J04525L01237J18714J672Q5428
$$ 49846 -44344 -123452 -377624 -692273 -659496 -489770 -385245 -84008 34706 36378 121806
15310A21806K85197K8266q0584n5407L2244j38599k4106j11462k4805L19797R1227
$$ 121806 407003 435269 354685 299278 331522 192923 168817 57355 32550 352347 443574
15299D43574q9470K3658j72035k30387p4717l36733j55016K8000J27178J46631
$$ 443574 354104 377762 205727 -24660 -99377 -436110 -591126 -563126 -435948 -289317
15289b89317J72725J11038L9922l5425O9449J18182j98542k54358J3780N2413
$$ -289317 -116592 -5554 34368 -1057 68392 186574 -11968 -266326 -252546 -200133
15279b00133P393P2535J27141J21919P3955N4045N4973p3026N1317J06749J19907
$$ -200133 -192740 -120205 6936 128855 202810 256855 311828 238802 290119 396868 516775
15268E16775l9441j81317r8932K3052j01985j52681K26362J55705j19925j37614
$$ 516775 477334 296017 197085 220137 118152 -34529 191833 347538 227613 89999
15258H9999m972j71802j67827J35666J57719J41895J34508p0689J2901J52414
$$ 89999 85027 -86775 -254602 -118936 38783 180678 315186 244497 257398 409812
15248D09812p686l31226m6960P6714Q926L3072j29899j64146j37415m5258M4471
$$ 409812 402126 70900 23940 100654 109580 142652 12753 -151393 -288808 -334066 -289595
15237b89595Q0346j4719l8191K40414K56984L05325Q8488l57614l77959k02135
$$ -289595 -209249 -223968 -262159 -21745 235239 540564 629052 271438 -106521 -308656
15227c08656k9151n966j13913m3016O6069J32202M0775K20324K94246K9152Q058
$$ -308656 -337807 -343773 -457686 -500702 -434633 -302431 -261656 -41332 252914 282066 290124
15216B90124J36799Q9020j85802k16313j46702r1862n4811M1191P1821J61020
$$ 290124 426923 515943 330141 113828 -32874 -124736 -179547 -138356 -66535 94485
15206I4485K68581R6462k28108j43550r9824p4777k7708k22228Q6527K33412J25981
$$ 94485 363066 459528 231420 87870 -11954 -86731 -114439 -336667 -250140 -16728 109253
15195A09253k1103j26553R978L8285o0560m3791Q9525J16403j32140r0663N2074
$$ 109253 88150 -38403 -28425 9860 -50700 -94491 -4966 111437 -20703 -111366 -59292
15184e9292l1614J13245J85778r717j53975M580J57036J39414l7606o8328K28409
$$ -59292 -90906 22339 208117 198400 44425 49005 206041 345455 307849 239521 467930
15173D67930J42491j55262k58220k66247l9106N4134j24566j80996l8439J77399
$$ 467930 610421 455159 196939 -69308 -108414 -54280 -178846 -359842 -398281 -220882
15163b20882J18139p0101L8166q1620j88661j67947J46743K36648l5515r8222
$$ -220882 -102743 -172844 -134678 -216298 -404959 -572906 -426163 -189515 -225030 -323252
15153c23252j48928j26292Q8472J36374K35531K20404M9276j75183o4021j659
$$ -323252 -472180 -598472 -510000 -373626 -138095 82309 131585 -43598 -107619 -109278
15143a09278q9039j56518j87915J4547K03270K63714J74763J42403M4463n6967
$$ -109278 -198317 -354835 -542750 -528203 -324933 -61219 113544 255947 300410 243443
15133B43443L4985K31193K69391k2356k96521m01878k97555l11627j08458K97154
$$ 243443 278428 509621 779012 756656 460135 58257 -239298 -550925 -659383 -362229
15123c62229J93039N7424r238m7150K95822K09095n7015m5260k09572l09756j90970
$$ -362229 -169190 -111766 -121004 -168154 127668 336763 279748 234488 24916 -284840 -475810
15112d75810K6266M9718l4834m8596j22378N4071K41368O1012o8671K384K30888
$$ -475810 -449544 -399826 -434660 -483256 -605634 -551563 -310195 -249183 -317854 -315470 -84582
15101h4582J56131k86830l10061R4959J24703K43210Q654n5447J67341J09664
$$ -84582 71549 -215281 -525342 -430383 -305680 -62470 -53816 -109263 58078 167742
15091A67742J23967J20798j2072j28836k09878j41222O0289J79596O3201n1450
$$ 167742 291709 412507 400435 271599 61721 -79501 -19212 160384 223585 172135
15081A72135J17893J26056O802l0043R4380Q5165M0030p0000l45927l29874J90950
$$ 172135 290028 416084 422886 392843 487223 572388 612418 542418 196491 -133383 57567
15070E7567k923j09179K34850M2892j66104q9405K02211J28966j45520k86163
$$ 57567 54644 -54535 180315 223207 57103 -32302 169909 298875 153355 -132808
15060a32808j80602j34913J8069P3292J41874L05768N8048m215L7079p7080j23472
$$ -132808 -313410 -448323 -430254 -356962 -215088 90680 148728 144513 181592 104512 -18960
15049a8960p4807P1809o0820K982K25816M0360m1276K5425r8768k33656p1580
$$ -18960 -93767 -21958 -82778 -79796 146020 186380 145104 170529 71761 -161895 -233475
15038b33475Q7218J337r3001r1082q50K6577J47939O6961r4871p7281j29617k5191
$$ -233475 -146257 -144920 -237921 -329003 -329853 -303276 -155337 -88376 -183247 -260528 -390145 -415336
15026d15336q5167J5863J56099J97453M7864r2792m6435J38857J55293n3150Q9409
$$ -415336 -500503 -484640 -328541 -131088 -83224 -176016 -222451 -83594 71699 18549 107958
15015A07958N9450o0666r983j21944j86458k56377j68873J63123M50255M5731
$$ 107958 167408 106742 96759 -25185 -211643 -468020 -636893 -473770 -23515 22216
15005B2216k4407J23956M8636j11642J05299J16421r3968r9880r7760O3906k7131
$$ 22216 -2191 121765 170401 58759 164058 280479 186511 86631 -11129 52777 25646
14994B5646m901N7074M5873k5274k7436J19503R5190j64770O6501J41764J54083
$$ 25646 20745 77819 123692 98418 70982 190485 285675 120905 187406 329170 483253
14983D83253j29958m26458l59765j8501M6725j40632j91907j00599L22227M38960
$$ 483253 353295 -73163 -432928 -451429 -404704 -545336 -737243 -837842 -515615 -76655
14973g6655K01735K25148L4937j64099j31417k5017o0717J16410O8974p4083j68164
$$ -76655 125080 350228 385165 221066 89649 64632 3915 120325 189299 115216 -52948
14962e2948k22868J21225K01621L3355k1887l2836j17443k82115j94020m7249
$$ -52948 -275816 -154591 47030 80385 58498 25662 -91781 -373896 -567916 -615165
14952f15165P8685K75656K35255L04874J56845r6277j3796Q3677J01068M8434
$$ -615165 -536480 -260824 -25569 279305 436150 339873 326077 409754 510822 559256
14942E59256q190k15586l59271l07627K2191J82661J5392k04822O598J92374J26795
$$ 559256 551066 335480 -23791 -331418 -309227 -126566 -111174 -315996 -309398 -117024 9771
14931I771J72003P6504l6996m2780p3065l2597J0359Q2775q5150k50299l35168
$$ 9771 181774 258278 221282 178502 105437 72840 83199 165974 80824 -169475 -504643
14920e04643k1352K81813L83415L17320j23853j30682L4238L227j63914k00054
$$ -504643 -525995 -244182 139233 456553 332700 202018 236256 239483 75569 -124485
14910a24485l53595m9267J09632N463p9538J41291J48381r7518M4448J97659o1068
$$ -124485 -478080 -527347 -417715 -412252 -491790 -350499 -202118 -299636 -255188 -57529 -118597
14899a18597l71840j84288J89159K4750j29900J21449L13139L23937K13582r7024
$$ -118597 -490437 -674725 -485566 -460816 -590716 -469267 -156128 167809 381391 284367
14889B84367j44983K2605J68548P2019j22548k23992k83767l33990k29322R8020
$$ 284367 139384 161989 330537 402556 280008 56016 -227751 -561741 -791063 -693043
14879f93043l0357k01730o9017p2615j00930P4964O5869j4973K10324L54442K13223
$$ -693043 -723400 -925130 -994147 -1066762 -1167692 -1092728 -1026859 -1041832 -831508 -477066 -263843
14868b63843K2903J29001j17936k14818J37020L05780K48196P0572M2704J33071
$$ -263843 -240940 -111939 -229875 -444693 -307673 -1893 246303 316875 359579 492650
14858D92650R4976j1645k72028j52815j41849k36624j79212r2313P7185j0476
$$ 492650 587626 575981 303953 151138 9289 -227335 -406547 -498860 -421675 -432151
14848d32151l1689J19484J45813k649q17K59641M7289r16J31033R6712J28734
$$ -432151 -463840 -344356 -198543 -201192 -202009 57632 104921 104005 235038 331750 460484
14837D60484k00991m16196j90534j02126j08012J98594M40363K43061j04363k26057
$$ 460484 259493 -156703 -347237 -449363 -557375 -358781 81582 324643 220280 -5777
14827e777l0966L6993J0718N7519J1209m6722j79484m6459O316m1824l7424M5649
$$ -5777 -36743 250 10968 68487 79696 32974 -146510 -192969 -186653 -228477 -265901 -220252
14815b20252K71998J54306q0361j62606J03568K7920M7202j03779j47261K13499
$$ -220252 51746 206052 125691 -36915 66653 94573 141775 37996 -109265 104234
14805A04234L83979J34788j64542j05613J10312P5779k01486j18405M0659n9741
$$ 104234 488213 623001 458459 352846 463158 538937 337451 219046 259705 199964
14795A99964J8267K14799O7837k78692j69743m3816K0671N9619L1756p2382j48294
$$ 199964 218231 433030 500867 222175 52432 8616 29287 88906 120662 48280 -100014
14784a00014j17250l6500J95340J87790N8123j01435j42006J3175M4215q4591
$$ -100014 -217264 -253764 -58424 129366 187489 86054 -55952 -42777 1438 -83153
14774h3153j40547J0109J05654J94433R8798m6105k31323m01645k05360n9632
$$ -83153 -223700 -213591 -107937 86496 185294 139189 -92134 -493779 -699139 -758771
14764g58771K74716M09120K57765l1813j84962j38365m989j31545j13809k9258
$$ -758771 -484055 -74935 182830 151017 -33945 -172310 -177299 -308844 -422653 -451911
14754d51911J29084j3209J22466K26552P0826M1348M4578L2322P748j0108j79579
$$ -451911 -322827 -336036 -213570 12982 83808 125156 169734 202056 209804 199696 20117
14743B0117n5154K21304K12323N1370l26822k36097r5777j78595M5750R6899J84665
$$ 20117 -35037 186267 398590 449960 123138 -112959 -208736 -387331 -341581 -244682 -60017
14732f0017J81259J52688R3966m29025n09374J3156K05361J42176L3314j11873
$$ -60017 121242 273930 367896 -61129 -570503 -557347 -351986 -209810 -176496 -288369
14722b88369L583k0166k43854l04322j58049l6047L271J65447J60807P6144K34034
$$ -288369 -284786 -304952 -548806 -853128 -1011177 -1047224 -1043953 -878506 -717699 -641555 -407521
14711d07521L5735P1672J1879k10427k9058O1288K2580K04197p26j21667P1625
$$ -407521 -371786 -300114 -288235 -498662 -527720 -466432 -443852 -239655 -240381 -362048 -290423
14700b90423J09593J99363J84101R3627Q9155l4901k46743l29772j8122J14657
$$ -290423 -180830 18533 202634 296261 385416 350515 103772 -226000 -244122 -129465
14690a29465K45521O3613j29666j72167m4205m8576J21247K06776O7665j1494
$$ -129465 116056 179669 50003 -122164 -166369 -214945 -93698 113078 180743 169249
14680A69249j62332j08645j56549J47586K40125L1675m4936j87163k92163j12855
$$ 169249 6917 -101728 -258277 -110691 129434 161109 116173 -70990 -363153 -476008
14670d76008K08515L54639Q9757j63365j24398j04927j6915j9088j37966L265
$$ -476008 -267493 87146 176903 13538 -110860 -215787 -232702 -251790 -389756 -386491
14660c86491J31337J9388j26870j27842Q2281J42515J18176J59600K35997J02990
$$ -386491 -255154 -235766 -362636 -490478 -408197 -265682 -147506 12094 248091 351081
14650C51081l2743o4648m19834m78757K2700L21316L66670Q3830o5950L5939J0909
$$ 351081 318338 253690 -166144 -644901 -622201 -300885 65785 149615 83665 119604 130513
14639A30513m7757k26539m9215K36504L26250J76209k98640k11855O8205K3176
$$ 130513 82756 -143783 -192998 43506 369756 545965 247325 35470 103675 126851
14629A26851l0069l7542N7989J72482L0137o9097j23719j45486j04147j84550
$$ 126851 96782 59240 117229 289711 319848 250751 127032 -18454 -122601 -307151
14619c07151k08546j19388J08502J77758M7426K87401J51942l24556k19070p5289
$$ -307151 -515697 -635085 -526583 -348825 -301399 -13998 137944 -186612 -405682 -480971
14609d80971J79396J13305L358O5235J64237J40476p8987j0530k94408j80259
$$ -480971 -301575 -188270 -184912 -119677 44560 185036 106049 95519 -198889 -379148
14599c79148M9301M9921J35876K04464J67778j93175p6622O9547K04246J27172
$$ -379148 -329847 -279926 -144050 60414 228192 35017 -41605 27942 232188 359360
14589C59360K4288k42451k48050r0906M590O4372J29725j41973k18728j4896J28650
$$ 359360 383648 141197 -106853 -197759 -193169 -128797 928 -141045 -359773 -374669 -246019
14578b46019J49764q8378j1707o1969k36722l9356r3046j8418J67845J22216K4356
$$ -246019 -96255 -184633 -196340 -258309 -495031 -534387 -627433 -645851 -478006 -355790 -331434
14567c31434K11210K10775m058j00301l6828J16223k2878k06638p5183j39041
$$ -331434 -120224 90551 86493 -13808 -50636 65587 42709 -163929 -239112 -378153
14557c78153N4722K07751J08496m6857k87669k78588K9372J19290m7043J8758
$$ -378153 -323431 -115680 -7184 -54041 -341710 -620298 -590926 -471636 -518679 -499921
14547d99921M3444J9490K8924k2813Q0830J02659K933J64366J31334Q9016J51109
$$ -499921 -456477 -436987 -408063 -430876 -350046 -247387 -244454 -80088 51246 140262 291371
14536B91371j23464k63430j5039J28171J17526J86645l7078j92436l1853J07389
$$ 291371 167907 -95523 -110562 17609 135135 321780 284702 92266 60413 167802
14526A67802j7816n0783j16072j22490k78664l61669j24823Q4943K01986M14948
$$ 167802 149986 99203 -16869 -139359 -418023 -779692 -904515 -819572 -617586 -202638
14516b02638K08789r3643j77695r0618O8917J15449K27354j0l05838k60096j64645
$$ -202638 6151 -87492 -265187 -355805 -286888 -171439 55915 55905 -249933 -510029 -674674
14505f74674J17896R130n5216J89140O085o0680K08256J56113K35902J45942l88642
$$ -674674 -556778 -547648 -602864 -413724 -407639 -468319 -260063 -103950 131952 277894 -110748
14494a10748l24872r1025Q9979K5827n4387j83365p5653J59219K4671k51111J16035
$$ -110748 -435620 -526645 -436666 -410839 -465226 -648591 -724244 -565025 -540354 -791465 -675430
14483f75430M66326L40740J06240l1284J1591J11332k93951j79380j15045j79395
$$ -675430 -209104 131636 237876 206592 218183 329515 35564 -143816 -258861 -438256
14473d38256M9390L4687r2941j33055j84644O372J75762L29980M04292J54939
$$ -438256 -388866 -354179 -447120 -580175 -764819 -758447 -582685 -252705 151587 306526
14463C06526j60248l57233l93899P6444J66075j31047j16332j06734j75347m5526
$$ 306526 146278 -210955 -604854 -528410 -362335 -493382 -609714 -716448 -891795 -937321
14453i37321K9347J9002J63673K75787L70510L20315K34676j00111n45762k76861
$$ -937321 -907974 -888972 -725299 -449512 -79002 241313 475989 375878 -169884 -446745
14443d46745N3113J00947J71030K17146N390j57878l80356k98929L7420M0885
$$ -446745 -393632 -292685 -121655 95491 100881 -56997 -437353 -736282 -698862 -657977
14433f57977J8025J20662K13659L16011K28196J28654J06457n7838j36053j94486
$$ -657977 -639952 -519290 -305631 10380 238576 367230 473687 415849 279796 85310
14423H5310k65943j98000O2994K90704J85449P3962P3186P4454P9936n2038k77895
$$ 85310 -180633 -378633 -315639 -24935 160514 234476 307662 382116 462052 410014 132119
14412A32119l60012k26093L4647K54217K19005j15415k19129J30830J11503k15000
$$ 132119 -227893 -453986 -419339 -165122 53883 -61532 -280661 -149831 -38328 -253328
14402b53328j27531L1259n0965q4830j50806P2760j6527p9171O4559j4039P3713
$$ -253328 -380859 -349600 -400565 -485395 -636201 -563441 -579968 -659139 -594580 -608619 -534906
14391e34906K03496j70O2194j32861l39207r4385L44440N11683J87132l10759
$$ -534906 -331410 -331580 -269386 -402247 -741454 -835839 -491399 20284 207416 -103343
14381a03343j95232J77344J83636K9397m55130k55564Q1563Q6039K50084J47426
$$ -103343 -298575 -121231 62405 91802 -363328 -618892 -537329 -451290 -201206 -53780
14371e3780K41310M5001p4562L1639j18209j79134J52410J74474p838k68264k52065
$$ -53780 187530 232531 157969 189608 71399 -107735 44675 219149 211311 -56953 -309018
14360c09018R8348K09551o1283j67542J12394L1877o9629K5842J26149K49585
$$ -309018 -210670 -1119 -62402 -229944 -117550 -85673 -155302 -129460 -3311 246274
14350B46274R8534n6158J09002j14036l25160o3905q1163j5485K33915J96658
$$ 246274 344808 288650 397652 283616 -41544 -105449 -186612 -202097 31818 228476
14340B28476L1741q0219j81845j28087j75206n8110p574j50969j47398J9654J34937
$$ 228476 260217 179998 -1847 -129934 -305140 -363250 -370824 -521793 -669191 -649537 -514600
14329e14600J01875R9413Q4022K9927j16238l35941m1746L14723J28715K8676
$$ -514600 -412725 -313312 -229290 -199363 -315601 -651542 -693288 -378565 -249850 -221174
14319b21174Q7056K68207J07295n2906j16558o605m20n9864l888l3407k66634
$$ -221174 -134118 134089 241384 188478 71920 65315 64895 5031 1143 -32264 -298898
14308b98898j88318R7404K84475J89278P18j69977j72731J92551P9509k05326
$$ -298898 -487216 -389812 -105337 83941 84659 -85318 -258049 -65498 14011 -191315
14298a91315j25564K18862K66625r2710K9466J58545M1861k7938J80881j71730
$$ -191315 -316879 -98017 168608 75898 105364 263909 305770 277832 458713 286983
14288B86983k50930J5460K13503K33455J17257m8837k38911j48004j15139R8967
$$ 286983 36053 51513 265016 498471 615728 566891 327980 179976 64837 163804
14278A63804J22377j47564j87151o6231q8376k36076k50335j07528n8627j06349
$$ 163804 286181 138617 -48534 -114765 -203141 -439217 -689552 -797080 -855707 -962056
14268i62056M9111L79215M15266K17509j24219k10236j57704J064R5507J77597
$$ -962056 -912945 -533730 -118464 99045 -25174 -235410 -393114 -392050 -296543 -118946
14258a18946k054j14178R7054K69795r7148n3023J31636p4930O1463K23160k19111
$$ -118946 -121000 -235178 -138124 131671 34523 -18500 113136 38206 99669 322829 103718
14247A03718m02170k51820j71467J16069K88982J03414J30531J2769j54449P9279
$$ 103718 -298452 -550272 -721739 -605670 -316688 -213274 -82743 -69974 -224423 -145144
14237a45144Q4388m8783k08098P738K49840J34532j5795j09794P3136K9208Q5620
$$ -145144 -60756 -109539 -317637 -309899 -60059 74473 58678 -51116 22020 51228 136848
14226A36848K4043k16675q9033j0992N9502J14638M3266J92662J71448p2487j6106
$$ 136848 160891 -55784 -144817 -155809 -96307 18331 61597 254259 425707 353220 337114
14215C37114o8038r29Q9112K9118j26969j95056k34564j09366L8497l8357K7772
$$ 337114 269076 268147 357259 386377 259408 64352 -170212 -279578 -241081 -279438 -251666
14204b51666J48310L67040J16097N0003K42967J66573L1243j83514j60488j77851
$$ -251666 -103356 263684 379781 429784 672751 839324 870567 687053 526565 348714
14194C48714k13341q1732J4032k47148k16177j4697N6290K29245J6402K1264R3733
$$ 348714 135373 53641 67673 -179475 -395652 -410349 -354059 -124814 -108412 -87148 6585
14183F585R6966M4018l2868k7582K0672N7474q77K15254L43155K31209R9994j91106
$$ 6585 103551 147569 114701 87119 107791 165265 164388 379642 722797 954006 1054000 862894
14171H62894k07706m8089l5280r2977J17803J8144m21364l03789O9217J77862
$$ 862894 655188 607099 571819 478842 596645 614789 193425 -110364 -41147 136715
14161A36715M6030M0552N1771l9142k09882j18636O5081N6302k45231l423K59100
$$ 136715 182745 223297 275068 235926 26044 -92592 -27511 28791 -216440 -219863 39237
14150C9237J88170j8825K4922Q164j02014r1023j62977j80521J2649K0659J70144
$$ 39237 227407 208582 233504 241668 139654 48631 -114346 -294867 -282218 -261559 -91415
14139i1415J79209j74401O0412O0727j29794O7105K00680p6407j26127n5281k13438
$$ -91415 87794 -86607 -26195 34532 -95262 -28157 172523 96116 -30011 -85292 -298730
14128b98730L292L9610Q6995J48681J53497P9607M906k4686N7320j43358k95872
$$ -298730 -295438 -255828 -168833 -20152 133345 212952 217858 193172 250492 107134 -188738
14117a88738j55687N912J24631j52804j97594j3666l9322j4636J54813J23479
$$ -188738 -344425 -338513 -213882 -366686 -564280 -577946 -617268 -631904 -477091 -353612
14107c53612j44156q6371J14260L51911J76923q651j09102l3658J32933o314j30617
$$ -353612 -497768 -584139 -469879 -117968 58955 50304 -58798 -92456 40477 34163 -96454
14096i6454N0084J51627M453j68895O7675J45377P1088P4481n0630k47714k98821
$$ -96454 -46370 105257 109710 -59185 8490 153867 224955 299436 248806 1092 -297729
14085b97729O5766J12882o7007m4567k1380o7427k27490k38306Q5128K66618O8271
$$ -297729 -231963 -119081 -186088 -230655 -252035 -319462 -546952 -785258 -700130 -433512 -365241
14074c65241j58439Q2377J02965N8933k5242q4795j33154n8347k5012L5740L84016
$$ -365241 -523680 -441303 -338338 -279405 -304647 -389442 -522596 -580943 -605955 -570215 -186199
14063a86199K79264j67323k09164k5695m103l3137r7585j78477L2405O2758J16959
$$ -186199 93065 -74258 -283422 -309117 -313220 -346357 -443942 -622419 -590014 -527256 -410297
14052d10297K48389N9931j51691q3450R2983k12860l24107j25960K89650M75081
$$ -410297 -161908 -101977 -253668 -337118 -244135 -456995 -781102 -907062 -617412 -142331
14042a42331M4536K30308K15866l8938o5644o5869j09463j92586k80988k42512
$$ -142331 -97795 132513 348379 309441 243797 177928 68465 -124121 -405109 -647621
14032f47621N0498J12590o9619k01311j06033R366J10819K40785K08189j63417
$$ -647621 -597123 -484533 -554152 -755463 -861496 -852130 -741311 -500526 -292337 -455754
14022d55754j64150k43385r3504o61j2244J73175K18030J27461J1672K24180K17808
$$ -455754 -619904 -863289 -956793 -957454 -969698 -796523 -578493 -451032 -439360 -215180 2628
14011B628R7103J24575k3166p9262o3925K7065j63840k03121J30749K69098J95386
$$ 2628 99731 224306 201140 121878 57953 85018 -78822 -281943 -151194 117904 313290
14000C13290Q3684o1182j40556r9984j27373l21715j89257r6238m9143K24297
$$ 313290 396974 335792 195236 95252 -32121 -353836 -543093 -639331 -688474 -464177
13990d64177K17751L1651J09595K21367j20552j19536N0081p6557M7360J04600
$$ -464177 -246426 -214775 -105180 116187 -4365 -123901 -73820 -150377 -103017 1583
13980A583J20671P2240O254J5281k17424j45368P1442j38567l11625m9854J35984
$$ 1583 122254 194494 200748 216029 -1395 -146763 -75321 -213888 -525513 -575367 -439383
13969d39383o7836m4049k2691M0812K89376J63184J07791P10j25293j14515l5231
$$ -439383 -507219 -551268 -573959 -533147 -243771 -80587 27204 27914 -97379 -211894 -247125
13958b47125j82281j08008O7158r4756j646P2613O3320K91468L6630p2757Q891
$$ -247125 -429406 -537414 -470256 -565012 -566658 -494045 -430725 -139257 -102627 -175384 -166493
13947a66493J23165K63165N0611j93032K7394K30891Q4069k19257k58676j38539
$$ -166493 -43328 219837 270448 77416 104810 335701 419770 200513 -58163 -196702
13937a96702j82352j18390L9102R0811k60382k06123J75213M4436J94734J80356
$$ -196702 -379054 -497444 -458342 -367531 -627913 -834036 -658823 -614387 -419653 -239297
13927b39297M8983n4216p1598K45839L46533P5919N4492k8216j68720k2579J10242
$$ -239297 -190314 -244530 -316128 -70289 276244 352163 406655 378439 209719 187140 297382
13916B97382k600L300k09543l03990J74089K08831m2698o9387k65351j83266k4143
$$ 297382 294782 298082 88539 -215451 -41362 167469 124771 55384 -209967 -393233 -417376
13905d17376o4633J22643K77187Q6112M8585j02484M0438L39336J15403J8743
$$ -417376 -482009 -359366 -82179 3933 52518 -49966 -9528 329808 445211 463954
13895D63954L772j4139R7746J42218j48650l73967k60604l36340j7839P4274J10549
$$ 463954 467726 453587 551333 693551 544901 170934 -89670 -426010 -443849 -369575 -259026
13884b59026k5899J1447J82384L10077N4182Q5517J36806j16219j22297o1714
$$ -259026 -284925 -273478 -91094 218983 273165 358682 495488 379269 256972 195258
13874A95258j07530p4014J95497P6554l9131M4401J96849R6839j20258j94528
$$ 195258 87728 13714 209211 285765 246634 291035 487884 584723 464465 269937
13864B69937n6993j3377m2513M6800J26875J4541r0338r1167K0662J12715J99771
$$ 269937 212944 199567 157054 203854 330729 345270 254932 163765 184427 297142 496913
13853D96913j12465k45527q3866L6015Q998L235j03295j64745j54997O4540L898
$$ 496913 384448 138921 55055 91070 100068 103303 8 -164737 -319734 -255194 -251296
13842b51296k3036k0212j03556P1082P9707j81548j28698j65545p5L76806P6527
$$ -251296 -274332 -294544 -398100 -327018 -247311 -428859 -557557 -723102 -723177 -346371 -269844
13831b69844l0081j06779j61245j24227N3612J14538m6056j95713m7599J94737
$$ -269844 -299925 -406704 -567949 -692176 -638564 -524026 -570082 -765795 -813394 -618657
13821f18657K64358L30975K25995p4179l54521m30558p7663J52367J44987K24610
$$ -618657 -354299 -23324 202671 128492 -226029 -656587 -734250 -581883 -436896 -212286
13811b12286J58408j28548k5130J53797M9173L139J8664J75751R4467p412j2228
$$ -212286 -53878 -182426 -207556 -53759 -4586 -1447 17217 192968 287435 280023 267795
13800B67795k92482j59236Q1347l8339k00134j61636j21486j00891J37542L22823
$$ 267795 -24687 -183923 -102576 -140915 -341049 -502685 -624171 -725062 -587520 -264697
13790b64697J39713j11528M3081K32451K67389P7452j94395k98118l03441L3300
$$ -264697 -124984 -236512 -193431 39020 306409 383861 189466 -108652 -412093 -378793
13780c78793k4371l785L49503K57368J54405Q3497j12354k24181j2632N7510o3709
$$ -378793 -403164 -406949 -57446 199922 354327 437824 325470 101289 88657 146167 82458
13769H2458k33295r2156k12552j30704m1756R8426K29457M35333K81068l1866
$$ 82458 -150837 -242993 -455545 -586249 -628005 -529579 -300122 135211 416279 384413
13759C84413j06165o8314j43090k31025K6763O5687K34532N0458j59907j71531
$$ 384413 278248 209934 66844 -164181 -137418 -71731 162801 213259 53352 -118179
13749a18179j40544K3208O0762J09540n1780P1150R3245M6939k2049J2740k9016
$$ -118179 -258723 -235515 -174753 -65213 -116993 -45843 47402 94341 72292 85032 56016
13738E6016j6276K8907J5739R6523J47899J696k26133j40694j2912J12524o4688
$$ 56016 39740 68647 84386 180909 328808 330504 104371 -36323 -49235 63289 -1399
13727a399p6508l0300m4165Q6821K59021J34991j34478n5165j3871k13583k41133
$$ -1399 -77907 -108207 -152372 -65551 193470 328461 193983 138818 124947 -88636 -329769
13716c29769j85549O0215K66394O0973J7653J36907J30732J62576J09792j31792
$$ -329769 -515318 -455103 -188709 -127736 -110083 26824 157556 320132 429924 298132
13706B98132j09409k41081k85337L6063J08682j68044M4085r296j196K14765j1684
$$ 298132 188723 -52358 -337695 -301632 -192950 -360994 -316909 -326205 -327401 -112636 -124320
13695a24320j14010j36595m4074J53436L8464m0835O4241R1573J82542Q6593k39634
$$ -124320 -238330 -374925 -418999 -265563 -227099 -267934 -203693 -112120 70422 157015 -82619
13684h2619l57732k49275j53641o3200J25880K39564P9771k07546O2030M52059
$$ -82619 -440351 -689626 -843267 -906467 -780587 -541023 -461252 -668798 -606768 -154709
13674a54709K26217j76210k25730P5123K37589N3026Q6862Q4854n2764J64731
$$ -154709 71508 -104702 -330432 -255309 -17720 35306 122168 207022 154258 318989
13664C18989M4495r8592r9195n3224L1852j23673j57730M8055k11387j17678K69059
$$ 318989 363484 264892 165697 112473 144325 20652 -137078 -89023 -300410 -418088 -149029
13653a49029K83837K45282R7096p2981n5911L947j60806k39447j46694l1186l2165
$$ -149029 134808 380090 477186 404205 348294 352241 191435 -48012 -194706 -225892 -258057
13642b58057q2099J79442J21772j81313l1898J19564K07438J44126K2487J07201
$$ -258057 -340156 -160714 -38942 -220255 -252153 -132589 74849 218975 241462 348663
13632C48663k7029m68393k99843J95168K50488K668j41469k04750j76671n9301
$$ 348663 321634 -146759 -446602 -251434 -946 1722 -139747 -344497 -521168 -580469
13622e80469m777J66724K98995J14395O7789J45441Q658O3848J44193N8156J79925
$$ -580469 -585246 -418522 -119527 -5132 62657 208098 216756 280604 424797 482953 662878
13611F62878j10397k29927n657K55130L7726k96237j89303N3123n8717k91626
$$ 662878 552481 322554 316897 572027 609753 313516 124213 177336 118619 -173007
13601a73007k46360Q1885J81011J38948j54120l45285N7584J6231p0742j8087
$$ -173007 -419367 -337482 -156471 -17523 -171643 -516928 -459344 -443113 -513855 -531942
13591e31942k206J17761J59665j61793j64200R6021L64416L72839K83442K82951
$$ -531942 -534148 -416387 -256722 -418515 -582715 -486694 -122278 250561 534003 816954
13581H16954Q3485j10082l48048l13659J35829r664l11885k1103J86064J72713
$$ 816954 900439 790357 442309 128650 264479 254815 -57070 -78173 107891 280604
13571B80604K2008q2829p7406Q0336J51617j98422j19055J60621r079r871J39524
$$ 280604 302612 219783 142377 222713 374330 175908 56853 217474 208395 198524 338048
13560C38048J2398k44119j65551Q7579K56909J40614j77238j72137j62839k9366
$$ 338048 350446 106327 -59224 28355 285264 425878 248640 76503 -86336 -115702
13550a15702L3411M3228P6155R4423Q3632J3525m2394r2715O7608K0303j17826
$$ -115702 -82291 -39063 37092 131515 215147 228672 186278 93563 161171 181474 63648
13539F3648J94381J34320n2770j17495r5579p5499Q785q712k94664k46568J75465
$$ 63648 258029 392349 339579 222084 126505 51006 59791 51079 -243585 -490153 -314688
13528c14688L9936k45385p4979K23397L80965J39236j84099j65418j15294l1985
$$ -314688 -274752 -520137 -595116 -371719 9246 148482 -35617 -201035 -316329 -348314
13518c48314J35296L5547M987J34304J13219j69763j41629Q1503K31967J01001
$$ -348314 -213018 -177471 -172484 -38180 75039 -94724 -236353 -154850 77117 178118
13508A78118l6153P0552R7421J47644J0873q5962j12534l8168j62244k05743m6260
$$ 178118 141965 212517 309938 457582 468455 382493 269959 231791 69547 -136196 -182456
13497a82456l5790J844N2973K09452K53387L55754K10558j09530j20447k76515
$$ -182456 -218246 -216402 -163429 46023 299410 655164 865722 756192 635745 359230
13487C59230k00231j8767k4184L6918j5175j23169N6367K92149P7951q1159l24345
$$ 359230 158999 140232 116048 152966 137791 14622 70989 363138 441089 359930 35585
13476C5585k74257J04223J69552l475K674k29144j4440M10168J47329o7871j76759
$$ 35585 -238672 -134449 35103 31628 34302 -194842 -209282 200886 348215 280344 103585
13465A03585k06319j50694k75427m65804m2608M53041N75806J22454L2142J68554
$$ 103585 -102734 -253428 -528855 -994659 -1037267 -584226 -8420 114034 146176 314730
13455C14730J35473K73559Q0953K836O0200p4330j79381j19835j44341j78585
$$ 314730 450203 723762 804715 807551 867751 793421 614040 494205 349864 171279
13445A71279J86211J68745k21935l73559k28542j42508K27586L75111p5524k42035
$$ 171279 357490 526235 304300 -69259 -297801 -440309 -212723 162388 86864 -155171
13435a55171n1556J9459R5847N8115j8470K40967K10373j13763k30326l9665J99191
$$ -155171 -206727 -187268 -91421 -33306 -51776 189191 399564 285801 55475 15810 215001
13424B15001N4579K142J04462m0830r8001J89029K79888j87340k45877j50501
$$ 215001 269580 271722 376184 335354 237353 426382 706270 518930 273053 122552
13414A22552j92170P3471J12266P1721Q0882j00989r2348l85751m58841L3760
$$ 122552 -69618 3853 116119 187840 268722 167733 75385 -310366 -769207 -735447
13404g35447K26322K04743K81305J98593P1952l4052j95701k7922J05312J43807
$$ -735447 -509125 -304382 -23077 175516 247468 213416 17715 -10207 95105 238912
13394B38912J35356P1262l6088M3406p8217j25780k06797k03140J0497K07112
$$ 238912 374268 445530 409442 452848 374631 248851 42054 -161086 -150589 56523
13384E6523J23595l3541k62202j17384K52270L09827l8559k12086p5929k25L04872
$$ 56523 180118 146577 -115625 -233009 19261 329088 290529 78443 2514 2289 307161
13373C07161L77304J04448L38919K13594r9391p1298j00581K42492N79489J030998
$$ 307161 684465 788913 1127832 1341426 1242035 1170737 1070156 1312648 1892137 2923135
13363B923135J377617J136298j08349r48802j159926j142427o32177k19224n807
$$ 2923135 4300752 5437050 5328701 4379899 3219973 2077546 1445369 1226145 1220338
13354A220338k08834m27398j88086j37401k18245j64245P799L39546J64018Q4541
$$ 1220338 1011504 584106 396020 258619 40374 -123871 -116072 223474 387492 472033
13344D72033o2363j72778K8028k0649M1958J74651J92018J84446J21685j58810
$$ 472033 409670 236892 264920 244271 286229 460880 652898 837344 959029 800219
13334H00219J8406Q2872j06695j13094j19562p3464j44308m67699j73583K60274
$$ 800219 818625 901497 794802 681708 562146 488682 344374 -123325 -296908 -36634
13324c6634M7652k153J79815K14509q0459k40820o5054K9279j07994j92750K6861
$$ -36634 11018 8865 188680 403189 322730 81910 16856 46135 -61859 -254609 -227748
13313b27748J96666P7109q566P0186J97639q3044j9573N5611j77772K88k9690
$$ -227748 -31082 46027 37461 107647 305286 222242 202669 258280 80508 80796 51106
13302E1106k967j22431K4778L10899l982K9415L60841K67387P880M5114J45193
$$ 51106 48139 -74292 -49514 261385 257403 286818 647659 915046 922926 968040 1113233
13291A113233J8609l60093m27766k94887j53362N3711l2583J01410J99480N7466
$$ 1113233 1131842 771749 343983 49096 -104266 -50555 -83138 18272 217752 275218
13281B75218j20038q5215N8842K08865k7789p7368l1353l6277O2251K8766j42108
$$ 275218 155180 69965 128807 337672 309883 232515 201162 164885 227136 255902 113794
13270A13794j53285J9644J28613j64167k56698J61971K82314L22974K75567M968
$$ 113794 -39491 -19847 108766 -55401 -312099 -150128 132186 455160 730727 735695
13260G35695r6571k90751l17583L1654J19561K88542J92911J5457O2189l9710
$$ 735695 639124 348373 30790 62444 182005 470547 663458 678915 741104 701394
13250G01394j84396j22947j06105r545r1896m9356R1524J34635L24680K11496
$$ 701394 516998 394051 287946 278401 186505 137149 228673 363308 687988 899484
13240H99484n3572j22500Q604k9818m6764J0009J65008K2053j45524j50459M4050
$$ 899484 845912 723412 732016 702198 655434 665443 830451 852504 706980 556521 600571
13229F00571J37073J33637j01389j61364j48673j17276j35645k99641j05073K31198
$$ 600571 737644 871281 769892 608528 459855 342579 206934 -92707 -197780 33418
13219C3418J56828J0173Q0893J56189J77892j2883k0294j64563j58084O2224N56
$$ 33418 190246 200419 281312 437501 615393 602510 582216 417653 259569 321793 322349
13208C22349J08457K49274K25143K15762O4618k15332j87846m0414K1267L8072
$$ 322349 430806 680080 905223 1120985 1185603 970271 782425 742011 763278 801350
13198H01350k7195j48639k15194k69730J1636J10241O7540K97480K28273o3931
$$ 801350 774155 625516 410322 140592 152228 262469 330009 627489 855762 791831
13188G91831n3079J28278N6785l21644l73061j50841k27394k14248j16780R437
$$ 791831 738752 867030 923815 602171 229110 78269 -149125 -363373 -480153 -470716
13178d70716K16842K8852L5855K18570K08491K46398O2866j27765o3241j21215
$$ -470716 -253874 -225022 -189167 29403 237894 484292 547158 419393 356152 234937
13168B34937j64286o0144l4542O371j44858j56703J66717J37251K39465K92912
$$ 234937 70651 10507 -24035 -17664 -162522 -319225 -152508 -15257 224208 517120
13158E17120K39941O8619j82566j32747J78838N2403l1963l9039j29265L2347
$$ 517120 757061 825680 643114 510367 689205 741608 709645 670606 541341 573688
13148E73688L06556L18219J54337j66874k40028M6232l9010L0682J48691K8373
$$ 573688 880244 1198463 1352800 1185926 945898 992130 953120 983802 1132493 1160866
13138A160866N805j4404m9551j31719K495k1273m7696k3519k07715j9755J19002
$$ 1160866 1166671 1152267 1102716 970997 973492 952219 904523 881004 673289 653534 772536
13127G72536K16795R2082m2805J28531J71210j45853l63504O7257K63735N2337
$$ 772536 989331 1081413 1038608 1167139 1338349 1192496 828992 896249 1159984 1212321
13117A212321q3743l08891l10778j64139Q3889L57196N60328J72710k07314k51251
$$ 1212321 1128578 819687 508909 344770 428659 785855 1346183 1518893 1311579 1060328
13107A060328O3337J72263K62386Q4863l0675J71959K34451J00640J90354K20321
$$ 1060328 1123665 1295928 1558314 1643177 1612502 1784461 2018912 2119552 2309906 2530227
13097B530227p5739l94257l98372p9442n1704m6219j12711j07268J38122O3722
$$ 2530227 2454488 2060231 1661859 1582417 1530713 1484494 1371783 1264515 1402637 1466359
13087A466359k49837k12948J00512K33060K01976K3320o5626j23432o2594R1601
$$ 1466359 1216522 1003574 1104086 1337146 1539122 1562442 1496816 1373384 1310790 1402391
13077A402391J57619J67003j7678m3862K67976K29013M6328j40918k5272N8437
$$ 1402391 1560010 1727013 1709335 1665473 1933449 2162462 2208790 2067872 2042600 2101037
13067B101037o2514q1705J54188J49411j10624m5799n3937l8277K932K26342K86381
$$ 2101037 2038523 1956818 2111006 2260417 2149793 2103994 2050057 2011780 2014712 2241054 2527435
13056B527435j025l30287m09409j14816K02895K32389J40146J06753p3043l2984
$$ 2527435 2526410 2196123 1786714 1671898 1874793 2107182 2247328 2354081 2281038 2248054
13046B248054l0635k21099k05656n9406J27836J06974J2222K3452m5947n5989
$$ 2248054 2217419 1996320 1790664 1731258 1859094 1966068 1978290 2001742 1955795 1899806
13036A899806l8890P3678J7242J67354K37472J40277Q3275j247J72213M62392
$$ 1899806 1860916 1934594 1951836 2119190 2356662 2496939 2580214 2578967 2751180 3213572
13026C213572M29272J72503k31890j58979J04038K12526P3335K2445Q2063j26862
$$ 3213572 3642844 3815347 3583457 3424478 3528516 3741042 3814377 3836822 3918885 3792023
13016C792023m6033L85544K41621K39389L18431J74463Q5696m0930M7242Q478
$$ 3792023 3745990 4131534 4373155 4612544 4930975 5105438 5191134 5150204 5197446 5205924
13006E205924P3508J10972K87710L46437N15760M83405M8002K02650L62402M22834
$$ 5205924 5279432 5390404 5678114 6024551 6540311 7023716 7071718 7274368 7636770 8059604
12996H059604N89257P32621R67599R66913R83772J162344J346240J636188J953143
$$ 8059604 8648861 9381482 10349081 11315994 12299766 13462110 14808350 16444538 18397681
12987A8397681K154214K643153L369769M298455N907975P636904R676384J3295472
$$ 18397681 20551895 23195048 26564817 30863272 36771247 44408151 54084535 67380007
12979F7380007J8466309K5827014L6103739M9331638O2377271O4797175L9851978
$$ 67380007 85846316 111673330 147777069 197108707 259485978 324283153 364135131
12972C64135131p376913m3875379n4706480n3444403m7468275l7125593k7073142
$$ 364135131 356758218 312882839 258176359 204731956 157263681 120138088 93064946
12965I3064946j9377691j4210304j0718235q184811o326026m982765l790049k759448
$$ 93064946 73687255 59476951 48758716 40573905 34247879 29265114 25475065 22715617
12957B2715617k371455j964727j694587j480543j202080j057332j021142q66352
$$ 22715617 20344162 18379435 16684848 15204305 14002225 12944893 11923751 11057399
12949A1057399p13782p46719o38855l09167k09695l21496j00615M9883j33228
$$ 11057399 10343617 9596898 8958043 8648876 8439181 8117685 8017070 8066953 7933725
12940G933725l77460l97353k69706p6240j77790l58062R2177K05005J6829K2083
$$ 7933725 7556265 7158912 6889206 6812966 6635176 6277114 6369291 6574296 6591125 6613208
12930F613208j395J04199J02475j17858J72663K74106M78138N87933M74717O38961
$$ 6613208 6611813 6716012 6818487 6700629 6873292 7147398 7625536 8213469 8688186 9327147
12920I327147R71701J093791J638382K481101L248915L613986K516208N7842k211343
$$ 9327147 10298848 11392639 13031021 15512122 18761037 22375023 24891231 24949073 22737730
12911B2737730k918726k367139j493100q21316j18563J39480K55024M43442J025844
$$ 22737730 19819004 17451865 15958765 15137449 15018886 15158366 15413390 15856832 16882676
12902A6882676J354599J371786J994374K741195L256851M436274N883388P734260
$$ 16882676 18237275 19609061 21603435 24344630 27601481 32037755 37921143 45655403
12894D5655403J0288051J3773028J9331460K7742780L8755105N2424906O4381071
$$ 45655403 55943454 69716482 89047942 116790722 155545827 207970733 272351804
12887B72351804O0191219K4552357k7524807n9702137o2467837n0816332l7612052
$$ 272351804 332543023 357095380 329570573 269868436 207400599 156584267 118972215
12880A18972215k6889030j9136332j3956991j0409407p905673o202760m919337
$$ 118972215 92083185 72946853 58989862 48580455 40674782 34472022 29552685
12873B9552685m092457l251563k500460k085674j627142j190526j019424j047458
$$ 29552685 25460228 22208665 19708205 17622531 15995389 14804863 13785439 12737981
12865A2737981r73404q94140o58686o41564p46822n64150l57871k00883j30595
$$ 12737981 11764577 10870437 10211751 9570187 8823365 8259215 7901344 7700461 7569866
12856G569866k61940m09881l18518k28127l31039l08210r4591p5802j31886k817
$$ 7569866 7307926 6898045 6579527 6351400 6020361 5712151 5617560 5541758 5409872 5407055
12846E407055J38941J27399k33652l12433p6610Q8882J53252J96066J45618J93154
$$ 5407055 5545996 5673395 5439743 5127310 5050700 5139582 5292834 5488900 5634518 5827672
12836E827672K46777K35191K64769J53405J71528N3459O101N1993L17595N19767
$$ 5827672 6074449 6309640 6574409 6727814 6899342 6952801 6958902 7010895 7328490 7848257
12826G848257N53961M98966N73528N96163O09724M54284M39359N54024P86909
$$ 7848257 8402218 8901184 9474712 10070875 10680599 11134883 11574242 12128266 12915175
12817A2915175R30274J269992J631684K022429K444871L071786L803780M787317
$$ 12915175 13845449 15115441 16747125 18769554 21214425 24286211 28089991 32877308
12809C2877308O319755Q248111J1373593J5822284K1877090L0135086M1352442
$$ 32877308 39197063 47445174 58818767 74641051 96518141 126653227 168005669
12802A68005669N4671465O3231227N1211427J0094335l7297369o0761325n8849585
$$ 168005669 222677134 285908361 337119788 347214123 309916754 249155429 190305844
12795A90305844m6720059l4215902k4636638j7931543j3031982r692555p489356
$$ 190305844 143585785 109369883 84733245 66801702 53769720 44077165 36587809
12788C6587809n827176m388810l417317k759301k401497k139413j576646j310931
$$ 36587809 30760633 26371823 22954506 20195205 17793708 15654295 14077649 12766718
12780A2766718j322337r76941o46686n75089q39802q89363o61274n71890n84468
$$ 12766718 11444381 10467440 9820754 9245665 8405863 7516500 6855226 6283336 5698868
12771E698868m59432m57852n09862k62933o4645r5610l43847l99580k42009r8212
$$ 5698868 5239436 4781584 4271722 4008789 3944144 3848534 3504687 3105107 2863098 2764886
12761B764886J57205J24142P4187o4559j60720j86474j61331n4264k6227j46548
$$ 2764886 2922091 3046233 3120420 3055861 2895141 2708667 2547336 2493072 2466845 2320297
12751B320297j87143j53497Q8977J46942j20190k05263j10918j805p3957j03122
$$ 2320297 2133154 1979657 2068634 2215576 2095386 1890123 1779205 1777400 1703443 1600321
12741A600321j49880q7127N9333P4295j37717k32746j81180n9880O0746J12962
$$ 1600321 1450441 1363314 1422647 1496942 1359225 1126479 945299 885419 946165 1059127
12731A059127J14190R0365J43168o5163k15974j47054J57652o2112j35985j67966
$$ 1059127 1173317 1263682 1406850 1341687 1125713 978659 1136311 1074199 938214 770248
12721G70248k07401P9140K01980Q7623K7887j18064j86432l5537N6202J65561
$$ 770248 562847 641987 843967 931590 959477 841413 654981 619444 675646 841207
12711H41207J0011j11453j92949k57565j09217J1748r5343n1530K07199M08732
$$ 841207 851218 739765 546816 289251 180034 191782 96439 44909 252108 660840
12701F60840L87449J0722k56718j87048m8197J44706K19195R5801r3365j65418
$$ 660840 1048289 1059011 802293 615245 567048 711754 930949 1026750 933385 767967
12691G67967r3082j36158l21789m5385K85950K8870j7548j3156j31297q5531j0398
$$ 767967 674885 538727 216938 171553 457503 486373 468825 455669 324372 238841 228443
12680B28443P8570o7353j14682p9213l9802O7205j0263k5886J50497P6l1415K50998
$$ 228443 307013 239660 124978 45765 5963 73168 62905 37019 187516 187592 156177 407175
12668D07175K48610j18884j78659j41777j44526L0706l0916q6022P5038Q7071
$$ 407175 655785 536901 358242 216465 71939 102645 71729 -14293 60745 147816
12658A47816k374R7937o8248J7198J66102K94595J08132k07532j23658N2884j30976
$$ 147816 145442 243379 175131 192329 358431 653026 761158 553626 429968 482852 351876
12647C51876k78292k5738J4039m9781o3563J2915j04162j74051O3602J55471o7479
$$ 351876 73584 47846 61885 12104 -51459 -38544 -142706 -316757 -253155 -97684 -165163
12636a65163j5338m0403j84229m0177Q7281J50076j14445q6929J05806j91574
$$ -165163 -180501 -220904 -405133 -445310 -358029 -207953 -322398 -409327 -303521 -495095
12626d95095j08245J46206J69893M20292L50757j64832n21526k96508N6909J18157
$$ -495095 -603340 -457134 -287241 133051 483808 318976 -202550 -499058 -442149 -323992
12616c23992K57303K38697m8091k8132N1218r9584q7771M7378J43328J85632J78160
$$ -323992 -66689 172008 123917 95785 147003 47419 -40352 7026 150354 335986 514146
12605E14146K11477M4280j84500k50557q8503r7253j87075K8896J85248J57910
$$ 514146 725623 769903 585403 334846 246343 149090 -37985 -9089 176159 334069
12595C34069n0137J4042K91455M1017m10727j81833m9641o4226Q9657j2741m4010
$$ 334069 283932 297974 589429 630446 219719 37886 -11755 -75981 13676 935 -43075
12584d3075R7690p0485k00021J26566J53974j54165j53226J04514Q4668N2277
$$ -43075 54615 -15870 -215891 -89325 64649 -89516 -242742 -138228 -53560 -1283
12574a283K09388K53266J57139K14520J30903l9561k93562l20022j85454J03793
$$ -1283 208105 461371 618510 833030 963933 924372 630810 310788 125334 229127
12564B29127J14674j43958m4617Q0463J52824k23388j56115J39873K19612M7848
$$ 229127 343801 199843 155226 235689 388513 165125 9010 148883 368495 416343
12554D16343n4106j53524j51240p950K26747L5534Q0412O7576j39935r6867r6659
$$ 416343 362237 208713 57473 49523 276270 311804 392216 459792 319857 222990 126331
12543A26331j75414J50581L38987L2410j23422j05981n4724k16351j29028O6191
$$ 126331 -49083 101498 440485 472895 349473 243492 188768 -27583 -156611 -90420
12533i0420J67157P3917n1136P0614j08762p7214N0218M3257M6691k90289l92568
$$ -90420 76737 150654 99518 170132 61370 -15844 34374 77631 124322 -165967 -558535
12522e58535k6088J10229J0733M6660K00828K32196M2751j10778J25401K32092
$$ -558535 -584623 -474394 -463661 -417001 -216173 16023 58774 -52004 73397 305489
12512C05489m3511l33979l02040j67240j21733L9869K01981Q0066P0747J52093
$$ 305489 261978 -72001 -374041 -541281 -663014 -623145 -421164 -341098 -270351 -118258
12502a18258k7728p7516K7417M7000J12087J22943j5003k5419J2511R4504o3772
$$ -118258 -145986 -223502 -196085 -149085 -36998 85945 70942 45523 58034 152538 88766
12491H8766k56873j40489j1390j55742r5926O4993O1894J17905J54259n0213n4683
$$ 88766 -168107 -308596 -319986 -475728 -571654 -506661 -444767 -326862 -172603 -222816 -277499
12480b77499J09699M9593n9699j68591o1420Q4287M187k30724k45080J82717L94358
$$ -277499 -167800 -118207 -177906 -346497 -407917 -323630 -319443 -550167 -795247 -612530 -218172
12469b18172L76770L04620L61931N18174J27000n00207n05519k60759j30114o3222
$$ -218172 158598 463218 825149 1343323 1470323 970116 464597 203838 73724 10502
12459A0502J19484J71769J88220J98003J04211M1196j7853k61236n68147l41513
$$ 10502 129986 301755 489975 687978 792189 833385 815532 554296 -13851 -355364
12449c55364j5492Q3705R6233R3597P7080K64071J17552j14480P6771J8694o1393
$$ -355364 -370856 -287151 -190918 -97321 -20241 243830 361382 246902 323673 342367 280974
12438B80974J3377j08002R1408L5041k02960j98517m1287j23009j32330l1701
$$ 280974 294351 186349 277757 312798 109838 -88679 -129966 -252975 -385305 -417006
12428d17006P3823K39616J78024J41349k27515l49518k01779p886N7881K23479
$$ -417006 -343183 -103567 74457 215806 -11709 -361227 -563006 -570892 -513011 -289532
12418b89532J62884p5204j46263P6307J13221P311k24463k52106j49191l2779
$$ -289532 -126648 -201852 -348115 -271808 -158587 -151276 -375739 -627845 -777036 -809815
12408h09815K58789O8686r5760Q821K7696J62649J97582J32541q1291K8845J25888
$$ -809815 -551026 -482340 -578100 -569279 -541583 -378934 -181352 -48811 -130102 -101257 24631
12397B4631j55883j32441j45205j76505m9412L5919K22639K35104l7814l1947
$$ 24631 -131252 -263693 -408898 -585403 -634815 -598896 -376257 -141153 -178967 -210914
12387b10914J47558J16138m3000o9763K56345J44366j6957j8824Q5291j5815l6698
$$ -210914 -63356 52782 9782 -59981 196364 340730 323773 304949 390240 374425 337727
12376C37727K21140J17681r3507k79203k14491l8478j29771j75691r977K90972
$$ 337727 558867 676548 583041 303838 89347 50869 -78902 -254593 -264570 26402
12366B6402K16249j67598l07156M4254K99478p7419k50616j92057j26333N1456
$$ 26402 242651 75053 -232103 -187849 111629 34210 -216406 -408463 -534796 -483340
12356d83340K69621J89911J28716m5718j43989j00112J48221J60566l7878j66184
$$ -483340 -213719 -23808 104908 59190 -84799 -184911 -36690 123876 85998 -80186
12346h0186j50874j06261j25190J76090Q0883j54146J21621J22099k41321n8346
$$ -80186 -231060 -337321 -462511 -286421 -205538 -359684 -238063 -115964 -357285 -415631
12336d15631K43971Q9335j45914l7220k0522m7138P6575r5296l4998J03585J31162
$$ -415631 -171660 -82325 -228239 -265459 -285981 -333119 -256544 -351840 -386838 -283253 -152091
12325a52091K2372P1628J75978J42423j5865L3375K06107K499L3137j17151j11533
$$ -152091 -129719 -58091 117887 260310 244445 277820 483927 486426 519563 402412 290879
12314B90879K4237k75711k69623r9118j59998j01410l4094p960l1970P0571J43604
$$ 290879 315116 39405 -230218 -329336 -489334 -590744 -624838 -632798 -664768 -594197 -450593
12303d50593L63975M56141K51875m2395j25821j40777k71699N9104Q5677j70980
$$ -450593 -86618 369523 621398 579003 453182 312405 40706 99810 185487 14507
12293A4507J39040K17146l55488k15450J03810n2014K5266M0417j64290L5377
$$ 14507 153547 370693 15205 -200245 -96435 -148449 -123183 -82766 -247056 -211679
12283b11679J8993L2687K57733K35552l0721j4373L1077n8859o6484j8513M0197
$$ -211679 -192686 -159999 97734 333286 302565 288192 319269 260410 193926 175413 215610
12272B15610R8244L4729J7277o2961j42482j69062l8817K2172j44677o7179P3645
$$ 215610 313854 348583 365860 302899 160417 -8645 -47462 -25290 -169967 -237146 -163501
12261a63501l5058m5850k8799j23611o5748J85346M17806K23762j04112k48160
$$ -163501 -198559 -244409 -273208 -396819 -462567 -277221 140585 364347 260235 12075
12251A2075j22935j04972k489N0959j13958M811K8788j58730J29234K17771M9870
$$ 12075 -110860 -215832 -218321 -167362 -281320 -276509 -247721 -406451 -277217 -59446 -9576
12240i576o7307O0534K02882K54221L0126L402K7755K32997K63662j25971m26893
$$ -9576 -76883 -16349 186533 440754 470880 474282 502037 735034 998696 872725 445832
12229D45832n00739m9515K14229K19873K4739j09484k92794k59630p7005J23087
$$ 445832 -54907 -104422 109807 329680 354419 244935 -47859 -307489 -384494 -261407
12219b61407M18722L51529P9695m560j93243j15303K2159j00817o8013J95932
$$ -261407 157315 508844 588539 583979 390736 275433 297592 196775 128762 324694
12209C24694J18301j19248j42443k8497J34324o6889j41113j27689k18822k33536
$$ 324694 442995 323747 181304 152807 287131 220242 79129 -48560 -267382 -500918
12199e00918k08886J38818K47935K14082j7424O39J48036K42295k9854k80964
$$ -500918 -709804 -570986 -323051 -108969 -126393 -125754 22282 264577 234723 -46241
12189d6241k42747J28291L35465M5018k34984k95374j90772l5558k7933j23554
$$ -46241 -288988 -160697 174768 219786 -15198 -310572 -501344 -536902 -564835 -688389
12179f88389O5883L11691J88310j100n8659n6166J56018J05622k34921k52678
$$ -688389 -622506 -310815 -122505 -123605 -182264 -238430 -82412 23210 -211711 -464389
12169d64389q0808j52860M762J73043J27981P709K2692K12428P8620k14356p9910
$$ -464389 -545197 -698057 -693295 -520252 -392271 -384562 -361870 -149442 -70822 -285178 -365088
12158c65088P7890L4045J07516M52931M39626O6350j77189J0592p0195k19020
$$ -365088 -287198 -253153 -145637 307294 746920 813270 636081 646673 576478 357458
12148C57458p3762K68238K47117J6060j86063k53187M0000K58801J47768K12181
$$ 357458 283696 551934 799051 815111 629048 375861 415861 674662 822430 1034611
12138A034611r1993l07433k18857J4244m8207k04339l02084Q8248K63681K50159
$$ 1034611 942618 635185 416328 430572 382365 178026 -124058 -35810 227871 478030
12128D78030O4790k71222j01415R7511m6653j7540K25165o9199j18868J73002
$$ 478030 542820 271598 170183 267694 221041 203501 428666 359467 240599 413601
12118D13601K73556J01176n540n0015r2102j20687k93347l24991k82891M9794
$$ 413601 687157 788333 782793 732778 640676 519989 226642 -98349 -381240 -331446
12108c31446L19226J59954j54601k46766j00450R1016j42559k20615L75750M74960
$$ -331446 -12220 147734 -6867 -253633 -354083 -263067 -405626 -626241 -250491 224469
12098B24469J91126K3368k16613k47010j9270R7815o9737j39896J07334K07395
$$ 224469 415595 438963 222350 -24660 -43930 53885 -15852 -155748 -48414 158981
12088A58981j8617k32424j10679J91389J23164M9332m9565k18601j79707r5514
$$ 158981 140364 -92060 -202739 -11350 111814 161146 111581 -107020 -286727 -382241
12078c82241J15709J04108j08291J47526L4201j02107M0446K22346J12229n0748
$$ -382241 -266532 -162424 -270715 -123189 -88988 -191095 -150649 71697 183926 133178
12068A33178J2319k5943k3541J0497o091J8003J20946j38248j96179O6244P0946
$$ 133178 145497 119554 96013 106510 100419 118422 239368 101120 -95059 -28815 42131
12057D2131q5144m6301j77691j94424n3899j10990k247J94095K91220K88876N0880
$$ 42131 -43013 -89314 -267005 -461429 -515328 -626318 -628565 -434470 -143250 145626 196506
12046A96506k43999j62148j50013j24172q350J14243J12366M9468J21224N8396
$$ 196506 -47493 -209641 -359654 -483826 -492176 -377933 -265567 -216099 -94875 -36479
12036c6479R8128J22647K4116j91315o1738j3609r151J51699L8159j64034N9072
$$ -36479 61649 184296 208412 17097 -44641 -58250 -67401 84298 122457 -41577 17495
12025A7495K1753j04993j00851j94310K53096L79408J48608J44475J6880N4590
$$ 17495 39248 -65745 -166596 -360906 -107810 271598 420206 564681 581561 636151
12015F36151m6232j26041j49197j59188k81329j04755K21534J61168j83027o3408
$$ 636151 589919 463878 314681 155493 -125836 -230591 -9057 152111 -30916 -94324
12005i4324J0051J43533k92546l07103O1493J83476K50331J58604J0942j5580
$$ -94324 -84273 59260 -233286 -540389 -478896 -295420 -45089 113515 124457 108877
11995A08877n1283p5062j36647p1094j28063r1911J80149J45384j41963k43092
$$ 108877 57594 -17468 -154115 -225209 -353272 -445183 -265034 -119650 -261613 -504705
11985e04705L4110J79456R8942J4562P802J22771N6365l1815n667O0738k9058
$$ -504705 -470595 -291139 -192197 -177635 -169833 -47062 9303 -22512 -28179 32559 3501
11974C501J94778l5799j91617o5852J39980J38919j20685j17463j52172j02336
$$ 3501 198279 162480 -29137 -94989 44991 183910 63225 -54238 -206410 -308746
11964c08746J19486J96591J68296J34174j1337p7668j64620j57373M8784O8421
$$ -308746 -189260 7331 175627 309801 298464 220796 56176 -101197 -52413 16008
11954A6008j83943o7011K32350K41067K8805j8006J57056J04810o7740k03157
$$ 16008 -167935 -234946 -2596 238471 267276 249270 406326 511136 443396 240239
11944B40239n2718N7209j61269j49003k52459k45321j19935N6588O2860N5692
$$ 240239 187521 244730 83461 -65542 -318001 -563322 -683257 -626669 -563809 -508117
11934e08117L28978L71814J42138M0368P1817J2438j46089o2444O5060L1939k27672
$$ -508117 -179139 192675 334813 375181 446998 459436 313347 250903 315963 347902 120230
11923A20230k77981J17208K63875K83365K08512j73667j35620L4511j13456j6597
$$ 120230 -157751 -40543 223332 506697 715209 541542 405922 440433 326977 310380
11913C10380K3527m0794o4976j16554k2667O9917j3708j44465j36196M1995K03267
$$ 310380 333907 293113 228137 111583 88916 158833 145125 660 -135536 -93541 109726
11902A09726J60215q2053k67321k0531J07044Q1662K56902O1665k11400j15327
$$ 109726 269941 187888 -79433 -99964 7080 88742 345644 407309 195909 80582
11892H0582n3002M4814R4623L42463N3051j55335r1248l2028J6592p3285j96728
$$ 80582 27580 72394 167017 509480 562531 407196 315948 283920 300512 227227 30499
11881C0499k45396l17672j14772J91406K68388N3568J77675J52294m435J49260
$$ 30499 -214897 -532569 -647341 -455935 -187547 -133979 43696 195990 191555 340815
11871C40815O487M2187j4794r5063j05537j54555K3412K92161L34966q8813k97029
$$ 340815 347302 389489 374695 279632 174095 19540 42952 335113 670079 581266 284237
11860B84237r4654o7213n1593J6270O8804J6023L9037l1452k64927j59098p8901
$$ 284237 189583 122370 70777 87047 155851 171874 210911 179459 -85468 -244566 -323467
11849c23467j63287N0284K53954K14589J49094L17731K24884J05408Q6378k58852
$$ -323467 -486754 -436470 -182516 32073 181167 498898 723782 829190 915568 656716
11839F56716m28153j05372R5491K46398K22437o6943j15882k09230j64608J09712
$$ 656716 228563 123191 218682 465080 687517 620574 504692 295462 130854 240566
11829B40566J9082k03877j19800k40411k18557n122J4105J00j23473j04471P0938
$$ 240566 259648 55771 -64029 -304440 -522997 -528119 -514014 -513914 -637387 -741858 -670920
11818f70920M16469L72430K32584K07382j85286k11704J09063J06540J06660j5930
$$ -670920 -254451 117979 350563 557945 372659 160955 270018 376558 483218 467288
11808D67288k62681k77868k00260K3626K1564r6773l983j07978j78102o0993j5238
$$ 467288 204607 -73261 -273521 -249895 -228331 -325104 -329087 -437065 -615167 -676160 -691398
11797f91398K29524L09843J7850O8517K7678j47410o3002j92501n4745J6225k30234
$$ -691398 -461874 -152031 -134181 -65664 -37986 -185396 -248398 -440899 -495644 -479419 -709653
11786g09653k2588L91436K13820J14165J9342m0355l3178j62709o6071r3958J5390
$$ -709653 -732241 -340805 -126985 -12820 6522 -33833 -67011 -229720 -295791 -389749 -374359
11775c74359J67746K55516J65630K6324J04936J39898q6234j94277j88944l28766
$$ -374359 -206613 48903 214533 240857 345793 485691 399457 205180 16236 -312530
11765c12530j97138l2365k8377k573J54112K39854K04671J59543O5174o3654k64174
$$ -312530 -509668 -542033 -570410 -572983 -418871 -179017 25654 185197 250371 186717 -77457
11754g7457m09347m50353k57508J03400L94208L05722n2521N7200N9052J92580
$$ -77457 -486804 -937157 -1194665 -1091265 -697057 -391335 -443856 -386656 -327604 -135024
11744a35024J68354k48897j37570J19074K1316l3440l3715K47407K1726j074j16437
$$ -135024 33330 -215567 -353137 -234063 -212747 -246187 -279902 -32495 -10769 -11843 -128280
11733a28280j50286L1125j26381n4928M8040J41547K14828j3159L8938K50876
$$ -128280 -278566 -247441 -373822 -428750 -380710 -239163 -24335 -37494 1444 252320
11723B52320J63371n1192k63406j97904p1839P3616M04058J76348j76899l31740
$$ 252320 415691 364499 101093 -96811 -168650 -95034 309024 485372 308473 -23267
11713b3267K0907J99762j28026j59516N3671N0180j43838o8026o6792P8890K66288
$$ -23267 -2360 197402 69376 -90140 -36469 13711 -130127 -198153 -264945 -186055 80233
11702H0233O8545j91472k5355K02067p6253j90223j1752J26658J13306n1254k50066
$$ 80233 148778 -42694 -68049 134018 57765 -132458 -144210 -17552 95754 44500 -205566
11691b05566j11899p6916L4877L39936L68690K93404N2518k79698N743K59090
$$ -205566 -317465 -394381 -359504 -19568 349122 642526 695044 415346 421089 680179
11681F80179L7597j85927n49846l15333j50632J08398K09435K96189K35897J08662
$$ 680179 717776 531849 -17997 -333330 -483962 -375564 -166129 130060 365957 474619
11671D74619m971r0301N1293j39157j11613j89133j77185q6847J37847j22644
$$ 474619 469648 379347 430640 291483 179870 -9263 -186448 -273295 -135448 -258092
11661b58092l07914l4243J70775J52106J61943n4590R3772J42971j49605j96913
$$ -258092 -566006 -600249 -429474 -277368 -115425 -170015 -76243 66728 -82877 -279790
11651b79790j44850r0104L6598R2575J4216j59345q1802K23013L71309K78752
$$ -279790 -424640 -514744 -478146 -385571 -371355 -530700 -612502 -389489 -18180 260572
11641B60572L702j14648N1019J12768k1932K5748P781k1177p0898n3153P4677
$$ 260572 264274 149626 200645 313413 291481 317229 325010 303833 232935 179782 254459
11630B54459J11948j15398m8899k8294j97787N8614J02348p428J74669L2908m10295
$$ 254459 366407 251009 202110 173816 -23971 34643 136991 129563 304232 337140 -73155
11619g3155l04988j27682K4033K41938K90582L49281J26120J28268K9136j11750
$$ -73155 -378143 -505825 -481792 -239854 50728 400009 526129 654397 683533 571783
11609E71783j21714j25339q9528n0917N1508J57529L3103O6153K64806k4996j55556
$$ 571783 450069 324730 235202 184285 235793 393322 426425 492578 757384 732388 576832
11598E76832J22524J1997M8221N0027k64034k02750K9525K9842K47509K66247
$$ 576832 699356 711353 759574 809601 545567 342817 372342 402184 649693 915940
11588I15940L7000L3160K70906J85125J38895K22750L35593P35330R59109J096247
$$ 915940 952940 986100 1257006 1442131 1581026 1803776 2139369 2874699 3833808 4930055
11578D930055J495775K287920L438673M744059P043912Q486335N478330k525042
$$ 4930055 6425830 8713750 12152423 16896482 23940394 32426729 37905059 35380017
11570C5380017q140496p866773n614871l615168k334807j734467j014037o58342
$$ 35380017 27239521 19372748 13757877 10142709 7807902 6073435 5059398 4401056
11562D401056n80366m16289m62520n31572m16838l22027j70600n7693J8755K87896
$$ 4401056 3820690 3404401 2941881 2410309 1993471 1671444 1500844 1443151 1461906 1749802
11552A749802L67255J57944J40404J64588K08502J06555j23080j41309j89306
$$ 1749802 2117057 2275001 2415405 2579993 2788495 2895050 2771970 2630661 2441355
11543B441355p3035L48411P28816Q33623J003195P84131m82425j263874j206128
$$ 2441355 2368320 2716731 3445547 4279170 5282365 6066496 5584071 4320197 3114069
11534C114069p88123n18231m19898l08111k03083K794o0915j36955o2548K29702
$$ 3114069 2325946 1807715 1387817 1079706 876623 879417 818502 681547 618999 848701
11524H48701Q3166j11076K8357j51193j7940j26153j46037M0656q3127j14443
$$ 848701 931867 820791 849148 697955 680015 553862 407825 448481 365354 250911
11514B50911m8445o2337j95946l78932l4618O6187N4762J1506J74913K62126K65802
$$ 250911 202466 140129 -55817 -434749 -469367 -403180 -348418 -336912 -161999 100127 365929
11503C65929K02392L3061J9167L9536p6416q3835Q6167J66298L9528j64980K7722
$$ 365929 568321 601382 620549 660085 583669 499834 586001 752299 791827 626847 654569
11492F54569l951p5590R1156L4799l4777n5183j89584j96490o4221J2692R3159
$$ 654569 650618 575028 666184 700983 666206 611023 421439 224949 160728 173420 266579
11481B66579J71123J53302J95174J03268J05674p3267m00976l66016K098J52783
$$ 266579 437702 591004 786178 889446 995120 921853 520877 154861 156959 309742
11471C09742O0552R180O3591j60842p3360K10445M3646k47233n1146l6019l95487
$$ 309742 370294 379474 443065 282223 208863 419308 462954 215721 164575 128556 -266931
11460b66931j72702J55794K17528L61285K0176j66045k99923k38561P4158J66398
$$ -266931 -439633 -283839 -66311 294974 315150 149105 -150818 -389379 -315221 -148823
11450a48823m3851L6843J01537R4519K26451L04823K68503l2490p0220j75026
$$ -148823 -192674 -155831 -54294 40225 266676 571499 840002 807512 737292 562266
11440E62266l07796j85383R368j09680j87216q7715J27613L01430P4338j70199
$$ 562266 254470 69087 78455 -31225 -218441 -306156 -178543 122887 197225 27026
11430B7026j28875R7589J84187l8811j34938k18618J2198R6577J09213j17828
$$ 27026 -101849 -4260 179927 141116 6178 -212440 -200242 -103665 5548 -112280
11420a12280k40651K2790j10736k24410L0681j35168q2956J33647K28117J12568
$$ -112280 -352931 -330141 -440877 -665287 -634606 -769774 -852730 -719083 -490966 -378398
11410c78398O004K8719N8787n2960K3174J30902J53536J70216r169k4093m0417
$$ -378398 -372394 -343675 -284888 -337848 -314674 -183772 -30236 139980 130811 106718 66301
11399F6301k3505l9802J0534L6029p7585j48603J18641L79357K71663j14475m26936
$$ 66301 42796 2994 13528 49557 -28028 -176631 -57990 321367 593030 478555 51619
11388E1619j64401J84295o2400p1893O4086R5376K98241K10989l54925l00848
$$ 51619 -112782 71513 9113 -62780 1306 96682 394923 605912 250987 -49861
11378d9861j8797J72826R3931K1823J20644J8942j94610L905J58798l5904J74602
$$ -49861 -68658 104168 198099 219922 340566 359508 164898 168803 327601 291697 466299
11367D66299J72686j96795q2915J62585J24789J04169j65737l30733j29123m0521
$$ 466299 638985 442190 359275 521860 646649 750818 585081 254348 125225 84704
11357H4704J47466Q588m90386l45666J29724M92511K69582n5512j33702j28973
$$ 84704 232170 240758 -249628 -595294 -465570 26941 296523 241011 107309 -21664
11347b1664o4456J27438L03256K43457M02606L77911M49001M97957N32597Q77616
$$ -21664 -86120 41318 344574 588031 990637 1368548 1817549 2315506 2848103 3725719
11337C725719R48920K63771m70487j023779r85797n31709n51558n82107k17531
$$ 3725719 4674639 4938410 4467923 3444144 2458347 1926638 1375080 792973 575442
11328E75442j2991k0237k37439j60459k75821k70099j34901Q4692l3870j04025
$$ 575442 562451 542214 304775 144316 -131505 -401604 -536505 -451813 -485683 -589708
11318e89708J08746M48123K81804m7018k12315K1831K8519j31641j2479J6229
$$ -589708 -480962 -32839 248965 201947 -10368 11463 39982 -91659 -104138 -87909
11308h7909o8853o8936j26458j67975k319J10754R0124J46783L3234k07204k08313
$$ -87909 -156762 -225698 -352156 -520131 -522450 -411696 -321572 -174789 -141555 -348759 -557072
11297e57072k2729L02932M19308o81j01827l9896J06381O7808j68095r9380J14972
$$ -557072 -579801 -276869 142439 141758 39931 35 106416 174224 6129 -93251 21721
11286B1721K85931K41364J04539O9699Q6213m4079L3083K56489j02427k39729
$$ 21721 307652 549016 653555 723254 809467 765388 798471 1054960 952533 712804
11276G12804l23449l55537o3197N2660r8961j44332M6269r8801j71540O5988J00137
$$ 712804 389355 33818 -29379 23281 -75680 -220012 -173743 -272544 -444084 -378096 -277959
11265b77959J46262J00675N6021K28188K22296Q2861j01772j83079p4510q1593
$$ -277959 -131697 -31022 24999 253187 475483 558344 456572 273493 198983 117390
11255A17390M0092J81791J57230j8570k05261j60094r1889M6660J11811k3248
$$ 117390 157482 339273 496503 477933 272672 112578 20689 67349 179160 155912
11245A55912j0256K1153j58958k44036k83878l01769L3214L85771K82939J6429
$$ 155912 145656 166809 7851 -236185 -520063 -821832 -788618 -402847 -119908 -103479
11235a03479j10129P7866K27455J13984K9454o0266j42856k15118k01536n2695
$$ -103479 -213608 -135742 91713 205697 235151 174885 32029 -183089 -384625 -437320
11225d37320R2323K3026n7227M9530J31099P3946j13160k5320L1610Q298P4422
$$ -437320 -344997 -321971 -379198 -329668 -198569 -124623 -237783 -263103 -231493 -223195 -148773
11214a48773J00798L5382m7715j89569O9557K8453j11188j18137p8686Q9448J17105
$$ -148773 -47975 -12593 -60308 -249877 -180320 -151867 -263055 -381192 -459878 -370430 -253325
11203b53325N5444N1173R7373P8037m3164j17199n3794l2360k27145m8491M702
$$ -253325 -197881 -146708 -49335 28702 -14462 -131661 -185455 -217815 -444960 -493451 -488749
11192d88749r583r1272N5096k8077m5527J29836k1914j03868M2142J73346K64886
$$ -488749 -498332 -589604 -534508 -562585 -608112 -478276 -500190 -604058 -561916 -388570 -123684
11181a23684R4918p1769L7850J43770j77442j71961R2530K31423J17449J30046
$$ -123684 -28766 -100535 -62685 81085 -96357 -268318 -175788 55635 173084 303130
11171C03130J56300n1397O9890J47422L2882k40895k44822P2511k21025m23547
$$ 303130 459430 408033 477923 625345 658227 417332 172510 245021 23996 -399551
11161c99551j29197N1445R0025M2769j6183R101N2259L161o10L5857K6102L2101
$$ -399551 -528748 -477303 -387278 -344509 -360692 -351591 -299332 -296171 -296781 -260924 -234822 -202721
11149b02721N8831r5556j45414K91089L02884M5345l8316J3103j05193j28816
$$ -202721 -143890 -239446 -384860 -93771 209113 254458 216142 229245 124052 -4764
11139d764Q1970l4306l3942L6265L7908n0699J2400l8173k57492j81613r3989
$$ -4764 77206 42900 8958 45223 83131 32432 44832 6659 -250833 -432446 -526435
11128e26435p1113J10669J69703k5521j27694O5064r8324R6052L15601J00527
$$ -526435 -597548 -486879 -317176 -342697 -470391 -405327 -503651 -407599 -91998 8529
11118H529Q8681K79379Q8605n3222o1908k19626k58044k04243J16596L17809J32550
$$ 8529 97210 376589 465194 411972 350064 130438 -127606 -331849 -215253 102556 235106
11107B35106j5803j71055q7126J26j3743J31210J65043L244l323J44711p7551
$$ 235106 219303 48248 -38878 -38752 -52495 78715 243758 247002 243679 388390 310839
11096C10839J512J31522J34839j5952j25448j76184j40636L1917P0994R5136M1430
$$ 310839 312351 443873 578712 562760 437312 261128 120492 152409 223403 318539 359969
11085C59969k274j43012k71515m139O5199J228p2930j33838p6456J75995J87471
$$ 359969 357695 214683 -56832 -60971 4228 5456 -67474 -201312 -277768 -101773 85698
11074H5698P7443N0887O6742l6935j43638k8838K37510K89656R8278j15245j20111
$$ 85698 163141 214028 280770 243835 100197 71359 308869 598525 696803 581558 461447
11063D61447l0570l1110n9894o7386j42406k02803k31619j18422J67174M46663
$$ 461447 430877 399767 339873 272487 130081 -72722 -304341 -422763 -255589 191074
11053A91074L10372j43500k75341k27338L3311M6867P8035J81238J77245J57372
$$ 191074 501446 357946 82605 -144733 -111422 -64555 13480 194718 371963 529335
11043E29335r0942l09509r6470j1829j14466r5673O1156L29738K13577N9193k83706
$$ 529335 438393 128884 32414 20585 -93881 -189554 -128398 201340 414917 474110 190404
11032A90404j58163L6853k2248j39117j7597J68065K16935J16541N0618p6144
$$ 190404 32241 69094 46846 -92271 -109868 58197 275132 391673 442291 366147
11022C66147k03531r972N4685R5408j0247j37709k16169p588K22425M9977j31040
$$ 366147 162616 152644 207329 302737 292490 154781 -61388 -68976 153449 203426 72386
11011G2386J43152K44487J21663j08260o7950n1587o8626j970r7467j30411J66745
$$ 72386 215538 460025 581688 473428 405478 353891 285265 283295 185828 55417 222162
11000B22162K64867q4446l45084k24305o9285j32496j08300j71833q7822J86170
$$ 222162 487029 402583 57499 -166806 -236091 -368587 -476887 -648720 -736542 -550372
10990e50372K05698K59323L9726R889K14408m2983j74907J5306J01527r6968p3315
$$ -550372 -344674 -85351 -45625 -35736 178672 135689 -39218 -23912 77615 -19353 -92668
10979i2668Q573O8767n7778j42281n0761k1149J30122L89418K23924J63301J31512
$$ -92668 -84095 -15328 -73106 -215387 -266148 -287297 -157175 232243 456167 619468 750980
10968G50980l4205o1695j41837k34216k47961j26936q497J22416q9733j3403J90385
$$ 750980 716775 655080 513243 279027 31066 -95870 -104367 18049 -71684 -85087 105298
10957A05298p8387k31288j51979k5924J44848J98463J07750r0844j24800j01137
$$ 105298 26911 -204377 -356356 -382280 -237432 -38969 68781 -22063 -146863 -248000
10947b48000N9759K13591L9792k24425p0268L7608O9644m1532k31779k05457k14710
$$ -248000 -188241 25350 65142 -159283 -229551 -191943 -122299 -163831 -395610 -601067 -815777
10936h15777Q3381J80256j00358l2811K89877K23547J97155J05324L8230P0364
$$ -815777 -732396 -552140 -652498 -685309 -395432 -171885 25270 130594 168824 239188
10926B39188j96931L9974M14201J40571j64404k29510p9425K5404r2278q1012
$$ 239188 42257 82231 496432 637003 472599 243089 163664 189068 96790 15778
10916A5778J77782K5157j43324L9458L10755K73540N940k90127j04698l1494j51091
$$ 15778 193560 218717 75393 114851 425606 699146 705086 414959 310261 278767 127676
10905A27676j88981k4169J69205J81819J66690p6814p2555k08363k23708r3477
$$ 127676 -61305 -85474 83731 265550 432240 355426 282871 74508 -149200 -242677
10895b42677J3130J27668J62667K13640J93121p8224l15716j98712J1768M1609
$$ -242677 -229547 -101879 60788 274428 467549 389325 73609 -125103 -113335 -71726
10885g1726J11790K3878l1521n1180q522L131J10824J79446N4564o0921j64861
$$ -71726 40064 63942 32421 -18759 -27281 -24150 86674 266120 320684 259763 94902
10874I4902j37619k1540K1790J35868K34404k2833l3684j37524k37777M3681K19116
$$ 94902 -42717 -64257 -42467 93401 327805 304972 271288 133764 -104013 -60332 158784
10863A58784O0120M0467R6636O647P5390p0120k75811j80785J33848P2165k20994
$$ 158784 218904 259371 356007 362654 438044 367924 92113 -88672 45176 117341 -103653
10852a03653J30352K36327l4200n7095O7839J4283j513J00402k3412l121l5609
$$ -103653 26699 263026 228826 171731 239570 253853 252340 352742 329330 326209 290600
10841B90600N6240J96897K07486M4464j6776J0272n0208n6364m2989N7083L09207
$$ 290600 346840 543737 751223 795687 778911 789183 738975 682611 639622 696705 1005912
10830A005912K04927J29049J88081m1160l1457J97100N4369k06468k29064P0532
$$ 1005912 1210839 1339888 1527969 1486809 1455352 1652452 1706821 1500353 1271289 1341821
10820A341821K95709M61500P70015Q71890O96661Q76095J406216K136352L186631
$$ 1341821 1637530 2099030 2869045 3740935 4437596 5313691 6719907 8856259 12042890
10811A2042890M748204O310198P323723N451780p94899o260673p223851n857057
$$ 12042890 16791094 23101292 30425015 35876795 35081896 28821223 21597372 15740315
10803A5740315l953580k605292j827764j458013j147437p75532m43549j82229
$$ 15740315 11786735 9181443 7353679 5895666 4748229 3972697 3529148 3346919
10795C346919P790k3392M0381J18951J07145J48826L42374O45796J105839J662302
$$ 3346919 3354709 3331317 3371698 3490649 3597794 3746620 4088994 4734790 5840629 7502931
10785G502931K100008L163367N319271P639436Q661783N117005l201901q570269
$$ 7502931 9602939 12766306 18085577 25725013 34386796 39503801 36301900 27731631
10777B7731631q255821n846021l675445k333008j775980j142275q88580q54349
$$ 27731631 19475810 13629789 9954344 7621336 5845356 4703081 3814501 2960152
10769B960152o35308l35306k09061m86572m48080k43135P358M4287o3443j6352
$$ 2960152 2324844 1989538 1780477 1293905 845825 602690 610048 654335 590892 574540
10759E74540J62085J1051j46138P8146J89324p6999l19083j75371L0460J46606
$$ 574540 736625 747676 601538 679684 869008 792009 472926 297555 328015 474621
10749D74621J88156L2863j71279l70144k31048k2912L1217N6863m4243j41445
$$ 474621 662777 695640 524361 154217 -76831 -99743 -68526 -11663 -55906 -197351
10739a97351l5514o3382M7227L29976M89126J00697k5919Q468m5801m4369K1203
$$ -197351 -232865 -296247 -249020 80956 570082 670779 644860 653328 607527 563158 584361
10728E84361o6672l7696j3256N4030J61559J51161N5140k41607k05579p8810p6982
$$ 584361 517689 479993 466737 520767 682326 833487 888627 647020 441441 362631 285649
10717B85649n616K73638J01253K6097j2437R604m8459o6392P8069K70k59600j22668
$$ 285649 280033 553671 654924 681021 668584 678188 629729 563337 641406 641676 382076 259408
10705B59408L2195J6766J26495L846k12764R6977L33373J23137m5016k17692k8604
$$ 259408 291603 308369 434864 438710 225946 322923 656296 779433 734417 516725 488121
10694D88121q3773l8061K3808K4384l4951j2945K25280J50958p5644O9514J74398
$$ 488121 404348 366287 390095 414479 379528 366583 591863 742821 667177 736691 911089
10683I11089O0633J27925J44737J58293K38873K42024N19590Q69388J149473R33546
$$ 911089 971722 1099647 1244384 1402677 1641550 1883574 2403164 3272552 4422025 5355571
10673E355571j90258j269242j097369p31140p24303m07750k43830j06377K09519
$$ 5355571 5165313 3896071 2798702 2067562 1343259 935509 691679 585302 794821
10664G94821q303K04597N93062K46346j25940l48888k15126j36888j57621j16266
$$ 794821 786518 991115 1584177 1830523 1704583 1355695 1140569 1003681 846060 729794
10654G29794n9386n4433k22833j32062L065O5132J8006k56169M4692K80710J43611
$$ 729794 670408 615975 393142 261080 264145 329277 347283 91114 135806 416516 560127
10643E60127p6j70872k22510J06633N8204m481l7064k3121J79434J63385k2104
$$ 560127 560051 389179 166669 273302 331506 327025 289961 266840 446274 609659 587555
10632E87555j52640k58359j37217j36634l19447o9644P3882M942P4105K1042J975
$$ 587555 434915 176556 39339 -97295 -416742 -486386 -412504 -407562 -333457 -312415 -310440
10621c10440J11902J92960o9812j79475m7142J60119J79904Q4825j09855q4122
$$ -310440 -198538 -5578 -75390 -254865 -302007 -141888 38016 122841 12986 -71136
10611g1136N1772p6012j6002j3811k7226K1633J09044k8664j38153k77845k78747
$$ -71136 -19364 -95376 -111378 -125189 -152415 -130782 -21738 -50402 -188555 -466400 -745147
10600g45147p2618K77461K71758j53536M3483J48745k5065r4074J2494J52965
$$ -745147 -817765 -540304 -268546 -422082 -378599 -229854 -254919 -348993 -336499 -183534
10590a83534r7377m9492k419n5228L674R4012K5014N6891J23234J69834j70011
$$ -183534 -280911 -330403 -332822 -388050 -384376 -290364 -265350 -208459 -85225 84609 -85402
10579h5402l67610K6120K06896O3889q1470J37219N9387r394O2660J05347K5322
$$ -85402 -453012 -426892 -219996 -156107 -237577 -100358 -40971 -50365 12295 117642 142964
10568A42964Q3911p8329k65668j92974R3506J33842o2619j01814n3458j4151J04158
$$ 142964 226875 148546 -117122 -310096 -216590 -82748 -145367 -247181 -300639 -314790 -210632
10557b10632J58609N2927k59634l06297j10073j43484M0156L84450K93466J61263
$$ -210632 -52023 904 -258730 -565027 -675100 -818584 -778428 -393978 -100512 60751
10547F0751l4696j19299j88762J96329K58800J38193j59333j32168l3078n8835
$$ 60751 26055 -93244 -282006 -85677 173123 311316 151983 19815 -13263 -72098
10537g2098j00085n2172m0750j086l5389o1612j16073n3763L19082L50158K16504
$$ -72098 -172183 -224355 -265105 -266191 -301580 -363192 -479265 -533028 -213946 136212 352716
10526C52716J71332o4855n9870p9109j37541q2743j4024K71242J38288j67307
$$ 352716 524048 459193 399323 320214 182673 99930 85906 357148 495436 328129
10516C28129l91108k43047L2688N5655n5837L4835J14192R8416O3067l7551J23306
$$ 328129 -62979 -306026 -273338 -217683 -273520 -238685 -124493 -26077 36990 -561 122745
10505A22745R8160j8443K38623N7525j92091j99916M239K621m3806O0696J71508
$$ 122745 220905 202462 441085 498610 306519 106603 110842 113463 69657 130353 301861
10494C01861J43389p4811M3997K29457J23068r6640j98P0344l0832P6343M9579
$$ 301861 445250 370439 414436 643893 766961 670321 670123 740467 709635 785978 835557
10483H35557q2190p9748J529j62637k13965j92455j14132Q8206J01485R1184J65591
$$ 835557 753367 673619 675148 512511 298546 106091 -8041 80165 181650 272834 438425
10472D38425n2212L2623J8546j27325j3378J41303K67900J05380o7075L2623R8600
$$ 438425 386213 418836 437382 310057 296679 437982 705882 811262 744187 776810 875410
10461H75410J99970J47403R4249p9304j76308J08567K66919L56684L19491M17559
$$ 875410 1075380 1222783 1317032 1237728 1061420 1169987 1436906 1793590 2113081 2530640
10451B530640P10221J024215J719209K150254K769148M176933O147126Q277366
$$ 2530640 3240861 4265076 5984285 8134539 10903687 15080620 21227746 29505112
10443B9505112P750594J134849o654115q549685o791772m488827k970064k128074
$$ 29505112 37255706 38390555 31736440 23186755 16394983 11906156 8936092 6808018
10435F808018j556836j094603q14392o00025l74316l79339k83566j90882k37896
$$ 6808018 5251182 4156579 3342187 2742162 2367846 1988507 1704941 1514059 1276163
10426A276163k29121j48269J8157l9069k32770k11443K5272O4428J17216J39065
$$ 1276163 1047042 898773 916930 877861 645091 433648 458920 523348 640564 779629
10416G79629J25239P9541n3560J2666j6201j39413L9541J64976J09206o7570k45665
$$ 779629 904868 984409 930849 943515 927314 787901 827442 992418 1101624 1034054 788389
10405G88389p5625N2977p415O3867K76747m5721m11014m13953k89859j44851Q8258
$$ 788389 712764 765741 758326 822193 1098940 1053219 642205 228252 -61607 -206458 -118200
10394a18200J87287J07137j39664o7549O0203Q7404J51270J43554j807j27642
$$ -118200 69087 176224 36560 -30989 29214 116618 267888 411442 409635 281993
10384B81993o1273K3639j56564j88330N75K40988R1756k18776r3979N7266r7216
$$ 281993 220720 244359 87795 -100535 -99960 141028 232784 14008 -79971 -22705 -119921
10373a19921p8368J35705J7443j09456P2004Q1198Q1136J9249m2401M9462J53967
$$ -119921 -198289 -62584 -45141 -154597 -82593 -1395 79741 98990 56589 106051 260018
10362B60018N1354j67434k71844p4977l822J5555k0071j4014K0354M4694L79462
$$ 260018 311372 143938 -127906 -202883 -206705 -191150 -211221 -225235 -204881 -160187 219275
10351B19275J45570j77185J16849L82070J882r1755q5905j8856r0823k05978k84861
$$ 219275 364845 187660 304509 686579 688461 596706 510801 491945 401122 195144 -89717
10340h9717m27198k32781k2875R8575J19367K85395K68657Q8699j52918j10866
$$ -89717 -516915 -749696 -772571 -673996 -554629 -269234 -577 88122 -64796 -175662
10330a75662r3794N3260J48132r083L9507j7717j14583j08288j2151K89820J34840
$$ -175662 -269456 -216196 -68064 -77147 -37640 -55357 -169940 -278228 -290379 -559 134281
10319A34281P3018k8530r2710L39478P18572J097323J503833J308410J62463r49215
$$ 134281 207299 178769 86059 425537 1144109 2241432 3745265 5053675 5216138 4266923
10309D266923j051407p27921p30286n89093m86731j38796m5738l26922j97522
$$ 4266923 3215516 2487595 1757309 1168216 681485 542689 496951 170029 -27493
10300b7493J15717Q9094J09452P9205O5348O9414m5094p1704k52598J37757K68330
$$ -27493 88224 177318 286770 365975 431323 500737 455643 383939 131341 269098 537428
10289E37428k1706j49203k9992J477r1483j6346O5507q6664j05319L3792J92957
$$ 537428 515722 366519 336527 338004 246521 230175 295682 209018 103699 137491 330448
10278C30448J58881j01414j65253k44045l6372P4712J51897K59611j7503Q895
$$ 330448 489329 387915 222662 -21383 -57755 16957 168854 428465 410962 419857
10268D19857j73489k59327j53464m520l3364N7977M2104m1830j56305j84967J64359
$$ 419857 246368 -12959 -166423 -170943 -204307 -146330 -104226 -146056 -302361 -487328 -322969
10257c22969M14353K17879m1433j13030k36421k7084J50829J93252N2535j87250
$$ -322969 91384 309263 267830 154800 -81621 -108705 42124 235376 287911 100661
10247A00661j63233n8988J55025P8705J98355K66453J34656J78862J25759j22359
$$ 100661 -62572 -121560 33465 112170 310525 576978 711634 890496 1016255 893896
10237H93896r8210o3965j91051k91036j11314J50157O2371j56249j26594k4512
$$ 893896 795686 731721 540670 249634 138320 288477 350848 194599 68005 43493
10227D3493O9159o9457q5834K1393J91013J22197L662p9788q0660j22419j19354
$$ 43493 112652 43195 -42639 -21246 169767 291964 295626 215838 135178 12759 -106595
10216a06595Q2824O2018L7982K00348J85164K8688l893p8957j14543k06480k05132
$$ -106595 -23771 38247 76229 276577 461741 490429 486536 407579 293036 86556 -118576
10205a18576j59127j87822j17224J72637J64951Q8563j75483p1313j71045j28391
$$ -118576 -277703 -465525 -582749 -410112 -245161 -156598 -332081 -403394 -574439 -702830
10195g02830L29930L20100N5881O278L206M1688J20972j17135j12462J40373J87947
$$ -702830 -372900 -52800 3081 9359 12565 54253 175225 58090 -54372 86001 273948
10184B73948J22263m2819k83497K6338L11885K2327j03462K6609j49551j28518
$$ 273948 396211 353392 69895 96233 408118 430445 326983 353592 204041 75523
10174G5523J61564J66938j91301l99382j87872n9079P3268J60981N1774j32784
$$ 75523 237087 404025 212724 -186658 -374530 -433609 -360341 -199360 -147586 -280370
10164b80370m4911R4058J68741L3506n8507j83262j18204J17849L44609L55681
$$ -280370 -325281 -231223 -62482 -28976 -87483 -270745 -388949 -271100 73509 429190
10154D29190R8812o6434l59624k06589J67993M9252j43848j83232j7626J26653
$$ 429190 528002 461568 101944 -104645 63348 112600 -31248 -214480 -232106 -105453
10144a05453K13194J10772J17867k23532k48423O2985O9885J1997R2184p1415
$$ -105453 107741 218513 336380 112848 -135575 -72590 -2705 9292 101476 30061
10134C0061r758j14488k4066L0244N6861M7095j06165J11813K26842J27405j7481
$$ 30061 20303 -94185 -118251 -88007 -31146 15949 -90216 21597 248439 375844 358363
10123C58363j01657k693M171q122j94361k79031l32248j54910J69669J87567K97757
$$ 358363 256706 254013 258184 250062 55701 -223330 -555578 -710488 -540819 -353252 -55495
10112e5495K39156j807l3334m3151m743J26782Q6075J09585j21203l51806k32059
$$ -55495 183661 181854 148520 105369 100626 227408 313483 423068 301865 -49941 -282000
10101b82000k8489R1026q140j91020j17565J31858L82695L00009q0604m07278
$$ -282000 -310489 -219463 -227603 -418623 -536188 -404330 -21635 278374 197770 -209508
10091b09508m00194P0114J95627Q2184J2028n5931l3115j95618k9475M93733L10321
$$ -209508 -609702 -539588 -343961 -261777 -249749 -305680 -338795 -534413 -563888 -70155 240166
10080B40166k1774R2306J68105K52758J63150J51173O00j29050k39453l64894
$$ 240166 218392 310698 478803 731561 894711 1045884 1046484 917434 677981 313087
10070C13087l13703j51063J85991r6365j59229R9618J87831J1709l76721l98454
$$ 313087 -616 -151679 34312 -62053 -221282 -121664 66167 77876 -298845 -697299
10060f97299r3148Q1813Q444J89896K48379J93346K55358K3749q8218k30303l18741
$$ -697299 -790447 -708634 -700190 -510294 -261915 -68569 186789 210538 122320 -107983 -426724
10049d26724j19521J14389K42483l7661k22570j41301K9739k2468J2940J91743
$$ -426724 -546245 -431856 -189373 -227034 -449604 -590905 -561166 -583634 -570694 -378951
10039c78951o59o8079k50369k26862J29057J06597K92809K87216r7580j86106
$$ -378951 -379610 -447689 -698058 -924920 -795863 -689266 -396457 -109241 -206821 -392927
10029c92927O7892m4839q3035K37554K33412k2587j67176l9256R2347k9080j7888
$$ -392927 -325035 -369874 -452909 -215355 18057 -4530 -171706 -210962 -118615 -147695 -165583
10018a65583P9149P6025J1726R3129K09995j54784k70470K8154K01684J71734
$$ -165583 -86434 -10409 1317 94446 304441 149657 -120813 -92659 109025 280759
10008B80759K1638n0951p1786j13244j53649k28896n4861m4741K7834J83623J17463
$$ 280759 302397 251446 179660 66416 -87233 -316129 -370990 -415731 -387897 -204274 -86811
9997h6811L797o4873n4057K96812M18953n6945k83799p8728N4295J56610M4214
$$ -86811 -83014 -147887 -201944 94868 513821 456876 173077 94349 148644 305254 349468
9986C49468j00843M3545J49239k23600p0892J95463K30356J02260r6451j84278
$$ 349468 248625 292170 441409 217809 146917 342380 572736 674996 578545 394267
9976C94267m2080j28014j9316J74489j103p1305q1281j4659j1169J00975J09601
$$ 394267 352187 224173 204857 379346 378243 306938 225657 210998 199829 300804 410405
9965D10405j58693l81786J5360K08545o668k74064k28659j8310J10066N2305R4470
$$ 410405 251712 -130074 -114714 93831 87163 -186901 -415560 -433870 -323804 -271499 -177029
9954a77029J15985R6023J9400q1143k72738j96745J60905P9055j18572n0764P4504
$$ -177029 -61044 34979 54379 -26764 -299502 -496247 -335342 -256287 -374859 -425623 -351119
9943c51119J99473K33853J63007k0158k36574k1658J39785R5097l0025j12930
$$ -351119 -151646 82207 245214 225056 -11518 -33176 106609 201706 171681 58751
$$ [...]
##END NTUPLES=NMR SPECTRUM
##END=
