##TITLE=C13_SL64-DAU(f8)-dry
 CDCl3, 21600 sc

 18.10.2022
##JCAMPDX= 6.0         $$ Bruker NMR JCAMP-DX V2.0
##DATA TYPE= NMR SPECTRUM
##DATA CLASS= NTUPLES
##ORIGIN= UXNMR, Bruker Analytische Messtechnik GmbH
##OWNER= root
$$ XWIN-NMR		Version 3.5
$$ Wed Oct 19 13:49:54 2022 Russian Standard Time (UT+4h)  she@DPX200
##.OBSERVE FREQUENCY= 50.327896
##.OBSERVE NUCLEUS= ^13C
##.ACQUISITION MODE= SIMULTANEOUS
##.ACQUISITION SCHEME= undefined
##.AVERAGES= 21601
##.DIGITISER RES= 17
##SPECTROMETER/DATA SYSTEM= spect
##.PULSE SEQUENCE= zgpg30
##.SOLVENT NAME= DMSO
##.SHIFT REFERENCE= (INTERNAL, DMSO, 0, 222.653)
##AUDIT TRAIL= $$ (NUMBER, WHEN, WHO, WHERE, WHAT)
$$ ##TITLE= Audit trail, XWIN-NMR		Version 3.5
$$ ##JCAMPDX= 5.01
$$ ##ORIGIN= Bruker BioSpin GmbH
$$ ##OWNER= she
$$ F:/spectra/data/she/nmr/c13/1/pdata/1/auditp.txt
$$ ##AUDIT TRAIL=  $$ (NUMBER, WHEN, WHO, WHERE, WHAT)
(   1,<2022-10-19 13:48:08.12 +0400>,<she>,<DPX200>,
      <created by zg, POWCHK disabled, PULCHK disabled
       terminated by command 'halt'
       configuration hash MD5:
       00 E9 B6 7A A2 85 ED C7 34 08 36 98 17 FE 4E 26
       data hash MD5: 32K
       C2 65 FD D4 A3 CB 04 B1 A6 33 BC 0D 56 D2 6F B1>)
(   2,<2022-10-19 13:48:12.54 +0400>,<she>,<DPX200>,
      <Start of raw data processing
       efp BC_mod = 2 LB = 1 FT_mod = 6 PKNL = 1 PHC0 = -313.879 PHC1 = 34.88469 SI = 32K 
       data hash MD5: 32K
       BF 3E 0E BB 3C 72 EB 7B 59 62 E5 E9 78 71 77 BD>)
(   3,<2022-10-19 13:48:15.09 +0400>,<she>,<DPX200>,
      <abs ABSG = 5 
       data hash MD5: 32K
       D5 A5 0E 08 5F 2F 13 67 E5 2E 96 CC 7C 9C F6 F9>)
(   4,<2022-10-19 13:48:59.64 +0400>,<she>,<DPX200>,
      <pk PHC0 = 0.7080126 PHC1 = 0 
       data hash MD5: 32K
       3F 5D 8B C7 E8 0F FA CA E8 BB 11 D7 9F E0 6A CE>)
(   5,<2022-10-19 13:49:03.28 +0400>,<she>,<DPX200>,
      <abs ABSG = 5 
       data hash MD5: 32K
       0F 27 A6 D0 B8 CE 08 D0 9F 6C C8 53 A8 FA 4C 75>)
$$ ##END=
$$ 
$$ hash MD5
$$ 01 87 AB D7 64 C2 E4 22 CB 35 E6 D6 D1 EF 50 E1
##$RELAX= 
##$RELAX= 
##$RELAX= 
##$RELAX= 
##$RELAX= 
##$RELAX= 
##$RELAX= 
##$RELAX= 
$$ Bruker specific parameters
$$ --------------------------
##$DU= <F:/spectra>
##$EXPNO= 1
##$NAME= <c13>
##$PROCNO= 1
##$TYPE= <nmr>
##$USER= <she>
##$AMP= (0..31)
100 100 100 100 100 100 100 100 100 100 100 100 100 100 100 100 100 100 
100 100 100 100 100 100 100 100 100 100 100 100 100 100 
##$AQSEQ= 0
##$AQ_mod= 1
##$AUNM= <au_zg>
##$AUTOPOS= <>
##$BF1= 50.322709
##$BF2= 200.13
##$BF3= 50.322709
##$BF4= 500.13
##$BF5= 500.13
##$BF6= 500.13
##$BF7= 500.13
##$BF8= 500.13
##$BYTORDA= 1
##$CFDGTYP= 0
##$CFRGTYP= 5
##$CHEMSTR= <none>
##$CNST= (0..31)
1 1 145 1 1 1 1 1 1 1 1 1 1 1 1 1 1 1 1 1 1 1 1 1 1 1 1 1 1 1 1 1 
##$CPDPRG= <waltz16>
##$CPDPRG1= <>
##$CPDPRG2= <waltz16>
##$CPDPRG3= <>
##$CPDPRG4= <mlev>
##$CPDPRG5= <mlev>
##$CPDPRG6= <mlev>
##$CPDPRG7= <mlev>
##$CPDPRG8= <mlev>
##$CPDPRGB= <>
##$CPDPRGT= <>
##$D= (0..31)
$$ [...]
##$SUBNAM4= <"">
##$SUBNAM5= <"">
##$SUBNAM6= <"">
##$SUBNAM7= <"">
##$SUBNAM8= <"">
##$SUBNAM9= <"">
##$SW= 239.972175391363
##$SWIBOX= (0..15)
0 1 3 0 0 0 0 0 0 0 0 0 0 0 0 0 
##$SW_h= 12077.2946859903
##$TD= 32768
##$TD0= 1
##$TE= 0
##$TE2= 300
##$TE3= 300
##$TEG= 300
##$TL= (0..7)
120 120 120 120 120 120 120 120 
##$TP= (0..7)
150 150 150 150 150 150 150 150 
##$TP07= 0
##$TPNAME0= <>
##$TPNAME1= <>
##$TPNAME2= <>
##$TPNAME3= <>
##$TPNAME4= <>
##$TPNAME5= <>
##$TPNAME6= <>
##$TPNAME7= <>
##$TPOAL= (0..7)
0.5 0.5 0.5 0.5 0.5 0.5 0.5 0.5 
##$TPOFFS= (0..7)
0 0 0 0 0 0 0 0 
##$TUNHIN= 0
##$TUNHOUT= 0
##$TUNXOUT= 0
##$USERA1= <user>
##$USERA2= <user>
##$USERA3= <user>
##$USERA4= <user>
##$USERA5= <user>
##$V9= 5
##$VALIST= <valist>
##$VCLIST= <CCCCCCCCCCCCCCC>
##$VD= 0
##$VDLIST= <DDDDDDDDDDDDDDD>
##$VPLIST= <PPPPPPPPPPPPPPP>
##$VTLIST= <TTTTTTTTTTTTTTT>
##$WBST= 1024
##$WBSW= 4
##$XGAIN= (0..3)
0 0 0 0 
##$XL= 0
##$YL= 0
##$YMAX_a= 129968593
##$YMIN_a= -31164183
##$ZGOPTNS= <>
##$ZL1= 120
##$ZL2= 120
##$ZL3= 120
##$ZL4= 120
##$ABSF1= 222.6533
##$ABSF2= -17.34351
##$ABSG= 5
##$ABSL= 3
##$ALPHA= 0
##$AQORDER= 0
##$ASSFAC= 0
##$ASSFACI= 0
##$ASSFACX= 0
##$ASSWID= 0
##$AUNMP= <proc_1d>
##$AZFE= 0.1
##$AZFW= 0.5
##$BCFW= 0
##$BC_mod= 2
##$BYTORDP= 0
##$COROFFS= 0
##$CY= -3
##$DATMOD= 1
##$DC= 0
##$DFILT= <>
##$DTYPP= 0
##$F1P= 0
##$F2P= 0
##$FCOR= 0.5
##$FTSIZE= 32768
##$FT_mod= 6
##$GAMMA= 0
##$GB= 0
##$INTBC= 1
##$INTSCL= 4.134877e-10
##$ISEN= 128
##$LB= 1
##$LEV0= 0
##$LPBIN= 0
##$MAXI= 10000
##$MC2= 0
##$MEAN= 0
##$ME_mod= 0
##$MI= 0.1934396
##$NCOEF= 0
##$NC_proc= 3
##$NLEV= 6
##$NOISF1= 120.0001
##$NOISF2= 80.00006
##$NSP= 0
##$NTH_PI= 0
##$NZP= 0
##$OFFSET= 222.6533
##$PC= 1.4
##$PHC0= -313.171
##$PHC1= 34.88469
##$PH_mod= 1
##$PKNL= yes
##$PPARMOD= 0
##$PSCAL= 0
##$PSIGN= 0
##$REVERSE= no
##$SF= 50.322730123286
##$SI= 32768
##$SIGF1= 140
##$SIGF2= 120
##$SINO= 11.81781
##$SIOLD= 32768
##$SREGLST= <13C.CDCl3>
##$SSB= 0
##$STSI= 32768
##$STSR= 0
##$SW_p= 12077.2946859903
##$SYMM= 0
##$S_DEV= 0
##$TDeff= 32768
##$TDoff= 0
##$TI= <>
##$TILT= no
##$TM1= 0
##$TM2= 0
##$TOPLEV= 0
##$USERP1= <user>
##$USERP2= <user>
##$USERP3= <user>
##$USERP4= <user>
##$USERP5= <user>
##$WDW= 1
##$XDIM= 32768
##$YMAX_p= 277541450
##$YMIN_p= -1237880
$$ End of Bruker specific parameters
$$ ---------------------------------
##NTUPLES= NMR SPECTRUM
##VAR_NAME=  FREQUENCY,     SPECTRUM/REAL,   SPECTRUM/IMAG
##SYMBOL=    X,             R,               I
##VAR_TYPE=  INDEPENDENT,   DEPENDENT,       DEPENDENT
##VAR_FORM=  AFFN,          ASDF,            ASDF
##VAR_DIM=   32768,         32768,           32768
##UNITS=     HZ,            ARBITRARY UNITS, ARBITRARY UNITS
##FACTOR=    0.368581032318806, 1,           1
##FIRST=     11204.5221812756, 0,            0
##LAST=      -872.772504714734, 0,           0
##MIN=       -872.772504714734, -1237880,    0
##MAX=       11204.5221812756, 277541450,    0
$$ Real data points
##PAGE= N=1
##DATA TABLE= (X++(R..R)), XYDATA
$$ [...]
18227 161327 121940 -71378 -96421 -197524 -284313 -152021 5745 6064 140224 247695 272629
18216 272629 90503 -34314 -25136 41131 82540 76254 117064 184409 368390 554780 416358
18205 416358 228942 251260 260386 111563 -32401 -231280 -422436 -516865 -524623 -444135 -251481
18194 -251481 66054 122438 -139799 -454632 -492004 -367248 -340702 -416878 -361313 -154481
18184 -154481 59076 341903 726773 1021782 892838 578988 439429 390441 295583 206826
18174 206826 258359 157187 168209 -259 -307781 -334935 -290607 -160482 -3175 16801
18164 16801 -57851 -273408 -360449 -241002 -110921 -57250 -94151 -72139 17689 265593 324667
18153 324667 320270 402386 386400 468142 595015 578410 428637 435937 565022 364073 37309
18142 37309 -104853 -224467 -344817 -252830 -62549 -98065 -46084 37219 133864 311627 297602
18131 297602 189860 185478 -56404 -187239 -20158 155203 248681 169927 133091 110664 54495
18120 54495 58541 -138956 -279061 -265496 -198802 -137981 -72359 22840 -14334 -104130 -209076
18109 -209076 -172784 122583 384574 401329 317955 329375 256293 188314 151611 -71279 -203499
18098 -203499 -78026 182550 333711 219680 -55021 -199575 -5273 182226 270173 247173
18088 247173 230953 38440 -280162 -286959 -218445 -232397 -298722 -317467 -228496 13570 118996
18077 118996 -71753 -268680 -278506 -314118 -450106 -464127 -343548 -140580 -23072 -87147
18067 -87147 21629 146444 177507 -52960 -97260 118806 1185 3448 75983 -96223 -263470
18056 -263470 -237434 -75289 65137 169028 220397 113700 -158213 -221985 -303289 -289495
18046 -289495 -22870 52885 54504 100946 228084 371392 490914 718802 763934 679842 606695
18035 606695 434174 42949 -164805 -217661 -529952 -813114 -884773 -603268 -238834 -149120
18025 -149120 -411762 -517763 -232582 29977 58476 29175 -84896 -20936 168119 251019
18015 251019 253165 51089 54188 294759 568652 591105 514860 257909 -118253 -197114 85629
18004 85629 358584 432612 297639 218252 150648 166404 365314 265939 120609 203064 321367
17993 321367 203505 91324 -28088 -13656 31264 -70861 -236972 -238804 -354257 -357700 -163134
17982 -163134 -162505 -194957 -112371 -57854 95886 145169 109813 146164 117297 118554 85196 97339
17970 97339 162001 197975 75108 -229759 -353969 -240670 -100052 -215117 -506289 -365786
17960 -365786 -218574 -47534 205236 310671 432300 462977 438949 356145 184786 125324
17950 125324 189755 170831 -77120 -158892 -65171 140204 141844 259500 423953 409450 316525
17939 316525 343484 410189 441391 414638 248963 104733 243894 522566 440633 205711
17929 205711 71531 -60595 -225266 -276895 -268647 -375007 -358061 -75458 7818 -211465
17919 -211465 -426127 -440666 -273392 -79400 58936 35665 -189845 -184985 26097 113548
17909 113548 -66885 -65483 22015 -59544 -119534 5627 111075 60352 43549 -39144 -86019
17898 -86019 -118521 -137732 -116109 -87799 20402 96132 -66278 -141388 4440 156411 255222
17887 255222 290248 100096 23738 171130 131873 98834 291829 437384 234328 105548
17877 105548 -11434 -206349 -261693 -218706 -234255 -259991 -257866 -237286 -77398 151743 279488
17866 279488 193567 14280 -238685 -410042 -449594 -371315 -434586 -425271 -345818 -376678 -387698
17855 -387698 -356471 -304340 -130816 -25578 -53979 -235374 -319489 -292501 -252506 -975 269063
17844 269063 576058 726575 584484 352621 248079 185810 219289 272533 181600 72213
17834 72213 -70488 -233648 -214199 -245750 -431121 -423575 -376567 -462029 -535035 -447400 -246133
17823 -246133 21840 247446 89371 -85002 -38575 129745 298660 284562 -21846 -278765
17813 -278765 -376996 -380950 -333569 -148213 143499 192589 95012 -195118 -336614 -379234 -315343
17802 -315343 -333330 -351735 -285360 -193718 -270555 -483475 -266738 91794 240915 262088 319354
17791 319354 186832 32926 61501 144374 147649 29105 -103481 -133882 -189844 -182179 -39876
17780 -39876 40296 118702 267129 376421 429748 369427 165405 -16173 -20464 -108668 -224148
17769 -224148 -316800 -299103 -187553 -109158 -78015 -72864 -166697 -120876 -54233 -11437 9902
17758 9902 -72787 -210566 -166672 -91664 -263767 -354749 -225753 4376 76878 10239 -92565
17747 -92565 -1987 71185 110273 262939 237215 -96792 -342504 -127544 66595 247176
17737 247176 269671 71655 -58213 -92946 -167175 -379410 -619894 -664461 -790299 -788938 -532052
17726 -532052 -339624 -228412 -216809 -112163 -80947 63465 173766 83001 36210 22806
17716 22806 -26727 -94160 135573 287521 461964 625908 662648 738438 711335 395016 -128866
17705 -128866 -329112 -268744 -104227 145171 347552 409460 476087 451716 289754 249948
17695 249948 121925 3998 -22099 -24379 -57451 33742 176527 132037 -91912 -378673 -471997
17684 -471997 -332668 -19552 266655 131293 -194961 -225743 -101874 165711 327343 339158
17674 339158 386675 437064 405784 142716 17553 38294 -40623 -9638 -40910 -172886 -67450
17663 -67450 142030 278703 303581 194945 -115998 -295896 -306546 -278229 -51491 315626
17653 315626 495507 517949 498330 323429 198412 168195 65849 -26167 -175947 -302101
17643 -302101 -358486 -447784 -507040 -584509 -468913 -212150 -203493 -482463 -574302 -520147 -225232
17632 -225232 49762 64928 132979 257067 122413 -251570 -489301 -567998 -528100 -424889
17622 -424889 -271310 -265694 -190830 -75265 -14895 -135384 -260280 -295916 -192452 -214464 -194992
17611 -194992 125023 359890 382033 141574 134201 371329 474455 389031 532609 632374
17601 632374 586662 516732 517136 723121 826469 715158 587139 541004 590859 815130 1263923
17590 1263923 1851258 2417874 2989048 3367870 2874511 1916848 1260201 1027920 920542
17581 920542 926127 959646 1066142 898704 711784 636190 598396 783196 860215 888890 940057
17570 940057 1122376 1372596 1370738 1425162 1649269 2119087 2761956 3425749 3550101 2899757
17560 2899757 2055894 1747690 1770585 1645977 1372038 976987 779973 771035 782081 856869
17550 856869 812536 730617 650785 569000 396779 244568 -2431 -334332 -575748 -490930
17540 -490930 -102422 -30755 -321474 -357009 -46540 117205 74383 -23939 -99069 -49380 11640
17529 11640 -52499 26530 119918 12187 -115456 -39600 95394 -76626 -143261 -53935 -80441
17518 -80441 -103069 13132 78720 -156026 -383188 -446169 -482791 -473482 -260105 -60372 -20615
17507 -20615 -27207 -34531 -193060 -342457 -268791 -213259 -147620 -136745 -148291 -244540 -294009 -214920
17495 -214920 -208864 -39624 255791 421912 438995 239633 252817 411890 438448 456595 395929
17484 395929 150952 -44087 28412 85255 -37099 -19506 -90627 -132043 35227 269507
17474 269507 437042 365588 36197 -220643 -201369 15396 5414 -238308 -170751 -132274 -138286
17463 -138286 -39941 267427 449504 375595 295598 187532 -13722 -165022 -266636 -214111
17453 -214111 -213155 -349725 -276197 -218910 -282588 -221070 -172344 -42772 -50630 51792 126189
17442 126189 207174 475258 567454 378209 259685 142824 -150421 -416709 -408822 -339498
17432 -339498 -219656 -178990 -262870 -348637 -365810 -345687 -362841 -156851 64157 34723 -71616
17421 -71616 -303 60766 61206 8244 177434 322501 267900 52473 -148258 -221438 -295636
17410 -295636 -317199 -286173 -274826 -609014 -867145 -843130 -589197 -326736 -165915 39047
17400 39047 17371 -109195 -57418 158034 270831 245183 286627 291225 101095 -190279 -378647
17389 -378647 -496955 -818174 -1011387 -828773 -750732 -767223 -599271 -312752 -208043 -209621
17379 -209621 -162683 -107152 -211163 -363812 -575451 -630963 -494810 -298706 -157701 -186222
17369 -186222 -71957 -14837 99779 217723 215684 167203 62150 81793 -156639 -538068
17359 -538068 -735152 -647975 -407874 -225335 -217720 -347417 -436057 -506075 -617290 -533586 -464734
17348 -464734 -368188 -292748 -355388 -465316 -468396 -351676 -319349 -320482 -364462 -356284 -197222
17337 -197222 -136288 -19848 130612 333394 399318 328764 212586 -64627 -108069 -154186
17327 -154186 -395511 -410928 -331127 -185038 80121 249562 231700 279774 256086 183591 217539
17316 217539 172339 66939 -60136 -230618 -246926 -182524 -205099 -474018 -559663 -391926
17306 -391926 -300084 -81347 -123245 -226148 -266488 -236380 -123866 281979 528992 563121
17296 563121 404260 252053 272413 309766 259200 95003 -123809 -84926 149955 82653
17286 82653 -101872 -23751 124664 -6988 -290256 -489839 -577000 -535931 -381696 -279671
17276 -279671 -67403 -74498 -206459 -210186 -57717 157868 212313 52607 -159638 -193546 -189681
17265 -189681 -305600 -229333 -163633 -122716 -13758 -47592 -12941 -40716 -174924 -179913 -252637
17254 -252637 -425907 -642966 -805438 -769329 -578543 -354788 -221708 -138610 -156004 -250683
17244 -250683 -332680 -353026 -433755 -558357 -581781 -355767 -121402 -86911 -25138 218255 292804
17233 292804 28665 -188223 -217026 -57029 -24597 -281612 -231927 -62908 -52332 -79908
17223 -79908 -114156 443 14154 -12069 41429 104925 -67551 -98581 221620 356907 261183
17212 261183 -24233 -255562 -346420 -341536 -333034 -261795 -204348 -256959 -299065 -409374 -436205
17201 -436205 -353057 -273817 -330758 -371920 -307144 -166163 30208 45107 -74493 -323934 -559984
17190 -559984 -637828 -522546 -504447 -483026 -257471 1271 198459 95941 -83838 -108504
17180 -108504 -22498 131091 90410 9963 114766 194669 24012 -36094 -37947 -298729 -520652
17169 -520652 -455773 -188316 -28657 -195322 -261784 -248419 -408812 -607472 -579106 -590872
17159 -590872 -564868 -427387 -396876 -167171 14304 -21209 -180435 -328626 -477191 -619022
17149 -619022 -479848 -213636 -169597 -359687 -438389 -465949 -317453 -47354 85263 -14928
17139 -14928 -32223 99080 109683 -8705 -100590 -24236 151206 139092 59028 -174150 -265331
17128 -265331 -242815 -231866 -62993 -47374 -286372 -547434 -439956 -357395 -420913 -248797
17118 -248797 -141900 52973 330756 341415 378664 449435 216484 154357 123065 83237 -35600
17107 -35600 -226143 -89148 75532 -1231 -38945 103316 131442 59876 95249 94450 -146527
17096 -146527 -380766 -656086 -612406 -436455 -477508 -520743 -437392 -354092 -209071 -34241
17086 -34241 -699 -37129 54876 174459 74099 -142605 -25091 99161 109597 158016 56239
17075 56239 23194 128912 93189 8467 -25682 24271 49426 -133692 -347401 -409357 -90329
17064 -90329 64926 -125284 -154111 -171400 -258733 -326826 -315392 -256198 -193846 -106759 70506
17053 70506 182777 100213 76841 41560 38669 -20915 -187180 -103491 65177 158533 102935
17042 102935 -167856 -343678 -308925 -286845 -150000 -136436 -101611 -46802 -141058 -327676 -221772
17031 -221772 180709 271239 202852 319020 355851 125129 -64924 -137886 -83594 -73888 37812
17020 37812 145975 125400 77084 62643 204825 277470 323113 555946 574011 467057 364490
17009 364490 139977 74301 81485 59 17777 171814 409426 296689 7433 -34348 -12723
16998 -12723 -40495 16434 117206 216465 389555 192057 75278 125670 101571 4328 -67770
16987 -67770 -180768 -332518 -407157 -181821 57092 254637 406501 520797 552549 317544
16977 317544 -21430 -297110 -215957 36208 41084 -49011 -58032 -28335 32398 -89875 -299096
16966 -299096 -366836 -322620 -262827 -79367 -14684 157041 436560 500565 407526 185264 -5518
16955 -5518 -232374 -250294 -129600 -149311 -138238 -245961 -407263 -290052 -92216 -131762 -173512
16944 -173512 -276173 -274550 -109642 -96441 -158634 -190875 -388826 -789798 -1127151 -1173693 -966824
16933 -966824 -741829 -647652 -666136 -753051 -865029 -843609 -743563 -452211 -156693 -275626
16923 -275626 -395096 -238915 70674 245186 135160 -172009 -224225 -90909 -174536 -315329
16913 -315329 -536253 -602151 -454769 -455376 -346148 -27822 69537 -222870 -497134 -506262 -269704
16902 -269704 -114828 -70281 84174 150757 136219 93752 56388 48489 254169 435597 223568
16891 223568 -140852 -259045 -220466 -88193 -66999 -168851 -194005 -52239 187422 301493
16881 301493 132895 -64202 709 157780 353751 346431 282613 134473 -11161 -70904
16871 -70904 -145449 -284503 -421341 -470967 -366091 -360345 -155538 76837 140249 112670 117095
16860 117095 92484 -33295 -143778 -81203 153379 285428 175558 -136384 -196896 -106554
16850 -106554 -35500 155379 347587 200983 106682 72302 -58347 74116 217168 151892
16840 151892 238293 212265 141770 37619 115674 33958 -92416 -93452 -47991 121297 271829
16829 271829 262911 329945 298416 128312 29806 -244456 -566236 -615973 -383507 -211714 -154037
16818 -154037 -195308 -310593 -230079 -55099 3979 -22089 -85427 -114321 -49132 -20575 -161549
16807 -161549 -251378 -209351 -124286 161597 242197 176094 334951 590659 661494 453035 258478
16796 258478 -110181 -541276 -754647 -830876 -842788 -667396 -460117 -413200 -333174 -419811
16786 -419811 -328936 -60006 43050 181139 295200 126847 -57232 -49213 -187212 -314934
16776 -314934 -410526 -369097 -296497 -168375 -182083 -248889 -329133 -342607 -304415 -346843 -316931
16765 -316931 -168179 94713 125470 110222 195469 192795 79363 100390 155922 146621 209093
16754 209093 256850 281711 251204 169741 194602 38495 -102629 -31908 64 92766 186007
16743 186007 101630 40236 81513 181447 153174 6534 -140225 -274350 -418122 -337644 -312513
16732 -312513 -305206 -156640 -44035 37578 86658 106827 205814 192127 -140604 -480852 -565754
16721 -565754 -528433 -365688 -268556 -330709 -459589 -317923 37198 210014 249986 172228
16711 172228 -74625 -293116 -139167 -24162 30891 133918 110197 31528 -6300 43959
16701 43959 126008 112697 108453 124620 273538 129065 -184153 -152696 -120559 -167947 -274615
16690 -274615 -360396 -330115 -353555 -396632 -258792 -59884 -53158 565 -178648 -425655 -322352
16679 -322352 -68952 -52336 -108879 -187871 -12729 178151 299015 410888 434779 418086
16669 418086 434018 498495 390298 81737 49810 -28339 -95367 92564 287003 444004
16659 444004 379809 265193 160227 -54450 -289168 -201832 -22163 22242 45380 130995
16649 130995 245337 339147 277211 342969 423230 460740 552144 538600 436247 277108 215569
16638 215569 254578 73067 -168891 -270155 -262590 -26646 29289 -175900 -118080 74981
16628 74981 117080 27469 -43908 -7830 31499 -48467 -243580 -347705 -343296 -270964 -197657
16617 -197657 -176266 -116800 -4023 30812 91926 146345 378386 519328 581195 524432 366072
16606 366072 394838 382429 324424 307523 88811 -90734 12496 238251 384970 309501
16596 309501 297952 322244 344819 164520 -36933 -159697 -151384 -187434 -232184 -266964 -267388
16585 -267388 -350538 -318567 -192049 -212265 -105291 -41274 171162 174873 13526 -121045 -154803
16574 -154803 -130838 -236272 -344669 -168083 43420 74148 -23065 -195025 -358597 -394954
16564 -394954 -260617 -9578 143256 321831 463106 395329 445781 475007 311275 184220
16554 184220 50194 -25517 -102466 -123122 -133959 -161517 -25344 -5515 83237 174248 160103
16543 160103 141957 25355 -119665 -193944 -23436 78922 -145481 -271487 -227495 -178010
16533 -178010 -297434 -470332 -372838 -361379 -502926 -392416 -402724 -404538 -217806 -37352
16523 -37352 -94371 -275576 -317766 -542286 -715786 -809546 -716881 -294691 126060 205355 78864
16512 78864 -68404 -334123 -574375 -636815 -511176 -397892 -259617 -169052 -184327 -371927
16502 -371927 -383637 -175265 -23248 -128111 -301008 -379542 -364121 -283925 -191707 -267620 -451546
16491 -451546 -337663 -186971 -98723 106154 183257 -39408 -230511 -97679 16675 -51960
16481 -51960 -81201 -39685 -12387 148472 300001 497398 783483 898636 796985 419828
16471 419828 128754 154479 240087 134979 43732 119304 -26520 -233026 -184287 -144392 -235738
16460 -235738 -291726 -358793 -279939 -183832 -158571 -267247 -298035 -225788 -237497 -314950 -397585
16449 -397585 -446462 -509639 -332353 -82418 208013 92034 -269163 -317069 -337068 -469705
16439 -469705 -408409 -158214 -118252 -243363 -284990 -214323 -198917 -356867 -308094 -181435 -121690
16428 -121690 -214081 -386685 -429115 -494730 -329016 -124347 -113885 -183642 -131849 48223 105766
16417 105766 152886 230673 249196 413637 340043 213300 222747 461745 664896 609012 401960
16406 401960 187226 150772 134157 26559 -220655 -436645 -477124 -103217 392597 722921
16396 722921 704401 503147 290861 193069 142250 44242 97387 246086 290695 230254 218413
16385 218413 154431 -48496 -172718 -232938 -411527 -561495 -489861 -313252 -151841 -59221
16375 -59221 84497 318411 178783 -176433 -265311 -385183 -519421 -485187 -298320 -290427
16365 -290427 -416695 -322335 2323 235955 77193 -87081 -104394 -68829 -108510 -434805
16355 -434805 -485520 29588 364403 242198 193725 232370 149637 114677 84938 2869 -2359
16344 -2359 743 -86752 -316041 -330887 -12135 125029 117650 221216 124159 -99442 -381245
16333 -381245 -568348 -398019 -261893 -216474 -78911 -125076 -255456 -260089 -173997 963
16323 963 47239 217696 254310 47239 -18961 -24267 -96258 -84492 -18024 114648 119270 -206117
16311 -206117 -327268 -192186 -138668 -143084 -236911 -273679 -143915 -50054 -99275 -188160 -187137
16300 -187137 -67166 -12612 125325 331664 390503 413736 511041 446929 197647 -723
16290 -723 -12354 114556 264321 194740 -70560 -220925 -276420 -424447 -463178 -464841 -271187
16279 -271187 148260 353119 252736 195008 -3859 -76156 -144991 -227276 -194674 -46268
16269 -46268 -21081 -176015 -101182 -11196 9472 155703 128000 -26356 -208219 -89553 51449
16258 51449 77573 126161 184977 166274 5756 -155135 -81647 31869 -88751 -219859 -390479
16247 -390479 -385184 -155064 -158543 -316491 -425793 -482417 -570233 -570065 -274176 -129235 -4661
16236 -4661 18945 -179208 -260240 -265375 -177553 -101560 99222 202204 94451 131215 -92129
16225 -92129 -242179 -99209 13686 -50079 -44090 84851 143006 177809 277501 371472 481653
16214 481653 405679 352784 358590 308171 318285 479569 266787 -15288 -232760 -308762 -38019
16203 -38019 141426 151934 307531 354548 183980 57623 190285 254909 6145 -164547
16193 -164547 -132501 -12181 -157806 -322806 -450703 -527670 -323528 -230378 25123 256093
16183 256093 202954 172823 295460 323947 230923 521432 867909 686941 430897 265409
16173 265409 208255 108400 93380 -37804 -118818 177399 523067 518949 503592 510330 441972
16162 441972 285703 114936 103689 89633 -73308 -44264 69073 246983 356750 236267
16152 236267 195701 119250 133621 310379 231821 182079 214811 222769 279603 435480 549494
16141 549494 734930 1049868 1488380 1744518 1713007 1724075 1924037 2400428 2572719 2378573
16131 2378573 2200700 2106974 1784650 1495691 1106702 631733 633374 894389 798465 491895
16121 491895 93441 11320 139049 324571 465543 651230 789103 746521 507909 332393
16111 332393 337577 384174 250568 67766 -55298 14704 156910 193133 163791 80685 46393
16100 46393 115104 208973 237680 215181 92065 102197 349076 550051 521790 399543 415523
16089 415523 269726 -34704 -201317 -259136 -222769 -294446 -343908 -188904 -107303 -38036 -43095
16078 -43095 -89788 -10736 102463 97266 141851 271970 292970 215659 243001 307316 149609
16067 149609 -111489 -35529 156394 183712 62704 13421 56775 -67760 -197693 -157764
16057 -157764 -8558 -96073 -307347 -249805 -124772 -208101 -75582 182222 224454 209866
16047 209866 218221 261299 85826 -64229 -75032 -123411 -254891 -418376 -508359 -582895 -552351
16036 -552351 -544148 -530026 -598600 -700998 -747117 -521368 -213504 -46978 -25215 117104 285347
16025 285347 225682 153018 276149 305126 386977 346333 397747 533225 382120 316669 229334
16014 229334 166963 -951 -107865 -121740 -136952 -37980 13099 -18521 -146903 -261213 -278001
16003 -278001 -251856 -103793 10133 71308 229701 228303 225236 252203 137547 -5852 -181856
15992 -181856 -354395 -316844 -230337 -88121 211173 225986 120933 246541 393446 470691
15982 470691 584116 644001 362274 98875 209963 254543 285042 278203 296904 225290 95464
15971 95464 134981 -48628 -224415 -185776 -52885 -7702 198943 396758 330103 112619
15961 112619 75185 67296 22447 -47684 -56414 71586 179826 138895 -73042 -187341 -229876
15950 -229876 -219996 -306638 -499596 -517046 -582261 -629054 -358487 -39577 48028 -21464 -130496
15939 -130496 -27943 212702 217301 98313 38822 -95215 -199727 -315816 -281168 -112529
15929 -112529 2543 137167 136830 181215 149066 39305 239530 276921 168848 -74486 -204345
15918 -204345 -163583 -329534 -389920 -224163 -55240 -22185 -23327 -148825 -235023 -126671 -13464
15907 -13464 5330 76333 -183523 -412811 -327423 -271548 -381029 -438989 -505987 -310639 22948
15896 22948 34097 -76654 -115361 21021 127229 191359 337397 363837 196754 19837
15886 19837 75899 251643 498899 457928 102346 -252945 -448328 -519542 -625242 -504510
15876 -504510 -227322 17402 194265 321904 377520 415449 454975 530344 754162 685432
15866 685432 419517 305733 211462 -31200 -178237 -109037 189931 224721 99798 128978
15856 128978 110586 111984 141348 -33569 -177376 -254059 -236812 -159709 -59089 -16068 -181605
15845 -181605 -441977 -492849 -262523 60482 225560 140473 -154650 -339182 -328879 -510959
15835 -510959 -427325 -40623 164091 111113 31916 -40329 -148270 -112851 -84506 -26796 23174
15824 23174 233471 227823 -92009 -353201 -472552 -537242 -304163 104093 368434 305241
15814 305241 -47691 -343129 -454667 -302214 -310093 -412475 -472939 -417856 -216772 -142067
15804 -142067 -285879 -410940 -260249 -97579 -21478 114225 7726 -66228 153576 364737
15794 364737 262082 46035 -909 168600 359431 261857 105314 -63865 -300888 -378515
15784 -378515 -275043 -377168 -566394 -496271 -353112 -368388 -376149 -346951 -190217 -97814 -129733
15773 -129733 -228771 -235870 -50934 153537 286741 91429 -52649 -98593 -165571 -303580
15763 -303580 -249486 -51295 -8515 -176395 -431154 -633263 -717641 -600631 -429233 -228217
15753 -228217 146440 451977 362719 114380 11542 107142 252267 341125 218792 -146378
15743 -146378 -392312 -469478 -400314 -327944 -412559 -548218 -407254 -348465 -399384 -214569 223681
15732 223681 361108 404826 515832 463375 403254 334655 350227 189140 60236 80652 182394
15721 182394 131127 23381 33117 118091 113524 88229 -40604 -163142 -171743 -139340 -177542
15710 -177542 -94926 125249 37834 -19112 -95642 -327026 -196539 -123773 -397589 -619728
15700 -619728 -698227 -498389 -282322 -175768 -93540 -20744 -11862 -179182 -345211 -327505 -195558
15689 -195558 -306709 -368890 -467128 -645779 -427209 -343807 -388209 -349203 -316513 -116545 87118
15678 87118 39565 -60504 -44439 -80727 -232063 -316094 -267091 -89427 120783 332228 375350
15667 375350 297615 160408 -92441 -105940 -117197 -159152 -186611 -248763 -296692 -263525 -139919
15656 -139919 112478 348314 417538 325147 331380 636972 792390 814125 811454 621636 422226
15645 422226 226257 119217 216712 98737 -118364 -205016 -22225 111725 35617 -265279
15635 -265279 -260280 -283040 -310929 -154842 21107 -108384 -246071 -292265 -361189 -428448 -452462
15624 -452462 -408589 -295272 -281055 -565639 -665280 -442542 -373834 -359187 -344798 -240422 -72575
15613 -72575 -36522 10697 17248 35711 -3756 -88172 -178179 -129858 -153422 -274548 -386774
15602 -386774 -613778 -807938 -779103 -582952 -393311 -388586 -442973 -437839 -246429 -17055 8278
15591 8278 -104735 54195 387522 322114 -7733 -327930 -446585 -342045 -183976 9325
15581 9325 101692 71225 8445 -96351 -90674 -7362 26757 -109134 -96784 41641 176216
15570 176216 339900 291941 330846 284837 212953 122056 54978 153119 213368 219341 253606
15559 253606 209582 189616 202381 17699 -260697 -449254 -483777 -353536 -318349 -294112 -153166
15548 -153166 -75708 -28669 98987 342216 566194 577002 577254 577930 378446 155382 -59059
15537 -59059 -51926 147076 146034 -64759 -306273 -339841 -316033 -336751 -171860 35874 -9368
15526 -9368 -42020 -140058 -186401 -310081 -454872 -296284 -492309 -840592 -782372 -469269 -209046
15515 -209046 -177006 -123104 49216 22694 -263430 -393932 -255643 -143992 -169621 -266647
15505 -266647 -473746 -488731 -273881 -55374 114350 -71404 -328386 -404280 -384206 -347976
15495 -347976 -167025 -9368 -110087 -244570 -228357 -505570 -730807 -679356 -444861 -372804
15485 -372804 -263190 -100906 -36525 -242252 -266711 22334 205261 239632 301480 221664
15475 221664 94402 2149 33191 -67584 -211881 -424802 -563497 -480171 -345299 -269134
15465 -269134 -162555 99991 267362 243841 -3270 15367 171563 213415 -32170 -181737
15455 -181737 -138129 -95209 -127299 -62895 140465 268138 395230 328303 189147 129977 -74682
15444 -74682 -52757 -229214 -332509 -193953 40248 136849 198721 269771 174100 105439 178946
15433 178946 157277 14324 -194314 -203280 -144539 -201836 -151700 -85886 -38970 22109 -82931
15422 -82931 -254568 -307987 -298969 -429062 -480223 -191274 101200 -3107 -169849 -111608 4574
15411 4574 40929 -67331 -125042 -78630 -66013 82453 369983 470649 345347 92433 -110224
15400 -110224 -226707 -230170 -225515 -347617 -339878 -344047 -432622 -340717 -37953 229880 271615
15389 271615 143568 5619 -104805 -73417 56010 166075 183023 202847 114977 -56793
15379 -56793 -15311 186872 302728 265602 168857 29365 -159549 -352907 -525102 -582584
15369 -582584 -327152 -212527 -252074 -223382 -80556 125841 308814 212143 -104179 -137293
15359 -137293 -38573 19026 122913 48207 -56713 -110292 -79828 -184164 -156237 -23931 -119275
15348 -119275 -195461 -181813 -231883 -474791 -580800 -643593 -753083 -826755 -696621 -477995
15338 -477995 -48927 265657 306343 210109 -49813 -218735 -71847 91926 -64859 -310999
15328 -310999 -599634 -829339 -718215 -371271 -37986 49211 -321 -66887 -110023 -343536
15318 -343536 -598257 -702527 -639293 -472236 -235084 98528 405414 298600 -4590 -228289
15308 -228289 -338184 -418810 -334879 -230186 -16696 -124790 -484650 -596346 -626697 -526696
15298 -526696 -257370 -87936 -116388 -143679 -3162 100460 -73352 -308185 -251992 -242308
15288 -242308 -258816 -205541 -48191 -49393 -171360 -268976 -219902 -45176 -4844 -94820 -195256
15277 -195256 -238577 -356651 -467514 -374194 -281593 -245061 -135042 -158930 -151061 -200667 -226681
15266 -226681 -266686 -490681 -571825 -442300 -313125 -180681 40831 173043 123309 -103753
15256 -103753 -252105 -108363 125503 75827 -44720 -72658 -217061 -220926 -168220 -43579
15246 -43579 -214697 -298987 -214300 -114254 50971 30637 -90219 -182110 -332184 -449775
15236 -449775 -487573 -265135 38031 148776 283622 307488 326499 450428 450774 386318 237030
15225 237030 155716 138045 56524 -45100 -236651 -414956 -451878 -481418 -378216 -78379
15215 -78379 253218 437186 556259 469574 253322 -5990 -111559 -15522 216145 321554
15205 321554 358702 428438 484895 656224 674920 408777 154564 -102930 -201338 -335162
15195 -335162 -393241 -260866 -151288 -158823 -46736 180209 409972 321554 38266 6146
15185 6146 135153 229229 324259 325268 181684 97614 199563 188785 109368 33119 -106113
15174 -106113 -190451 -258054 -512797 -731201 -639350 -325619 -55695 -107634 -346426 -210686
15164 -210686 234789 284663 78743 -141009 -374951 -382166 -220222 -198247 -404467 -449543
15154 -449543 -320861 -114149 -32967 -179924 -366499 -288011 -233082 -392613 -383760 -362690 -512599
15143 -512599 -709501 -618763 -351761 -284810 -223863 -245113 -317783 -256617 -206050 -374957 -563470
15132 -563470 -523658 -221113 -124063 -227457 -291040 -275012 -188436 -119669 -263285 -401763 -379904
15121 -379904 -425924 -564178 -617952 -621389 -635292 -532929 -453910 -342540 -326484 -242865 -74650
15110 -74650 119139 16336 -99054 -137094 -36078 114542 234308 322226 115846 -141974
15100 -141974 -122097 -189704 -123844 178847 281410 234320 99453 17162 164384 358311
15090 358311 296458 24074 -233087 -440807 -756039 -836781 -795243 -606940 -427633 -333321
15080 -333321 -265467 -322700 -269691 35376 424405 545937 483141 328174 186906 175278
15070 175278 346231 256482 -45405 -30927 21885 -139735 -487875 -845980 -916645 -868896
15060 -868896 -711524 -480425 -535327 -831677 -958455 -701546 -406418 -272884 -200204 -257953
15050 -257953 -302344 -177132 -212428 -369390 -326807 -139555 -146447 -508612 -772034 -833078 -867751
15039 -867751 -873327 -954482 -854369 -685728 -435803 -219258 -119168 11236 118941 116249
15029 116249 21247 -69265 -147963 -147428 62267 78995 -164103 -224684 -115805 53535 317275
15018 317275 478086 356413 6141 -217536 -237700 -129980 85610 278777 288082 151576
15008 151576 24948 76061 236200 273446 14667 -156639 -9967 128590 20468 -126623
14998 -126623 -87879 -66111 -139121 -179103 -199277 -203768 -143289 74634 86683 -82823 39674
14987 39674 166863 192377 114053 60986 -82706 -199041 -105590 -16623 7842 156572 346080
14976 346080 342788 95646 -83488 -172942 -114891 -295569 -479441 -404213 -278449 32785
14966 32785 263207 31346 -335476 -419265 -243106 -36261 282214 333971 72737 11556
14956 11556 235704 376559 375091 193658 -58006 -212500 -154475 -130426 -97651 -21327 117459
14945 117459 266313 455847 579439 545488 442344 289535 105594 4710 -200018 -295507
14935 -295507 -21665 163085 -36619 -18960 22431 -139035 -316817 -437616 -425682 -339853
14925 -339853 -286361 -4209 190875 291689 206633 -17432 -143247 -22145 29424 -168174
14915 -168174 -117744 112665 182074 114035 -8052 -207084 -256940 -173265 82022 207450
14905 207450 339948 444723 485830 285499 11803 18683 52462 9781 -78813 -186738 -318146
14894 -318146 -386804 -383041 -442437 -401154 -310529 -355730 -610534 -645173 -248142 36073 61918
14883 61918 -39388 -260823 -462781 -549223 -449564 -427996 -333560 -101519 -87189 -117068 -149231
14872 -149231 -112719 -62817 -118865 -173285 -157446 -27424 88351 -13176 -32139 115605 285235
14861 285235 311799 221068 124585 166052 103527 -180448 -239878 -109384 -1763 63977 137997
14850 137997 311406 392288 326935 189748 -15112 170305 399724 377608 391869 653930
14840 653930 607751 312052 83870 -134567 -337772 -371855 -344677 -540625 -527211 -361914
14830 -361914 -317651 -138576 153849 393291 484074 415880 502391 521756 240021 103695
14820 103695 124516 -27233 -250597 -168742 16635 45921 -25636 76025 229597 428224
14810 428224 660787 902639 1016672 920672 699053 568644 335731 286514 339933 186430
14800 186430 -189174 -399348 -315824 -145237 -236498 -386158 -466838 -416927 -316399 -305242
14790 -305242 -159984 -269117 -520003 -550790 -495952 -541220 -523731 -606534 -513998 -395191 -533267
14779 -533267 -714542 -816073 -796607 -724770 -448610 -252034 -291029 -346789 -215405 -111388
14769 -111388 -255609 -401919 -345105 -216590 -92508 -25044 -155694 -371190 -405973 -322117
14759 -322117 -169601 -48001 -152863 -299375 -314282 -213630 -291594 -374292 -501356 -538971
14749 -538971 -456289 -331995 -96802 7465 -176222 -296441 -294396 -355941 -372662 -289749 -257167
14738 -257167 -300837 -290653 -170938 -108822 128077 271045 47404 -78571 -346813 -626429
14728 -626429 -582408 -441996 -466576 -248796 92377 178461 121625 -70541 -142986 -236763 -248753
14717 -248753 -297330 -223891 -51231 -95536 -112276 -151973 -278120 -155581 56528 121794 -69048
14706 -69048 -218243 -412631 -706379 -740338 -485798 -233099 -242175 -203247 42795 380597
14696 380597 565531 644852 672293 504717 392224 495814 676879 715309 530958 227875
14686 227875 188207 302610 214252 51441 -94913 -152160 -204009 -234841 -189318 -125000 -76441
14675 -76441 -82492 -28290 60080 -113148 -268407 -243729 -116921 -107947 -197030 -295803 -370605
14664 -370605 -450894 -452739 -566599 -707133 -697777 -716221 -573751 -228594 -142601 -103138 34174
14653 34174 277110 495770 485225 219487 -5715 -63250 -22229 -49183 -201508 -171461 -31049
14642 -31049 35239 94974 216939 418824 429924 358237 361949 324130 196366 225041 433518
14631 433518 432656 172361 87396 9565 -87140 -233424 -418573 -493319 -526484 -362166 -268329
14620 -268329 -297970 -379797 -352343 -167930 -3311 45395 115900 163584 2283 -185135 -270525
14609 -270525 -146330 -206802 -272642 -229527 -225069 -172696 -93113 -15776 -163868 -419143 -563216
14598 -563216 -336702 153417 600790 712886 590831 457744 275294 211578 110986 -229231
14588 -229231 -478449 -479904 -257079 -1097 54683 -193971 -487420 -587511 -640092 -668167
14578 -668167 -563479 -335955 -166630 -32692 -13520 -138054 -87899 172547 390971 321639
14568 321639 96944 -24971 -129545 -85585 -135202 -316124 -414387 -333725 -5391 245748
14558 245748 294111 209221 111683 20417 151199 129903 48154 64885 -38695 -382179 -568908
14547 -568908 -538373 -406926 -317164 -184339 -119414 -147234 -129963 41765 145094 250298
14537 250298 233292 144536 91917 -20820 -202891 -273038 12085 116147 -35164 -302054
14527 -302054 -414943 -306670 -177521 -113341 142198 338324 229913 123280 -32760 -89448
14517 -89448 90110 175232 153431 78506 -28600 59440 161948 111706 -205988 -515818 -399471
14506 -399471 -99449 -6932 -68588 -226691 -216807 -225384 -265091 -145599 -47917 49616 6929
14495 6929 -15587 25583 8071 -90869 -194861 -280052 -306912 -450046 -475961 -194418 78769
14484 78769 160140 184023 164500 -45330 -215231 -218208 -93718 19964 68686 -12704 -53019
14473 -53019 204577 548859 602508 540088 403979 100526 -99766 213230 518236 516346
14463 516346 521823 623833 603233 327551 -73182 -330543 -226228 52358 210731 232683
14453 232683 166794 73374 -12997 -80837 80872 166902 58639 -102916 -295223 -305834 -194781
14442 -194781 -353165 -317678 -224902 -325500 -388914 -246267 -216289 -168453 3157 142625
14432 142625 54604 -21085 -181096 -323614 -299862 -78607 180111 360741 374996 190442
14422 190442 65226 87763 212500 123667 59034 118038 53039 -87843 -138642 29050 72418
14411 72418 -151916 -289342 -336082 -111107 103834 61026 96804 130332 221464 330895 215011
14400 215011 4748 -76781 -82126 -131390 -42810 135869 -18003 -167554 94270 228381
14390 228381 298696 267036 109127 -147431 -410781 -321471 -255220 -326014 -91324 172915
14380 172915 26333 -343166 -574409 -548301 -512009 -461585 -520137 -595848 -423763 -179470
14370 -179470 -233511 -440344 -460578 -569613 -547533 -241372 -61532 -57739 -181916 -350579
14360 -350579 -303334 -66174 100025 108539 -138577 -395145 -425418 -279131 -221594 -176170 -70420
14349 -70420 -44407 -41485 -145193 -362298 -390345 -395081 -382312 -123224 83721 103931 17594
14338 17594 -118072 -325720 -479662 -609781 -339688 47901 268571 188578 -48108 -70588
14328 -70588 -115464 -228221 -205047 -208491 -123171 89478 295521 332926 155357 43934 22183
14317 22183 -199281 -414693 -602644 -663489 -589541 -441747 -370277 -408187 -360968 -210058 -158311
14306 -158311 -148300 -238061 -499075 -665851 -551234 -423571 -400104 -518941 -596555 -479435
14296 -479435 -107099 28234 -163586 -331999 -439378 -495484 -370654 -274129 -144728 -200344
14286 -200344 -342629 -289135 -214654 -286445 -446496 -399933 -87607 38812 -103077 -174564
14276 -174564 -155529 80449 205017 228464 179547 99989 -34327 65880 125745 66175 168077
14265 168077 359150 386099 215497 -38708 -92405 -44333 -59561 -68662 -53858 -50878 36607
14254 36607 70887 112437 234544 284089 60153 -165027 -257456 -334107 -292607 -204864 -160894
14243 -160894 23447 -22107 -281579 -303792 -228268 -309683 -442969 -267291 -73366 -156060
14233 -156060 -398082 -420772 -304173 -166556 -142901 -128503 60807 125900 -67718 -281992
14223 -281992 -316655 -227544 -185356 -294618 -316756 -288218 -81165 58268 37732 116661 91434
14212 91434 -3322 45767 124093 203599 259643 378826 476810 344328 35714 -86650 -199867
14201 -199867 -343964 -336881 -403501 -472444 -475306 -367192 -310913 -342641 -303604 -93244 104049
14190 104049 72181 93010 138820 107432 91179 65314 77763 83004 28295 -150724 -162211
14179 -162211 -201774 -254505 -316862 -380256 -122650 -77166 -212073 -174089 31404 72177 -196935
14168 -196935 -370788 -364934 -178207 -173188 -341719 -389764 -283849 -131167 -4325 206343
14158 206343 89818 -98567 -111169 22878 233057 366843 408222 292388 220518 250552
14148 250552 284253 216654 127238 331033 550086 400085 363803 395496 507974 587119 560047
14137 560047 236375 -68143 -183435 -250643 -146217 -19185 -4087 18775 -213676 -436071
14127 -436071 -445832 -509355 -349973 -261407 -7115 160294 66297 96576 289992 445299 459279
14116 459279 244649 -111087 -399747 -495728 -346563 -233115 -121198 82683 170614 226052
14106 226052 147101 -39946 -276484 -290161 -117917 168379 367936 447677 550116 474597
14096 474597 327430 195056 204963 20868 -185628 -184459 -25397 104181 -94535 -126745
14086 -126745 -19910 -98994 -188079 -125358 1494 163250 292334 291184 227929 378097 389167
14075 389167 209279 225293 167294 78154 100312 130233 221800 446031 500248 274736 102104
14064 102104 87040 37475 -80231 92553 322261 279153 258286 47818 -77595 79925
14054 79925 217722 104234 -46249 -54854 -174657 -152194 -174051 -194334 -160990 -125702 -124462
14043 -124462 -120348 -232820 -295683 -133885 76080 149514 206360 228061 87959 -110945 -54789
14032 -54789 50080 -29556 -327532 -467664 -322782 -241420 -355585 -640413 -562012 -261610
14022 -261610 66582 175468 209530 -18298 -158601 12010 131348 80532 -111893 -234128
14012 -234128 -104710 -76919 -178588 -214709 -109262 -64292 -134954 -177516 -59453 109008
14002 109008 -139301 -246499 -100874 -163201 -451728 -673147 -738158 -568534 -445333 -396406
13992 -396406 -172342 16377 26422 159940 140387 -68379 -230745 -313746 -357908 -426346
13982 -426346 -350965 -459876 -564857 -492498 -271446 -34939 -32750 -264267 -378604 -225651
13972 -225651 -206958 -230420 -297370 -463841 -614897 -583572 -659914 -683902 -575665 -644232 -669620
13961 -669620 -519669 -263844 20398 -85533 -304844 -372588 -250946 -117596 -157121 -310961
13951 -310961 -249214 -114619 -11697 10115 7551 -77115 -329458 -394079 -243017 -9038 -148821
13940 -148821 -431122 -619818 -600092 -299489 41913 256096 268200 -10234 -396350 -582496
13930 -582496 -742196 -917888 -734419 -263895 -33879 -212534 -349267 -237988 -286459 -380185
13920 -380185 -294473 -253256 -225946 -101622 -21459 133669 423823 379994 8764 -288810
13910 -288810 -398454 -465135 -292670 -227640 -243673 -222730 -225771 -253403 -417805 -440157 -179673
13899 -179673 75747 376009 511851 422633 268630 93515 -149105 -375864 -271942 -162885
13889 -162885 -133966 -19827 -32397 -174647 -157580 -121959 -198516 -20971 121625 -188792
13879 -188792 -232571 27450 67909 86326 106226 165891 321576 111510 -60342 114472
13869 114472 186380 75246 54977 -42429 -228142 -461927 -496786 -376655 -385945 -488086 -464581
13858 -464581 -448866 -407008 -291456 -455853 -705303 -988222 -797648 -330055 596 140148
13848 140148 140122 82798 -4649 -38875 149470 384214 378750 66249 -62811 -3511 -19958
13837 -19958 13688 87585 209196 386609 471571 471529 448519 557424 482117 92414 -175388
13826 -175388 -305126 -294521 -108989 -116959 -207290 -131369 -150170 -306179 -485662 -470466 -402467
13815 -402467 -660956 -730834 -488612 -219191 36779 225930 179353 123324 266331 219503
13805 219503 90348 6056 -98404 -146620 -205523 -71852 13361 148595 436415 513903
13795 513903 384803 113856 -150309 -78667 209415 432462 356787 395540 416993 378318
13785 378318 198100 -30095 -64185 2717 -69032 -99375 26883 80337 79023 62483 -124789
13774 -124789 -272688 -498089 -665295 -720431 -505584 -398587 -763545 -1075558 -980059 -485963
13764 -485963 -168156 -61147 82552 256194 274950 130178 100288 261322 350461 203796
13754 203796 172568 214688 256790 246188 263288 197086 -131175 -259722 -90277 110375 247862
13743 247862 364079 336890 304836 197502 34480 -179639 -251076 -246030 -174223 -75899 -23948
13732 -23948 156801 438617 549868 178435 -285945 -530263 -603039 -420638 -213735 -38768
13722 -38768 64620 68315 -19387 -17756 252094 341476 203393 152517 -20148 -64178 -172730
13711 -172730 -198955 -88748 151813 325107 275879 173907 166589 216235 261591 428521 630583
13700 630583 744465 590145 411827 138330 -222522 -468116 -465666 -306731 -292110 -246921
13690 -246921 -261560 -246197 -108855 -56573 -11411 -41808 -137734 -175193 -300827 -581912 -725299
13679 -725299 -748063 -600333 -254924 -48686 14145 -22586 75255 799 -125021 -1459
13669 -1459 184753 304181 234286 69784 -123925 -125447 140732 153807 159301 224215 155997
13658 155997 210775 145768 165631 415367 376212 170496 -49334 -192310 -229523 -248377 -200548
13647 -200548 -199491 -169692 -78199 -43267 11243 -194991 -356523 -314869 -141581 -179436 -297148
13636 -297148 -352092 -341560 -413899 -454942 -298407 -101994 84351 234046 309504 264037 143372
13625 143372 29358 -21362 -49872 -167855 -246518 -138549 30262 -11617 92975 254204
13615 254204 231939 134786 79546 -125991 -256039 -281525 -71241 285123 334871 134322
13605 134322 -138002 -325087 -413436 -449524 -413993 -416113 -441152 -402553 -400314 -387825 -233668
13594 -233668 -98424 -156650 -417708 -640292 -549924 -328305 -250355 -237005 -374581 -557973
13584 -557973 -582874 -381669 -70250 -38238 -139680 -311499 -509396 -540580 -344077 -196078
13574 -196078 -205350 -101401 -2673 -234518 -427523 -453783 -530224 -318677 -50582 10867 -79678
13563 -79678 -142765 -186783 -360657 -317255 -264952 -208064 70216 239039 244455 250253 263414
13552 263414 241274 279308 281719 341314 519220 642984 606041 591810 646658 513771 390192
13541 390192 205694 21561 -174915 -355397 -356130 -311598 -356943 -391703 -341298 -147519 -73203
13530 -73203 -42276 -59333 -82530 60305 100680 43848 -52782 -269669 -386792 -436719 -408262
13519 -408262 -287525 -273767 -440177 -424994 -246012 -163912 -368052 -557253 -659499 -740370
13509 -740370 -670680 -519319 -462363 -374945 -100117 245444 386794 264612 81172 -97580
13499 -97580 -286353 -478437 -453989 -272827 -155238 -66480 -156653 -309065 -544393 -626111
13489 -626111 -397458 -230838 -79303 69627 241034 412112 419667 564134 848167 966652
13479 966652 937813 898358 732701 509603 385689 345409 247693 112883 58460 3545 -21337
13468 -21337 -96060 -229226 -383734 -396478 -258417 -293669 -379400 -378783 -307251 -258087 -137217
13457 -137217 132895 151239 -105260 -243201 -52282 68797 -43474 -98743 25087 185488
13447 185488 78896 27941 189238 266994 163253 -3474 -153633 -244288 -165292 23226
13437 23226 141241 318985 249715 64290 48168 52213 129323 334198 277994 154242 66578
13426 66578 -127310 -335562 -510083 -513551 -312630 -261446 -427552 -363869 -93034 32690
13416 32690 86929 108031 112935 -77441 -153135 18701 207706 202617 272310 290355 135654
13405 135654 6101 114072 276337 117828 -199566 -254871 -5464 116358 171781 244631
13395 244631 430438 382652 158414 171187 167683 52762 -66098 -75045 -99384 72165 504167
13384 504167 675351 607621 444933 288683 135455 129939 144180 313875 190576 -76482
13374 -76482 -60607 -86021 65261 302969 537963 598174 468583 371039 116345 314446
13364 314446 525477 359289 243272 208381 165388 250293 254154 219006 231680 207211 282886
13353 282886 381373 389473 497278 388657 230080 213026 196110 438147 875289 1023628
13343 1023628 876670 637184 407976 369874 527574 626191 451183 265366 270794 253830
13333 253830 240266 285945 156003 -63941 -96479 -282473 -494498 -561381 -495817 -140572
13323 -140572 -65663 -10280 51952 126374 263007 429563 123743 -261349 -180342 -64010
13313 -64010 15015 164493 388805 650876 782021 716411 827173 804547 679498 500284
13303 500284 374140 603544 815323 703553 414632 340766 373223 411872 516376 659334
13293 659334 847667 899705 732421 665722 601691 382529 253363 193222 269912 283574 230916
13282 230916 86064 -138775 -197276 -123805 -46376 -48070 -62772 -62669 52109 59487 -80847
13271 -80847 -24897 131660 151056 100353 -44787 23124 176053 351003 445082 318712 210090
13260 210090 296913 403075 443925 594095 686397 641135 586756 581117 529434 281957 213770
13249 213770 218798 77651 -51221 -40927 1586 35708 292109 516557 644081 783294
13239 783294 878264 702463 500747 524785 606969 474445 323791 243298 316244 539417
13229 539417 657272 628284 508500 612797 679522 802653 915966 802349 684737 742334
13219 742334 616926 423654 292397 137417 332979 533236 418741 179151 122133 275899
13209 275899 490544 522664 257423 158715 215810 322173 599293 716143 646812 428939
13199 428939 434981 651417 785181 740429 720787 687846 658900 697416 835238 1034655 1091196
13188 1091196 897828 621957 373391 433819 531135 545975 614115 822664 959906 751622
13178 751622 484542 362378 447580 535190 593989 607393 586398 628354 687171 589612 462133
13167 462133 430772 436069 249964 31696 2570 259833 436239 479808 435319 273826 172700
13156 172700 122110 124459 288844 457045 533770 575444 532641 336697 112978 71655 88184
13145 88184 144342 304722 571629 681578 575977 816447 1176132 1338630 1292593 1250014
13135 1250014 1052781 751226 498813 354686 372316 510348 911302 1117621 1269257 1283441
13125 1283441 1046869 778828 701447 778856 770097 795723 921234 999110 1079886 1015291 875145
13114 875145 775333 652812 391192 395362 644790 904062 1012081 1047947 922598 763403
13104 763403 790846 771401 650828 635895 711420 969969 1159930 1123205 924392 671808
13094 671808 509872 679051 984100 1065828 1000756 658577 428761 361955 412938 503709
13084 503709 576704 592845 638449 777164 683181 474565 534334 669586 857418 957894
13074 957894 1010395 974715 886667 954950 1071322 1145403 1223141 1267830 1083485 801699 816679
13063 816679 979071 1097764 1030915 804219 673124 514408 519566 643519 909615 1132850
13053 1132850 1348196 1498462 1493146 1288229 1175125 1088289 1027214 1282995 1658788 1802059
13043 1802059 1715577 1451095 1410964 1619060 1846394 1919694 1703416 1518989 1530060 1608078
13033 1608078 1917295 1974912 1950243 2094118 2499198 2856692 2815754 2689238 2449467 2359366
13023 2359366 2472988 2661919 2640161 2538968 2625137 2827865 3023498 3102899 3064427 3056987
13013 3056987 3146623 3216797 3412439 3614673 3709722 3862501 3990442 4133101 4373031 4637844
13003 4637844 5005326 5532481 5891139 6259305 6500288 6958228 7574019 8324431 9118397
12994 9118397 9861642 10629710 11626735 12737356 14077055 15844727 17928106 20522195 23739819
12985 23739819 27773317 32505263 38057895 45064928 54170853 65873717 80828207 100268171
12977 100268171 125789619 159170568 200274781 242891577 269822373 263413071 228087622
12970 228087622 184133836 145077404 114627304 91648440 74292378 61241900 51175761
12963 51175761 43413971 37309269 32209616 28050517 24697017 21993697 19788116 18096633
12955 18096633 16627128 15076698 13748630 12789504 11967321 11039437 10193146 9685004 9309148
12946 9309148 8818205 8272071 7870687 7463183 7073485 6715431 6353391 6177533 5999813
12937 5999813 5724319 5618472 5437956 5181193 5196255 5371878 5419281 5534954 5735380 5750744
12927 5750744 5787702 5889940 5946946 6030595 6272058 6538997 7117271 7923597 8737928 9707457
12917 9707457 10783781 11916019 13253531 14302987 14481909 13796039 12897339 12396659 12289557
12908 12289557 12401031 12575885 12978802 13923436 15117491 16491436 18225906 20137279 22624972
12899 22624972 25813101 29652777 34542355 40685643 48125266 57612255 70130000 86507103
12891 86507103 107927791 135820953 172155399 215920382 257974672 277541450 260475781
12884 260475781 218988934 174027131 136395850 107776722 86553690 70638848 58496418
12877 58496418 49181872 41879513 36043240 31381694 27471356 24180721 21350165 18936078
12869 18936078 17210849 16057157 15045626 14120381 13204449 12307780 11677775 11323594 10833883
12860 10833883 10193053 9781452 9458404 9230918 9368754 9950962 10908412 11896573 11842414
12851 11842414 10733260 9556749 8440402 7649811 7084067 6648152 6257175 5870988 5477809
12842 5477809 5350629 5466264 5570406 5689170 5737365 5876440 6094175 6301737 6311609 6289159
12832 6289159 6421575 6688526 7134575 7795310 8359417 8879515 9579675 10232654 10761242
12823 10761242 11422187 12121010 12735684 13507709 14581779 15422647 16232864 17505419 19358704
12814 19358704 21516651 24089685 27367388 31531215 36719776 43059603 50995274 61279240
12806 61279240 74647867 92061773 115056139 144980733 182920091 226281203 262329830
12799 262329830 271016879 245959349 203161498 160768761 126365578 100188252 80570832
12792 80570832 65921734 54823965 46223522 39464165 34043409 29486513 25656819 22540802
12784 22540802 20115901 18088564 16384001 14821070 13412733 12193413 11048219 9980245
12776 9980245 9118889 8610463 8072845 7486849 6872723 6371942 6080338 5742607 5220108
12767 5220108 4859529 4627743 4189938 3864753 3774739 3620274 3513346 3492497 3362172 3029173
12757 3029173 2847300 2823604 2727289 2726320 2737458 2525044 2359579 2233109 2137200 2181030 2283829
12746 2283829 2170088 1972474 1839126 1696140 1672509 1704701 1815656 1937000 1783937 1560471
12736 1560471 1678115 1692894 1483509 1181096 1095704 1164784 1161154 910451 740393 872386
12726 872386 1082333 1011419 1006950 1247178 1429439 1201270 853191 541426 458348 576171
12716 576171 599563 414579 472477 566894 539261 492822 489928 491181 486198 497275 361093 318211
12704 318211 474786 394991 303852 344830 438519 599704 685770 660036 609709 703824 911855
12693 911855 899138 834051 741805 551248 349449 366879 511944 461248 439095 411194 360100
12682 360100 311773 288095 212028 212784 250170 350486 292055 129814 -2444 271626 654629
12671 654629 714453 651085 545801 519179 559799 512852 537884 581461 348905 261426 430511
12660 430511 469947 456239 520080 562139 609550 575842 453323 373486 308985 197620 -90387
12649 -90387 -219826 -167029 -61996 209303 321739 488390 502780 491533 499538 566376 806180
12638 806180 814009 503587 162508 83688 169871 196326 206623 342415 547775 568902 322290
12627 322290 97468 -128592 -366862 -374021 -91308 71610 227786 379469 466825 471192
12617 471192 456861 414364 340698 284669 331263 387499 494478 506843 432404 219971 -3378
12606 -3378 -119041 -115594 -303244 -604315 -618529 -102867 345087 482095 559350 474455 366236
12595 366236 490041 572182 671312 467803 299713 274743 199772 210537 199201 157483 118755
12584 118755 16761 -166070 -179109 -79203 -114852 -239178 -198358 -208783 -300144 -266246 -173320
12573 -173320 -67180 -39917 80826 331443 668619 797467 685227 408410 236243 238669
12563 238669 155887 -144181 -224733 427 96918 48001 -77819 -143518 -229268 -218961 -158579
12552 -158579 -243786 -98411 313211 423945 287624 -31158 -28104 -9667 -94516 -239652
12542 -239652 -151959 -46376 -111211 -133716 -14065 122105 147643 216610 444805 671114
12532 671114 628759 286526 -122051 -163741 -123329 -186476 -138628 273829 565096 370007
12522 370007 62940 15956 79647 173786 124185 143853 291513 504793 742490 745194 455921
12511 455921 219542 39216 -76587 7882 174485 217962 306496 379220 308293 223954 81868
12500 81868 -108107 -27204 295921 582490 825644 881513 797660 679487 460964 167742
12490 167742 44540 131938 184881 19457 -256989 -538679 -682313 -592410 -503288 -543065
12480 -543065 -401880 -51574 134669 96543 1043 642 302645 616129 611071 246378 -110966
12469 -110966 -122979 -75142 -39049 23678 68232 66187 47850 -80682 -143746 97125 203573
12458 203573 218892 136936 79190 256661 436323 616340 645827 460088 209052 -53600
12448 -53600 -49643 225247 606731 736507 655989 455393 439770 427093 318525 228151 63204
12437 63204 -2478 10910 -7033 -149588 -414574 -451171 -345780 -194922 -4651 49905 -23249
12426 -23249 -79561 -327104 -625343 -953065 -971296 -820597 -692952 -381399 -39209 183288
12416 183288 149615 9983 18696 47030 49958 193946 366279 294542 106191 68323 208637
12405 208637 477290 358715 126379 168568 205198 173447 196748 338881 390799 317118 120303
12394 120303 -41063 -201254 -164187 -20407 -186611 -372912 -208959 -32690 121614 80156
12384 80156 -44876 -29993 -30649 -13159 109171 172953 300267 383117 171677 27470 -193395
12373 -193395 -224944 -7508 73995 76071 82005 7505 -138858 -110244 160814 214693 -17324
12362 -17324 122799 389966 410886 320174 204530 170924 93495 -178928 -364435 -278126 -128171
12351 -128171 -116270 -91786 -78886 -247913 -218345 -192106 -353575 -548541 -627855 -633282 -480376
12340 -480376 -266964 -112124 -49731 -40712 -75653 -36207 134784 251846 267931 70712 -31437
12329 -31437 -101008 -231010 -420113 -432832 -387248 -288071 -55251 -213353 -511725 -470177 -343154
12318 -343154 -318509 -285834 -133705 8017 -124970 -181861 -93184 137421 162786 -56983
12308 -56983 -360183 -454141 -379281 -489139 -409097 -55011 106032 -37963 -288735 -484554
12298 -484554 -480037 -264015 35488 -24578 6555 74772 28247 -163854 -313357 -316654 -328798
12287 -328798 -310552 -150005 11620 50386 76880 -1971 -141337 -282791 -276489 -15392 372350
12276 372350 485673 516926 572448 519614 318073 114216 -144716 -135326 16432 -128297
12266 -128297 -368095 -439742 -531267 -646691 -569062 -364689 -307439 -360060 -356561 -156805 -5905
12255 -5905 -123447 -204004 -36440 79429 43585 -30800 -88578 -290280 -341920 -147053 -64839
12244 -64839 74044 218871 137237 55780 -30524 -166246 -301282 -272578 -142762 76859
12234 76859 209683 264601 264382 273306 389501 463177 526911 476949 311989 192775 91866
12223 91866 -32800 -195871 -369417 -252387 -186733 -374440 -310062 -35045 214515 96810
12213 96810 -160181 -478389 -717203 -668122 -614811 -758440 -727766 -464667 -307637 -231639
12203 -231639 -162274 3417 214119 208246 147054 32899 -101785 -94660 -178452 -53274 -69728
12192 -69728 -113758 -74478 -160786 -97372 133296 194995 124844 -142588 -509691 -649650 -364278
12181 -364278 -213037 -357436 -295738 -134836 19658 133649 31742 -83145 -124219 -176431
12171 -176431 -253060 -525231 -572330 -317261 -21799 137770 19045 -7136 24946 129542
12161 129542 75756 -52883 42691 205815 385257 332927 239975 235647 318560 521978 471408
12150 471408 208467 241822 167004 -239847 -397193 -326966 -150790 19332 -160738 -283428
12140 -283428 -145780 -59818 14086 51013 -74238 -148834 114425 156303 129587 236501 88300
12129 88300 -82738 -117145 -186137 -421604 -509794 -482593 -530732 -471881 -276901 -284917 -372071
12118 -372071 -98712 169659 385396 304378 66948 -268083 -569978 -517528 -324943 -128423
12108 -128423 -9667 103205 114402 -111153 -295007 -407312 -478262 -521783 -631913 -799108
12098 -799108 -777878 -729215 -575805 -549708 -599381 -550428 -552282 -456724 -385528 -197695 -28106
12087 -28106 57505 133238 62475 -15089 11001 11933 108620 184040 47459 -146353 -160348 106377
12075 106377 371967 512074 572349 540516 657606 610956 611963 680736 443731 33104 -99021
12064 -99021 30595 50010 -14575 -40121 5708 147675 232283 349410 117853 2538 318129
12053 318129 634311 824168 732714 608182 498620 416974 328128 172191 73063 140350
12043 140350 258954 138243 73990 78887 91820 37414 184454 306554 190568 221138 240416
12032 240416 198417 278619 447344 505906 459258 464368 558612 535247 352660 405776 599478
12021 599478 701414 754174 613989 429813 241628 160933 301311 422486 491563 504950
12011 504950 401133 588240 797757 735026 713024 1042738 1561056 2194010 2761371 2835671
12001 2835671 2611764 2318770 2001589 1733848 1492714 1290586 1267348 1127468 980979 767464
11991 767464 407713 164057 7332 194280 235250 138045 183436 410183 580340 446230
11981 446230 165076 -76174 -177155 -59633 100021 220825 246671 158105 67888 182027
11971 182027 296420 275659 231486 239473 158590 88765 195906 285766 271942 123529 165606
11960 165606 184660 165248 150102 266708 285798 265449 161174 118324 386932 386048 93212
11949 93212 -60158 -48356 315426 728995 817763 535683 138966 -31715 152788 315273
11939 315273 201315 252881 488555 646869 716002 892249 1130595 1283439 1346557 1423031
11929 1423031 1657669 1945763 2152260 2025994 1788607 1807849 1682773 1355069 1186650 1056339
11919 1056339 1048425 1013945 961785 846632 727592 486046 353842 386115 256982 158883
11909 158883 95361 240532 315200 30957 -218424 -101840 -17337 -116464 -63043 -183185
11899 -183185 -351821 -218189 -16196 112529 132322 31452 40293 129241 152662 23881
11889 23881 -836 152421 203263 116488 -68914 -53180 72883 84260 -65626 -157777 -219548
11878 -219548 -165328 -50132 54981 240119 257067 133875 -139487 -279608 -23958 421921
11868 421921 640444 457368 250170 81169 -23450 -45623 -12124 -14424 -84014 -16363 111220
11857 111220 137633 61999 30732 146839 196937 149513 299239 466803 340504 197766
11847 197766 152240 130912 -136704 -269608 -162513 -105324 -47977 194834 333628 367209
11837 367209 437362 687592 685761 465498 340078 281782 442166 778816 658777 446276
11827 446276 332612 135061 -88856 -147533 -72567 -78825 -58232 -59604 6429 74493 124294
11816 124294 -184898 -304649 -126174 -25490 154653 234319 135071 20658 -129955 -179230
11806 -179230 -193181 -332457 -423969 -512282 -439687 -282472 -284546 -313653 -290906 -348894 -435958
11795 -435958 -448505 -576281 -695074 -693839 -490196 -224166 149512 466360 605625 521444
11785 521444 152031 -112588 -286384 -364170 -210489 10544 6949 35005 44772 -41322 -136448
11774 -136448 -181497 -117873 -41974 -319079 -302520 -40345 -26286 80038 206743 93330
11764 93330 -223377 -457694 -294074 -34206 97756 106879 54286 261729 377746 377290 382988
11753 382988 107213 -43304 87183 173028 165661 28716 -168466 -125878 -32447 -87322 -149508
11742 -149508 -269185 -377134 -427276 -361377 -395654 -469795 -465860 -424057 -243435 -161286 -217147
11731 -217147 -84297 288722 535317 572505 611025 464943 222963 -26198 -124511 -199676
11721 -199676 -334455 -258259 -184734 -231873 -470857 -603115 -553702 -554934 -482234 -125882 53396
11710 53396 -241837 -599319 -789714 -980091 -930136 -671332 -483541 -410867 -456368 -562536
11700 -562536 -665587 -694669 -501130 -320478 -233586 -166930 50874 -9646 -217248 -220846 -246919
11689 -246919 -257993 -197797 -208700 -106880 176431 189292 2283 55170 202119 12660
11679 12660 -194476 -370888 -328569 -224741 -207195 -101938 6196 55512 198898 280284
11669 280284 6788 -153843 -84721 -231976 -379062 -388214 -298954 -297476 -396724 -369772 -187162
11658 -187162 -161409 -211259 -249219 -274446 -308007 -275908 -209462 -49939 69127 17852 -93666
11647 -93666 -151662 64710 294486 278272 233614 218709 -67744 -304788 -278550 -206999 -77138
11636 -77138 -70663 7067 149700 244304 299787 150249 3330 27039 181348 330213 393496
11625 393496 386450 313429 213999 95276 196317 94585 -212155 -354018 -348506 -236292 -166440
11614 -166440 -128335 30330 171276 87784 53820 29400 -138104 -395926 -348964 -99895
11604 -99895 -30418 166781 449217 369156 79147 186415 350546 266025 297186 396827 575192
11593 575192 858801 880818 702832 448531 315757 405311 588937 664567 657490 543597
11583 543597 436209 302554 290977 239547 303825 259459 409005 789665 986465 888459
11573 888459 793070 828111 787845 792494 687651 499654 437166 422163 599823 903656 999364
11562 999364 996621 1037505 1058363 801572 477636 500911 781126 976210 1083237 1182023 1387760
11551 1387760 1826047 2061271 2130057 2128774 2193808 2223412 2345540 2432250 2348285 2213089 2059995
11540 2059995 2003111 1857227 1773359 1914197 2097356 2325292 2700796 3022076 3106997 3400324
11530 3400324 3487354 3393730 3323517 3083571 2652034 2154922 1889960 1678960 1506520 1496928
11520 1496928 1455169 1323732 1241008 960082 682707 500968 372703 453128 470187 372063
11510 372063 321583 329536 350207 422459 240032 -87402 -3920 277302 568506 577124 396004
11499 396004 300436 324217 220916 205098 205606 276206 351588 431707 518214 303670 234726
11488 234726 288796 225449 205883 147212 185442 248764 360394 367031 230085 215013 213858
11477 213858 381016 587334 730352 651215 342682 107007 117307 177537 123992 48985
11467 48985 -6437 143292 283473 307686 331713 374245 507587 660882 593094 381197 198865
11456 198865 206167 146609 129946 119282 199642 49336 -204099 -442357 -624697 -595066 -344794
11445 -344794 -188205 -56062 -91898 -94204 -125356 -71230 162811 300283 213564 -104578 -337021
11434 -337021 -246256 -71247 118975 203006 161813 137554 249160 283399 151743 -2578
11424 -2578 -120564 -173536 -20757 213885 274317 379001 457514 315704 29748 -92644
11414 -92644 -176660 -432594 -556711 -314135 -225394 -338731 -321206 -282442 -208359 -180721 -219172
11403 -219172 -94649 101433 164902 235623 233650 -2848 -111997 -81072 58196 78226 -142576
11392 -142576 -321678 -490480 -455422 -147227 148638 57698 -7275 25887 -40223 135858
11382 135858 473073 572832 332969 141707 197335 389559 472253 425598 322890 121438
11372 121438 32716 135040 225889 228153 244737 314461 251408 185918 225371 165172 88681
11361 88681 -53574 34348 228434 345866 460531 246877 145846 261281 267518 317629
11351 317629 388285 418619 556782 683738 571098 484097 420351 190666 208612 284576 85733
11340 85733 -121414 -205070 -165121 71413 187743 -247555 -694607 -672452 -374455 -27430
11330 -27430 252287 400796 423015 331092 342923 401619 281064 210017 56275 -123008 -283655
11319 -283655 -579118 -769966 -662158 -496899 -363634 -178314 26597 25070 -155699 -172941
11309 -172941 -104735 -166102 -303204 -512613 -703423 -839493 -666616 -208027 154723 151029
11299 151029 -90870 -302235 -402400 -496850 -464555 -364884 -184048 -115035 -139724 -169662 -236507
11288 -236507 -219436 -210084 -187030 -156647 -49445 49889 23990 -13387 -78915 -301540 -386755
11277 -386755 -397176 -502077 -497776 -280274 -47087 149841 78887 -113729 -183180 -133355 -140137
11266 -140137 -426117 -467243 -407996 -148806 133384 219631 313100 424009 615928 640161
11256 640161 398565 262905 270989 207779 12327 -201381 -332843 -344536 -198592 -53756
11246 -53756 -115285 -168375 -47558 86362 88331 31453 193391 279906 276795 320186 333891
11235 333891 179178 136412 225006 371174 614757 707994 567874 166592 -166344 -398023
11225 -398023 -439284 -362156 -429034 -510134 -505153 -441761 -180590 -95629 -200574 -483784 -588375
11214 -588375 -475896 -341202 -305166 -228959 -103479 -138552 -452509 -707019 -698554 -398031
11204 -398031 -88261 -23612 43912 368633 512179 331426 201786 -43954 -55064 -16317
11194 -16317 -21378 3308 -115333 -75409 151710 274389 183178 23636 -152152 -408557 -451330
11183 -451330 -259741 -62950 151211 517299 619933 406329 140228 25722 -87894 -267262
11173 -267262 -356878 -454684 -483242 -530306 -721934 -793856 -756083 -516567 -234096 -168396 -348367
11162 -348367 -290153 -194992 -313887 -572413 -653013 -388017 -267168 -179583 -136042 -80889 56730
11151 56730 153388 48272 -66195 -53343 -125365 -258153 -214811 -97356 -124663 -152647 -180532
11140 -180532 -120663 7885 -87767 -184168 -175047 -188794 -133621 -83862 74813 313181 317911
11129 317911 298570 131631 55477 134810 94723 3074 197187 401378 182074 16303
11119 16303 -106500 -280510 -298983 -211977 -70996 86187 131047 121439 258812 472730 414928
11108 414928 73650 -83784 -49193 -60251 -1175 69949 135711 214763 16229 -287107 -582094
11097 -582094 -718797 -843733 -792150 -589626 -330424 -203692 -230975 -363510 -418603 -344942
11087 -344942 -383853 -485692 -458002 -221941 -94549 -39111 85993 380270 573833 602347
11077 602347 472881 173574 -33480 -188113 -245048 -232867 -149151 96081 210513 152486
11067 152486 156337 202426 384614 469609 337490 193855 -60457 -50070 192333 294268
11057 294268 189629 33653 40354 202119 189169 72068 -63972 -73166 -55490 -208356 -218114
11046 -218114 -127841 -187113 -261626 -126587 18924 -138386 -333957 -365393 -457960 -518419 -421732
11035 -421732 -170518 -58202 -251398 -375550 -187461 105667 27697 -156807 -124928 -164830
11025 -164830 -62316 219772 162685 80902 90905 -241877 -583609 -534273 -345200 -234570
11015 -234570 -13019 51477 -50038 -96956 -328801 -493286 -605438 -678861 -606460 -591602
11005 -591602 -670327 -813761 -719328 -651211 -576769 -269294 -90204 131220 274880 414381
10995 414381 578567 601238 439328 170741 110498 246185 192660 70892 42910 94575
10985 94575 191911 151487 149935 133997 5924 104306 206307 292660 388315 259114 -42750
10974 -42750 -262184 -220543 -42289 -42053 -87692 -84612 43604 286178 564620 531687 263060
10963 263060 -129453 -373392 -376997 -177883 98881 186084 259359 400565 444263 412636 202268
10952 202268 -20034 -145142 -70928 70853 91312 37499 -18684 128173 266889 293443
10942 293443 159868 -133359 -362551 -326193 -88068 307002 544354 439755 293965 291835
10932 291835 195329 201628 367130 248337 -56432 -280518 -448367 -715206 -780232 -476723
10922 -476723 -9096 89950 -93434 60785 214444 112486 109873 151942 8350 9505 158599
10911 158599 200601 117641 1314 -153216 -190394 -203250 -312550 -401162 -290874 -99608
10901 -99608 -23881 39168 45713 -71620 -11686 144483 99803 141975 249670 68520 -252511
10890 -252511 -381958 -334899 -158109 -14232 -64143 -260239 -364821 -270862 -256737 -285387
10880 -285387 -254046 -87367 -103627 -277956 -291705 -382536 -350710 -88974 -39271 -220739 -376455
10869 -376455 -182771 66890 2251 -102098 -101388 211733 397745 164697 -283805 -531068
10859 -531068 -623201 -563421 -326864 -40665 111310 21020 -138763 -281063 -441529 -420297
10849 -420297 -175243 -151604 -240063 -186046 -216307 -50996 142356 -102811 -457321 -469685
10839 -469685 -289429 -110241 14608 24578 182273 370990 511077 500029 376721 406206
10829 406206 516202 459656 218852 -296755 -712103 -756442 -740953 -551236 -243779 -94710
10819 -94710 -43544 -125344 -129980 -155405 -171588 -53837 -129396 -211815 -186219 -145016 -46581 -5680
10807 -5680 -48153 33864 187339 353063 260903 159454 161793 7811 35759 67886 -78781
10796 -78781 -109327 -120181 -207883 -153090 -54886 -41114 12962 244404 254238 132396 206803
10785 206803 228533 65497 23427 48321 319668 516138 403747 142112 176132 283564
10775 283564 161742 -125529 -158463 81943 373979 586500 540103 446928 450115 447127 538154
10764 538154 688895 701883 548537 283385 63136 141743 348818 400937 315084 245625
10754 245625 93262 38782 220125 427950 587781 934922 1177438 1303236 1449036 1662164
10744 1662164 1854176 1989441 2142930 2344687 2481770 2557531 2399271 2135349 1983419 1858510
10734 1858510 1694053 1425757 1214050 1207138 1336391 1178099 929792 873198 875613 1017986
10724 1017986 1176929 1166300 1090554 998267 951655 1116737 1179416 941903 762488 644049
10714 644049 607516 728004 660936 536533 728930 896204 947150 946245 723389 446190 283443
10703 283443 299284 476412 420065 289230 172245 -54256 -175283 -81081 -8549 -178810
10693 -178810 -504437 -445382 -121630 207679 394041 473489 559296 323907 135897 61839
10683 61839 173732 246062 82804 19125 3079 -72907 -142266 -177383 -136154 -44786 -60190
10672 -60190 100726 230920 55852 -192444 -97811 321130 594763 465296 64127 -211589
10662 -211589 -248212 -285 182980 215536 341726 336101 183915 -33968 -229825 -378016
10652 -378016 -384446 -320748 -60981 281138 252900 106992 64052 -79809 -206140 -192947 130199
10641 130199 234657 109530 59030 -12882 -68138 -150350 -181072 -141627 -53184 91975 51104
10630 51104 -55594 -11483 169458 206682 135497 218718 434613 438343 525137 821726 1228495
10619 1228495 1482156 1615491 1588013 1490493 1219975 883438 634870 389467 148264 106752
10609 106752 199200 328255 417432 290342 156259 66141 116408 244981 492756 721898
10599 721898 659730 466002 400573 237509 56626 85118 -105528 -113222 20454 176058
10589 176058 384733 667842 714071 403128 310115 501210 694005 596187 410567 354174
10579 354174 270832 241451 331875 407289 440390 369747 198003 138710 215813 464575 458309
10568 458309 438187 300830 16784 -87905 -214621 -278928 -110500 224096 81987 -64682
10558 -64682 99471 197310 240516 224812 215156 120583 -16932 -28421 -64578 56885 229345
10547 229345 241743 85066 -83891 -124304 83069 459563 555220 431346 373295 200952
10537 200952 -69378 -207506 -198319 -137334 18674 77757 239231 490700 458631 297092
10527 297092 54425 -159862 -237655 -119131 70889 67111 -102717 -407169 -527569 -378426
10517 -378426 -335544 -172401 158198 239500 131636 184651 255563 271688 268220 277830 274189
10506 274189 295172 326353 240138 156586 -9904 115749 234007 208207 254699 336225 412212
10495 412212 368517 213227 107031 283842 429648 264359 215635 409444 620207 830458
10485 830458 1020185 1172223 1271952 1450976 1718856 1839136 1845194 1878939 1915341 1614450
10475 1614450 1314899 1324270 1386386 1356062 1499711 1612996 1379698 965192 794748 653505
10465 653505 763316 725241 436707 261863 127833 165704 184458 185683 180796 240662 127569
10454 127569 40202 58411 81170 241482 293322 253038 366903 600029 372142 180639
10444 180639 245435 227267 288172 125936 -209485 -207821 112551 310944 250456 72841 -50312
10433 -50312 -71112 43862 221344 237784 184795 276051 244178 96897 -130274 -201195 6093
10422 6093 238268 478388 504860 478154 714870 723462 593559 582757 496476 419506 441760
10411 441760 288081 40858 97174 158940 68996 -16864 -44908 -101398 -197104 -244832 -184205
10400 -184205 76161 278072 153615 -53884 -202031 -246271 -270118 -267853 -181073 59631
10390 59631 413698 502849 307493 61111 -61743 -96011 -265344 -413858 -493948 -453700
10380 -453700 -372887 -290996 -213409 -258550 -396074 -608209 -718079 -721697 -793915 -630481 -423410
10369 -423410 -327124 -106523 81099 167420 277272 232901 141431 246332 252224 108700 57907
10358 57907 293646 509358 335720 58084 58632 178649 478377 896129 1246592 1110781
10348 1110781 518704 235654 185163 224902 325331 284914 240241 192066 81781 -83723
10338 -83723 -5179 194976 143855 136266 11553 -207474 -205453 -71193 -112845 -99399 14649
10327 14649 -66969 -155712 -4047 296569 400585 256123 170995 239917 -5763 -192118
10317 -192118 -137949 -176769 -37792 25620 -24959 -51334 -108141 -150107 89303 350296 241876
10306 241876 -78263 -379818 -395260 -399000 -345747 -380769 -478642 -339722 -21581 211607 343214
10295 343214 284149 78056 -182749 -264772 -126559 -148666 -276993 -224527 -102458 -51135
10285 -51135 -271080 -173122 105640 97420 56746 -87381 -157794 -240 111661 147096 161540
10274 161540 -19501 158930 466911 674326 594095 264759 86740 -55405 -93912 26925
10264 26925 107958 5682 -153470 -300569 -287164 -215733 -10923 137946 219506 180091 259249
10253 259249 153678 -58454 -128902 -274352 -411654 -566099 -804622 -1086429 -896242 -546270
10243 -546270 -495723 -474402 -289991 -321254 -173759 -21375 -71942 -195318 -448554 -726153
10233 -726153 -682178 -489422 -537240 -649032 -610400 -535899 -491605 -429992 -452679 -629354 -605023
10222 -605023 -377785 -297257 -279725 -298357 -275852 -282695 -147349 2718 36495 20889 -40695
10211 -40695 -55491 -15583 -55193 -15821 243567 609466 764071 749649 466417 63405 -201910
10200 -201910 -195724 -209611 -337553 -137923 7985 -45001 -121333 -143379 -242978 -229904 -269073
10189 -269073 -585098 -932499 -1019102 -733057 -380925 -354589 -594028 -679107 -632141 -574151
10179 -574151 -297806 -74940 92751 -9408 -285849 -398498 -430390 -570409 -536967 -352813
10169 -352813 -96490 79179 60386 -147897 -393447 -382215 -344963 -349851 -173068 -103134 -152687
10158 -152687 -175242 -279992 -436445 -590360 -625455 -342371 77796 309239 273443 113681
10148 113681 -33883 -161817 -209914 -158482 -139463 -260086 -384072 -409739 -151793 695
10138 695 -204969 -320901 19923 172532 -69029 -248449 -197042 -56093 106813 96784
10128 96784 -39341 -134593 -123258 20423 79487 -42074 -327635 -389022 -3695 363978
10118 363978 773152 971844 881345 921336 1097829 1266163 1564725 2061141 2430650 2757651
10108 2757651 3396509 4068626 4693925 5478758 5965664 5556843 4648387 3866643 3176863
10099 3176863 2481222 1992266 1561327 1274512 1217948 1242545 1260042 1172992 1099378 1058163
10089 1058163 1045252 952454 729248 673161 643413 590819 415912 284249 335047 455808
10079 455808 242452 7979 42533 164150 164279 28582 -163097 -144270 -143221 -67885 76945
10068 76945 242430 274421 71283 23857 163032 53672 -197369 -199728 -60219 -15016 -57702
10057 -57702 -178388 -238163 -143946 210091 600197 757578 672223 574227 690605 642967 528864
10046 528864 494160 441865 247442 106142 127200 64172 -117792 -159311 -78795 8028 -7465
10035 -7465 -47076 -31277 62800 204677 236859 153629 163240 155822 140025 108944 205770 207425
10023 207425 -77468 -241612 -338626 -484603 -317641 -189850 -331391 -353808 -22081 410535
10013 410535 508294 250444 -137632 -598065 -886807 -622675 -266686 -190953 59526 2029
10003 2029 -226997 -306904 -263605 -152216 -50408 118336 387066 375057 227984 129309 208085
9992 208085 214021 803 -109196 -153541 -226691 -69678 331068 679286 678725 565316 223960
9981 223960 -249762 -380624 -197233 -148706 -165790 -109321 -163623 -164023 -147597 -173368 -176078 -189120
9969 -189120 -360876 -315930 -271381 -471322 -409767 -319665 -299284 -315842 -322817 -129261 13144
9958 13144 12904 -137893 -233440 -154748 -125020 -191981 -286256 -372764 -637528 -830606 -831542 -640861
9946 -640861 -160839 -108630 -317709 -259502 -284635 -339416 -380696 -351667 -185961 21889 -8495
9935 -8495 -64185 4766 -21826 -154341 -379210 -505872 -287735 -85553 -219494 -315653 -174338
9924 -174338 123916 383647 393368 460287 589008 457725 163192 -53032 -216761 -319141
9914 -319141 -424776 -515882 -428912 -409677 -618292 -628368 -364444 -79400 66374 115352 140005
9903 140005 158256 -93 -285954 -142150 10978 -115115 -114785 -51579 -143409 -232742 -379566
9892 -379566 -348310 -333424 -306441 -312585 -248338 -41069 -21705 -128974 -57806 10005 12488 -153670
9880 -153670 -270765 -151158 67711 282594 278446 144228 38980 85735 190320 46083
9870 46083 -53519 -192026 -387972 -273854 -122224 -59128 -38417 -49435 -63143 -176568 -96019
9859 -96019 160749 114883 -130520 -288837 -367004 -314082 -243117 -237898 -143615 76932 180976
9848 180976 82761 14247 20113 145812 190407 121990 -71257 -194435 -121985 -165054 -333834
9837 -333834 -455054 -368762 -147344 -5826 -2558 119036 110160 -59992 -301278 -465330 -326458
9826 -326458 -44943 209289 337748 336802 61242 -164319 -112674 101219 213109 262746 192235
9815 192235 192550 230931 233762 132364 183145 89331 -10009 112593 218863 227883 276443 63258
9803 63258 -95211 -23087 46920 11504 12372 207175 198337 -139771 -442202 -416462 -210079
9792 -210079 -164533 -164473 -359998 -554393 -540179 -369838 -142193 -116928 -295059 -420142 -329200
9781 -329200 -211144 -46841 -204776 -406307 -399145 -285987 -307101 -83392 -62176 -359240
9771 -359240 -491174 -384928 -503535 -640238 -479703 -368119 -66866 113563 73295 -6170
9761 -6170 -39966 -222032 -471198 -497855 -399196 -204314 -62078 -144510 -200214 -159499 -207864
9750 -207864 -220365 -213064 -206343 -132691 -90018 -147713 -161900 24645 345257 462527 401081
9739 401081 309395 276650 382995 415222 165929 -157046 -188694 58350 105084 71711 57785
9728 57785 86550 211691 336717 375380 290282 187337 212355 283238 133006 202549 371311
9717 371311 85564 -7874 335968 731961 704666 473214 516359 641982 336829 150222
9707 150222 203055 239519 393982 615223 608380 638494 639314 666734 678586 564689 468004 429744
9695 429744 423177 418847 269731 -10554 -269677 -303267 -159352 -37972 -130407 -403280 -547023
9684 -547023 -362124 -264774 -214350 -185425 -253263 -266548 -259986 -203045 -316723 -430893 -414620
9673 -414620 -462054 -342741 -378322 -317257 -179175 -101013 -35923 -143576 -20617 114293 126723
9662 126723 43526 -156209 -315444 -375270 -328173 -371874 -349315 -224151 -120471 -341621 -649367
9651 -649367 -754027 -591981 -521628 -370532 -172431 -95119 164589 261428 100417 -35011
9641 -35011 225826 557749 734929 742084 719741 472540 327697 375840 322368 148472 111585
9630 111585 283822 322523 168679 241797 212975 79736 157211 631283 1103540 1494527
9620 1494527 1575874 1603434 1819421 2039568 2076811 2352407 2589428 2489033 2317080 2011505
9610 2011505 1672978 1197978 874584 873880 803061 768159 761708 644214 412466 233410 92524
9599 92524 130407 213704 114235 4398 -165857 -333001 -374216 -251214 -68243 131922 123506
9588 123506 -8673 -52977 -212000 -364721 -579661 -594982 -435751 -376730 -525773 -497115
9578 -497115 -231667 29231 95096 288935 478966 421323 463394 535432 497304 235512 150018
9567 150018 199005 129499 82224 55095 146081 279311 219219 146068 151939 145327 -20277 -148308
9555 -148308 -259458 -98711 15947 143332 341526 346295 165244 278052 596662 524011
9545 524011 166886 -196239 -342146 -367291 -429353 -493850 -322265 42744 413366 677589
9535 677589 772272 784850 639637 593079 605434 432071 299823 34004 -328861 -483680
9525 -483680 -456994 -151839 -11762 -86836 -91883 -29285 -55251 -262067 -556857 -457469 -179449
9514 -179449 34883 185395 196964 169917 263953 377858 396489 311745 261108 323905 296558
9503 296558 221717 196387 175966 -96646 -478441 -530352 -404618 -385078 -600046 -721289 -495365
9492 -495365 -72444 319346 423327 431243 517407 470279 363655 318543 410018 544429 541599
9481 541599 551916 402633 413830 461914 574132 721718 951144 1101832 1334769 1546643
9471 1546643 1664115 1570198 1354769 1063193 768274 691739 920329 993997 875626 867747
9461 867747 985386 838987 367996 -25210 -78416 -62186 136599 266637 182754 294944
9451 294944 483176 443133 380777 421122 502941 463135 338095 261699 167217 162917 337901
9440 337901 411794 425263 651452 830443 796319 533405 408848 160556 -17928 28605
9430 28605 71179 108322 29403 -50396 -223148 -454603 -678391 -716395 -545068 -372328 -162911
9419 -162911 141882 288505 172206 150777 88728 1845 17494 130633 174120 189310 179276
9408 179276 -68077 -137814 -204025 -109155 -19075 68449 145558 -5056 -134486 -295115 -276532
9397 -276532 -205953 -158773 -107467 -104343 4906 76668 315881 551338 439500 463897 277647
9386 277647 123457 52004 -97875 -173912 -173295 -109486 -93687 -178007 -183253 -36536 191643
9375 191643 256622 140807 182889 115235 -178080 -294950 -426145 -464001 -432554 -210350 -131337
9364 -131337 -103431 112895 58558 -162845 -99299 -37036 -125867 -236309 -252685 -340262 -397380
9353 -397380 -328103 -324156 -332604 -138019 -29229 -185329 -263417 -256040 -218897 -161160 -214178 -249525
9341 -249525 -318788 -450184 -554558 -666704 -612398 -538917 -482833 -395870 -299924 -337114 -418502
9330 -418502 -337175 -504426 -756040 -831464 -675690 -422369 -250633 -130413 -105120 -136290
9320 -136290 -80009 67284 35013 66118 116654 21430 7729 55541 -33148 -79448 -67313
9309 -67313 -193026 -32057 -71594 -168779 -87420 46508 162484 162906 190135 100746 75038
9298 75038 60078 -144510 -392731 -556419 -495279 -228539 64590 316620 295638 165097
9288 165097 -5472 -205698 -308950 -243711 -27546 69295 124484 115066 -34993 19762 -28071
9277 -28071 -338808 -403834 -317285 -146694 99524 248833 211358 70216 -162647 -352750
9267 -352750 -344439 -390248 -594086 -621688 -400857 -163375 -16595 241353 329674 153861 -85995
9256 -85995 -167154 -150526 -107180 -187855 -333738 -377640 -484242 -534026 -510145 -393040 -156785
9245 -156785 -57566 -62100 -53422 -348212 -414853 -417817 -526906 -169442 43999 -76698 -131714
9234 -131714 -40238 61987 -147897 -247149 -329893 -395134 -422882 -521368 -465835 -571512 -847474
9223 -847474 -751601 -528953 -341558 -85319 133253 208400 174512 214521 187858 128180 162821
9212 162821 291198 517147 692951 748723 602126 438199 276770 126923 137055 93395
9202 93395 -100473 -367454 -471467 -465167 -455200 -598764 -693924 -652832 -715314 -875617 -873952
9191 -873952 -788782 -652909 -441250 -465982 -504795 -423741 -188937 -130261 17591 344519 451973
9180 451973 484210 573417 603490 690054 739863 723655 649718 544968 546418 345799 96584
9169 96584 46875 69715 -29793 21797 51244 -42293 -4437 108496 241493 346565 220756
9158 220756 75323 -44871 -131162 -197808 -246244 -189012 -242275 -266021 -191843 -113678 -40789
9147 -40789 -7004 -9454 23189 178309 293874 163983 -59422 -276547 -324771 -346173 -258807
9136 -258807 -201054 -310526 -357915 -438144 -342625 -99516 -86561 -237916 -141696 41834 102067
9125 102067 208199 85357 -124045 -328734 -382011 -528964 -713855 -625866 -233111 126166
9115 126166 250728 137545 5042 126484 204793 94842 53888 94252 157627 306223
9105 306223 378952 472328 457144 298671 342844 131546 -168865 32424 227170 136432 134505
9094 134505 13 -110233 -271072 -304312 -183592 -110983 -34201 52688 300644 539922
9084 539922 429558 272673 84242 -163328 -511749 -753188 -519224 -283371 -388585 -451320
9074 -451320 -248633 92258 544102 744247 773729 644376 543256 484292 373365 310362
9064 310362 123921 -4283 -88841 -108658 -90108 -3919 101437 89534 34559 -118780 -67538
9053 -67538 132789 75983 -254257 -369313 -195177 -160864 -136593 -242371 -257360 -191981 -254007
9042 -254007 -373913 -433405 -304364 -186564 -69572 48760 105487 -150 -184585 -437619
9032 -437619 -354569 -152547 -64602 44899 202657 293250 282942 127873 -33155 -185603
9022 -185603 -445127 -361766 -99787 139479 98771 -206918 -513157 -642132 -514508 -535319
9012 -535319 -445772 -290558 -324461 -148997 104162 13160 -173067 -260636 -254479 -243671 -295617
9001 -295617 -373521 -334464 -190073 116475 553735 709304 568336 300197 22665 -230154
8991 -230154 -298889 34990 251721 342540 557660 440183 254717 83424 -91906 -240085
8981 -240085 -385659 -433537 -383250 -239626 -209324 20847 30689 -140131 -270341 -119421 43629
8970 43629 115157 144138 161024 209809 57885 55618 301903 464137 378610 372278 320422 148833
8958 148833 111946 146518 -15046 -266194 -286191 -128639 -40047 -71864 -141005 -118055 25159
8947 25159 2994 -130830 -367114 -536764 -589458 -719262 -819942 -699473 -579945 -592256
8937 -592256 -469005 -255550 -226206 -122382 -936 32190 -76240 -270441 -254139 -138931
8927 -138931 -97386 35545 303204 485866 380892 164225 147583 74255 145417 112793 -10758
8916 -10758 -110550 -99796 249567 623097 859595 942567 918117 685814 420810 269340 279367
8905 279367 330909 118766 -115994 -160972 -28537 305079 452207 414786 526077 443727
8895 443727 123196 -93403 -78875 -39579 109905 278689 178554 134166 342378 450530
8885 450530 472243 207093 -18887 56775 94994 202317 134576 -208461 -482005 -536563 -317508
8874 -317508 -60773 -100276 -72346 -110124 -65227 137256 309691 368578 336310 264858 -11218
8863 -11218 -263946 -313689 -18054 500002 794368 672552 228386 -95536 -498372 -622491
8853 -622491 -407287 -272724 -145461 -138609 -89486 -24124 128466 235613 285553 220909 41691
8842 41691 -62873 73707 258993 364335 383147 351647 347571 318638 469667 645548 737227
8831 737227 737029 594127 379125 401802 481255 480896 391136 393319 192314 -250120 -741313 -860096
8819 -860096 -631205 -426184 -455280 -639213 -618039 -419379 -322241 -320424 -183310 -110673 25500
8808 25500 356467 551537 564332 604690 636154 802345 967353 979617 746290 702261 822437
8797 822437 837532 711096 454616 269431 243375 293129 197767 -73610 -116649 -14338 125155
8786 125155 148751 -11465 -163970 -148223 -176377 -308921 -107296 65298 48229 -91132
8776 -91132 -427005 -716565 -654368 -492335 -313396 -371775 -358417 -217772 -172117 -362453 -500461
8765 -500461 -195604 112618 227241 253195 187802 86163 168408 225796 354793 539221
8755 539221 613080 616104 755461 956532 1136071 1191837 1295080 1285942 1152462 1109983 1302054
8744 1302054 1379650 1331998 1262250 1112707 977926 1004597 862098 641492 834993 1253798
8734 1253798 1260359 865851 673658 894490 1040769 992084 1006719 972264 1021600 1213211 1269696
8723 1269696 1008119 614860 357961 340793 381875 352937 387195 430790 508728 647145 595227
8712 595227 555035 463428 295943 125604 228290 358745 259601 112729 38724 135743 321301
8701 321301 429221 360955 522400 592517 386601 516348 705535 920963 1353635 1844420
8691 1844420 1971236 1774151 2070326 2494342 2702856 2731739 2548249 2357658 2333302 2351930
8681 2351930 2223016 1715985 1230497 925012 657736 542142 436827 379996 341137 529179
8671 529179 724487 852007 806359 694411 751624 757651 668270 538088 480338 434201 489306
8660 489306 635275 555490 357502 94678 -14800 -32261 -307072 -459787 -312269 -89453
8650 -89453 114106 63500 -243418 -275725 -93506 -2593 3846 222700 218247 17083 -52977
8639 -52977 -111881 -284690 -188208 -20153 8465 -25064 -84571 -57959 48232 225553 288147
8628 288147 49772 92310 247479 366515 474006 504276 533332 542649 525654 291886 147225
8617 147225 245473 415428 402837 203771 62798 -47645 -212581 -294807 -440029 -409868
8607 -409868 -181158 128804 342972 355639 204649 72078 25119 19780 24023 -28823 -360270
8596 -360270 -658355 -621459 -544622 -462039 -394875 -380347 -318175 -138576 4427 73917 92313
8585 92313 -150036 -307831 -262750 -32987 182482 172013 -155670 -364150 -377677 -380627 -110458
8574 -110458 108026 205327 287162 -6845 -463368 -719240 -830657 -1049464 -1165360 -753969
8564 -753969 -366794 -432029 -467375 -531599 -432065 -24359 166072 222877 251401 255877 292237
8553 292237 212911 203916 404473 324247 52188 -14773 15159 79470 -62047 -329683 -317213
8542 -317213 -136464 -56856 -86373 -94678 -3092 238074 426802 410533 375200 266086 79035
8531 79035 -83369 -263954 -311498 -58147 114877 47686 -44440 -73318 -21636 21945 57752
8520 57752 204336 261190 189616 -64705 -356297 -578342 -694118 -697958 -549240 -266109 -222847
8509 -222847 -337291 -323013 30092 344573 227039 13737 107135 233016 448806 585853
8499 585853 564902 453093 314338 267770 353502 462534 286467 5770 -141655 -293009
8489 -293009 -526756 -588668 -490915 -442900 -525163 -429769 -437404 -512670 -604426 -802108 -881728
8478 -881728 -783444 -671230 -322179 166796 323268 356607 522867 617342 622181 645431 493807
8467 493807 167534 52682 37435 24660 151331 66520 -85201 62998 135905 201450 352291
8456 352291 82310 -374744 -558081 -398151 -169157 -174638 -151170 -77520 438 -49381 -165859
8445 -165859 -245201 -330494 -315196 -255235 -247904 -200142 -150791 -117357 -17066 210856 164802
8434 164802 190810 307522 282355 284006 250823 88314 -126526 -185434 -36946 102478 45599
8423 45599 -3200 54155 153316 206920 108028 -11656 -156876 -266357 -331203 -251171 -76047
8412 -76047 -101668 -20923 121897 233474 282664 249001 224138 291950 451812 410374 175388
8401 175388 135345 269660 488325 356380 152225 -167128 -528440 -680368 -544475 -572112
8391 -572112 -330368 -61793 -36046 9332 220464 118687 -80050 53207 220960 155185
8381 155185 70538 10240 -116743 -199472 -210105 -255747 -541497 -446116 -274112 -203807 -285074
8370 -285074 -451886 -539604 -606650 -664843 -546986 -397140 -428121 -514820 -679472 -505439 -29592
8359 -29592 148941 54731 -117087 -353221 -423749 -353749 -189175 -64608 -26362 -160871 -325359
8348 -325359 -257883 -63630 40763 -146558 -204377 -107926 -38143 -30986 135918 332906 421972
8337 421972 504231 259564 -15047 -132534 -305931 -494685 -376645 -167091 -240003 -281214
8327 -281214 -334609 -317752 -219471 5451 91731 -101506 -119742 85468 128646 -73408 -223177
8316 -223177 -470873 -760748 -989929 -1032023 -902795 -765684 -384593 -85304 -12857 -17369
8306 -17369 -112594 -134908 -74988 -14747 11651 -88533 -189556 -256241 -270491 -359606 -507048
8295 -507048 -426717 -327196 -321423 -457238 -559337 -406348 -254568 -157887 -27994 8975 -82565
8284 -82565 -169599 -268413 -293151 -313144 -304161 -90740 43646 48036 94565 246544 404066
8273 404066 260349 7410 131594 380108 263383 81242 -162679 -491527 -690655 -652920
8263 -652920 -555298 -536663 -626626 -432221 -61442 225714 264519 66617 -199137 -484253
8253 -484253 -610646 -459289 -193770 -8288 -70549 -76824 77367 323525 547150 486917
8243 486917 386583 333420 256344 -35384 -244353 -146346 -150958 -179015 -324072 -489995 -453717
8232 -453717 -384408 -473090 -777578 -625814 -242804 -12854 172606 87517 -92440 -205832
8222 -205832 -206242 -86877 65081 272524 241066 -60288 8077 114780 31923 -31567 -39193
8211 -39193 163406 126062 -160109 -449626 -705675 -621885 -207111 50290 201005 315719
8201 315719 233028 129039 -51350 -172925 -270755 -346528 -277261 -291964 -265760 -231691 -16700
8190 -16700 249633 465761 467564 421003 319216 79285 -98448 11328 8991 -225995 -370482
8179 -370482 -308251 -233744 -313652 -343469 -360478 -370280 -391423 -346656 -209552 -46897 99113
8168 99113 234152 262227 191856 346701 390514 181394 192424 415999 365953 268939 367945
8157 367945 378990 282007 240661 257254 265244 193345 -5890 -141836 -14366 160357 120728
8146 120728 -47000 -163873 -156126 -139395 -201348 -242272 -239331 -257823 -276971 -181920 -48828
8135 -48828 29364 -100251 -193713 -85782 -14412 -41724 -124607 -146838 -45048 63097 -130788
8124 -130788 -485251 -528515 -380666 -354364 -281725 -21742 7804 37593 130119 160697 -4863
8113 -4863 -318591 -327086 -71603 182423 43727 -142413 -110067 1311 176375 254760 93883
8102 93883 -109244 -25661 113283 239768 355321 406183 212709 -69065 -235708 -339117
8092 -339117 -333395 -160988 44819 224930 343084 417528 438303 308181 259484 431307 547184
8081 547184 458844 419003 551545 813115 770115 591995 279341 185950 392451 370529 96920
8070 96920 74280 291295 360360 275500 70093 -269367 -561891 -594607 -547910 -328614 -199954
8059 -199954 -291643 -283869 -339082 -351241 -216033 175565 434761 276582 83393 161082 188267
8048 188267 55270 -164567 -365898 -514473 -423129 -50836 -29332 -309685 -528811 -504921
8038 -504921 -232836 -223619 -277052 -271047 -294165 -352343 -211874 30895 52209 150812 138204
8027 138204 -109925 -213167 -193869 -258635 -134421 55320 96354 240015 464494 405796
8017 405796 100680 -180186 -215167 30346 235862 357781 311584 120708 -11254 16442
8007 16442 265847 521127 274619 -231007 -451541 -412135 -299870 -145370 29569 107191
7997 107191 -29700 -175312 -23515 235280 347521 359468 180949 50451 140007 163336
7987 163336 -56986 -283415 -204806 -122393 -148011 -128271 49958 202340 320123 370501 313996
7976 313996 261279 242285 427013 448442 289779 282714 515557 629570 539773 377389 127584
7965 127584 -79287 -90291 98400 107770 167868 259431 233559 84283 65288 169961 264040
7954 264040 228714 207428 324272 449199 513740 615004 567121 382583 233895 193813 345788
7943 345788 370774 192023 143270 46062 -219059 -310197 -392009 -460166 -425974 -248192 -156960
7932 -156960 -106136 -15753 42250 32925 24838 230885 262805 161180 270448 284599 171073
7921 171073 74626 46495 -127234 -239014 -128235 -16179 -130074 -246801 -117327 180763
7911 180763 188221 65551 -202676 -214348 90574 189948 79181 132221 165093 158323 165456
7900 165456 175304 295118 199923 -120891 -351666 -300571 -380066 -535529 -719219 -553618 -186669
7889 -186669 -101849 -241436 -466847 -579619 -487956 -388849 -225082 -264798 -280212 -86580 115520
7878 115520 227702 241420 169661 -65878 -245962 -307454 -134259 21161 -23450 -10012 -61541
7867 -61541 -365568 -590981 -518091 -506628 -507899 -395668 -303276 -299974 -137095 -136651 -206594 -81326
7855 -81326 31719 -3661 -92291 -212201 -287419 -289216 -197782 -278912 -272509 -139397 64893
7844 64893 224461 296826 212758 217538 172170 -24636 -187022 -109106 -4497 -183453 -440372
7833 -440372 -491234 -362161 -192784 -150306 -156227 -17140 145691 278973 177804 14882
7823 14882 50051 36341 40409 35914 107646 95458 -153817 -226951 -320633 -286079 -142546 -26730
7811 -26730 -47856 -88820 273 128849 219725 201803 29901 58803 108670 184845 172857
7800 172857 8170 -292744 -421733 -197965 -5957 67816 73612 -33175 -83424 -44015 66337
7789 66337 -33529 -40329 -13465 -21686 -183646 -378173 -321619 -65825 23630 -87199 -140403
7778 -140403 -188121 -389852 -398812 -383366 -412611 -303381 -271537 -233716 -16439 367419 538509
7767 538509 396665 154727 -16619 27898 202164 306590 226803 172449 74996 54683 162362
7756 162362 86847 -153606 -306097 -107094 201712 230253 168543 -2351 -162438 -161036 4370
7745 4370 329602 453193 372871 196367 165391 195638 128243 33445 31408 234307 345471
7734 345471 100637 161337 410334 546429 592747 497106 478523 329724 202121 395063
7724 395063 550625 472145 356063 226391 77550 15188 -56925 -219686 -445671 -559661
7714 -559661 -554262 -433909 -241152 -52715 -277684 -483730 -297843 -37196 -109227 -410070
7704 -410070 -435046 -269759 -229348 -187680 -51447 -179300 -442912 -507659 -520297 -586792 -590041
7693 -590041 -454012 -279580 -70360 28257 -27131 -192959 -288114 -151822 187239 274846
7683 274846 -17261 -131663 -350770 -352868 -74810 141514 137187 -105563 -344627 -337646 -247182
7672 -247182 -367308 -562406 -729138 -691805 -439178 -318621 -375616 -410518 -428564 -382358 -465663
7661 -465663 -523551 -541202 -565498 -469273 -136000 -9307 -230134 -431977 -491141 -438282 -231989
7650 -231989 -278295 -210472 -164698 -262520 -290499 -199048 -139157 -309430 -457560 -404079 -207855
7639 -207855 -233727 -476585 -526067 -345207 -247941 -264077 -379071 -555176 -665201 -591765 -409096
7628 -409096 -275235 -73668 86639 48903 -125094 -281376 -380185 -344594 -395607 -570130
7618 -570130 -763447 -767688 -470585 -147599 -70434 -75080 -31676 -122849 -198092 -216739 -196608
7607 -196608 -149747 41783 88899 -118674 -215018 -354246 -448591 -380861 -251486 -185468 -275476
7596 -275476 -397003 -527544 -322055 -181321 -34505 113343 15769 -223585 -437903 -395481
7586 -395481 -223312 -75948 -96212 -93314 145859 337024 231664 64079 36701 -15518 -112395
7575 -112395 -199216 -441365 -669177 -753526 -616512 -441074 -290530 -25286 98911 -30868
7565 -30868 -11716 210002 500284 614190 569752 489389 517660 400631 190021 140291 101726
7554 101726 113478 28272 -178529 -256360 -132006 -23411 96924 66031 129854 216253 83678
7543 83678 47122 8635 -106578 -92119 -54868 16435 -91072 -209817 -353928 -356015 -197713
7532 -197713 -185341 -314149 -368933 -107121 -42470 -68902 45360 276446 255477 -140037 -447184
7521 -447184 -435210 -378881 -182560 102186 41538 -122073 -225451 -195156 -220285 -210505 -287519
7510 -287519 -165834 168223 283927 80723 -166653 -275186 -215425 -214431 -186616 -257490 -222943
7499 -222943 -196240 -218035 -354631 -324376 -245883 -332403 -163848 -22077 -114695 -179856 -356547
7488 -356547 -737829 -612800 -231629 -32097 -116974 -159497 122730 167966 153212 154213 110885
7477 110885 127595 234659 75868 -117536 43701 156109 114106 -84122 -126676 -99907
7467 -99907 -221080 -466710 -628638 -777815 -812114 -756419 -633276 -441161 -336920 -373774
7457 -373774 -440787 -389155 -395419 -455997 -433321 -247780 -132213 -74113 58157 326101 368344
7446 368344 502982 726849 846270 787828 608884 514073 327378 162889 101648 -115361
7436 -115361 -230129 -123227 126421 423763 337801 277031 301915 316199 340155 376575 481148
7425 481148 418675 221207 173606 256846 173837 33049 161244 229795 77420 -168501 -288842
7414 -288842 -550713 -606022 -314744 46649 393283 455613 239603 82219 157856 288571
7404 288571 311858 144684 -75570 -196560 -190124 -155782 -254344 -256175 -93960 -33959 -344680
7393 -344680 -548553 -286175 99720 91569 -147700 -259269 -367476 -502931 -446682 -328048
7383 -328048 -257372 -337547 -480246 -560838 -347745 -54462 258346 333876 115833 -171996
7373 -171996 -191954 77303 280799 184807 136084 115380 -8971 123407 23968 -198910 -205274
7362 -205274 -104631 -202694 -231158 -79044 -44238 -108839 -131123 -87343 -40905 -282933 -461199
7351 -461199 -318658 -235540 -221891 -108723 -96120 -407386 -684047 -675549 -432515 -245164 -258945
7340 -258945 -328550 -296285 -363042 -249997 64629 164520 105498 132857 107799 149154 276466
7329 276466 421933 584210 549909 269002 141940 159721 70768 -74275 -296556 -463144
7319 -463144 -370820 -253315 -298025 -299742 -158189 243418 477107 393481 184801 109421 118934
7308 118934 112858 24409 225214 316220 207129 -15546 -66223 -41012 110653 293546 378425
7297 378425 180282 -174915 -306719 -208324 -157160 -148152 -14324 -155859 -420089 -401202 -327281
7286 -327281 -150823 124357 307755 370988 303770 -49075 -394566 -419876 -315090 -283790
7276 -283790 -257636 -211143 -224818 -66006 112069 42161 -107923 -208657 -77232 175025
7266 175025 97289 -144480 -282191 -299341 -332794 -346475 -267797 -74615 -39071 31154 50088
$$ [...]
##END NTUPLES=NMR SPECTRUM
##END=
