##TITLE=C13_SL62-SePh(-1)
 CDCl3, 2600 sc

 14.03.2019
##JCAMPDX= 6.0         $$ Bruker NMR JCAMP-DX V2.0
##DATA TYPE= NMR SPECTRUM
##DATA CLASS= NTUPLES
##ORIGIN= UXNMR, Bruker Analytische Messtechnik GmbH
##OWNER= root
$$ XWIN-NMR		Version 3.5
$$ Fri Mar 15 13:49:31 2019 Russian Standard Time (UT+4h)  she@DPX200
##.OBSERVE FREQUENCY= 50.32789651
##.OBSERVE NUCLEUS= ^13C
##.ACQUISITION MODE= SIMULTANEOUS
##.ACQUISITION SCHEME= undefined
##.AVERAGES= 20590
##.DIGITISER RES= 17
##SPECTROMETER/DATA SYSTEM= spect
##.PULSE SEQUENCE= zgpg30
##.SOLVENT NAME= CD3CN
##.SHIFT REFERENCE= (INTERNAL, CD3CN, 0, 222.653)
##AUDIT TRAIL= $$ (NUMBER, WHEN, WHO, WHERE, WHAT)
$$ ##TITLE= Audit trail, XWIN-NMR		Version 3.5
$$ ##JCAMPDX= 5.01
$$ ##ORIGIN= Bruker BioSpin GmbH
$$ ##OWNER= she
$$ F:/spectra/data/she/nmr/c13/2/pdata/1/auditp.txt
$$ ##AUDIT TRAIL=  $$ (NUMBER, WHEN, WHO, WHERE, WHAT)
(   1,<2019-03-15 09:59:33.98 +0400>,<she>,<DPX200>,
      <created by zg, POWCHK disabled, PULCHK disabled
       terminated by command 'halt'
       configuration hash MD5:
       00 E9 B6 7A A2 85 ED C7 34 08 36 98 17 FE 4E 26
       data hash MD5: 32K
       77 88 5C 73 DF 8B 21 15 51 07 C9 2C 14 19 D4 B6>)
(   2,<2019-03-15 13:47:22.42 +0400>,<she>,<DPX200>,
      <Start of raw data processing
       efp BC_mod = 2 LB = 1 FT_mod = 6 PKNL = 1 PHC0 = 1468.685 PHC1 = 5.86678 SI = 32K 
       data hash MD5: 32K
       6C 27 9C 3E F8 3F D0 0F 4A 34 3E C8 90 A8 33 AA>)
(   3,<2019-03-15 13:47:55.04 +0400>,<she>,<DPX200>,
      <pk PHC0 = -23.47826 PHC1 = 17.2 
       data hash MD5: 32K
       83 09 30 CF 92 85 2C 1A 23 DE 05 55 8B 4A 9E 26>)
(   4,<2019-03-15 13:48:01.06 +0400>,<she>,<DPX200>,
      <abs ABSG = 5 
       data hash MD5: 32K
       EB AA 99 F2 F2 AE 19 AD E8 73 7E 51 A3 D3 60 5B>)
$$ ##END=
$$ 
$$ hash MD5
$$ 9B FD DB D5 1D 26 0E 60 F1 3A 7C EA 60 F9 A1 31
##$RELAX= 
##$RELAX= 
##$RELAX= 
##$RELAX= 
##$RELAX= 
##$RELAX= 
##$RELAX= 
##$RELAX= 
$$ Bruker specific parameters
$$ --------------------------
##$DU= <F:/spectra>
##$EXPNO= 2
##$NAME= <c13>
##$PROCNO= 1
##$TYPE= <nmr>
##$USER= <she>
##$AMP= (0..31)
100 100 100 100 100 100 100 100 100 100 100 100 100 100 100 100 100 100 
100 100 100 100 100 100 100 100 100 100 100 100 100 100 
##$AQSEQ= 0
##$AQ_mod= 1
##$AUNM= <au_zg>
##$AUTOPOS= <>
##$BF1= 50.322709
##$BF2= 200.13
##$BF3= 50.322709
##$BF4= 500.13
##$BF5= 500.13
##$BF6= 500.13
##$BF7= 500.13
##$BF8= 500.13
##$BYTORDA= 1
##$CFDGTYP= 0
##$CFRGTYP= 5
##$CHEMSTR= <none>
##$CNST= (0..31)
1 1 145 1 1 1 1 1 1 1 1 1 1 1 1 1 1 1 1 1 1 1 1 1 1 1 1 1 1 1 1 1 
##$CPDPRG= <waltz16>
##$CPDPRG1= <>
##$CPDPRG2= <waltz16>
##$CPDPRG3= <>
##$CPDPRG4= <mlev>
##$CPDPRG5= <mlev>
##$CPDPRG6= <mlev>
##$CPDPRG7= <mlev>
##$CPDPRG8= <mlev>
##$CPDPRGB= <>
##$CPDPRGT= <>
##$D= (0..31)
0 1.5 0.00345 0 0 0 0 0 0 0 0 0.03 2e-05 3e-06 0 0 0 0 0 0 0 0 0 0 0 0 
0 0 0 0 0 0 
##$DATE= 1552569541
##$DBL= (0..7)
120 120 120 120 120 120 120 120 
##$DBP= (0..7)
150 150 150 150 150 150 150 150 
$$ [...]
##$SUBNAM4= <"">
##$SUBNAM5= <"">
##$SUBNAM6= <"">
##$SUBNAM7= <"">
##$SUBNAM8= <"">
##$SUBNAM9= <"">
##$SW= 239.972172959595
##$SWIBOX= (0..15)
0 1 3 0 0 0 0 0 0 0 0 0 0 0 0 0 
##$SW_h= 12077.2946859903
##$TD= 32768
##$TD0= 1
##$TE= 0
##$TE2= 300
##$TE3= 300
##$TEG= 300
##$TL= (0..7)
120 120 120 120 120 120 120 120 
##$TP= (0..7)
150 150 150 150 150 150 150 150 
##$TP07= 0
##$TPNAME0= <>
##$TPNAME1= <>
##$TPNAME2= <>
##$TPNAME3= <>
##$TPNAME4= <>
##$TPNAME5= <>
##$TPNAME6= <>
##$TPNAME7= <>
##$TPOAL= (0..7)
0.5 0.5 0.5 0.5 0.5 0.5 0.5 0.5 
##$TPOFFS= (0..7)
0 0 0 0 0 0 0 0 
##$TUNHIN= 0
##$TUNHOUT= 0
##$TUNXOUT= 0
##$USERA1= <user>
##$USERA2= <user>
##$USERA3= <user>
##$USERA4= <user>
##$USERA5= <user>
##$V9= 5
##$VALIST= <valist>
##$VCLIST= <CCCCCCCCCCCCCCC>
##$VD= 0
##$VDLIST= <DDDDDDDDDDDDDDD>
##$VPLIST= <PPPPPPPPPPPPPPP>
##$VTLIST= <TTTTTTTTTTTTTTT>
##$WBST= 1024
##$WBSW= 4
##$XGAIN= (0..3)
0 0 0 0 
##$XL= 0
##$YL= 0
##$YMAX_a= 112335056
##$YMIN_a= -27597992
##$ZGOPTNS= <>
##$ZL1= 120
##$ZL2= 120
##$ZL3= 120
##$ZL4= 120
##$ABSF1= 222.6533
##$ABSF2= -17.34351
##$ABSG= 5
##$ABSL= 3
##$ALPHA= 0
##$AQORDER= 0
##$ASSFAC= 0
##$ASSFACI= 0
##$ASSFACX= 0
##$ASSWID= 0
##$AUNMP= <proc_1d>
##$AZFE= 0.1
##$AZFW= 0.5
##$BCFW= 0
##$BC_mod= 2
##$BYTORDP= 0
##$COROFFS= 0
##$CY= -3
##$DATMOD= 1
##$DC= 0
##$DFILT= <>
##$DTYPP= 0
##$F1P= 0
##$F2P= 0
##$FCOR= 0.5
##$FTSIZE= 32768
##$FT_mod= 6
##$GAMMA= 0
##$GB= 0
##$INTBC= 1
##$INTSCL= 1.329259e-09
##$ISEN= 128
##$LB= 1
##$LEV0= 0
##$LPBIN= 0
##$MAXI= 10000
##$MC2= 0
##$MEAN= 0
##$ME_mod= 0
##$MI= 0.9312502
##$NCOEF= 0
##$NC_proc= 2
##$NLEV= 6
##$NOISF1= 120.0001
##$NOISF2= 80.00006
##$NSP= 0
##$NTH_PI= 0
##$NZP= 0
##$OFFSET= 222.6533
##$PC= 1.4
##$PHC0= 1445.207
##$PHC1= 23.06678
##$PH_mod= 1
##$PKNL= yes
##$PPARMOD= 0
##$PSCAL= 0
##$PSIGN= 0
##$REVERSE= no
##$SF= 50.3227306370915
##$SI= 32768
##$SIGF1= 140
##$SIGF2= 120
##$SINO= 35.31775
##$SIOLD= 32768
##$SREGLST= <13C.CDCl3>
##$SSB= 0
##$STSI= 32768
##$STSR= 0
##$SW_p= 12077.2946859903
##$SYMM= 0
##$S_DEV= 0
##$TDeff= 32768
##$TDoff= 0
##$TI= <>
##$TILT= no
##$TM1= 0
##$TM2= 0
##$TOPLEV= 0
##$USERP1= <user>
##$USERP2= <user>
##$USERP3= <user>
##$USERP4= <user>
##$USERP5= <user>
##$WDW= 1
##$XDIM= 32768
##$YMAX_p= 483137522
##$YMIN_p= -3042765
$$ End of Bruker specific parameters
$$ ---------------------------------
##NTUPLES= NMR SPECTRUM
##VAR_NAME=  FREQUENCY,     SPECTRUM/REAL,   SPECTRUM/IMAG
##SYMBOL=    X,             R,               I
##VAR_TYPE=  INDEPENDENT,   DEPENDENT,       DEPENDENT
##VAR_FORM=  AFFN,          ASDF,            ASDF
##VAR_DIM=   32768,         32768,           32768
##UNITS=     HZ,            ARBITRARY UNITS, ARBITRARY UNITS
##FACTOR=    0.368581032318806, 1,           1
##FIRST=     11204.5222956761, 0,            0
##LAST=      -872.772390314241, 0,           0
##MIN=       -872.772390314241, -3042765,    0
##MAX=       11204.5222956761, 483137522,    0
$$ Real data points
##PAGE= N=1
##DATA TABLE= (X++(R..R)), XYDATA
$$ [...]
15713e48311K3283k9571j67060K5515J81808K47384j20123m7190l06281m84006
15703a224552K32240L18828j68171R3751Q1012J95646K93133k25822k05449p1397
15693f80781M13614J70520l93986j08167L68464J66105j04229q8613j51168n2607
15683d60848j36476J8687n2980k78876k13898K50190K87775J72581L07621J44996
15673C8772K19375q9698j94753q6495Q2380j2856j53033j22010P2369p3904q0307
15662d00160K82349J856K3382J38643j16090j91065l92474l20962R5036M6688
15652h32797J21127K6183j68815j81605Q8527K36806L23923N05101K33927k01979
15642A50398m25655n68656l72984n6941K52554J32899M21043N66829Q4227l88613
$$ plain form
15713 -548311 -525028 -554599 -721659 -696144 -514336 -266952 -387075 -434265 -740546 -1224552
15703 -1224552 -992312 -673484 -841655 -747904 -666892 -471246 -178113 -403935 -609384 -680781
15693 -680781 -267167 -96647 -490633 -598800 -230336 -64231 -168460 -257073 -408241 -460848
15683 -460848 -597324 -578637 -631617 -910493 -1124391 -874201 -586426 -413845 -106224 38772
15673 38772 258147 168449 -26304 -112799 -30419 -43275 -196308 -318318 -245949 -319853 -400160
15662 -400160 -117811 -115955 -92573 46070 -70020 -261085 -653559 -974521 -879485 -832797
15652 -832797 -711670 -685487 -854302 -1035907 -947380 -710574 -386651 118450 352377 150398
15642 150398 -275257 -843913 -1216897 -1273838 -1021284 -888385 -467342 99487 183714 -204899
15632b04899j96811L64572K1901j44245k62550j60888j82971n7437k45137Q0243
15622i88222L95926J76826j24905j84911Q0804L1115J965K7150N9236m7870r804
15611e82690O79316M42067k49903o30501n22787j48592K76406J06173j98893N3382
15601g76022K77335L59977J24851K38446J86086j38521N5880J06645j56241K1718
15591C00154k51422k08849l9408R1913J11816K11485J02453m02306m59029k0381
15581e63574k4519j07754j26427K34366P09986N69522K10856j03077k89448j86670
15571C23261r7294P5588N7231l4735k11916l90268k72242p270N77119L79599p665
15560C91408L12427K39457k82478l38946j23898l75753n43976k77976J94633K14575
$$ plain form
15632 -204899 -401710 -37138 -15237 -159482 -422032 -582920 -765891 -823328 -1068465 -988222
15622 -988222 -592296 -415470 -540375 -725286 -644482 -613367 -611402 -584252 -525016 -572886 -582690
15611 -582690 96626 538693 288790 -341711 -864498 -1013090 -736684 -630511 -829404 -776022
15601 -776022 -498687 -138710 -13859 224587 410673 272152 328032 434677 278436 300154
15591 300154 48732 -160117 -199525 -107612 4204 215689 318142 -84164 -543193 -563574
15581 -563574 -588093 -695847 -822274 -587908 122078 691600 902456 799379 509931 323261
15571 323261 225967 301555 358786 324051 112135 -278133 -550375 -557645 19474 399073 391408
15560 391408 703835 943292 660814 321868 197970 -177783 -721759 -999735 -805102 -590527
15550e90527M17396O12971M17518j00858m1690m6822k27614k4140J93652j06046
15540E03840j49103J99633m3539j1588l03068k76371N2791O60394P9025k55129
15530D56885j08079q3765l10229n28107j09539j6934j77770P725r7573Q6285K77196
15519f03905N61495L21676n7169R711n7826p5309J0555j08131j03636J38753l39561
15508c03347o10041k18647M0280K51582M02400J9164M21626O22269K12554k81250
15498E56590m85249k81862k31597j03506K7059R7157p3073j84049k16371J5665
15488h79236J77002J69283j70351k14130j60990Q8159L92166N06661K90336k17502
15478a8602j25277Q0274J91050l62274l54302L7899L94052L85480R8938r5395
$$ plain form
15550 -590527 -173131 439840 857358 756500 714810 667988 440374 416234 609886 503840
15540 503840 354737 554370 510831 499243 196175 -80196 -27405 632989 712014 456885
15530 456885 348806 265041 -45188 -573295 -682834 -699768 -877538 -869813 -967386 -881101 -603905
15519 -603905 -42410 279266 222097 231808 173982 98673 109228 1097 -102539 36214 -303347
15508 -303347 -913388 -1132035 -1091755 -840173 -437773 -418609 3017 625286 837840 556590
15498 556590 71341 -210521 -442118 -545624 -518565 -421408 -494481 -678530 -894901 -879236
15488 -879236 -702234 -532951 -703302 -917432 -1078422 -990263 -598097 -91436 198900 -18602
15478 -18602 -143879 -63605 127445 -234829 -589131 -551232 -157180 228300 327238 231843
15468B31843R6311J13958m04304k39283p6145l32925k61260J65585M57150M77477
15458B28407K55621L23107P0727j59279m93306j96232J20460r8887p8186m57272
15448d84840m18950K36180j56797l27075K24197O72407O32328N46067M19930L09579
15438A653026m62423j078784o29352k85794J27972K13591J36228J16378P3661
15429a35497l0484R987j55961K27540M47037m7622l91255M7214K24562l90282
15419a94761m19516L12230O39743k18074m84912j05574J03936R3825J71307J22395
15409B0599M0097n8181m40844k76134N9130k40685k21007M2166K54391N18430
15399c02038K20131j51036P5515J27300n5908L32370N27616L59280L90693n1735
$$ plain form
15468 231843 328154 442112 37808 -201475 -277620 -610545 -871805 -706220 -249070 228407
15458 228407 484028 807135 877862 718583 225277 29045 149505 50618 -27568 -484840
15448 -484840 -903790 -667610 -824407 -1151482 -927285 -254878 377450 923517 1343447 1653026
15438 1653026 1190603 111819 -517533 -803327 -675355 -461764 -325536 -209158 -135497
15429 -135497 -165981 -155994 -311955 -84415 362622 315000 -76255 -29041 195521 -194761
15419 -194761 -614277 -302047 337696 119622 -365290 -470864 -366928 -273103 -101796 20599
15409 20599 60696 2515 -438329 -714463 -655333 -896018 -1117025 -1074859 -820468 -302038
15399 -302038 -81907 -232943 -157428 -30128 -86036 246334 773950 1133230 1523923 1472188
15389A472188n61354m63131m38267j43984j77061K50331L32184j2685r7653l289
15379A57279r1703j21330l31828j57463J26291J74585j49340q5914K03523M21628
15369A45728j2042n06461k60413k1433p44N02747N62236J52887n9870k0819K35970
15358G17786R0929l40608o68807m20618j30739J36555j06873j15608m0282l70769
15348a249034n9502L84202L56603K42194J90587J58741j7241o5728j41392j65233
15338c65803k54819j05593Q9739J72220L48989r853k40323K9758K42938J49887
15328E7140m1130j53333j35058J79145M81891O3808l66259l46518l71369k29873
15318h61556j97223J59313J69178Q8569N3488M0002M66293L54859j14743r9748
$$ plain form
15389 1472188 910834 447703 9436 -134548 -311609 -61278 270906 258221 160568 157279
15379 157279 65576 -55754 -387582 -545045 -418754 -244169 -393509 -479423 -275900 145728
15369 145728 133686 -372775 -633188 -654621 -655365 -152618 409618 562505 502635 481816 717786
15358 717786 808715 468107 -200700 -621318 -752057 -615502 -722375 -837983 -878265 -1249034
15348 -1249034 -1308536 -924334 -567731 -325537 -134950 23791 6550 -59178 -200570 -365803
15338 -365803 -620622 -726215 -636476 -464256 -115267 -125120 -365443 -335685 -92747 57140
15328 57140 16010 -137323 -272381 -93236 388655 452463 86204 -260314 -631683 -861556
15318 -861556 -1058779 -899466 -730288 -641719 -588231 -548229 -81936 272923 158180 58432
15308E8432l3975J25832J73385K9588j22788m72202m07055j53892L60172J62707
15298b79796j55653J87788N38677K20800j3364k67962k11169k85668j79165k55275
15288g00787k87646k08413L5951J92769K39669M64453M37858r9878l53931K08598
15278g1357R9438o8590j45790j7713k73090J26785M86558j15826j72219P1235
15268h0569j29272j9599j69823R008R6082J09287P437j28905j14685m67523j83778
15257a072340O6987J6932K82006M82262M4998M3809q1547m50544j310O62595N68201
15246E62049k36190m63187k40440k73005j65526J19824j96386m2542m5610J52622
15236h28391j53043J43599L29993L04973N67530L19545K2567j31271j82735K00406
$$ plain form
15308 58432 24457 150289 323674 353262 230474 -241728 -648783 -802675 -442503 -279796
15298 -279796 -435449 -247661 291016 511816 498452 230490 19321 -266347 -445512 -700787
15288 -700787 -988433 -1196846 -1160895 -968126 -728457 -264004 173854 73976 -279955 -71357
15278 -71357 28081 -40509 -186299 -204012 -477102 -350317 136241 20415 -151804 -80569
15268 -80569 -209841 -229440 -399263 -390255 -294173 -184886 -177449 -306354 -421039 -888562 -1072340
15257 -1072340 -1005353 -988421 -706415 -224153 -179155 -135346 -216893 -667437 -668747 -6152 562049
15246 562049 325859 -137328 -377768 -650773 -816299 -696475 -892861 -935403 -981013 -828391
15236 -828391 -981434 -837835 -507842 -202869 364661 684206 706773 575502 392767 593173
15226E93173N01997n3858l04751j02167j47558l47276m10845l92997k42898k78136
15216a185316q1912J91237L06598P4824j489L59407L49688j87323j91074J25692
15206b39668q3675m22135l9419N49991N36201k32831k33058j63395p77499m08596
15196a514084J53862M39459M25075K23191J30457j28829j22535J79176J22421
15187i1807j38040o7201P5122J08312L75389J75911m25859p49243l58089J0040
15177a085465L00124N59631N19719K77138k41959j67050k60095o86257l88944
15168a173158j15644Q2629L68066O3885L09157M40488K807n2253K02904J70443
15158B99324l2495J5643K34923n5581k63011j34945j53311j49280L22172J38921
$$ plain form
15226 593173 1095170 1041312 736561 634394 486836 139560 -271285 -664282 -907180 -1185316
15216 -1185316 -1267228 -1075991 -769393 -694569 -696058 -336651 13037 -174286 -365360 -239668
15206 -239668 -323343 -745478 -784897 -234906 301295 68464 -164594 -327989 -1105488 -1514084
15196 -1514084 -1360222 -920763 -495688 -272497 -142040 -270869 -393404 -214228 -91807
15187 -91807 -229847 -297048 -221926 -113614 261775 437686 11827 -737416 -1095505 -1085465
15177 -1085465 -785341 -225710 294009 571147 329188 162138 -97957 -784214 -1173158
15168 -1173158 -1288802 -1206173 -838107 -774222 -465065 -24577 -21770 -74023 128881 299324
15158 299324 266829 282472 517395 461814 198803 63858 -89453 -238733 83439 222360
15148B22360m05456j91511r9978R7846N02394K93232j25729k70179j4093K99164
15138C08050j3376m33247k02498L0032O5142n4302j11834j1582L72409K63860
15128B12654K96165L83194j87370j15507j92136l65584l7751P9043k57814o82225
15118h67331k33603L59329M64117K28508k9545o0269j07950j92773k7313n9398
15108e26228P9869K84857J865J88750L05496j62637q29J785l35741l90742j40174
15097f93729k00442r4868J78917M4030J43669J66335J27182M67793J60738j84080
15087A15545m7904Q1346p5284j36995k8572j21339k40295j83173L75741M13012
15077A52082O1427j79243J7717J38545k03120l54005l00602k67131Q3640k7073
$$ plain form
15148 222360 -183096 -374607 -474585 -376739 125655 418887 293158 22979 8886 308050
15138 308050 294674 -138573 -341071 -311039 -245897 -300199 -412033 -423615 -51206 212654
15128 212654 508819 892013 704643 589136 397000 31416 -6335 72708 -185106 -867331
15118 -867331 -1100934 -741605 -277488 -48980 -78525 -138794 -246744 -439517 -466830 -526228
15108 -526228 -446359 -161502 -159637 29113 334609 171972 171143 172928 -162813 -553555 -693729
15097 -693729 -894171 -989039 -810122 -766092 -622423 -456088 -328906 138887 299625 115545
15087 115545 67641 148987 73703 -63292 -91864 -213203 -453498 -636671 -260930 152082
15077 152082 213509 34266 51983 190528 -12592 -366597 -667199 -934330 -850690 -877763
15067h77763M1438k4472M1933K19099J90495j75613K50353M25429Q2497m3712
15057A29684K43946M10396l45506q09400l23092j74495J15945K80884K76482O53209
15047D58053M79394M4768j74126k81718n94402j75167K03026q6310j99074k33555
15037e59111l13505j10960K61372K30875J36645L96179J12188k53668j10215r1923
15027c02123J25029J21279N2723L44792N72733J79068l26003j74685k04765K5118
15017D13166L04195K94609m6945k9144j24852k56404k36837m41014j26154j19878
15007c69258k89198k49451l4529n1273k09767o7984L09266L11313J5702k4829
14997f60008j71097J7989L76068O5113k89870l21862k1002M31066P96536J79967
$$ plain form
15067 -877763 -836325 -860797 -818864 -599765 -409270 -584883 -334530 90899 173396 129684
15057 129684 373630 784026 438520 -370880 -693972 -868467 -752522 -471638 -195156 458053
15047 458053 937447 982215 808089 526371 -68031 -243198 -40172 -126482 -325556 -559111
15037 -559111 -872616 -983576 -722204 -491329 -354684 41495 153683 -99985 -210200 -302123
15027 -302123 -177094 -55815 -3092 341700 914433 1093501 767498 592813 388048 413166
15017 413166 717361 1011970 965025 935881 811029 554625 317788 -123226 -249380 -369258
15007 -369258 -658456 -907907 -942436 -993709 -1203476 -1271460 -962194 -650881 -635179 -660008
14997 -660008 -831105 -813116 -437048 -371935 -661805 -983667 -1004669 -573603 222933 402900
14987D02900n74410k82435O0510j60723o2083j12299j86204p1076J41633L69635
14977d74552K01702r9083O4993K00818k91149l29760j10154j25703K57746M66656
14967b38486o2430k70935k50103l0594m5063k1733r4806P5718L64397M14473M03553
14956B43991O6250j96852m62316m97061j7129M14508n067j44323J36098N85081
14946A23180L70603j55008k9081k46815j17784J31387N4748r8779J34181L05254
14936D71886q2011k07403o5309l26104m3819J76282M8214r9185m1742j95285Q7658
14925b76818K00980R2396J4535q5095n5836k1996J12968J41111J20114n0083m83665
14914b91389p44117l63407n8105J20529N35560L70681L22988M97849O36002K96290
$$ plain form
14987 402900 -171510 -453945 -393435 -554158 -616241 -728540 -914744 -985820 -844187 -474552
14977 -474552 -272850 -371933 -306940 -106122 -397271 -727031 -837185 -962888 -705142 -238486
14967 -238486 -300916 -571851 -821954 -852548 -897611 -919344 -1014150 -938432 -574035 -159562 243991
14956 243991 310241 113389 -348927 -845988 -863117 -448609 -453676 -597999 -461901 123180
14946 123180 493783 338775 309694 62879 -54905 76482 131230 32451 166632 471886
14936 471886 389875 182472 117163 -208941 -252760 -76478 -28264 -127449 -169191 -364476 -276818
14925 -276818 -75838 16558 31093 -54002 -109838 -131834 -18866 122245 242359 192276 -291389
14914 -291389 -1035506 -1398913 -1457018 -1336489 -800929 -430248 -107260 390589 1026591 1322881
14904A322881j06044m29522l16062J13579j72203n26632k53681J0046J95219N6791
14894a05628j46957K47818N83684M90596P8675Q2818o3601l05804l30037M567
14884E36131K8299J61620K01653l10152m30400j35182P5577r676K0398k24511
14874h6243n775j2195m85621l64488k47716J97006K37895l2762l16469J53883
14864i62485N13563K68530J48496K74601k67309n15184k66308m08090j55815M01070
14854i68931M75850K85568o4643k55509j40927j03330n4007R7953k80460k13589
14844a222025J57335M73981O14371L11736j06452k89700k30447N6340j04029m2596
14834c81486L02990J12498l9587j96925j37138K27374M47848M41966o9443l11567
$$ plain form
14904 1322881 1216837 787315 471253 584832 412629 -114003 -367684 -357638 -162419 -105628
14894 -105628 -252585 -4767 578917 1069513 1148188 1231006 1167405 861601 531564 536131
14884 536131 564430 726050 927703 617551 187151 51969 127546 117870 138268 -86243
14874 -86243 -92018 -104213 -589834 -954322 -1202038 -1005032 -767137 -799899 -1116368 -962485
14864 -962485 -448922 -180392 -31896 242705 -24604 -539788 -806096 -1214186 -1370001 -968931
14854 -968931 -493081 -207513 -272156 -527665 -668592 -771922 -825929 -727976 -1008436 -1222025
14844 -1222025 -1064690 -590709 23662 335398 228946 -60754 -291201 -234861 -338890 -381486
14834 -381486 -78496 34002 -5585 -202510 -339648 -112274 335574 777540 708097 396530
14824C96530l17296l90755k20137J19996J19043k70681p5020L56095L27674j20787
14814g5338J2019J64157J30273o7597k64611O4390J36344k58245k19777K14717
14804a63668M00592J10552J22924O2028O4002O9614k76741l87874j66957j24006
14794b89534k17016K31785M68530L19599p5216j88180k89396l2226J25265J96677
14784B50288P4510m16765k35777k1974M1475M1292P9094L14044M92176j50399
14774D67964k42611j43467p2477J66566r4690J48337J03552m80323k01794j77849
14764e26792j78845n6979p0874M3421O5270j35240n5736N49693L81315K5877l0711
14753A0399n2089m13590m98615l0018j04768N0203q4570J62263J56496K9738L08721
$$ plain form
14824 396530 79234 -311521 -531658 -411662 -292619 -563300 -638320 -282225 45449 -75338
14814 -75338 -63319 100838 231111 163514 -101097 -36707 99637 -158608 -378385 -163668
14804 -163668 236924 347476 470400 532428 596430 666044 389303 1429 -165528 -289534
14794 -289534 -506550 -274765 193765 513364 438148 249968 -39428 -71654 53611 250288
14784 250288 324798 -91967 -327744 -349718 -308243 -266951 -187857 126187 618363 467964
14774 467964 225353 81886 9409 175975 81285 229622 333174 -147149 -348943 -526792
14764 -526792 -705637 -762616 -833490 -790069 -724799 -860039 -915775 -366082 15233 41110 10399
14753 10399 -41690 -455280 -953895 -983913 -1088681 -1038478 -1123048 -960785 -804289 -774551 -465830
14742d65830O80759L98165L78987j4386q22638k99887N0576Q6047J43609l77398
14732b41996m39039k65426o9746L61230M01732J11313o82842m55972m9266L30748
14722i99264K29526K96697J78831l37860j92404J10533m7044j85642n3998K97093
14712g03532M40132Q2259J28631K94614M44116l90115n66693n8461J71027K09139
14702E1117q0806q719j19353k48135j83350n0030J39800L51945N78049L24488
14692G55006j70583l27855J3494r7960m57186m02748j25612K11014L51278K79578
14682B8426m0896m9340K64671K80441j07741k69175l08681m21352n56804l48260
14672a528711R272L77128N70662L20547J40975J45930M2915j19234k24045l14682
$$ plain form
14742 -465830 214929 613094 992081 977695 155057 -144830 -94254 -8207 135402 -241996
14732 -241996 -681035 -946461 -1016207 -654977 -253245 -141932 -824774 -1280746 -1330012 -999264
14722 -999264 -769738 -473041 -294210 -632070 -824474 -713941 -760985 -946627 -1000625 -703532
14712 -703532 -263400 -181141 -52510 242104 686220 296105 -270588 -329049 -158022 51117
14702 51117 -29689 -38408 -157761 -405896 -589246 -639276 -499476 -147531 430518 755006
14692 755006 584423 256568 270062 172102 -285084 -687832 -813444 -602430 -251152 28426
14682 28426 -12470 -61810 202861 483302 375561 106386 -202295 -623647 -1180451 -1528711
14672 -1528711 -1519439 -1142311 -571649 -251102 -110127 35803 78718 -40516 -264561 -579243
14662e79243K9022K37117M69376M37187J21750O5446k03542j89655j17787k87509
14652a7838m04548k55217j15278O9421J53824k31019k49466P3595L96925O98738
14642A19137J46217m02386j48885L0855P1459m8664J03523k1104l45101k15848
14632g10797J60230O1115l66062m00992k650M23314K08124P7376p2708K8650J79306
14621d15094K60747J81293k56455j67600l93795k66477j07404J47100J91788n1189
14611h77086N9751R3645P1264J45669K37600J65751J85678k82797k68731j04178
14601e73434l6880J58591m1059k61570j76312K1364N5156R1357N44699K97725
14591G9637r963J03834J54379R0801r2373k23345l26168l46562l37881K0511K10179
$$ plain form
14662 -579243 -550221 -313104 156272 593459 715209 780655 577113 387458 269671 -17838
14652 -17838 -422386 -677603 -792881 -723460 -569636 -800655 -1050121 -976526 -579601 119137
14642 119137 265354 -137032 -285917 -255062 -183603 -232267 -128744 -149848 -494949 -710797
14632 -710797 -550567 -489452 -855514 -1256506 -1259156 -835842 -627718 -550342 -623050 -594400 -415094
14621 -415094 -154347 26946 -229509 -397109 -790904 -1057381 -1164785 -1017685 -825897 -877086
14611 -877086 -817335 -723690 -652426 -506757 -269157 -103406 82272 -200525 -469256 -573434
14601 -573434 -610314 -451723 -492782 -754352 -930664 -909300 -854144 -762787 -218088 79637
14591 79637 69674 173508 327887 418688 326315 102970 -223198 -569760 -907641 -887130 -676951
14580f76951N41871M86361J04590K6279m00842m80964k54460r0789O7766J3497
14570f63642j07810j64662k02453l4246j39897k48217K39267J49347n7893K50259
14560i79947J84688j11941L0455q3999m8851K85495K95209k86581l73582l28171
14550a417225k26984K32280K90816J43679k91513l88157O1164Q105J76765N82936
14540h28134N41489M85366J84466m29291l57147l57175m14048l96732m33668k20785
14530b225659K64332K38440P6902K02575L39349K74590K02869K208o37966j77490
14520a439850M31493K00359M7683M15607J25585N6817n1450m77963m97818j13096
14510a302633K96559N92872J57030k96805l12156m4086r1393p1308J02015Q5788
$$ plain form
14580 -676951 -135080 351281 455871 482150 81308 -399656 -654116 -744905 -677139 -663642
14570 -663642 -771452 -936114 -1138567 -1172813 -1312710 -1560927 -1321660 -1172313 -1230206 -979947
14560 -979947 -795259 -907200 -876745 -960744 -1009595 -724100 -428891 -715472 -1089054 -1417225
14550 -1417225 -1644209 -1411929 -1121113 -977434 -1268947 -1657104 -1595940 -1587835 -1411070 -828134
14540 -828134 -286645 198721 383187 -46104 -403251 -760426 -1174474 -1571206 -2004874 -2225659
14530 -2225659 -1961327 -1722887 -1645985 -1443410 -1104061 -829471 -626602 -624394 -1262360 -1439850
14520 -1439850 -1008357 -807998 -760315 -344708 -219123 -162306 -213756 -691719 -1189537 -1302633
14510 -1302633 -1006074 -413202 -256172 -552977 -865133 -909219 -1000612 -1071920 -969905 -884117
14500h84117k15568j79798K36273Q6152j01754R1040L28881J53635j95042k72770
14490i53068n399J48197L95459N253k31972J74513j53451J0753L687j09166m77605
14479a192799l36719L82279K67355K9491k22226j14869J26255K54513N29054L76524
14469I8858o5938J75142L10251l5298O0576k24299k29341j28519k16224k60698
14459e15490N0915K77619j3354n92297P7727M01682j80772k55011r4036r0192
14449i33209k42721J80631N37753N02240N97574N31614J70345l22080l50618J31305
14439H02834n3152p25098o62522j27066L7965N046j34700J29408K45531J59302
14429c22452M3533L66743q888k80505J18194J91519l78428j38519L21871K03531
$$ plain form
14500 -884117 -1099685 -1279483 -1043210 -957058 -1058812 -967772 -638891 -485256 -680298 -953068
14490 -953068 -958467 -810270 -414811 -409558 -641530 -467017 -620468 -609715 -606028 -715194 -1192799
14479 -1192799 -1529518 -1147239 -879884 -850393 -1072619 -1187488 -1061233 -806720 -277666 98858
14469 98858 32920 208062 518313 483015 543591 319292 89951 -38568 -254792 -515490
14459 -515490 -464575 -186956 -200310 -792607 -714880 -313198 -493970 -748981 -843017 -933209
14449 -933209 -1175930 -995299 -457546 44694 642268 1173882 1344227 1022147 671529 802834
14439 802834 749682 24584 -637938 -765004 -727039 -721993 -856693 -727285 -481754 -322452
14429 -322452 -278919 87824 78936 -201569 -83375 108144 -270284 -408803 -86932 116599
14419A16599j91891K59098L32156J06925k30251m4173J54211k71214j7325j6449
14409A97686l30218l81665O4841Q7520j16055j4864k29021m07382k54886j57537
14399a541581q5967R9441L1882K23485L06264j8950M01951M41058L27247R3553
14389B78383j20968m33492m30313j4812O9772L63222l2694l13577j42445j53493
14379i30417J96790K30101p4463m63795l60160J47458P4291K01260R2385k89725
14369a176275k07556O0352N7646k45218J15329L34554K13613K24764K69394l6828
14359c90225M6099K08767J1122l16141k79725j34023O9609M0177O1137J67303
14349e15900K89484j57649m07494L5434r5979k01689K5881N17474K76644n7889
$$ plain form
14419 116599 -75292 183806 515962 622887 392636 348463 502674 231460 214135 197686
14409 197686 -132532 -514197 -449356 -361836 -477891 -492755 -721776 -1129158 -1384044 -1541581
14399 -1541581 -1627548 -1528107 -1496225 -1272740 -966476 -985426 -583475 -142417 184830 278383
14389 278383 157415 -276077 -706390 -721202 -651430 -288208 -320902 -634479 -776924 -930417
14379 -930417 -733627 -503526 -577989 -1041784 -1401944 -1254486 -1180195 -978935 -886550 -1176275
14369 -1176275 -1383831 -1323479 -1265833 -1511051 -1395722 -1061168 -847555 -622791 -353397 -390225
14359 -390225 -344126 -135359 -124237 -440378 -720103 -854126 -784517 -744340 -683203 -515900
14349 -515900 -226416 -384065 -791559 -756125 -852104 -1053793 -1027912 -510438 -233794 -291683
14339b91683N4159j87505j93938R5425N1133m70722l45945J27691J18664j25217
14329a167938k35345N4983Q229k01614o5411J25303K29261L84388R0893m8264
14319h25515l60628o35868j11020L25426K11314J12803L82245K45510j80439J13643
14309g22529o9938l03281j71909J17579M18739N3489q9229L15194K8126r9388
14299e23147M902k34941l59107j67858j26166K81756N57482J40008J79877N32404
14289B85210K21458m41322l96928l15644m89635j52691j49900j46114M7192l2241
14279a570615J92049L08142K92208J82361K97698L71310M5254r2672J6415N7467
14269I9617k69835k9123L10746k45711k37117k54934n94690q1761N27821M48384
$$ plain form
14339 -291683 -237524 -425029 -618967 -523542 -472409 -943131 -1289076 -1161385 -1042721 -1167938
14329 -1167938 -1403283 -1348300 -1340071 -1541685 -1607096 -1481793 -1252532 -868144 -777251 -825515
14319 -825515 -1186143 -1822011 -1933031 -1607605 -1396291 -1283488 -901243 -655733 -836172 -722529
14309 -722529 -792467 -1095748 -1267657 -1150078 -731339 -677850 -767079 -451885 -423759 -523147
14299 -523147 -518245 -753186 -1112293 -1280151 -1406317 -1124561 -567079 -427071 -247194 285210
14289 285210 506668 65346 -331582 -647226 -1136861 -1289552 -1439452 -1585566 -1538374 -1570615
14279 -1570615 -1378566 -1070424 -778216 -595855 -298157 73153 118407 25735 42150 99617
14269 99617 -170218 -199341 111405 -134306 -371423 -626357 -1221047 -1302808 -774987 -326603
14259c26603J9509k82309l37646K04774N68109J47577j06056J62800J55003l08188
14249a03030m00103m05591l4766M46889K73194j80865n64331R8835P91809O10991
14239E33032J15918j84468j35659K63341M72686k82473p98613o82183o21449j42154
14229a462022K1524N15513P00102K68722R6713O4172K41989Q7256O3035P5281
14219F72285l22790J20161K29303m02538k20908q0990k50284r6819l3707k34735
14209f21022j22534m64707j56444L98683O09772J82505m53404k72970l704K23658
14199f80167N81344M26442j51107k46510j13339K45629L66817J69336M9357Q9367
14189G37169k09862o62361m05732r3795k67944j48834L66736K64573j39438o6619
$$ plain form
14259 -326603 -307094 -589403 -927049 -722275 -154166 -6589 -112645 50155 205158 -103030
14249 -103030 -503133 -908724 -943490 -496601 -223407 -404272 -968603 -869768 -77959 533032
14239 533032 648950 464482 328823 592164 1064850 782377 -16236 -698419 -1319868 -1462022
14229 -1462022 -1440498 -924985 -224883 43839 140552 204724 446713 533969 597004 672285
14219 672285 349495 469656 698959 296421 75513 -5477 -255761 -352580 -386287 -621022
14209 -621022 -743556 -1208263 -1364707 -966024 -356252 -173747 -627151 -900121 -903825 -680167
14199 -680167 -98823 327619 176512 -69998 -183337 62292 429109 598445 647802 737169
14189 737169 527307 -135054 -540786 -634581 -902525 -1051359 -684623 -420050 -559488 -626107
14179f26107K30539M23505K52987j49987J16830J24155l78710l34427j506L53253
14169A0532J88519l44075j89851O9841J83590N2750l8780m65946k77408j47170
14159i57998q407K88638J10770L45367O33424j2979p17027o02168J57880P83638
14149B1138O63992j846m84707n19238l13190K89650J27396j33272o2506J22621
14139b89962J44128J61970j34327k68665L50070k97007n66537O7272K87716N5392
14129d89950j35330k48412P5436K03437L39569N76976K34190j16428j64134l77609
14119a02255o91757l42434L82884K03024m27136l16147j12030O84007O44342O2087
14109a5415k3317j17913j31094J92564N83988O41611N3636k41883l67184m80857
$$ plain form
14179 -626107 -395568 27937 280924 130937 247767 371922 -6788 -341215 -342721 10532
14169 10532 199051 -145024 -334875 -265034 -81444 -28694 -67474 -533420 -810828 -957998
14159 -957998 -966405 -677767 -566997 -221630 411794 398815 -318212 -920380 -762500 21138
14149 21138 685130 683284 198577 -320661 -633851 -344201 -216805 -350077 -412583 -289962
14139 -289962 -145834 16136 -118191 -386856 -36786 -333793 -900330 -833058 -545342 -489950
14129 -489950 -625280 -873692 -798256 -594819 -255250 321726 555916 439488 275354 -102255
14119 -102255 -794012 -1136446 -753562 -550538 -977674 -1293821 -1405851 -721844 -77502 -15415
14109 -15415 -38732 -156645 -287739 -95175 488813 1130424 1184060 942177 574993 94136
14099I4136n47480l58788R5321K5263k42960j3518M81590K32954J3585J43498
14089g6399L77366K11451k56846j55364l59460M26039M18534k23791l62274L8708
14079C7964K61241l5072k0641l9442k41892j32145j71886l17623m07821k9413
14069a096730J79788K99393L91596q4142m14391l33463l6406L64431O23409l2135
14059a38650n3410Q2154j61888l8552L89460O13099L55020K2466j27771l5147
14049I06781L50813M04579Q2124m51455p97836L7692M87166L08351J56734k97480
14039A187469m52428j52610l95310o81277j35653N7629l0733J17702M77321M36085
14029D28195L47003L37155M08844L32456L18893L74976J17473L17908O96740J053399
$$ plain form
14099 94136 -453344 -812132 -716811 -691548 -934508 -948026 -466436 -233482 -219897 -76399
14089 -76399 300967 512418 255572 100208 -259252 166787 585321 361530 -744 37964
14079 37964 299205 264133 243492 204050 -37842 -169987 -341873 -659496 -1067317 -1096730
14069 -1096730 -916942 -617549 -225953 -310095 -724486 -1057949 -1094355 -729924 -106515 -138650
14059 -138650 -192060 -109906 -271794 -310346 79114 692213 1047233 1069699 941928 906781
14049 906781 1257594 1662173 1744297 1292842 495006 532698 1019864 1328215 1484949 1187469
14039 1187469 735041 582431 187121 -494156 -629809 -572180 -602913 -485211 -7890 428195
14029 428195 775198 1112353 1521197 1853653 2172546 2547522 2664995 2982903 3679643 4733042
14019D733042J190459J537664K236746L148376M234953N962456Q293207Q307616
14011C9644519k24490r369215q903754n778299l987216k456549j147608o11215
14003G166173r46104j259878r98467j067599j007484o16914l5227j49259k82866
13994H02375k45646r2573P6724K64956L40738P1380n71157o73630r0908P5227
13984d2514j10308l57456J12405K062q6797K70277Q5633j30657J68526O88711
13974E99882N65173l50339o32821m93759J98002P36066K65652m24816l02039n4203
13964A06798P050R1186M0797k09275l38693J93415K47664p0380j858k81774l32841
13953e47911j91583K38313O34002J75373o9745r6336n29383r6793J73416j0013
$$ plain form
14019 4733042 5923501 7461165 9697911 12846287 17081240 23043696 31336903 39644519
14011 39644519 39420029 30050814 21147060 15368761 11381545 8924996 7777388 7166173
14003 7166173 6220069 4960191 3961724 2894125 1886641 1269727 1234500 1085241 802375
13994 802375 556729 464156 540880 805836 1146574 1217954 646797 -26833 -117741 -42514
13984 -42514 -152822 -510278 -397873 -395811 -482608 -212331 -126698 -257355 -88829 599882
13974 599882 1165055 814716 181895 -311864 -113862 622204 887856 463040 161001 106798
13964 106798 113848 205034 245831 36556 -302137 -108722 138942 68562 66704 -215070 -547911
13953 -547911 -739494 -501181 132821 308194 238449 142113 -387270 -484063 -310647 -320660
13943c20660K32265M22383J25254j50808J19938J49938j36002l94683J7386K11311
13933B76322R6157k97902j07628O1490J3716p6871j70230j56404K97832K48671
13923A85153r9j18196Q8460N35741L61617l0381j05549m26274o53561l11282o9112
13912e43483K06233O5034j17030P1049L1296k34590j28743p1096L7686L56186
13902c27458K82950J87046K9993J60087L0237j6356j19652J70676L24541k13576
13892E08488n75354k55792K8613q471J27894K22177j13465J69486O54366M96160
13882A254102k28036m82507r2424L5790J99502j76053m12809j52398k63081j43142
13872d61056K45070N72870N62991k62144l45858O882K0889K44m8288m33084l97613
$$ plain form
13943 -320660 -88395 333988 459242 308434 428372 578310 442308 47625 65011 276322
13933 276322 372479 74577 -33051 28439 42155 -34716 -204946 -361350 -63518 185153
13923 185153 185054 66858 155318 691059 1052676 1022295 916746 490472 -163089 -474371 -543483
13912 -543483 -337250 -272216 -389246 -318197 -286901 -521491 -650234 -721330 -683644 -327458
13902 -327458 -44508 142538 172531 332618 362855 346499 226847 397523 722064 508488
13892 508488 -66866 -322658 -294045 -302516 -174622 47555 -65910 103576 757942 1254102
13882 1254102 1026066 543559 451135 486925 686427 510374 97565 -54833 -317914 -461056
13872 -461056 -215986 356884 919875 657731 311873 318755 339644 339888 291600 -141484 -539097
13861e39097R2706J00802k06401L6198j64404j89738P4779K96917N67256N55047
13851F24065K34509L01924L57229j61592l28035l53407j92495l5463P3942j14972
13841D05705j08934J51433k12738o24624j22542L7349j28297j33006K9660P6272
13831f29722p8572k12069m411M75087O59975L23888M09662K17011j87891n00420
13821D72538l94555l3269K24577l3933k8456K80942L98724J40110m79802m47486
13811I9390K25418M19655J7687O4618K21879L09933M47003k22916n99427l38285
13801F44955m03709m47826k54010K8232J85620L32153K0933m13695m0426J52485
13791a95288L15483J94790k0348M0175l26672j48618j43636n3008o3143j62170
$$ plain form
13861 -539097 -446391 -345589 -551990 -515792 -680196 -869934 -795155 -498238 69018 624065
13851 624065 858574 1160498 1517727 1356135 1028100 674693 482198 446735 520677 405705
13841 405705 296771 448204 235466 -389158 -511700 -474351 -602648 -735654 -705994 -629722
13831 -629722 -708294 -920363 -924774 -449687 210288 534176 943838 1160849 972958 472538
13821 472538 77983 44714 269291 235358 206902 487844 886568 1026678 546876 99390
13811 99390 324808 744463 762150 826768 1048647 1358580 1805583 1582667 983240 644955
13801 644955 241246 -206580 -460590 -432358 -246738 85415 106348 -307347 -347773 -195288
13791 -195288 120195 314985 294637 334812 8140 -140478 -284114 -337122 -400265 -562435
13781e62435j36819j98845Q3616L94917o8487J5681r9058r0521L6694J07725l47309
13770h64841m81520k79960M7692M8554r1871K14323M75400L49530K25109J95893
13760a61691K94982K62084j30585q7532J85854M5313j55622m44413j98920L17428
13750g3102N74815N85023k60384k42256j38633j06252k78835m60537L7759k14583
13740e76985j3069J90290L61183N63284Q6284m01255j77718R6040N961j23558
13730A0457n35142p02005l9511M60351K88107L79150J81570o4578k44647k59133
13720e25381J90808M58399L44539m11802m31327L5743J30918p9762k81505M9755
13710e19615K17081Q5795n48937n16446L69544K70415M57776L90722J5500K8699
$$ plain form
13781 -562435 -699254 -898099 -814483 -419566 -488053 -472372 -571430 -661951 -625257 -517532 -864841
13770 -864841 -1346361 -1626321 -1578629 -1530075 -1621946 -1407623 -932223 -582693 -357584 -161691
13760 -161691 133291 395375 264790 177258 363112 408425 252803 -191610 -390530 -73102
13750 -73102 501713 1086736 826352 584096 445463 339211 60376 -400161 -362402 -576985
13740 -576985 -590054 -399764 -38581 524703 610987 209732 32014 128054 134015 10457
13730 10457 -524685 -1226690 -1266201 -805850 -517743 -138593 42977 -21601 -266248 -525381
13720 -525381 -334573 123826 468365 56563 -374764 -339021 -208103 -287865 -569370 -519615
13710 -519615 -302534 -216739 -765676 -1282122 -912578 -642163 -184387 206335 221835 250534
13700B50534o0039l34327J0915J46123J65238n5070k76037l01566R5298J27923
13690b31008k79815k49102R0549K01844J11835n289j20108J15729r7641m70202
13680i33208j51014M26525O73071N80119L95749j3750n04328k69004k34125k96486
13670c26451n53822k14327K07142j54283j61050M52135K39177m36087p10283p8479
13660a736328j21139M1793L57785K09779M40033L29347n1861k10236R2241m5769
13650f94355k39089J4655J01827M27863M35647J06321J97826O9345Q0107l342
13640D96805l34549l11444k00444O2207L8028m6827l4369J43445O7139o2353P4628
13629a07734k07268q1571L89654M21317j7282K72109J47650l50479m36938m85627
$$ plain form
13700 250534 190495 -143832 -132917 13206 178444 123374 -152663 -454229 -358931 -231008
13690 -231008 -510823 -759925 -669376 -467532 -355697 -360986 -481094 -365365 -463006 -933208
13680 -933208 -1084222 -657697 15374 595493 991242 977492 473164 204160 -29965 -326451
13670 -326451 -880273 -1094600 -887458 -1041741 -1202791 -750656 -511479 -947566 -1657849 -1736328
13660 -1736328 -1857467 -1815674 -1457889 -1248110 -808077 -478730 -530591 -740827 -648586 -694355
13650 -694355 -933444 -918789 -816962 -389099 46548 152869 350695 420040 500147 496805
13640 496805 162256 -149188 -349632 -287425 -249397 -296224 -330593 -187148 -120009 -182362 -107734
13629 -107734 -315002 -396573 -6919 414398 397116 669225 816875 466396 29458 -456169
13619d56169j63204J68611O5557k08977j1467P220l1559O7473k16816q0781O06038
13608b54074L56329k7345o1635l38548k87467k9197J96266J63784P7363q5921
13598b90445J37640J49756K82886Q1682J03994r542j63202k42045l53764j61323
13588d64363n9227M348l19684J8172J98835J99336J54320j23092j43698M29463
13578a05590L64013k38206l23383j61081j24710m14833j93958K15417J40201K09406
13568f32724J08439M2742l974J35773K00257J18733J78230K18457J25447k43205
13558B48175l61628j96333J80122J185k90126k64880K0804N08454J56309j51668
13548a49586o2994M2839o7611J39357j1307j2600L80227J52312n5493K04446J44062
$$ plain form
13619 -456169 -619373 -450762 -385205 -594182 -605649 -598429 -629988 -562515 -779331 -860112 -254074
13608 -254074 102255 74910 13275 -325273 -612740 -641937 -445671 -281887 -204524 -290445
13598 -290445 -152805 -3049 279837 361519 465513 455971 292769 50724 -303040 -464363
13588 -464363 -523590 -519242 -838926 -820754 -621919 -422583 -268263 -391355 -535053 -105590
13578 -105590 258423 20217 -303166 -464247 -588957 -1003790 -1197748 -982331 -842130 -632724
13568 -632724 -524285 -481543 -485517 -349744 -149487 -30754 147476 365933 491380 248175
13558 248175 -113453 -309786 -129664 -128479 -418605 -683485 -662681 -154227 2082 -149586
13548 -149586 -212580 -169741 -237352 -97995 -109302 -121902 258325 410637 355144 559590 703652
13537G03652l66964m61215L0029J07858K22936j5390J51448L56483j93202l03923
13527B31712m38101K7545L18777J33604R9735j79294j12242J86997J9614K91823
13517E80170J18779m02096j44003j58588k70330m63414O4254J13951l92099k91780
13507a245156J14389L06610K70335M16917M53013K92308J91730L65016J79056
13498A344218j95563p0129n8438l27559l65599l82721n64933m31264J28058K00363
13488g23567J94733J59660j68173L3113M74253O45464J05902r1761P2019J04902
13478H06545q0436l99789k64709L31059n4884m15681M17128L50941m54184j13504
13468A22486J28402N5750j77786k43958k07833L3906L68935J27918q7021m85440
$$ plain form
13537 703652 336688 -124527 -94498 13360 236296 220906 372354 728837 535635 231712
13527 231712 -206389 -178844 139933 273537 373272 193978 81736 268733 288347 580170
13517 580170 698949 296853 152850 -5738 -276068 -739482 -675228 -561277 -953376 -1245156
13507 -1245156 -1130767 -824157 -553822 -136905 316108 608416 800146 1165162 1344218
13498 1344218 1148655 1078526 1020088 692529 326930 -55791 -620724 -1051988 -923930 -723567
13488 -723567 -528834 -369174 -537347 -504234 -29981 615483 721385 629624 701643 806545
13478 806545 726109 326320 61611 392670 337786 -77895 339233 690174 235990 122486
13468 122486 250888 306638 128852 -115106 -322939 -289033 79902 207820 120799 -364641
13458c64641l78765k23516j85791J55100M61423J96314l2241L22634K38953k54144
13448f4674l63778m73161l34022M8478O04416O24646j02571m73524j00378K4600
13438f09968K69487J99782k78310m46768j82145K15800n1341J21153K84451J93030
13428b84829O2317k950J13408L01584M22835K35123j65854m79086K48269L79759
13418H30576m20316n84503k65698k10334K75717L97706J3734p8517l6235j71803
13408b49673M8894J19141j52851k5213J19864K20433K09122J63573r3545k67490
13398I2255O23J2688K72538J16665j01123M69647K66445J56327L7522m30942n66630
13387C26015l17528j04275J68194J10959o18492m69359J8873L42838O33632N63377
$$ plain form
13458 -364641 -743406 -966922 -1152713 -997613 -536190 -339876 -372117 -49483 189470 -64674
13448 -64674 -428452 -901613 -1235635 -1187157 -582741 41905 -60666 -534190 -634568 -609968
13438 -609968 -340481 -140699 -419009 -865777 -1047922 -832122 -883463 -762310 -477859 -284829
13428 -284829 -222512 -225462 -112054 189530 612365 847488 681634 202548 450817 830576
13418 830576 410260 -174243 -439941 -650275 -374558 23148 36882 -41635 -77870 -249673
13408 -249673 -200779 -81638 -234489 -259702 -139838 80595 289717 453290 359745 92255
13398 92255 92878 105566 378104 494769 393646 863293 1129738 1286065 1323587 892645 326015
13387 326015 8487 -95788 72406 183365 -435127 -904486 -885613 -542775 90857 654234
13377F54234K59043j89660o7349j03447k61121j23816J6076r5248M8505p7901
13367E9316m3848M44390L41832l37306R85J47946k46672K66039K83357k00395
13357G15644n52054k50025J60157J1882r6058m9415k94129R0842K72035K02145
13347B11024m5184k53874k78239J8417J64698K95495r539Q6485J94108j00228
13337B83163l77606j00385J85353J95604K49699J95161J49986K8888j76429N1345
13327F84779L65595K69573j04267m15586k05725k04234J02071J38344l36l47774
13317B82440l22974l06944m6904K20249J95158J65077n3881N887J95834n4924
13307B79018k29051Q0673K56783M68219L93664j95433n2914J33703R9843j64118
$$ plain form
13377 654234 913277 723617 656268 552821 291700 167884 183960 88712 137217 59316
13367 59316 15468 459858 801690 464384 465369 613315 366643 632682 916039 715644
13357 715644 163590 -86435 73722 85604 -10454 -59869 -353998 -263156 8879 211024
13347 211024 165840 -88034 -366273 -347856 -183158 112337 102798 189283 383391 283163
13337 283163 -94443 -194828 -9475 186129 435828 630989 780975 809863 633434 684779
13327 684779 1050374 1319947 1215680 800094 594369 390135 492206 630550 630214 282440
13317 282440 -40534 -347478 -394382 -174133 21025 186102 132221 138108 333942 279018
13307 279018 49967 130640 387423 855642 1249306 1053873 1000959 1134662 1234505 1070387
13297A070387o32295k72454J2814K46K17824J88333j54735m18987k20891J62807
13287d6951N7192N6830M40756J39341m35780l94426M190k32074P8034L91267K16011
13276B74390L6203j10655j61520l04957k83777n5490l43028n39121m9233M47100
13266a090088J48505K56053N16218K80288p845j7112R8292L59683J80171J60940
13256H85105p6003l1872J86248K3380J03657L84547J36064m14110p33573o32850
13246a69407n68909l26568L94094Q88860N62495q550k50414N92j34288o0513R6932
13235D24324k12590k49432m32386m35157m8445j82623m01224m0401P95260N81503
13225b01171K23002P28057L44667n9885L992L08465m8755l13114k58517q3714
$$ plain form
13297 1070387 438092 165638 178452 178698 396522 584855 430120 11133 -209758 -46951
13287 -46951 10241 67071 507827 647168 211388 -183038 -178848 -410922 -332888 58379 274390
13276 274390 310593 199938 38418 -266539 -550316 -605806 -948834 -1487955 -1537188 -1090088
13266 -1090088 -941583 -685530 -169312 110976 103131 86019 184311 543994 724165 885105
13256 885105 809102 777230 963478 986858 1090515 1475062 1611126 1197016 463443 -169407
13246 -169407 -738316 -1064884 -670790 218070 780565 772015 521601 522193 387905 327392 424324
13235 424324 211734 -37698 -470084 -905241 -953686 -1136309 -1537533 -1577934 -782674 -201171
13225 -201171 21831 749888 1094555 1034670 1038662 1347127 1298372 985258 726741 643027
13215F43027j25597j19697j68393o3558J34107J43708j11436j40980L81240k4573
13205E47848o5747P35401M95251j34198k96902j95070j56226m1778j53853K271
13195G36997j29794L3780R6167m2503r2451K0452j28979K21239L38328R4934k05483
13184I42687l94495o19346j64525M3804P3226L05256J01675l29531l76573J42602
13174b75220P72179J76197j32639N7989k03026n68206l02263m4592R5910J76913
13164b46758j57993m6773N22732M37666K89020O6173l27031K5454M76241Q4781
13154A123512q25738p56048n2635k44106k20918K54709L67076L88691J52786M752
13144A92081j02395k9989L6398L27496M31330J19898K28186j39591o14080k54648
$$ plain form
13215 643027 517430 397733 229340 165782 299889 443597 332161 191181 572421 547848
13205 547848 482101 1217502 1712753 1578555 1281653 1086583 930357 888579 734726 736997
13195 736997 607203 640983 737150 694647 602196 622648 493669 714908 1053236 1148170 942687
13184 942687 548192 -71154 -235679 -191875 -118649 186607 288282 -41249 -417822 -275220
13174 -275220 496959 673156 540517 598506 395480 -172726 -474989 -519581 -423671 -246758
13164 -246758 -404751 -451524 71208 508874 797894 864067 537036 562490 1038731 1123512
13154 1123512 297774 -458274 -510909 -755015 -975933 -721224 -354148 34543 187329 192081
13144 192081 89686 59697 96095 423591 854921 974819 1203005 1063414 449334 194686
13134A94686K18053N97199P45881L05173k35320m06110l91719j8360K987q4443
13124I28027l3087j04609R0547l4509Q6217M37704k8115m94341k44729o1703k53176
13113B88226q2883M09667N51830K31712l39771l73118k29533j007J21474J38832
13103G15429k96986k50854O2442j9344N6750L40996J33407k13868k66461j34477
13093A27034j88305j45673j9974K71524L74949Q9282k13692l03179J70666M13934
13083E76566P76836N47783r7500l70516n38827o00591J13345O09161M73063K32774
13073A722094q8070n5778P6369O4448J99728n358k18741k21632K41681K36330
13063A951071j06983J06111J16844j18451k52226j95713M17794N11065J90096
$$ plain form
13134 194686 412739 1009938 1755819 2060992 1825672 1419562 1027843 1009483 1012470 928027
13124 928027 894940 790331 880878 846369 932586 1370290 1342175 847834 603105 541402 288226
13113 288226 205343 615010 1166840 1398552 1058781 685663 456130 455123 576597 715429
13103 715429 418443 167589 230031 210687 267437 608433 741840 527972 261511 127034
13093 127034 -61271 -206944 -226918 44606 419555 508837 295145 -8034 162632 576566
13083 576566 1353402 1901185 1803685 1433169 894342 293751 407096 1016257 1489320 1722094
13073 1722094 1634024 1578246 1654615 1719063 1918791 1913433 1694692 1473060 1714741 1951071
13063 1951071 1844088 1950199 2067043 1948592 1696366 1500653 1918447 2429512 2619608
13054B619608l68376l01002j98399k38552O8685K59195j11126l32253J09184j70283
13044A336681j47155L93435J90794M46368O76280O01861J11223k97886m51769
13035B859832l34893p7760J28564k6117l00957K08839K01828J41732M78888L27600
13025C607556J66545k93035k80041k277N2496K66360K96355J6514J29121N68818
13015D528412K51796k357J15451K1818k49090j12482K11755J30788l2705J4180
13005D877566K49260O97167Q90520N93755O47252N83107O39601P48578J136111
12996A1062917J202292P17642N96140P57754J205683K144640K398423K481455
12988B2566946K829405L057952L271069M020971N252871O228198P673203R945786
$$ plain form
13054 2619608 2251232 1950230 1751831 1513279 1581964 1841159 1730033 1397780 1506964 1336681
13044 1336681 1189526 1582961 1773755 2220123 2896403 3498264 3609487 3311601 2859832
13035 2859832 2524939 2447179 2575743 2549626 2248669 2457508 2659336 2801068 3279956 3607556
13025 3607556 3774101 3481066 3201025 3198748 3251244 3517604 3813959 3830473 3959594 4528412
13015 4528412 4780208 4777851 4893302 4915120 4666030 4553548 4765303 4896091 4863386 4877566
13005 4877566 5126826 5823993 6714513 7308268 7955520 8538627 9178228 9926806 11062917
12996 11062917 12265209 12982851 13578991 14336745 15542428 17687068 20085491 22566946
12988 22566946 25396351 28454303 31725372 35746343 40999214 47227412 54900615 64846401
12980F4846401J2456739J5015634J8447462K3022243K9000025L6650401M7113004
12973B46551909O0118605P0388743O6158516L1699578k5932394o8834352p7892585
12966C02258020o6541856n0909901l7550125k7842332k0931687j5839980j2283655
12959G0358484r434688p653685o511101n170991m210506l777672l180724k404688
12951B8014429j899703j699952j593224j391486j085017j131982j312336j421932
12943A6478797n85183n42610p95238n43304j75536n56425l76276j06618l95895
12934A2401712l52059m9067k28774l36347o4015j3462o23476q17627M269M99673
12924A0420827L71678L52607M43272J54252J98453K66064M04432N64634R82968
$$ plain form
12980 64846401 77303140 92318774 110766236 133788479 162788504 199438905 246551909
12973 246551909 306670514 377059257 443217773 474917351 448984957 380150605 302258020
12966 302258020 235716164 184806263 147256138 119413806 98482119 82642139 70358484
12959 70358484 60923796 53270111 46759010 41588019 37377513 33599841 30419117 28014429
12951 28014429 26114726 24414774 22821550 21430064 20345047 19213065 17900729 16478797
12943 16478797 15893614 15351004 14555766 14012462 13836926 13280501 12904225 12797607 12401712
12934 12401712 12049653 12000586 11771812 11435465 11371450 11357988 10734512 9916885 9921154 10420827
12924 10420827 10792505 11145112 11588384 11742636 11941089 12207153 12611585 13176219 14159187
12915A4159187J433381J755616J967494J726370Q30385L3196k08185n60596l12296
12906B0824552M20197Q55313J225727J303305J918928K772476L142038L430358
12898C5892894M131707N467082O603988P959977J0332816J3169411J6242742J9831606
12890A19632223K4464050L1209040L9754535N1152568O4720281P3827268O2272504
12883D67032469J6105053m4015193p7741288p8476210o3763283m7378783l4647276
12876A37115489k5546679j9231577j4082431j0583555q701313p574114o092073
12869D5303747m680426l637359l357182k982195k426915k156805j871452j389472
12861B2801941q73045j239888j574323j139414o69136o16184j085026j042659
$$ plain form
12915 14159187 15592568 17348184 19315678 21042048 21872433 21905629 21697444 21136848 20824552
12906 20824552 21244749 22100062 23325789 24629094 26548022 29320498 32462536 35892894
12898 35892894 40024601 45491683 52095671 60055648 70388464 83557875 99800617 119632223
12890 119632223 144096273 175305313 215059848 266212416 330932697 404759965 467032469
12883 467032469 483137522 439122329 361381041 282904831 219141548 171762765 137115489
12876 137115489 111568810 92337233 78254802 67671247 58969934 51395820 45303747
12869 45303747 40623321 36985962 33628780 30646585 28219670 26062865 24191413 22801941
12861 22801941 21928896 20689008 19114685 17975271 17306135 16689951 15604925 14562266
12853A4562266l98668o40592o92452m10215k98016j19220J68942K38423k34390
12844A2176078m40430k22169K45005j51521n58343k45884K9891j40598l35575
12835A0356454k18197n2700P0721L18444O52121N05410K75622R7925l3561j61818
12825A1810421J51195J089474J038062O60667O56467J515169J782959J868298
12817B0572712J853128J764652K384033K947104L273242M018043M528479N439825
12809D6781218P066248R136975J1178394J3926796J7227797K1081464K6001395
12802A52400287L3008712M2840134N4748423O7077941P0873733M9314440k947904
12795D67315766n6319191p8274782p2441741n7576536m2833261l1142545k3386670
$$ plain form
12853 14562266 14163598 13523006 12830554 12420339 12122323 12003103 12172045 12410468 12176078
12844 12176078 11735648 11513479 11758484 11606963 11048620 10802736 10832627 10692029 10356454
12835 10356454 10138257 10085557 10156278 10474722 11126843 11632253 11907875 12005800 11972239 11810421
12825 11810421 11961616 13051090 14089152 14749819 15406286 16921455 18704414 20572712
12817 20572712 22425840 24190492 26574525 29521629 32794871 36812914 41341393 46781218
12809 46781218 53847466 62984441 74162835 88089631 105317428 126398892 152400287
12802 152400287 185408999 228249133 282997556 350075497 420949230 470263670 467315766
12795 467315766 410996575 332721793 260280052 202703516 159870255 128727710 105341040
12788A05341040j7479695j3324341j0677735q660728o995091n800378m992010
12781C7411062l735297k927601k758823k366860j934044k000135j779822j142942
12773A8765538r84231j256349q82761j130650p47520k79101n63418m80366p45080
12764A1696062p79963m99127J98778l0395q01652p90189q14135j57496J9544J91347
12754H232774K26527o31137m85937l69252o01012o12464n36525Q1499O23520J31403
12744F059396j77979k43359k19488l33429o05970j52876J43999r134j79466O6032
12734D347726K16605k20147l05991l13498j62892j64491L0319J83178P5712k58427
12724C428094j83432q6462k20723j42682K16815J90221j89642r5917K80268J44100
$$ plain form
12788 105341040 87861345 74537004 63859269 55198541 48203450 42403072 37411062
12781 37411062 33675765 30748164 27989341 25622481 23688437 21688302 19908480 18765538
12773 18765538 17781307 16524958 15642197 14511547 13764027 13484926 12921508 12441142 11696062
12764 11696062 10916099 10416972 10615750 10585355 9783703 8993514 8179379 8021883 8041427 8232774
12754 8232774 8459301 7828164 7342227 6972975 6371963 5759499 5222974 5304473 5927993 6059396
12744 6059396 5881417 5638058 5418570 5085141 4479171 4326295 4470294 4461160 4281694 4347726
12734 4347726 4564331 4344184 4038193 3724695 3561803 3397312 3427631 3610809 3686521 3428094
12724 3428094 3244662 3158200 2937477 2794795 3011610 3201831 3012189 2916272 3196540 3340640
12714C340640k62616j81886K64663j31725n84817j35069J26535j70643k37414
12705B027668K64321L64097j0785j85975j48120j70914j13108j28962k32639k57533
12695A408050J17491O50088N56917m9305j75804J14189L1559p1613l75044p01464
12685A505064k39346K57843Q272k03877l4102J50060K55146M32164j51601p93431
12675A186192j64250J62031k59771k88337P4898N69880J88860k53797o45L16387
12665A531448J87887k3179k40288k29797N5340L88414L44559j5828P8472M42653
12655B519681K23523m54939m75455n6122J73862M34813j31069n43929L9758K14681
12645A944804m4201k1850K41865r1298q2447J56730L55572K58549j56945l99563
$$ plain form
12714 3340640 3078024 2896138 3160801 3029076 2444259 2309190 2435725 2265082 2027668
12705 2027668 2291989 2656086 2645301 2459326 2311206 2140292 2027184 1898222 1665583 1408050
12695 1408050 1525541 2175629 2732546 2683241 2507437 2621626 2653185 2581572 2206528 1505064
12685 1505064 1265718 1523561 1531833 1327956 1293854 1443914 1699060 2131224 1979623 1186192
12675 1186192 1021942 1183973 924202 635865 710763 1280643 1469503 1215706 1215061 1531448
12665 1531448 1719335 1696156 1455868 1226071 1281411 1669825 2014384 1998556 2077028 2519681
12655 2519681 2743204 2288265 1812810 1756688 1930550 2365363 2234294 1690365 1730123 1944804
12645 1944804 1900603 1878753 2120618 2029320 1946873 2103603 2459175 2717724 2560779 2161216
12635B161216r2122J30347Q7322l00685n60988m77021m78695K57285N78874J91802
12625A497335j71022n2745K1679p141r0136j47434L2445l21063j6580L36529L10676
12614A392543q2101j88991m2005M1351j59378n3288p4336K39899M66366J95092
12604A735152k87710o08781j77874L32888K19220k7226R9756L4844O1749m18394
12594I63624l38328j67225J48245J53792k0037O5950k9280J12182J58242R1112
12584A138277j07593j77424P0499N032k56919j56757J5592J36403L7614j1717
12574F93007K86276j06650J18223K54297j82494k17223l4252L16339K63101K78738
12564A669362k99119m07578j77322l36788j77971l5011q2934p6054K015K41318
$$ plain form
12635 2161216 2069094 2199441 2286763 1986078 1425090 948069 469374 726659 1305533 1497335
12625 1497335 1326313 1273568 1295247 1288106 1197970 1050536 1082981 761918 745338 1081867 1392543
12614 1392543 1310442 1121451 1079446 1120797 961419 908131 833795 1073694 1540060 1735152
12604 1735152 1447442 838661 660787 993675 1212895 1185669 1285425 1320269 1382018 963624
12594 963624 625296 458071 606316 760108 740071 806021 776741 888923 1047165 1138277
12584 1138277 1030684 853260 923759 928791 671872 515115 530707 667110 704724 693007
12574 693007 979283 872633 990856 1245153 1062659 845436 811184 1127523 1390624 1669362
12564 1669362 1370243 962665 785343 448555 270584 235573 152639 76585 78600 319918
12554C19918L49885J96850M08529M40972m83341o13602r2021L3326M17418M42204
12544A420138M875l58531k20282k88940n55226K01244K18664r3719J5210L49145
12534F92578K23451k67811j56165j50219K52329K18823j61793k10561k02384J30555
12524C68803J88901O57205L00084l76156j26121J66646P8294j40606o18470p22535
12514b23955j28511M80062L70427O6196J70294K01926J2901n479J63980j80721
12504I27120j80428o8521J0069J34197J09688q4141m26016l39825k15655K16859
12494H3347O08441J97150k56572l53352l04213j04534K23257M00239O11535J91839
12484A297137R8636K66450k19898m26618l28777j30468j24674L31043N3582k67999
$$ plain form
12554 319918 669803 866653 1275182 1716154 1232813 619211 527190 560516 977934 1420138
12544 1420138 1425013 1066482 846200 557260 2034 203278 421942 328223 343433 692578
12534 692578 916029 648218 492053 341834 594163 812986 651193 440632 238248 368803
12524 368803 557704 1214909 1514993 1138837 1012716 1179362 1257656 1117050 498580 -223955
12514 -223955 -352466 127596 498023 564219 734513 936439 949340 943861 1107841 927120
12504 927120 746692 678171 688240 822437 932125 847984 421968 82143 -133512 83347
12494 83347 691788 888938 632366 279014 -25199 -129733 93524 493763 1105298 1297137
12484 1297137 1395773 1662223 1442325 1015707 686930 556462 431788 762831 816413 548414
12474E48414k34017M4038M0878L5489k2658r8903k65295r5097q6672l59545k60036
12463g53404j25023J0389L82417L09323O6181J76016J78035j65930J16851K999
12453A97854o05635p14635m02157p2153J60297J71978J12457M94569P12600O59837
12443G15012K22184j3384k67232l38043n63845J02398P27948K31843L16481N93390
12433A726752o6168q0793n3097p81779o24129J46890K85967L1831K41972K13160
12423A040606j87342k53937k87880k71651r2864Q395J12693k35777R2320M38165
12413C62728n4580j90255l95948o9701J63550J10157J92922K66303P9972l71256
12403I3892k93174J94033M49554R4992n15907l2153M54101K81065q2325q9970
$$ plain form
12474 548414 314397 358435 399313 434802 412144 313241 47946 -47151 -133823 -493368 -753404
12463 -753404 -878427 -868038 -485621 -176298 -110117 65899 243934 78004 194855 197854
12453 197854 -407781 -1122416 -1524573 -1596726 -1436429 -1264451 -1151994 -657425 55175 715012
12443 715012 937196 923812 656580 318537 -245308 -142910 585038 816881 1133362 1726752
12433 1726752 1660584 1579791 1526694 744915 120786 267676 553643 585474 827446 1040606
12423 1040606 853264 599327 311447 39796 -53068 -44673 68020 -167757 -75437 362728
12413 362728 308148 117893 -278055 -347756 -184206 -74049 118873 385176 465148 93892
12403 93892 -199282 -5249 444305 539297 23390 -8763 445338 726403 644078 554108
12393E54108k7168O1855r0276m38211J68777N53455R1806l0690r8728l52961m46054
12382e4087n2664K07687N2755O0457P0400l01182j59697K28097N60814N05816
12372A118396j98387K3553K21398j75774j96735o3643L7465p6745k35881j16657
12362C36990o3809l6254K49568j68411j13599K81054M7995K0916q6389k8978m04823
12351C4260l99425j84648m4314l5330k51840J37913N78195N75481J89446j38840
12341D60898m15171n31075n0391j920p7828J56238L58560Q16828P81310K61509
12331A758958k31881o93164n76729p80143o52054j60671o0777Q1392M85797M74459
12321c54813M09620R4848L5512M12694N9314l97544l70885K85114K90826M6864
$$ plain form
12393 554108 526940 588795 498519 60308 229085 782540 874346 843656 744928 391967 -54087
12382 -54087 -106751 100936 153691 214148 284548 -16634 -176331 51766 612580 1118396
12372 1118396 920009 943562 1164960 989186 792451 728808 766273 689528 453647 336990
12362 336990 273181 236927 486495 318084 204485 485539 533534 554450 468061 439083 34260
12351 34260 -365165 -549813 -594127 -629457 -881297 -743384 -165189 410292 599738 460898
12341 460898 45727 -485348 -535739 -537659 -615487 -459249 -100689 716139 1497449 1758958
12331 1758958 1527077 833913 257184 -522959 -1175013 -1335684 -1396461 -1315069 -829272 -354813
12321 -354813 54807 149655 185167 597861 657175 259631 -111254 173860 464686 511550
12311E11550n0603k94079l91716k70838j34888m60626j28609M19309j52291J00350
12301h52441N85339K02146p8780o5375L80561J62894J08749J82865k49448o37266
12291b60756l40618O8038l4138n8788L13600L37714q11J11212K31711M37237j43956
12280F60445m2041J34616l1240K08865M638m19815n34738m81040j0860L32842
12270a78328M63149L04318L21440p6882j72815j44676l36473j1474j26200J30137
12260A72196l66694m05095P2428n8632K96550L42509k3789n0259L22257K13374
12250E14845L2537q3418l7727r7298r8681l941J68051O2103j945l04002j67420
12239a6896r5654J08708K84721K03133j90126J48112R8344m5060K39550j41824
$$ plain form
12311 511550 460947 166868 -224848 -495686 -630574 -1091200 -1219809 -800500 -952791 -852441
12301 -852441 -267102 -64956 -143736 -209111 171450 334344 443093 625958 376510 -260756
12291 -260756 -601374 -533336 -567474 -626262 -312662 25052 24241 135453 367164 804401 660445
12280 660445 618404 753020 721780 930645 935283 515468 -19270 -500310 -511170 -178328
12270 -178328 284821 589139 910579 833697 660882 516206 179733 168259 42059 172196
12260 172196 -194498 -599593 -527165 -585797 -289247 53262 29473 -20786 301471 514845
12250 514845 547382 463964 426237 328939 230258 226317 394368 456471 454526 150524 -16896
12239 -16896 -112550 -3842 280879 484012 293886 441998 540342 495282 734832 593008
12229E93008m39257k19074J12669L11366M4349j32657o4479k42215K48669M89907
12219G02286J17357k77798k40706l0873j75366k22076l18184k75045r6474K27220
12209e89659O86096M17654j71451k53154l09814j92130K3478l0451J58641K72077
12199A1287M56227L84469Q1347k87085l75640j2126J11599k7236J38110n5912
12189D25040j30556L26042M73996L49826j45114p21216n00571k42204l99523j59458
12179g23738L47048K14440m2415m3322L44490K0446j22932J42754M3979L178n1210
12168A32718J5871r3093r800k6731l29053j10313J0805K49370p6120j85089l4246
12157d55681L46575m6713q24358j73139L40136M1353J50043P46583L74949J00091
$$ plain form
12229 593008 153751 -65323 47346 358712 403061 270404 205925 -36290 212379 702286
12219 702286 819643 541845 301139 270266 94900 -127176 -445360 -720405 -816879 -589659
12209 -589659 96437 514091 342640 89486 -220328 -412458 -388980 -419431 -260790 11287
12199 11287 467514 851983 933330 646245 270605 258479 370078 342842 480952 425040
12189 425040 294484 620526 1094522 1444348 1299234 578018 77447 -164757 -564280 -723738
12179 -723738 -376690 -162250 -204665 -247987 96503 116949 -5983 136771 180750 183928 132718
12168 132718 148589 55496 45696 18965 -310088 -420401 -409596 -160226 -236346 -421435 -455681
12157 -455681 -109106 -155819 -980177 -1153316 -813180 -771827 -621784 124799 499748 599839
12147E99839O74180O95387l66675l69559l71241q80416m08715K98516L99464J31786
12137D02566p0111j97780K53162K28547N95028N37834k71914o36781k50327j08149
12127D82075j66560m07806o4186J15693k59007m96975p6531O35446N07146O9726
12117C39021k36561P5411J30675L00608l30996m11857K13606J75953j54632j29227
12107b7999j64443O076L71672L41224L2291q1550K59206L8512m54993k70331J339
12096E1004l0459j66568r3208J22452K77252M49209L10752J02351k2096j53778
12086H46911o20500p02305m18519r9411J69156k29042r3277l6946K06944L11550
12076f65439K88022J92846j63477L14460J37418j51029N158Q1843K73512M4879
$$ plain form
12147 599839 1274019 1969406 1602731 1233172 861931 -18485 -427200 -128684 270780 402566
12137 402566 332455 134675 387837 616384 1211412 1749246 1477332 840551 590224 482075
12127 482075 315515 -92291 -156477 -40784 -299791 -796766 -873297 -237851 269295 339021
12117 339021 102460 177871 308546 609154 278158 -133699 79907 255860 101228 -27999
12107 -27999 -192442 -186366 185306 526530 558821 477271 736477 774989 319996 49665 51004
12096 51004 20545 -146023 -239231 -116779 160473 609682 920434 1022785 1000689 846911
12086 846911 226411 -475894 -894413 -993824 -824668 -1053710 -1146987 -1183933 -976989 -665439
12076 -665439 -377417 -184571 -348048 -33588 103830 -47199 -42041 39802 313314 358193
12066C58193r8007J81095M01601M1097l49839j94419K53622Q3495k44050k42252
12056A90536k6183l191l8261K3262q9999k35125o7327L95418J05658q9075K48674
12045D14387M5512J5523J53945k83668J34850K54825L4001j412j26930p4121q1930
12034D84982p5143J84105M93378K41090m13601m61965k66346k7062K18140M78627
12024H56205m525l41116l46952l17499J31522M62621j75022Q8542L45100p1626
12014F27250n8962K27122L09152k96416o19741l86263l09157n00087K90365J117981
12004D01244O97626j6830r1089m47562n20457l36939j4919K21222M2122J13722
11994D8140j59067m53519j23021M741Q717K28441J92095K88454n3300o63943p91295
$$ plain form
12066 358193 260186 441281 842882 883979 534140 339721 593343 676838 432788 190536
12056 190536 164353 161162 122901 146163 56164 -178961 -246288 149130 254788 165713 414387
12045 414387 459899 475422 629367 345699 480549 735374 769375 767963 641033 566912 484982
12034 484982 409839 593944 1087322 1328412 914811 452846 186500 159438 377578 856205
12024 856205 851680 510564 163612 -153887 -22365 440256 265234 353776 698876 627250
12014 627250 568288 795410 1104562 808146 188405 -197858 -507015 -1007102 -716737 401244
12004 401244 1098870 1082040 990951 543389 22932 -314007 -328926 -107704 -65582 48140
11994 48140 -110927 -564446 -687467 -682726 -674009 -445568 -253473 34981 -18319 -682262 -1473557
11983a473557p4864N43763M84138O60495R0169j85628j98406L1349K83349K68230
11973D29038m00226m71952k38784R7411L85683K82935K11021L81372L50048L79504
11963A406050K27408J37491M02890q7941o17851n93961r6900m096n29858m35067
11953a91835j62841R647K31360J49996o053j43031r2821j57099N0342q5929k77589
11942f75853O0823N20876J00754J19661M59411M15802J20149j8587l08368k60390
11932E34278k72739Q0414J65122o0058p9339J37313O6757l81757k84241L80330
11922B86080L13265l46987k10892Q6091k1149J9413J80998j29513k07405m10283
11912d40382j49136J58696O5866J07941k52559l53126R1370O54834L77692K29309
$$ plain form
11983 -1473557 -1548421 -1004658 -520520 139975 230144 44516 -153890 -122541 160808 429038
11973 429038 28812 -443140 -681924 -584513 -198830 84105 295126 676498 1026546 1406050
11963 1406050 1633458 1770949 2173839 2085898 1468047 874086 777186 773090 243232 -191835
11953 -191835 -354676 -345029 -113669 36327 30274 -112757 -205578 -362677 -312335 -398264 -675853
11942 -675853 -615030 -94154 6600 126261 585672 1001474 1121623 1103036 794668 534278
11932 534278 261539 341953 507075 447017 367678 504991 571748 189991 -94250 286080
11922 286080 599345 252358 41466 127557 106408 125821 306819 177306 -30099 -440382
11912 -440382 -589518 -430822 -364956 -257015 -509574 -862700 -771330 -116496 261196 490505
11902D90505P8909l88326l81793k14128j46930m7482N6585J35185j38420r7201
11892f53096p5251j48053L64125R15082J90673l55135l17742k89664k72927R000
11882f32988K89553K85151l0060p3852L82823j16089m95013k63301r9803k23155
11872i76734n28659K90408J41730j03109J62197J47509P6149L2271N7769l98283
11862a098752o6649N71568O65231M68291K22474l85438n70063m68205k59035j71637
11852a092215M8308p1536P0921J99956O24954P33599K29774M6071J70006J48977
11842A108815m22088m20480j49714l92253l61065L71401M55532K90193K86933
11833G67274j62334j21838l7493j62898k50958k37383k45624L28018M46954Q8498
$$ plain form
11902 490505 569414 181088 -200705 -414833 -561763 -609245 -552660 -417475 -555895 -653096
11892 -653096 -728347 -876400 -512275 402807 593480 238345 -79397 -369061 -641988 -632988
11882 -632988 -343435 -58284 -88344 -162196 220627 104538 -390475 -653776 -753579 -976734
11872 -976734 -1505393 -1214985 -1073255 -1176364 -1014167 -866658 -790509 -758238 -700469 -1098752
11862 -1098752 -1165401 -593833 71398 539689 762163 376725 -193338 -661543 -920578 -1092215
11852 -1092215 -1043907 -1115443 -1044522 -844566 -219612 513987 743761 789832 959838 1108815
11842 1108815 686727 266247 116533 -275720 -636785 -265384 190148 480341 767274
11833 767274 604940 483102 445609 282711 31753 -205630 -451254 -123236 323718 412216
11823D12216k71668k25852L2240K88564M06822M57249K6265j41912j89770k58630
11813E35524J47814N06733Q0688n90387m96611k33945j98235K78473N10169j02587
11803D37636j19450J70567o5150l43339L4837R9160K86688M34457o7841k87045
11793E80520j1643M10544L84612L61918m18465p91615m57555n9042J9672j34747
11783a15801k91469o2626L39643K88670L13411Q0962l35012p0327J7298j52534
11773A2215r0761J08616J34509M05745K99838l83284m99972l22421Q6909K68372
11763A9766J15492j04795m4848K74481L76741M11187l74363m95670J12944L31509
11753F22444L11082l33378m07976K1858J25291r1803j60565L49626p80486j431894
$$ plain form
11823 412216 140548 -85304 -53064 235500 642322 1099571 1125836 983924 794154 535524
11813 535524 683338 1190071 1270759 680372 183761 -50184 -248419 30054 540223 437636
11803 437636 318186 488753 423603 80264 115101 214261 500949 935406 867565 580520
11793 580520 568877 979421 1364033 1725951 1307486 515871 58316 -726 18946 -115801
11783 -115801 -407270 -469896 -130253 158417 471828 552790 217778 147451 164749 12215
11773 12215 -78546 30070 164579 570324 870162 486878 -13094 -335515 -248606 19766
11763 19766 135258 30463 -14385 260096 636837 1048024 673661 177991 290935 622444
11753 622444 933526 600148 192172 214030 339321 247518 86953 436579 -343907 -1775801
11743a775801N22216o27859r68953j92368M60480O98808k82735N32323J157331
11734d76558K89732m01866j2744j83802K3340K98809J49085k20913o06369j65332
11724a306618j46880k88847N63000N53759J25678j39425k17789J71905N07341
11715a77876K17711j92248m11456K9777R9497J44905K73025K92859J19255j72885
11705B22564l6408j40577J06138J80409k88831j56764L37257J79629N7704j16687
11695C44434k91694l4086j29647k46147J14369N7128L35708N41048K70557j15162
11685H46508l71351l44393k57254l19189M23621M67795J32668K7491j0855j82493
11675D12548j1893j56382l21258j18306K2681J39068L7919J46864J9744k09007
$$ plain form
11743 -1775801 -1253585 -1881444 -2850397 -3042765 -2582285 -1883477 -2166212 -1633889 -476558
11734 -476558 -186826 -588692 -601436 -785238 -761898 -463089 -314004 -534917 -1141286 -1306618
11724 -1306618 -1453498 -1742345 -1179345 -625586 -499908 -639333 -857122 -685217 -177876
11715 -177876 39835 -152413 -563869 -534092 -434595 -289690 -16665 276194 395449 222564
11705 222564 186156 45579 151717 332126 43295 -113469 223788 403417 461121 344434
11695 344434 52740 18654 -110993 -357140 -242771 -185643 150065 691113 961670 846508
11685 846508 475157 130764 -126490 -445679 -22058 445737 578405 605896 595041 412548
11675 412548 400655 244273 -76985 -195291 -172610 -33542 4377 151241 170985 -38022
11665c8022l77736j73111K96279K37532K26626J62073k03865l88776l35762K42424
11655c52338J5797Q398L85134K70576J75060J76595j38240l16484l3846J36134
11645C26786o5421j2042M31960L33034K4606q5758l48903l34092k08388K62865
11635C24647L21336N5576j36077J33219j1879n20801l78413j5489J11101L02733
11625A85953K63352Q2177k20934k92779k61488j91383M20784K69337j51906J36219
11615B39332J69792m69293l67950k10443j0017J89693J24280J92935P2022l14321
11605c83970l13462K9787J83247K55568K38778M370k8506p4930j37087j92438
11595d18643k94407K0744M94766L77293M18701J29239l00631j39266J05062J86834
$$ plain form
11665 -38022 -415758 -588869 -292590 -55058 171568 333641 129776 -259000 -594762 -352338
11655 -352338 -336541 -328143 56991 327567 502627 679222 540982 224498 190652 326786
11645 326786 261365 249323 681283 1014317 1038923 953165 604262 270170 61782 324647
11635 324647 645983 701559 565482 698701 686822 166021 -212392 -227881 -116780 185953
11625 185953 449305 531482 310548 17769 -243719 -435102 -14318 255019 103113 239332
11615 239332 409124 -60169 -428119 -638562 -648579 -458886 -334606 -141671 -69649 -383970
11605 -383970 -697432 -667645 -484398 -228830 9948 14318 -14188 -89118 -226205 -418643
11595 -418643 -713050 -692306 -197540 179753 598454 727693 427062 287796 392858 579692
11585E79692J08930l37972m79747R164j32041l51952r3168M201O7947K81424L98358
11574E4836J2587j5264J18211L6660K16194N2199k478L7347k37949k6j35989l24862
11562a88534j98351J50660K01860m5480J11213K6448r6884q692N7839N0911p3145
11551a2155j43725k71792M8698Q9361p0403m24128O4349O50712l2270j84005J44025
11540a41333J25620P2498Q2142L4224J47921K41060J07462n7395J32214K96244
11530A040657n4016m87000m62200j57165O5651o8666K57174q127o2012K96563
11520C60859M526j7501L00651K93281L1467j26801l61998p2514l87645m86082
11510d61757j36511J1927J40351P2189J81261K28549K97797m2274j456J75141
$$ plain form
11585 579692 688622 350650 -129097 -119933 -251974 -603926 -697094 -692893 -624946 -343522 54836
11574 54836 67423 52159 170370 207030 423224 475423 472945 510292 272343 272317 136328 -188534
11562 -188534 -386885 -236225 -34365 -79845 31368 57816 -39068 -47760 10079 60990 -12155
11551 -12155 -155880 -427672 -378974 -289613 -360016 -784144 -719795 -69083 -101353 -285358 -141333
11540 -141333 -15713 56785 138927 173151 321072 562132 669594 612199 744413 1040657
11530 1040657 986641 499641 37441 -119724 -54073 -122739 134435 126308 64296 360859
11520 360859 365385 347884 648535 941816 973283 846482 484484 411970 24325 -461757
11510 -461757 -598268 -586341 -445990 -373801 -192540 36009 333806 291532 290076 465217
11500D65217K93904L12051L41903J97703j66047k2521m09186o95680O445L25353
11490F49142m5941r3670M44279K22581n13994j12830L46919P8093j68700r4403
11480G11476j0963k35097n01459l70971J78531J7440R1494K32464K77000L53013
11470G42928M17525L35970L0898l89381n58187k88795L7735L20063P46884L14173
11460A709813j475930j304071n06499j094588N01608M62213l82244N12883R28306
11451f48509L74198J48555K65030l58399l90518m41818n21135K51597K72637m60445
11441a508807j75572n4138J173379J162889K10250J36531R0830l57761n37765
11432A39836m64876l79573l26454k31603p4090K7755O32827K33096k03520n663
$$ plain form
11500 465217 759121 1071172 1413075 1610778 1444731 1422210 1013024 317344 323789 649142
11490 649142 603201 509531 953810 1176391 662397 549567 896486 974579 805879 711476
11480 711476 700513 465416 -36043 -407014 -228483 -211043 -119549 112915 389915 742928
11470 742928 1160453 1496423 1527321 1137940 579753 290958 328693 648756 1395640 1709813
11460 1709813 233883 -1070188 -1576687 -2671275 -2169667 -1707454 -2089698 -1576815 -648509
11451 -648509 -274311 -125756 139274 -219125 -609643 -1051461 -1572596 -1320999 -1048362 -1508807
11441 -1508807 -1684379 -1738517 -565138 597751 808001 944532 1035362 677601 139836
11432 139836 -325040 -704613 -1031067 -1262670 -1336760 -1309005 -676178 -443082 -646602 -652265
11422f52265K85735J86227l25883r3047k3474p7178L55108L99654K18930O5814
11412C39621k0058k70951j34978m7224L4193J22464M7126J2174l24142o5850j19177
11401d26802K3821K03929K78913J09405k14609p5792n05M73250N1167l00150j47928
11390b5301k04932r0947K46659K59715k00412o55158l36507N0462j34252K16347
11380h74326K48310M85586J42415m04608k30764K40233L94297J62215Q6553P8244
11370C28155O6540k76379k95903k9515J1334J99265J92822m6055j0150p9870j16439
11359e6195L46275K50674m8025m6379k92908k77753J75916l20740n51090k27168
11349a047393J10961M16610L12078M05720L45378l47769n03925n36265j98170
$$ plain form
11422 -652265 -366530 -180303 -506186 -599233 -622707 -699885 -344777 54877 273807 339621
11412 339621 319563 48612 -86366 -133590 -99397 23067 70193 82367 -241775 -307625 -426802
11401 -426802 -402981 -199052 79861 189266 -25343 -101135 -101640 371610 422777 122627 -25301
11390 -25301 -230233 -321180 -74521 185194 -15218 -670376 -1006883 -956421 -1090673 -874326
11380 -874326 -626016 -140430 1985 -402623 -633387 -393154 1143 163358 249911 328155
11370 328155 394695 118316 -177587 -207102 -195768 3497 196319 150264 140114 60244 -56195
11359 -56195 290080 540754 492729 446350 153442 -124311 51605 -269135 -820225 -1047393
11349 -1047393 -936432 -519822 -207744 197976 543354 195585 -308340 -844605 -1042775
11340a042775M46649N42558L43032j7604Q6099o7930j90711j3430L70241K75589
11330G31718K2088o4858l02029l79191m5874L00137o7523m85534n74765l51895
11320a217726M0405M39702M80235K87794j03680k12064K55132K84603k5289K05640
11310D34752r2248m26401m42636j98131r9509j33474p4841p1794N5417J62059
11300h86806M50823J28882k29956l08471J43264L49823J94632K15406k19802j35329
11290b97534J35121o6679j39657J9107J28668j82496p3980K67668J49679K47040
11280A86937K55178P1133L22620j33485k0155K89573L52599M3057p96395m19614
11270A51448Q1641j94416o77558k84179O95043R65479K92583l01323n11954J17858
$$ plain form
11340 -1042775 -596126 -53568 289464 271860 357959 290029 99318 85888 456129 731718
11330 731718 753806 688948 386919 7728 -38146 261991 194468 -291066 -865831 -1217726
11320 -1217726 -1177321 -737619 -257384 30410 -73270 -285334 -30202 254401 229112 434752
11310 434752 342504 -83897 -526533 -724664 -824173 -957647 -1032488 -1104282 -1048865 -886806
11300 -886806 -435983 -307101 -537057 -845528 -702264 -352441 -157809 57597 -162205 -297534
11290 -297534 -162413 -229092 -368749 -349642 -220974 -403470 -477450 -209782 -60103 186937
11280 186937 442115 513248 835868 702383 682228 971801 1324400 1367457 571062 151448
11270 151448 233089 38673 -638885 -923064 -228021 737458 1030041 728718 216764 334622
11260C34622N00787J00819k2320j11193m57915l32206O3933J72993K82525M98654
11250A030699L55639k45090m52633M6575L47914K01910j82144k56813J0815k23433
11240F33439o65843n55537o321M86570K74445k93592l47998l50421J53206K86818
11230c85234M53970J26905Q0869L82588K12777J58767k29291l28264n7462k86796
11220A28829k33882q1604l05204m12110l797L3883l8873K1005m4991K96167R75929
11209C35352O29912r6944l23429J63426K03969m85244m88327Q9578n356m40032
11199d17095l42750J61237M60454L71124N8393m9003J99720K03028P3914k36118
11189D82904k18137m5052J57874Q7697k58280l47900l36370o6870j66788q1777
$$ plain form
11260 334622 835409 936228 913908 802715 344800 12594 76527 249520 532045 1030699
11250 1030699 1386338 1141248 688615 735190 1083104 1285014 1102870 846057 856872 633439
11240 633439 -32404 -587941 -594262 -107692 166753 -126839 -474837 -825258 -672052 -385234
11230 -385234 68736 195641 276510 659098 871875 1030642 801351 473087 415625 128829
11220 128829 -105053 -186657 -491861 -903971 -907768 -873885 -912758 -891753 -936744 -640577 335352
11209 335352 965264 868320 544891 708317 912286 427042 -61285 28293 22937 -417095
11199 -417095 -759845 -598608 -138154 232970 291363 242360 442080 645108 719022 482904
11189 482904 264767 219715 377589 465286 207006 -140894 -477264 -544134 -710922 -792699
11179g92699Q9842J90784N59485M77563K1315o16297j93372L63296N57805J86532
11169H44254Q7719L81738J24707k85290o90455p97568k57580J0972j70234l04653
11159a056390P831M73627M41972j1285J48690M10069K23534J7624l03149L2841
11149C85364K40787J46123j67397k49951n04311n59192q5809M37240L77464L50445
11139C70763J08606k06001m20930l24696L3020M46260M04653j23524J42524J94134
11129F24809m20125m96994n38695l63799l36964K560O67593M75114L31135r565
11119f4931J37894K94161k43442l7513Q306J85326K8909k05356R896J92501J18241
11108D23992j09897j96504J42134J63223k77551l54681j59196J64627k1643m17684
$$ plain form
11179 -792699 -702857 -512073 47412 524975 546290 -70007 -263379 99917 657722 844254
11169 844254 931973 1313711 1438418 1153128 462673 -334895 -592475 -581503 -751737 -1056390
11159 -1056390 -1048559 -574932 -132960 -144245 4445 414514 638048 655672 352523 385364
11149 385364 626151 772274 604877 354926 -149385 -708577 -794386 -357146 20318 370763
11139 370763 479369 273368 -147562 -472258 -439238 7022 411675 288151 430675 624809
11129 624809 204684 -292310 -831005 -1194804 -1531768 -1529208 -861615 -386501 -55366 -64931
11119 -64931 72963 367124 123682 86169 94475 279801 308710 103354 113250 305751 423992
11108 423992 314095 117591 259725 422948 145397 -209284 -368480 -203853 -225496 -643180
11098f43180r8802K11070j27521q2693l3885j63069K1229K97833L14199M00321
11088I5502L81670M7448k19566l92577l95537J70993J30556j57338k19820k17210
11078g75879J35837J49371j64159k41295r58O533o392j15101k69985J6726j29910
11067a395212K54689O92221M08683l83557o46170J64341P18150M79717J97257
11058D90119j17333n2936n86194p39215k82808K41982O64731N38425j0913j17277
11048B8581K99715K07654p4437L50716J71670o70331r87018p3812M08874K84116
11038e4272K76861K6790r2912k91920l37124K4439M74175K52353k79534j86213
11028a87357J80048K26997p5777q0767r2056k5023M83318N87227p5331m65649
$$ plain form
11098 -643180 -741982 -530912 -658433 -741126 -775011 -938080 -916851 -619018 -304819 95502
11088 95502 477172 524620 305054 -87523 -483060 -312067 -181511 -338849 -558669 -775879
11078 -775879 -640042 -490671 -654830 -896125 -897083 -890550 -896942 -1012043 -1282028 -1265302 -1395212
11067 -1395212 -1140523 -448302 -39619 -423176 -1069346 -905005 -186855 292862 490119
11058 490119 372786 319850 -266344 -1005559 -1288367 -1046385 -381654 156771 145858 28581
11048 28581 328296 535950 461513 812229 983899 313568 -673450 -747262 -338388 -54272
11038 -54272 222589 249379 156467 -135453 -472577 -448138 26037 278390 -1144 -187357
11028 -187357 -7309 219688 143911 63144 -28912 -53935 429383 1016610 941279 475630
11018D75630n05272m48358k80395j08745q5472J15666J96448j56381j61095O8725
11008h89249O70032O49056L03102l40139l88733m89039k84188J26802Q5147r9369
10998f56578M35678O64044Q5856j29993r8270p6008j72440K68436K67314k04919
10988C83120j24410J37960K33321q5629j94803L01735K40828k99529j31909k53155
10978B07529k55174M1006Q407K66294L61959O83172L03036m49823m40751l72226
10968C53429k6847k2896J92582M31900L8511l29938k21515l01070j13002J67948
10958A69102J34257M59287J49718J25988J09152l92381m05553P3929j38454j45497
10948A39548p4052j3786k6950r271k61801r8424J88046L59538J34395k07493r1826
$$ plain form
11018 475630 -29642 -478000 -758395 -867140 -952612 -836946 -640498 -796879 -957974 -889249
11008 -889249 -219217 429839 732941 392802 4069 -484970 -769158 -642356 -557209 -656578
10998 -656578 -220900 443144 529000 399007 300737 224729 52289 320725 588039 383120
10988 383120 258710 396670 629991 544362 349559 651294 892122 592593 460684 207529
10978 207529 -47645 -6639 1768 268062 630021 1313193 1616229 1166406 725655 353429
10968 353429 326582 303686 496268 928168 966679 636741 415226 114156 1154 169102
10958 169102 303359 762646 912364 1038352 1147504 755123 349570 423499 285045 139548
10948 139548 65496 51710 24760 15489 -246312 -344736 -156690 202848 337243 129750 37924
10937C7924o3383J08930K31925Q8117k67345j38693J82451P3509m2012N3525j91794
10926G3154m89409L1425r2377l86717m79805j81272K00536K76678N67732L50778
10916a29277J78791J80486k20627n0601l576j48784N2765J20025O3519J01023
10906A43744J09110J33196k60064m29473j38762l94450l03920k01779j30580J20135
10896a352843N34013K65969J26106L63687M31990k51418n60029n07036k8984M66907
10886e11638M01899N2625r0064P8401L88221J17606l46609r3577m2110k18495
10876b63741J22129Q3855J5949M0216j8211Q1968R859p453j41479J80676L69885
10865D73653K93015R147m49842l11886L73520N72103k00858m54368J7421K80635
$$ plain form
10937 37924 -25459 83471 315396 403513 136168 -2525 179926 253435 211423 264948 73154
10926 73154 -416255 -384830 -477207 -863924 -1343729 -1525001 -1324465 -1047787 -480055 -129277
10916 -129277 49514 230000 9373 -41228 -44804 -193588 -140823 -20798 42721 143744
10906 143744 252854 386050 125986 -303487 -442249 -836699 -1140619 -1342398 -1472978 -1352843
10896 -1352843 -818830 -552861 -426755 -63068 368922 117504 -442525 -949561 -978545 -511638
10886 -511638 -109739 -57114 -147178 -68777 319444 437050 90441 -3136 -45246 -263741
10876 -263741 -141612 -57757 -41808 -1592 -19803 62165 72024 64571 -76908 103768 473653
10865 473653 766668 775815 325973 14087 387607 959710 758852 304484 321905 602540
10855F02540l82050o92969L80108O41367K33346j86321k65112k21808j66443J05914
10845D8572L6038k51527k06775o6336J22116K6812n3376J96261O12966M41970
10835I06721j57333l23110m02357k14620J51101j0733J52715N16833M41958J52310
10825A213485j51636r6691l45978k31262j73264m56433m05363N021K41980o1750
10815d61891k58864l59850l00083J63151N24182M42447K00765j66533J30848M6469
10805c9359k76337R0348J45325Q1666J37613q3283Q6349K82129K03310j95576
10795D32185O960P17158J42231l13866j23130j40822p4019l56342m45750k27371
10785c82766O7105l8671k4647K44969J24774l2025r5689q1486q0322Q064Q8925
$$ plain form
10855 602540 220490 -472479 -92371 548996 782342 596021 330909 109101 -57342 48572
10845 48572 84610 -166917 -373692 -440028 -317912 -291100 -344476 -148215 464751 906721
10835 906721 749388 426278 23921 -190699 -39598 -50331 102384 619217 1061175 1213485
10825 1213485 1061849 965158 619180 387918 214654 -241779 -647142 -642121 -400141 -461891
10815 -461891 -720755 -1080605 -1380688 -1217537 -693355 -250908 -50143 -216676 -85828 -39359
10805 -39359 -315696 -225348 -80023 1643 139256 55973 142322 424451 627761 432185
10795 432185 439145 1156303 1298534 984668 861538 720716 646697 290355 -155395 -382766
10785 -382766 -315661 -354332 -378979 -134010 -9236 -41261 -136950 -218436 -298758 -290694 -201769
10774b01769k4564K25321n6464l64100J46519j23531l60590q1923k94445k53735
10764a389281K94612M75750L07581m7222j36823l37262k25209O5576K20434J48830
10754f23014j13963m0013n268k41280o6091K95620O21246O50262l4743n73252
10744a30496m17392J8366R2541J67929j00263j79790r484J09471M85868N03925
10734E40675n4054l78169Q1944R0449k68929k00625M0814q4076j35237k98411
10724f65619j57540K39251J06820k2630K38154M1482J4704l7470K09811K2443
10714a0594k46823n4396j88234l1311R1004K53850M41729M70256p092j93440k48799
10703B76150l60811p7997o2860K1827Q5479p8223j54989K40925L52085J38903
$$ plain form
10774 -201769 -226333 -1012 -57476 -421576 -275057 -398588 -759178 -841101 -1135546 -1389281
10764 -1389281 -1094669 -618919 -311338 -358560 -495383 -832645 -1057854 -992278 -771844 -623014
10754 -623014 -736977 -776990 -782258 -1023538 -1089629 -794009 -172763 477499 442756 -130496
10744 -130496 -547888 -529522 -436981 -269052 -369315 -549105 -558589 -449118 36750 540675
10734 540675 486621 108452 190396 280845 11916 -188709 -147895 -231971 -367208 -665619
10724 -665619 -823159 -583908 -477088 -499718 -261564 -220082 -205378 -242848 -33037 -10594
10714 -10594 -257417 -311813 -500047 -531358 -440354 -186504 255225 725481 718389 524949 276150
10703 276150 -84661 -162658 -225518 -203691 -118212 -196435 -351424 -110499 241586 380489
10693C80489l7772l03269k89388J13128K59132N8000j03569j26818L65308N38511
10683H53752M5379k09116m57263m44534j17213q3087l26411j74548m49733q3443
10673a446217J81009m1125Q6996L41057M35655o7720n11822l14987j62540J79281
10663a320413O59644O88414L99715r0411l13523j30088j67991l6020J65981L38580
10653A93888j78781k71900j99759o6412J82481N13467L01580k54721j52265m49945
10643c82367n50160J07281L83187J88730k93781l88271J9974K78351n0234J53442
10633e33848J74535M7646k63601M1324k50984o24418p9038K54841p0721K39531
10623a064733R30238N46521K60170J87492N8224m40913l69988l92899m4936J24
$$ plain form
10693 380489 342717 39448 -249940 -136812 122320 180320 76751 -50067 315241 853752
10683 853752 899131 690015 232752 -211782 -328995 -412082 -738493 -913041 -1362774 -1446217
10673 -1446217 -1265208 -1306333 -1219337 -878280 -442625 -510345 -1022167 -1337154 -1499694 -1320413
10663 -1320413 -660769 27645 427360 336949 23426 -106662 -274653 -310673 -144692 193888
10653 193888 15107 -256793 -456552 -522964 -340483 172984 474564 219843 67578 -382367
10643 -382367 -932527 -825246 -442059 -253329 -547110 -935381 -915407 -637056 -687290 -533848
10633 -533848 -359313 -311667 -575268 -533944 -784928 -1409346 -1488384 -1233543 -1304264 -1064733
10623 -1064733 -134495 412026 672196 859688 917912 476999 107011 -285888 -330824 -330700
10613c30700m2510K11775J19070k00094l57039o21776k0796M07793O50549L10152
10603A26424j67344j88303k3600K05653K73501K12165J47198J70977l07550m61948
10593a2827j86190k52038J48102K13858K6957r9635R8515M15227M27068J44360
10583I23397j44967l11781p4146k48339o24034k65712Q5658k29014m00M5321r922
10572h53939K23953p6726k47403k41034j85385m1288j19451J32306O07907J41742
10562f59318j4852J69650j00525k55621k26271J86371M10958M68296K16790J56433
10552C51911o9400j82902q27l07905j65998Q9785J38040K93710M98963L10263
10542I55640l43336l85452n3684j38779j3826N85148N50327j26873o54816o15392
$$ plain form
10613 -330700 -373210 -161435 -42365 -242459 -599498 -1221274 -1242070 -834277 -183728 126424
10603 126424 -40920 -229223 -252823 -47170 226331 438496 585694 756671 449121 -12827
10593 -12827 -199017 -451055 -302953 -89095 -62138 -161773 -63258 351969 779037 923397
10583 923397 778430 466649 392503 144164 -479870 -745582 -659924 -888938 -889338 -844017 -853939
10572 -853939 -629986 -706712 -954115 -1195149 -1380534 -1421822 -1541273 -1408967 -801060 -659318
10562 -659318 -674170 -504520 -605045 -860666 -1086937 -900566 -489608 -21312 195478 351911
10552 351911 282511 99609 98782 -209123 -375121 -285336 -147296 146414 645377 955640
10542 955640 612304 226852 173168 34389 20563 605711 1156038 1029165 374349 -241043
10532b41043m78028n4946L47880M04652J59973K4761J09160J74834J67522n67042
10522D7723k40200J05887N2064k18235k95460M22873N57614J71394l15965m06342
10512a18647j39688j03872O9246J97218O0010Q7007R28K78423O1888n2239k6780
10501C13494o9515l4286q366l72693l77849J88246N45754K58830L28827K93572
10491A066014j99547m16509l1887J87699J41688k90515n3749J02084j37938j11183
10481B56157r6068l62066k08934P2949j74196j16967M28629O08641O13600J95593
10471A217338k90919n2681j91488m70657q7104N10006K33405j29821l28713o12476
10461b03110o00734k24936L34207M21186M00540L5912J9702P9307q751P6960m73959
$$ plain form
10532 -241043 -719071 -774017 -426137 -21485 138488 163249 272409 447243 614765 47723
10522 47723 -192477 -86590 -34526 -252761 -548221 -125348 432266 603660 287695 -118647
10512 -118647 -258335 -362207 -292961 -95743 -35733 51274 52202 330625 392513 340274 313494
10501 313494 243979 209693 201327 -171366 -549215 -360969 184785 443615 772442 1066014
10491 1066014 866467 449958 418071 605770 747458 456943 403194 505278 367340 256157
10481 256157 160089 -201977 -410911 -337962 -512158 -629125 -200496 408145 1021745 1217338
10471 1217338 926419 873738 682250 211593 124489 634495 867900 738079 409366 -203110
10461 -203110 -803844 -1028780 -694573 -273387 127153 163065 182767 262074 253323 330283 -143676
10450a43676k93188q7418n5006M12791N48944K64710J38439L2840k93773j15424
10440D09239N6446l45456l31899O1804L446m82980k72607M00028L05221J99241
10430B483N78956M48744k28118o23122l03313M10842N2306n45194o31432J47395
10420f90453M62091m747r7296J46319J1895j40331Q5453q8060l57861p2306r4030
10409h39326l55156L2337L34836M56365M3993k79364j8615O7761N2256J21940
10399c82973K81916M09418p8638j85648K47167K04003l41013n69945j55832L2125
10389e39420L2888M66007o4602j63091m8294O8427L49528O48333M17077L799m38341
10378G32311l81432l07668j21957O7747J11213j80087k04485K69263J96866J42906
$$ plain form
10450 -143676 -436864 -524282 -579288 -166497 382447 647157 785596 818436 524663 409239
10440 409239 465685 120229 -211670 -149866 -146420 -629400 -902007 -501979 -196758 2483
10430 2483 581439 1030183 802065 178943 -124370 286472 338778 -206416 -837848 -690453
10420 -690453 -228362 -233109 -330405 -184086 -172191 -312522 -227069 -315129 -672990 -745296 -839326
10409 -839326 -1194482 -1162145 -827309 -370944 -326951 -606315 -624930 -557169 -504913 -382973
10399 -382973 -101057 308361 229723 44075 291242 495245 154232 -415713 -571545 -539420
10389 -539420 -506532 -40525 -105127 -268218 -316512 -248085 101443 749776 1166853 1170652 732311
10378 732311 350879 43211 -78746 -10999 100214 -79873 -284358 -15095 181771 324677
10368C24677K11161J2106l75558m75861j26996K43469K05785L293j38399n8393
10358a74716K95875k82755m89618r3399M26031L31227r0514l13558j79737K0743
10348e50421K46336N67542L81252j97802j90693j50533l49809L7837K19827O2296
10338G5832j77749p31946n74732J72065L63665J12341k58874k24858N29897J54121
10328e60238k09102J54628K29646m385O6336k9101n83037j74265J98772J43511
10318g67235M06575L26287j0130r4178m13306l72033K26153O90158J16307j22077
10308a3479j16622j87465Q7468J59648J74316M459J78332Q7552k30149l54681
10298b10621k06036J42517N39983K21898r8458k94197k30159l22274l87963j8583
$$ plain form
10368 324677 535838 547944 172386 -303475 -430471 -187002 18783 22076 -116323 -174716
10358 -174716 121159 -161596 -651214 -744613 -318582 12645 -77869 -391427 -571164 -550421
10348 -550421 -304085 263457 644709 446907 256214 105681 -244128 -206291 13536 75832
10338 75832 -101917 -833863 -1408595 -1236530 -872865 -760524 -1019398 -1244256 -714359 -560238
10328 -560238 -769340 -614712 -385066 -389451 -323115 -352216 -935253 -1109518 -910746 -767235
10318 -767235 -360660 -34373 -44503 -138681 -551987 -924020 -697867 -7709 108598 -13479
10308 -13479 -130101 -317566 -230098 -70450 103866 108325 286657 374209 144060 -210621
10298 -210621 -416657 -274140 265843 487741 389283 95086 -135073 -457347 -845310 -863893
10288h63893o0569m4180L66256N09417J13561J48794J30653k32984j87399k02260
10278c22604l06874L4168j58859j20599J87859R3910p4459n0609L08907j3572
10268d22732k79362J56914N8414m75047k76157K55170O44982M02807K0372j68577
10258h3216l97941k89401k22641k5418J63850m9400r3898R3164K97023l7859J17013
10247e28724M05988J97415J16552J05039K47700p5930k02362k41206m36346k24115
10237f35989k17912K3877J61305K70541M77901L18515k93730r08938m80794j9568
10227a304792K56715M60958j209Q9447L37341r7472m22776m45353p7230M10916
10217g93455M89183L36393M58940M12768j4857n44432k55639J85522J41587j76255
$$ plain form
10288 -863893 -924462 -968642 -602386 -92969 20592 169386 300039 67055 -120344 -322604
10278 -322604 -629478 -595310 -754169 -874768 -686909 -592999 -667458 -718067 -409160 -422732
10268 -422732 -702094 -545180 -486766 -961813 -1237970 -982800 -337818 64989 85361 -83216
10258 -83216 -481157 -770558 -993199 -1018617 -854767 -904167 -998065 -904901 -607878 -645737 -528724
10247 -528724 -122736 74679 191231 296270 543970 468040 265678 24472 -411874 -635989
10237 -635989 -853901 -830024 -668719 -398178 79723 398238 104508 -804430 -1285224 -1304792
10227 -1304792 -1048077 -587119 -588328 -498881 -161540 -259012 -681788 -1127141 -1204371 -793455
10217 -793455 -304272 32121 491061 903829 888972 344540 88901 274423 416010 239755
10207B39755p8614k37739m06177j85078L60940N75034O63882L87022k63202l40964
10197G14859Q7530K68342J45663k79242l80245m51258m15510J1419L74024L09388
10187C84970J7743K1177M5602k32494k64696O5960M1167m15557n13132l73838
10177a223098o2577M44219M1948J01649L14711k3729j70001J14322J90779j35997
10167d07774K71221n7727m22052P72J14085l3947J7540j90381j93464n3216o1574
10156a016517p5648j07741L05514L10920J09279J57769l8799P7646k13366n0747
10146e41690M58171M85897L46493P94820L47980m17447j076116p71543k20076
10137e93511r258J65101j50359K30193M30733K6732n3553J78576k70966K712M83092
$$ plain form
10207 239755 161141 -76598 -482775 -667853 -306913 268121 932003 1319025 1055823 714859
10197 714859 802389 1070731 1216394 937152 556907 105649 -309861 -298442 75582 384970
10187 384970 402713 423890 469492 236998 -27698 38262 79429 -336128 -849260 -1223098
10177 -1223098 -1285675 -841456 -799508 -697859 -383148 -406877 -576878 -462556 -271777 -407774
10167 -407774 -136553 -194280 -616332 -615560 -501475 -535422 -517882 -708263 -901727 -954943 -1016517
10156 -1016517 -1092165 -1199906 -894392 -583472 -474193 -316424 -355223 -277577 -490943 -541690
10146 -541690 -83519 402378 748871 1543691 1891671 1474224 398108 -373435 -593511
10137 -593511 -602769 -437668 -588027 -357834 72899 99631 46078 224654 -46312 -43600 439492
10126D39492L7927j39359l06989m25319l84743k42372J74023P16527N72156k3768
10116D17575k38520n8678Q4427J78232j3972k38452k92678j18416L84594J98332
10106C02444n22863j72439J54474L54194L82439q4966j46474K59368N00589j40302
10096H86464n64275p78545J38729J98103j81469K70309M78331K20635j90350q0549
10086C97383k67754l64088j36825r6744L9836j40847j52580j25989j87142L89617
10076f45133M65785J08851K10444J55433j52560j20520j10801R3121l1071r4480
10066a20931K3349k582j40402j8231J10094M85833J95641m23731j84051P8915
10056C904j99867j31111K42517L68887K13289j01308o17081M1061K28550m84651
$$ plain form
10126 439492 477419 338060 31071 -394248 -778991 -1021363 -847340 -130813 441343 417575
10116 417575 179055 120377 204804 383036 369064 130612 -162066 -280482 104112 302444
10106 302444 -220419 -392858 -238384 115810 498249 413283 266809 526177 1026766 886464
10096 886464 322189 -456356 -317627 -119524 -300993 -30684 447647 668282 477932 397383
10086 397383 129629 -234459 -371284 -468028 -428192 -569039 -721619 -847608 -1034750 -645133
10076 -645133 -179348 -70497 139947 295380 142820 22300 -88501 4620 -26451 -120931
10066 -120931 -97582 -100164 -240566 -258797 -148703 337130 532771 109040 -75011 3904
10056 3904 -195963 -327074 -84557 284330 497619 396311 -220770 -179709 48841 -435810
10046d35810m7230K58575J63052K11716M40252N3830r3952j65438j87720k22009
10036b4734j97650J07446L63121K69299J73980J62329L36868J21324j96526j21241
10026I94216k52728k07191P4706J40375J4499k10812k55157j70366m72714o88571
10016a033743j59182Q595m7043K93278O34572L23200m7161l18063r885K09950
10006a45482o6978k77071k24367K82495K58826J9341K70188J04441k91770n89672
9996f60049j80214N54999N47544L9520J32968R9187M8840p2807R7690N1241l40099
9985C18820K52539R5124k25243j68040j35453L45357K15355k97289l4531l7971
9975C28668l09841j07553j55085j59601P7301L06691L95757j28850m59898k26958
$$ plain form
10046 -435810 -483040 -224465 -61413 150303 590555 644385 550433 384995 197275 -24734
10036 -24734 -222384 -114938 248183 517482 691462 853791 1190659 1311983 1115457 994216
10026 994216 741488 534297 609003 749378 763877 553065 297908 127542 -345172 -1033743
10016 -1033743 -1192925 -1184330 -1231373 -938095 -303523 19677 -27484 -345547 -355432 -145482
10006 -145482 -212460 -489531 -713898 -431403 -172577 -153236 116952 221393 -70377 -660049
9996 -660049 -840263 -285264 262280 301800 434768 533955 582795 509988 607678 658919 318820
9985 318820 571359 666483 441240 273200 137747 483104 698459 401170 366639 328668
9975 328668 18827 -88726 -243811 -403412 -326111 -19420 376337 247487 -212411 -439369
9965d39369Q8061J79073J77808j99210k60429K1660Q1458M8582J92332K17145
9955A07111k30117j28238K36859K06166o1929K47976K96046j76443k55920o1970
9945A79541p9446k08535k84293k70602P1528N67885L41990j69517k50860J46870
9935D4561J3691K8946o7314m67962n71994l85424l11167j15591J31488K86537
9925a414229L79461M57065j67830n75010j9522N46202J54224j87285j4072J38903
9915g02093K83388N0147j88795j41781j23365j39682K3232j96347K59004K92623
9905e83669q9125P1360K86473K03993j25919k04304l41853m07197J08171L04122
9895g77948K87880L17067N9040j14667M2800L03426m1790k28168q5203P8447L41920
$$ plain form
9965 -439369 -351308 -172235 5573 -193637 -454066 -432406 -350948 -302366 -110034 107111
9955 107111 -123006 -251244 -14385 191781 129852 377828 673874 497431 241511 179541
9945 179541 100095 -108440 -392733 -663335 -591807 -23922 318068 148551 -102309 44561
9935 44561 58252 87198 19884 -448078 -1020072 -1405496 -1716663 -1832254 -1700766 -1414229
9925 -1414229 -1034768 -577703 -745533 -1320543 -1340065 -793863 -639639 -826924 -840996 -702093
9915 -702093 -418705 -368558 -557353 -699134 -822499 -962181 -938949 -1135296 -876292 -583669
9905 -583669 -672794 -601434 -314961 -110968 -236887 -441191 -783044 -1190241 -1082070 -777948
9895 -777948 -490068 -173001 -113961 -228628 -185828 117598 75808 -152360 -237563 -159116 182804
9884A82804K06356k19282l37551k80253N3347J37955r7012k65863M872K77316
9874c37311K27924K07852j36444l55239L0886K50961M28604J38230k7459r3266
9864C34738n16280l74129j51341M1572M15092L84650o0419p3985L48049L52126
9854G00073o4694m2063n2922j60361j45234m05469n9477Q0610l11891k23683J39246
9843e45865J62821o8958L5745N9548M8524L13129j66297n6448o6019j26907k38756
9832f49483k01234K2601K84706N47050L81662p9623k28719q7758J68697L46320
9822E04219K65796R63j63917k6521q1560r5771k36308m19304o08540m40803l9253
$$ plain form
9884 182804 389160 169878 -167673 -447926 -394579 -256624 -353636 -619499 -614627 -337311
9874 -337311 -109387 98465 -37979 -393218 -362332 -111371 317233 455463 428004 334738
9864 334738 -181542 -555671 -707012 -665440 -250348 134302 73883 -102 347947 700073
9854 700073 635379 593316 540394 380033 234799 -170670 -230147 -149537 -461428 -685111 -545865
9843 -545865 -383044 -452002 -416257 -356709 -308185 4944 -161353 -217801 -283820 -410727 -649483
9832 -649483 -850717 -828116 -543410 3640 385302 305679 76960 -10798 157899 504219
9822 504219 770015 770978 607061 580540 498980 403209 166901 -252403 -860943 -1301746 -1340999
$$ [...]
##END NTUPLES=NMR SPECTRUM
##END=
