##TITLE=C13_SL62-I2-B-isomer
 CDCl3,  1100 sc

 27.07.2021
##JCAMPDX= 6.0         $$ Bruker NMR JCAMP-DX V2.0
##DATA TYPE= NMR SPECTRUM
##DATA CLASS= NTUPLES
##ORIGIN= UXNMR, Bruker Analytische Messtechnik GmbH
##OWNER= root
$$ XWIN-NMR		Version 3.5
$$ Wed Jul 28 11:29:07 2021 Russian Standard Time (UT+4h)  she@DPX200
##.OBSERVE FREQUENCY= 50.327896
##.OBSERVE NUCLEUS= ^13C
##.ACQUISITION MODE= SIMULTANEOUS
##.ACQUISITION SCHEME= undefined
##.AVERAGES= 23000
##.DIGITISER RES= 17
##SPECTROMETER/DATA SYSTEM= spect
##.PULSE SEQUENCE= zgpg30
##.SOLVENT NAME= CDCl3
##.SHIFT REFERENCE= (INTERNAL, CDCl3, 0, 222.697)
##AUDIT TRAIL= $$ (NUMBER, WHEN, WHO, WHERE, WHAT)
$$ ##TITLE= Audit trail, XWIN-NMR		Version 3.5
$$ ##JCAMPDX= 5.01
$$ ##ORIGIN= Bruker BioSpin GmbH
$$ ##OWNER= she
$$ F:/spectra/data/she/nmr/c13/1/pdata/1/auditp.txt
$$ ##AUDIT TRAIL=  $$ (NUMBER, WHEN, WHO, WHERE, WHAT)
(   1,<2021-07-28 11:27:05.25 +0400>,<she>,<DPX200>,
      <created by zg, POWCHK disabled, PULCHK disabled
       terminated by command 'halt'
       configuration hash MD5:
       00 E9 B6 7A A2 85 ED C7 34 08 36 98 17 FE 4E 26
       data hash MD5: 32K
       F3 1A AC 5E 43 54 30 74 C7 9D 43 C3 4F DD 6A EC>)
(   2,<2021-07-28 11:27:07.56 +0400>,<she>,<DPX200>,
      <Start of raw data processing
       efp BC_mod = 2 LB = 1 FT_mod = 6 PKNL = 1 PHC0 = -340.3618 PHC1 = 35.36238 SI = 32K 
       data hash MD5: 32K
       0A 24 5D 06 FC 65 9F 3F CF 94 2D 72 50 52 2D 66>)
(   3,<2021-07-28 11:27:10.26 +0400>,<she>,<DPX200>,
      <abs ABSG = 5 
       data hash MD5: 32K
       73 CB 34 2F C0 BE BF 13 AD 4D 70 0E 3F BC F3 18>)
(   4,<2021-07-28 11:27:41.64 +0400>,<she>,<DPX200>,
      <pk PHC0 = 0.3444351 PHC1 = 0 
       data hash MD5: 32K
       11 7B ED A3 EA 7B 0B 09 2A F6 4B 50 A3 04 5A B3>)
(   5,<2021-07-28 11:27:45.54 +0400>,<she>,<DPX200>,
      <abs ABSG = 5 
       data hash MD5: 32K
       19 C5 4D 3D 23 E9 6A 68 C0 76 FE 9E 5F 3B 65 64>)
$$ ##END=
$$ 
$$ hash MD5
$$ F7 D5 BF 1B 64 93 87 03 CD 1D B1 11 5C 70 11 53
##$RELAX= 
##$RELAX= 
##$RELAX= 
##$RELAX= 
##$RELAX= 
##$RELAX= 
##$RELAX= 
##$RELAX= 
$$ Bruker specific parameters
$$ --------------------------
##$DU= <F:/spectra>
##$EXPNO= 1
##$NAME= <c13>
##$PROCNO= 1
##$TYPE= <nmr>
##$USER= <she>
##$AMP= (0..31)
100 100 100 100 100 100 100 100 100 100 100 100 100 100 100 100 100 100 
100 100 100 100 100 100 100 100 100 100 100 100 100 100 
##$AQSEQ= 0
##$AQ_mod= 1
##$AUNM= <au_zg>
##$AUTOPOS= <>
##$BF1= 50.322709
##$BF2= 200.13
##$BF3= 50.322709
##$BF4= 500.13
##$BF5= 500.13
##$BF6= 500.13
##$BF7= 500.13
##$BF8= 500.13
##$BYTORDA= 1
##$CFDGTYP= 0
##$CFRGTYP= 5
##$CHEMSTR= <none>
##$CNST= (0..31)
1 1 145 1 1 1 1 1 1 1 1 1 1 1 1 1 1 1 1 1 1 1 1 1 1 1 1 1 1 1 1 1 
##$CPDPRG= <waltz16>
##$CPDPRG1= <>
##$CPDPRG2= <waltz16>
##$CPDPRG3= <>
##$CPDPRG4= <mlev>
##$CPDPRG5= <mlev>
##$CPDPRG6= <mlev>
##$CPDPRG7= <mlev>
##$CPDPRG8= <mlev>
##$CPDPRGB= <>
##$CPDPRGT= <>
##$D= (0..31)
$$ [...]
##$SUBNAM4= <"">
##$SUBNAM5= <"">
##$SUBNAM6= <"">
##$SUBNAM7= <"">
##$SUBNAM8= <"">
##$SUBNAM9= <"">
##$SW= 239.972175391363
##$SWIBOX= (0..15)
0 1 3 0 0 0 0 0 0 0 0 0 0 0 0 0 
##$SW_h= 12077.2946859903
##$TD= 32768
##$TD0= 1
##$TE= 0
##$TE2= 300
##$TE3= 300
##$TEG= 300
##$TL= (0..7)
120 120 120 120 120 120 120 120 
##$TP= (0..7)
150 150 150 150 150 150 150 150 
##$TP07= 0
##$TPNAME0= <>
##$TPNAME1= <>
##$TPNAME2= <>
##$TPNAME3= <>
##$TPNAME4= <>
##$TPNAME5= <>
##$TPNAME6= <>
##$TPNAME7= <>
##$TPOAL= (0..7)
0.5 0.5 0.5 0.5 0.5 0.5 0.5 0.5 
##$TPOFFS= (0..7)
0 0 0 0 0 0 0 0 
##$TUNHIN= 0
##$TUNHOUT= 0
##$TUNXOUT= 0
##$USERA1= <user>
##$USERA2= <user>
##$USERA3= <user>
##$USERA4= <user>
##$USERA5= <user>
##$V9= 5
##$VALIST= <valist>
##$VCLIST= <CCCCCCCCCCCCCCC>
##$VD= 0
##$VDLIST= <DDDDDDDDDDDDDDD>
##$VPLIST= <PPPPPPPPPPPPPPP>
##$VTLIST= <TTTTTTTTTTTTTTT>
##$WBST= 1024
##$WBSW= 4
##$XGAIN= (0..3)
0 0 0 0 
##$XL= 0
##$YL= 0
##$YMAX_a= 139347239
##$YMIN_a= -34680427
##$ZGOPTNS= <>
##$ZL1= 120
##$ZL2= 120
##$ZL3= 120
##$ZL4= 120
##$ABSF1= 222.6973
##$ABSF2= -17.29953
##$ABSG= 5
##$ABSL= 3
##$ALPHA= 0
##$AQORDER= 0
##$ASSFAC= 0
##$ASSFACI= 0
##$ASSFACX= 0
##$ASSWID= 0
##$AUNMP= <proc_1d>
##$AZFE= 0.1
##$AZFW= 0.5
##$BCFW= 0
##$BC_mod= 2
##$BYTORDP= 0
##$COROFFS= 0
##$CY= -3
##$DATMOD= 1
##$DC= 0
##$DFILT= <>
##$DTYPP= 0
##$F1P= 0
##$F2P= 0
##$FCOR= 0.5
##$FTSIZE= 32768
##$FT_mod= 6
##$GAMMA= 0
##$GB= 0
##$INTBC= 1
##$INTSCL= 4.134877e-10
##$ISEN= 128
##$LB= 1
##$LEV0= 0
##$LPBIN= 0
##$MAXI= 10000
##$MC2= 0
##$MEAN= 0
##$ME_mod= 0
##$MI= 0.1934396
##$NCOEF= 0
##$NC_proc= 3
##$NLEV= 6
##$NOISF1= 120.0001
##$NOISF2= 80.00006
##$NSP= 0
##$NTH_PI= 0
##$NZP= 0
##$OFFSET= 222.6973
##$PC= 1.4
##$PHC0= -340.0174
##$PHC1= 35.36238
##$PH_mod= 1
##$PKNL= yes
##$PPARMOD= 0
##$PSCAL= 0
##$PSIGN= 0
##$REVERSE= no
##$SF= 50.3227279136918
##$SI= 32768
##$SIGF1= 140
##$SIGF2= 120
##$SINO= 11.81781
##$SIOLD= 32768
##$SREGLST= <13C.CDCl3>
##$SSB= 0
##$STSI= 32768
##$STSR= 0
##$SW_p= 12077.2946859903
##$SYMM= 0
##$S_DEV= 0
##$TDeff= 32768
##$TDoff= 0
##$TI= <>
##$TILT= no
##$TM1= 0
##$TM2= 0
##$TOPLEV= 0
##$USERP1= <user>
##$USERP2= <user>
##$USERP3= <user>
##$USERP4= <user>
##$USERP5= <user>
##$WDW= 1
##$XDIM= 32768
##$YMAX_p= 291767871
##$YMIN_p= -1310096
$$ End of Bruker specific parameters
$$ ---------------------------------
##NTUPLES= NMR SPECTRUM
##VAR_NAME=  FREQUENCY,     SPECTRUM/REAL,   SPECTRUM/IMAG
##SYMBOL=    X,             R,               I
##VAR_TYPE=  INDEPENDENT,   DEPENDENT,       DEPENDENT
##VAR_FORM=  AFFN,          ASDF,            ASDF
##VAR_DIM=   32768,         32768,           32768
##UNITS=     HZ,            ARBITRARY UNITS, ARBITRARY UNITS
##FACTOR=    0.368581032318806, 1,           1
##FIRST=     11206.7354408978, 0,            0
##LAST=      -870.559245092494, 0,           0
##MIN=       -870.559245092494, -1310096,    0
##MAX=       11206.7354408978, 291767871,    0
$$ Real data points
##PAGE= N=1
##DATA TABLE= (X++(R..R)), XYDATA
$$ [...]
15834b250M6236J96527J61669K5153k43408j37869q7453q6706Q3343J52333J45704
15823B53279K2198J22385j7041j40157j42572Q2336L42964J15627j42261k61008
15813B35750j88149k09876p8202J5791N0985j05504P7663P0193N057P425k9920
15802a48787N4788O7722J51238j2234j11104r5761p0410m6974k2472K01267J28937
15791I6210j15231k35365p3335J53452M23480L17545K5748j17777p5443j81399
15781B17885j19193L9221K8466p0493j29097j9029Q6952J22408N9804L3537J14029
15770C64490K1322j34629k14049k20215j98006O7344J25125k9359l58973k63377
15760h40327J41298J36982k19822q8088J47183J68738J25428L6897p074P7301
$$ y = [-2250, 43986, 240513, 402182, 427335, 183927, 46058, -41395, -128101, -44758, 107575, 253279, 275477, 397862, 380821, 240664, 98092, 180428, 523392, 639019, 496758, 235750, 47601, -162275, -240477, -224686, -173701, -279205, -201542, -131349, -126292, -118867, -148787, -93999, -26277, 124961, 112727, 1623, -94138, -164548, -211522, -233994, -32727, 96210, -19021, -254386, -327721, -174269, 249211, 566756, 592504, 474727, 399284, 217885, 98692, 137913, 166379, 95886, -33211, -52240, 34712, 157120, 216924, 250461, 364490, 385812, 251183, 37134, -183081, -381087, -313743, -188618, -217977, -576950, -840327, -699029, -562047, -781869, -869957, -722774, -554036, -428608, -391711, -398785, -321484]
15750c21484L26277O6070j99065M0754J78617J00688j14985n7994j99775L803
15740a77094N2053j04243N1251K32135K40428m4249j34455k54438j6492K37559
15730H2455J55982L4899K66925K62364j64409l57288k79980l8980R3462j05219
15720d9789j58953r385j6709m1212K6443J82932K20732K0940k6803r2112j55339
15709i9255k43111j13537j25523Q0249K80992J66798L20829J77079q6132m2948
15699C15441k9789k22232k70867j04828L9544K57995P4150j24400k49279j73899
15689d88164K1126J72037K35070P2839o1622M4612M535r6380r5011K8539K22362
15678E9943J41833n8408l491J07922J05490N9420k7308j02572j24191k20596m5654
$$ y = [-321484, 4793, 70863, -128202, -87448, 91169, 191857, 76872, 18878, -180897, -177094, -125041, -229284, -178033, 54102, 294530, 250281, 115826, -138612, -155104, 82455, 238437, 273336, 540261, 802625, 638216, 280928, 948, -38032, 55430, -49789, -208742, -218127, -234836, -276048, -249605, -66673, 154059, 174999, 148196, 56084, -99255, -342366, -455903, -581426, -501177, -220185, -53387, 267442, 444521, 358389, 315441, 285652, 63420, -207447, -312275, -272731, -14736, 59414, -64986, -314265, -488164, -467038, -295001, -59931, 12908, -48714, -4102, 433, -95947, -190958, -162419, 59943, 201776, 143368, 139877, 247799, 353289, 412709, 385401, 282829, 158638, -61958, -107612]
15667a07612J37808K15727j79465j25841K01766j04320l09344p5095J67875J09527
15657f8974N841J38983Q0677j21796j65680j51691J6838L3251j09098K9131J41563
15646a70955R6200J34659L0595j9536N8194k8850l25397l42113j93299N2941K47420
15635d60141J06238K9110k3315j1934p7644o477k6343J735K18395J90914J56367
15624I6905J8819L9770K01097J57620O6565O2816j48782j73961p4364O1116j09142
15613A98459m22899k82994m6342J5597l3628l0285J84014J97328K69525K13801
15603B62576j8861m3953j39700k20115j02904Q0019Q8908J70593K52448j0303
15593C18708n7446M738p5117j09176k40747j36892M5636J60507K59887R9172p4165
$$ y = [-107612, 30196, 245923, 66458, -59383, 142383, 38063, -271281, -346376, -178501, -68974, -63133, 75850, 156527, 34731, -130949, -282640, -265802, -232551, -341649, -312518, -170955, -74755, 59904, 90499, 70963, 129157, 100307, -225090, -567203, -760502, -707561, -460141, -353903, -324793, -348108, -360042, -437686, -444163, -470506, -468771, -250376, -59462, 96905, 115724, 155494, 356591, 514211, 580776, 643592, 494810, 320849, 246485, 307601, 198459, -224440, -507434, -553776, -538179, -571807, -602092, -418078, -220750, 48775, 262576, 243715, 199762, 60062, -160053, -262957, -182938, -94030, 76563, 329011, 318708, 261262, 266000, 190883, 81707, -159040, -295932, -250296, -89789, 170098, 269270, 195105]
15582A95105M7403p271j38467r2678K7457o6846k01157n3446R598n7492K5728
15571c12066J52423K31577J21495M5339K00227K53329O470n7210j16499n8484
15561D66601k26819k04912k2345j39731Q3018K84184J59951j15768P4403L39083
15551F97665P0702o5176q6199k6053j49362j09772N9799M7776Q6440J4442j09572
15540D30690k40199k02051j01676k30726j25008R1523p5387q0599M4224N6755
15530d32454K06949o2269m9406J99962n0366k02511K5500J38989O9275j15211
15520b71542j52048j61744J35623K7365J5141J91200O4582k12197k40533J28633
15510d75520K59873K14292k37975n34724k13098J88095K31849K01972O8294p0120
$$ y = [195105, 242508, 235237, 96770, 4092, 31549, -35297, -236454, -289900, -280302, -337794, -312066, -159643, 71934, 193429, 238768, 438995, 692324, 698794, 641584, 525085, 466601, 239782, 34870, 12525, -127206, -44188, 239996, 399947, 284179, 358582, 697665, 768367, 703191, 616992, 590939, 441577, 331805, 391604, 439380, 525820, 540262, 430690, 190491, -11560, -113236, -343962, -468970, -377447, -452834, -533433, -489209, -432454, -225505, -287774, -337180, -137218, -187584, -390095, -364595, -225606, -156331, -271542, -423590, -585334, -449711, -422346, -407205, -216005, -151423, -363620, -604153, -475520, -215647, -1355, -239330, -774054, -987152, -799057, -567208, -365236, -296942, -367062]
15500c67062R5880K22163J5313j04420o5373j47886j09606K3909N6525J21887
15490b58670N4059p6882J26584P8671o270J46151m4268l11785k51897J81990K10657
15479a51660L8098L5887J45563j99398l92364j99608J29564J77676J66814j4870
15469b64298k61966r2120K19130J73450k02087m7349J76722L6584Q3746K9797
15459a48391o9592j69840j20674J05796K42013J90367k62401l08750M2383P3924
15449d25165P6703L5985J18469J72369k52550j84039J43577N0044r9356J4240
15439c49723N4717q6470J04730K33120R1637j19395Q5829J21266m9956k26819
15429a41064L354J0608R4817J49991n6988j3228j27896k28158J84223K78241M3975
$$ y = [-367062, -271182, -49019, -33706, -138126, -203499, -351385, -460991, -437082, -380557, -258670, -204611, -281493, -154909, -76238, -82508, 63643, 19375, -292410, -544307, -362317, -151660, -113562, -77675, 67888, -131510, -523874, -723482, -593918, -416242, -249428, -264298, -526264, -618384, -399254, -225804, -427891, -475240, -298518, -261934, -178188, -148391, -217983, -387823, -508497, -402701, -160688, 29679, -232722, -541472, -499089, -425165, -348462, -312477, -194008, -21639, -274189, -458228, -314651, -264607, -363963, -349723, -295006, -381476, -276746, -43626, 48011, -71384, 14445, 135711, 85755, -141064, -137710, -127102, -32285, 117706, 60718, 47490, -80406, -308564, -124341, 153900, 197875]
15418A97875M6672J0725n9260o0098j13262j26177j67744n9648P168j63432J1248
15407d75933Q8446K45487J68390j16425j2966K10843J05193j4220K23800j7231
15397D05384j91280Q0481O3818l6121q814j56987j06881L9028J39020L876m0343
15386A91181P3570p3645k9852k51504k81677J50345K75705P2154j37573j4938
15376b6234J46195l7870j07183J68041K07220l92j1404j74104k79382K8124J19830
15365C2841J20218J08583J3058j83699k6918K3324M8616P3465k01636k46685j5649
15354b54482L02456J94933n0738n1475l2386L6286k4701l65644j98373Q0438P8211
15343b85475O0082J37305J48331p0030l1046P1763Q4978m1820j27561j06797j02862
$$ y = [197875, 244547, 255272, 196012, 135914, 22652, -103525, -271269, -330917, -323749, -487181, -475933, -387487, -142000, 26390, -90035, -103001, 107842, 213035, 198815, 422615, 405384, 214104, 294585, 358403, 322282, 313468, 156481, 49600, 88628, 227648, 231524, 191181, 264751, 191106, 161254, -90250, -371927, -221582, 54123, 126277, -11296, -26234, 119961, 82091, -25092, 142949, 350169, 349777, 338373, 164269, -115113, -86989, 32841, 153059, 261642, 274700, 91001, 64083, 87407, 136023, 209488, 7852, -238833, -254482, 47974, 242907, 192169, 140694, 108308, 144594, 119893, -245751, -444124, -363686, -285475, -225393, -88088, 60243, -9787, -40833, 30930, 115908, 74088, -53473, -160270, -263132]
15332b63132j44738j44385r838K40571K27540N5368k36963j50118J49693j4544
15322b90546J6738O0512R6779R3985L603j8732j2286j77239j88829j08249J37662
15311c86602J67835n7384j29672k49049j21426Q9080N5866l595P3914J52283P6173
15300c32577N3993O7670J22004P8294N1267j6481P1724Q8857K27581L93965J78441
15289I84738k05030m61833m27149j38365o6821j46580P1595J11532j6219L7667
15279b56465J93298J79089k3298j54097l29044q2504K53657J50415m8686j26680
15269b44315R4714q9412q0068L14769L14131J9118j90892o3648o0079p7684r018
15258g2384J78546J80002N7173J5985O8027j4399r9882n0032n9535k07027j91341
$$ y = [-263132, -407870, -552255, -562093, -321522, -93982, -38614, -275577, -425695, -276002, -290546, -273808, -213296, -116517, -22532, -18929, -37661, -49947, -227186, -416015, -524264, -386602, -218767, -276151, -405823, -654872, -776298, -687218, -631352, -634947, -561033, -408750, -332577, -278584, -210914, -88910, -10616, 40651, 24170, 95894, 184751, 412332, 806297, 984738, 779708, 317875, -109274, -247639, -314460, -461040, -389445, -277913, -294132, -256465, -63167, 115922, 92624, -61473, -390517, -473021, -219364, -68949, -117635, -244315, -149601, -239013, -319081, -4312, 309819, 328937, 138045, 74397, 14318, -63366, -72384, 106162, 286164, 343337, 359322, 427349, 412950, 313068, 263036, 203501, -3526, -194867]
15247a94867J06735K00756P0132J72302M1927j35633q5973k04360j08967J64050
15237B6102O9994n5613K11304J87283J35306r436k88004j07057q7047P0762J74612
15226C28206L8269k06041j06748M3608j3036j99734k2312J05432J35881K15917
15216C19442j27766l32810j39368j1764q3717J64511J70551N240R6906P1193k9054
15205A03364m6281o2789O7873J06259K07114J0670p6787K9162l6785k26349j78736
15194a03285J01658K51867J23672Q3850j87889j13760J02262N5600Q6270j6960
15184C83285r1909k07377j07707J29039J04020o4878j67980m6367j40795l06317
15174e16986k00282Q6446K06907J74114K93527K72217L1438j66289j36421Q4450
$$ y = [-194867, -88132, 112624, 182756, 355058, 396985, 261352, 175379, -28981, -137948, 26102, 96096, 40483, 251787, 439070, 574376, 564940, 276936, 169879, 82832, 153594, 328206, 366475, 160434, 53686, 97294, 84258, -115476, -137788, -32356, 103525, 319442, 191676, -141134, -280502, -292266, -375983, -211472, -40921, -35681, 61225, 132418, 103364, 57083, -5706, 62167, 168426, 375540, 386210, 309423, 338585, 301800, 75451, -103285, -1627, 250240, 373912, 457762, 269873, 156113, 258375, 313975, 400245, 383285, 291376, 83999, -23708, 105331, 209351, 144473, -23507, -69874, -210669, -516986, -717268, -630822, -423915, -249801, 43726, 315943, 347381, 181092, 44671, 129121]
15164A29121J61394M7201l03634l87250n2219N5527J89439K03376P2284L7795
15154A53034J2980P0696J76876k15026k81377k5614l2623o6184O5031J79682J86253
15143B23728K8497j29733j73291j44468J23685J71077P090L8079l0947N0602n9208
15132A05111k63755k36724k31739O0680L17498M75925K08174k74445k40630j05933
15122a85838l5754K24234J16476j73238J0947J70888k0407n2133j7174r3897R403
15111d6493n9572j32259q7643J57482K54008q2645k42276j76437r973K73870L56479
15100B04541J84799j17923j21311j77538k65927l99225j30916K68895K13864k3419
15090c64160J1821K55472M37755K20022k50777m04493o8357J03905J06839J08483
$$ y = [129121, 290515, 337716, 34082, -353168, -405387, -349860, -160421, 42955, 115239, 153034, 166014, 236710, 413586, 198560, -82817, -108431, -141054, -207238, -142207, 37475, 223728, 252225, 122492, -50799, -195267, -71582, 99495, 106585, 144664, 113717, 164319, 105111, -158644, -395368, -627107, -566427, -248929, 226996, 435170, 160725, -79905, -185838, -221592, 2642, 119118, -54120, -43173, 127715, 107308, 55175, 38001, -55896, -46493, -106065, -238324, -325967, -168485, 85523, 2878, -239398, -415835, -425808, -151938, 204541, 389340, 271417, 150106, -27432, -293359, -692584, -823500, -554605, -340741, -364160, -352339, -96867, 340888, 560910, 310133, -94360, -162717, -58812, 48027, 156510]
15080A56510J34234K0679j09591k78716m86901k30612l978n1726K86077M80610
15070h3414J52619K4107L127M9173N2951P6926P829j54106n2572K41718R3733
15059D12091j37039l0335P0516k40233j08073K13726K81325n3959k60005J34960
15049B82974J79644j88305j743J34016O8850k55631j76802P5774P0909J23077
15039C12763o6994k27216p7241N6269j0551M6438N1409P5569M8869j92913N0949
15028F7351J12657M7772J58242Q9405J59627Q2118k42250q5717l7682N9280J5803
15017D26606j50361n1013J91668K25881K04935n5789j51044L8492O3541q0965
15007F61951k18931k82074j74557J06360J39863L5490O6168j61770k88885p8309
$$ y = [156510, 290744, 311423, 201832, -76884, -563785, -794397, -798375, -850101, -564024, -83414, 69205, 93312, 96439, 145612, 198563, 275489, 283318, 129212, 76640, 318358, 412091, 275052, 244717, 315233, 75000, -33073, 180653, 461978, 408019, 148014, 282974, 462618, 274313, 272570, 406586, 475436, 219805, 43003, 118777, 189686, 312763, 245769, 18553, -58688, -2419, -12970, 33468, 84877, 160446, 209315, 16402, 67351, 180008, 227780, 386022, 475427, 635054, 717172, 474922, 389205, 351523, 410803, 426606, 276245, 225232, 416900, 642781, 847716, 791927, 640883, 679375, 742916, 661951, 443020, 160946, -13611, 92749, 232612, 268102, 334270, 172500, -116385, -194694]
14997a94694J18199J58329M986N4515K21167K3193j86798q7165q1373k25265j94856
14986c89762K0677o1991j10773P1192P4397q8059P6833J59652R8693m4027n5384
14975b48552K19817L14711J301l8842N5655M2807Q2423L9499J8137l0542p4845
14964C81569J08410o5686k40665j76099o5784l1598J35292r953K8498J14236j78452
14953b32l36445r1569L16886L66876L41509J91402k15787m13813j45949N8648
14943G1526j75785k35317q8868j59516j24652L3193J37129J54190K2874j57066
14933e22292n1706M1163j03597l4899J03532K91253L53104l0612j81327q7987
14923b23368J49121K33015J37273j27140q6961j1730m0541K6262j24763r9953
$$ y = [-194694, -76495, 81834, 86820, 141335, 362502, 385695, 198897, 111732, 30359, -194906, -389762, -369085, -431076, -541849, -470657, -396260, -484319, -407486, -247834, -149141, -193168, -248552, -28735, 285976, 287277, 248435, 304090, 346897, 429320, 468819, 486956, 456414, 381569, 489979, 424293, 183628, 7529, -58255, -89853, 45439, 35486, 63984, 178220, -232, -336677, -428246, -111360, 255516, 597025, 788427, 572640, 158827, 12878, 71526, -104259, -339576, -428444, -587960, -712612, -679419, -542290, -388100, -365226, -522292, -573998, -532835, -636432, -671331, -567799, -276546, 76558, 45946, -135381, -223368, -74247, 158768, 296041, 168901, 81940, 70210, 29669, 55931, -68832, -168785]
14913a68785r7979j23690J1878K09567k1536j76425O3021O8617k6846Q8990K770
14902a70418L1286Q318J35858O8269p8687r6285j41089R8901J41121j00106j56121
14891b58953r0096r8455l7116r3550L5339L10895K05845R875j39607j99161k0569
14880c75553K24387J06313Q3708j3134p9747n1983j4273P3144Q5987j38773r5182
14869a95106J43509J45880O9047K4340j06398L1910K2742l7380L1054j68514k38985
14858b77901j15174m8680n5603K09375J31942q1490j21674N3848l1751r1508M3228
14847c85388J99013P1079m1129q2656o2237P6769K34614O3594k13320j03282j17111
14836c60054k58027M1348K56362R5177N3899l7156L8058k4619k8531J25226k1296
$$ y = [-168785, -266764, -390454, -378576, -169009, -190545, -366970, -303949, -235332, -262178, -173188, -170418, -139132, -130814, 5044, 73313, -5374, -101659, -242748, -143847, -2726, -102832, -258953, -349049, -447504, -484620, -578170, -542831, -231936, -26091, -16216, -155823, -354984, -375553, -151166, -44853, 38855, 25721, -54026, -106009, -120282, -47138, 38849, -99924, -195106, -51597, 94283, 163330, 187670, 81272, 113182, 135924, 98544, 129598, -38916, -277901, -393075, -441755, -497358, -287983, -156041, -237531, -359205, -305357, -337108, -428616, -385388, -186375, -115296, -156425, -239081, -301318, -224549, 10065, 73659, -139661, -242943, -360054, -618081, -576733, -320371, -225194, -171295, -208451, -170393, -195012, -223543, -98317, -119613]
14825a19613N8874N3830k5552l5667j74034o1536n4627M8745J14120J02700l1083
14814a23843j55473L0363J75025p5115l201J50237k06434k68666l1434j72494
14804f81035j78779J77044J23372r7996K9687J47867K33046J66029q1955j10543
14794b73263j77920j40403J67910M22307L42561K34132M5343l4927o1404l3641
14784D90695R4673O3038Q264k29257j85267n2180k65428k29826m4901K21017R2511
14773c6661P2358J03711j02689k32036l0378J58884M7589p9385r0873j10587J79841
14762a20226K98988L3030m8376j8077q5522r1363j47638j93201J06985J52286
14752a13114k11765k14521M4253J60801J15747J0699p3224r8143m2798K5126R631
$$ y = [-119613, -60739, -6909, -32461, -68128, -242162, -303698, -358325, -309580, -195460, -92760, -123843, -279316, -248953, -73928, -149043, -152244, -2007, -208441, -477107, -508541, -681035, -859814, -682770, -559398, -657394, -627707, -479840, -246794, -80765, -162720, -273263, -451183, -591586, -423676, -1369, 341192, 575324, 620667, 585740, 524336, 490695, 585368, 648406, 656670, 427413, 242146, 189966, -75462, -305288, -350189, -129172, -36661, 35697, 139408, 36719, -195317, -225695, -66811, -19222, -98607, -189480, -300067, -120226, 178762, 211792, 163416, 145339, 59817, -31546, -179184, -372385, -265400, -113114, -324879, -539400, -495147, -334346, -218599, -207900, -281124, -379267, -422065, -396939, -387308]
14741c87308J20107N0910n3169k8457m3208N533K07261J20122K32828K87091o4383
14730D47327l91950m72822J12624J56796o9914J77119O7157r4900j08670j04227
14720b81460K4603J72191J61925R0787L6015j04151p9974J2193J85507J84162
14710D01798J27777J3830j47687K1132m7919k58501j83174K7212K43167L77410
14700E75045L01492K2841j3682J35882k6672j61668k10721K9363J31280l18063
14690D65097m23778j54636p5997M6566J21210Q9606J17416K115p163j5048j97929
14679c2541j75809M9926o6r5028M5487J02845J4304O5379m0595m0631p7177O0197
14667a23709K08115J71902L1168j33297k52169p2618K7757j75379j34885J0092
$$ y = [-387308, -267201, -216291, -269460, -297917, -341125, -335592, -128331, -8209, 224619, 511710, 447327, 55377, -417445, -304821, -148025, -217939, -40820, 26337, -68563, -177233, -281460, -256857, -84666, 77259, 168046, 204061, 99910, 19936, 32129, 217636, 401798, 529575, 543405, 395718, 416850, 368931, 110430, -72744, -45532, 197635, 575045, 876537, 899378, 885696, 1021578, 994906, 833238, 622517, 651880, 783160, 465097, 41319, -113317, -189314, -142748, -21538, 68068, 185484, 187599, 180436, 165388, -32541, -208350, -158424, -158490, -253518, -208031, -105186, -90882, -25503, -66098, -106729, -183906, -123709, 84406, 256308, 287476, 154179, -97990, -170608, -142851, -318230, -453115, -443023]
14657d43023N4996P7801J32311J04170J00662j38183l95555j66373J38051P1202
14647d63941n889K01641J22297l1570J76269J46760J12846Q1836l3083j24220
14637A82946o5913J0591r1339K2754J20075J1161q5234j74426j33445J41862J24744
14626F3776J16639J59448n5382j57896K41498K05628m2518l74952k94203K3022
14616a14940p3691j54580P4647L11402O7314l04044k88813j36470j02669n8648
14606g80492Q7457J44748J25629J98031N3336p1450j9173l9958j5476M9609P9661
14595a88078J26962J11536O0098J70907J5600j38775j89069j85331j14221q4882
14585d15253m5786J07693K22565J31783j789R7804k6108N0947J43410l3832J5854
$$ y = [-443023, -388027, -310226, -177915, -73745, 26917, -111266, -506821, -673194, -535143, -463941, -469830, -268189, -145892, -177462, -1193, 145567, 258413, 340249, 307166, 182946, 117033, 127624, 36285, 59039, 179114, 190275, 105041, -69385, -202830, -60968, 63776, 180415, 339863, 284481, 126585, 368083, 573711, 531193, 156241, -137962, -114940, -188631, -343211, -268564, 42838, 110152, -193892, -482705, -619175, -721844, -780492, -693035, -548287, -422658, -224627, -171291, -242741, -261914, -301872, -317348, -267739, -188078, -61116, 50420, 110518, 281425, 297025, 158250, -30819, -216150, -330371, -415253, -461039, -353346, -130781, 1002, -787, 97017, 70909, 121856, 265266, 231434, 247288]
14574B47288j07668k00918q5853p0844K4021K597K81845K57292M5630j8591k17983
14563A56816j76934P3128J71686J62479j36592j77584j30786j34663j61989N7343
14553b97096L97780K02742o1478k19691k64234r7921K7043K4875J70062J41093
14543B3175N450k62269o7508Q4519J81756O8231M2882J30361k2316j87702j48453
14532a51874k8929j06812o4960J27969K456q5475r8865j13105l1643K70046K92225
14521A1033L9881j59116j50347R289n0300j5351Q1878k14876l35614j28157L03216
14510f08464K89859J63227K53558K75717J18299j86328k10605j3914J85876J88877
14500D56102J732R279n5317j32901j70601j40546j27674J9708M3260L9282o3262
$$ y = [247288, 139620, -61298, -147151, -217995, -193974, -191377, 90468, 347760, 393390, 374799, 156816, -20118, 53010, 224696, 387175, 250583, 72999, -57787, -192450, -354439, -297096, 100684, 303426, 241948, 22257, -241977, -339898, -312855, -287980, -117918, 23175, 28625, -233644, -301152, -216633, -34877, 33354, 76236, 206597, 184281, -3421, -151874, -180803, -287615, -352575, -224606, -222150, -307625, -406490, -519595, -551238, -281192, 11033, 50914, -108202, -258549, -249260, -299560, -314911, -233033, -447909, -783523, -911680, -608464, -318605, -155378, 98180, 373897, 492196, 305868, 95263, 81349, 267225, 456102, 457834, 467113, 411796, 278895, 108294, -32252, -159926, -140218, -96958, -57676, -120938]
14489a20938k57557j36077J68809J72422N7333j03913J2650J74599j12282J1743
14479a33211J60753j8509j80334j15434K4516J76419J30059o8985k05711j0543
14469b40980Q9582j2489J4228j21870k9903j04650r9962j53013M3613J50221J43742
14458c21481J70560L9977j45095k14612Q4088O2869N3973R393q3979J07664K17431
14447a9212j73199k90886k8702K67474L17317j82505j26864J13018m3160k61257
14437d27976j04727Q9122l0004l8417J54014R6592J4165j43641q7645L64712L58918
14426B45113j9075j7634k8658j25467k00177j57122N1419K65041J16341Q8587
14416B18368J45008k38233k09639L2912j39643l02204M2116J26802J71437M5415
$$ y = [-120938, -378495, -514572, -345763, -173341, -116008, -219921, -207271, -32672, -144954, -133211, 27542, 9033, -171301, -286735, -262219, -85800, 44259, -24726, -230437, -240980, -151398, -163887, -149659, -271529, -301432, -406082, -506044, -659057, -615444, -465223, -321481, -150921, -110944, -256039, -470651, -386563, -323694, -269721, -260328, -344307, -236643, -19212, -192411, -483297, -511999, -244525, 72792, -109713, -236577, -123559, -166719, -427976, -532703, -443581, -473585, -512002, -357988, -261396, -247231, -390872, -478517, -113805, 245113, 226038, 208404, 179746, 54279, -145898, -303020, -251601, 13440, 129781, 218368, 363376, 125143, -84496, -51584, -191227, -493431, -451315, -324513, -153076, -107661]
14406a07661K25K23970K74392J35177j30438l05966L2625K04317q1278j35283
14396A10080k51504o7812K28676J21960k4795j30570l4386k5661j00753p4637
14386b49402N5507J9742o3093l3492j6477j0113P1681J2667j49620L4626J75947
14375a52027N9252J15107J08662N4509j23045j09467K3663N0471k39873k46172
14365d58920j39509p5008o7064K27488J65247J8655J32632m5882J1749J34782
14355i5830R4667j7939k36459l97592j25130j6509R0000J99926J11329K8589J37815
14344b27133J13228j16449j50282j03846J17461K36947J03486m438p2451k2174
14334a25651o2878q8161p2523M0783o6012j6581q298j19021K20878P603k05671
$$ y = [-107661, -107436, 116534, 390926, 526103, 395665, 89699, 122324, 326641, 245363, 110080, -141424, -209236, 19440, 141400, 116605, -13965, -48351, -74012, -174765, -249402, -193895, -174153, -237246, -270738, -287215, -297328, -225647, -212980, -362600, -327974, -152027, -92775, 22332, 130994, 185503, 62458, -47009, -23346, 27125, -212748, -458920, -598429, -673437, -740501, -513013, -347766, -329111, -196479, -242361, -230612, -95830, -1163, -19102, -255561, -653153, -778283, -794792, -704792, -504866, -393537, -364948, -227133, -113905, -230354, -380636, -484482, -367021, -130074, -26588, -31026, -103477, -125651, -188529, -276690, -349213, -308430, -374442, -391023, -399321, -518342, -297464, -289861, -495532]
14323d95532Q0938Q5145J3359Q7612j51563j27891j29027K31852L77926J83623
14313A56442K6932J1846N4245O0820r4633J5254J6080O3680P3456p7162j37538
14302A69422j73530j14878j08485o3991k28069j30896m2840m7855O96Q2742p2806
14291g30490p0770l4659n053l0991J5819P1859J43096J11403O3810J19374J83536
14280a63066O7042L8653Q706J82299N6477j24311J56498k1955j76654j43898J89464
14269F9255L23377j5902k72582l52302j17052M14503M70056N7771k66948l09992
14259A84P3107O0426j22412R6286P2307N7892j86890l17107m030m2475j776o8293
14247c82781r0658j08789J6268J51725Q2673J80011J78536k7437l2224n6234j64308
$$ y = [-495532, -414594, -329449, -316090, -228478, -380041, -507932, -636959, -405107, -27181, 156442, 183374, 195220, 249465, 310285, 215652, 230906, 246986, 310666, 384122, 306960, 169422, -4108, -118986, -227471, -291462, -519531, -650427, -693267, -741122, -740426, -657684, -730490, -801260, -835919, -840972, -871963, -856144, -784285, -641189, -529786, -465976, -346602, -163066, -96024, -57371, -48665, 133634, 190111, 65800, 222298, 200343, 23689, -120209, 69255, 392632, 376730, 104148, -248154, -365206, 49297, 519353, 577124, 310176, 184, 73291, 133717, 11305, 107591, 179898, 237790, 50900, -266207, -270237, -312712, -314488, -382781, -473439, -582228, -565960, -414235, -331562, -151551, 26985, -452, -32676, -88910, -253218]
14236b53218k11869j27942L06433K75157q9832m1752J7348L6824N5823l4560j48864
14225b16452o324Q3795l2783j65822r0476J00547P8750K3095J04966J77144l9748
14214A6692l35100k58840l383N4859Q1527N5465M7941J2084J5989M1280O1429
14203b10057j91462j89914J38455K78271K03047J40025J82031j6432j27171J8809
14193B25602p9648n6138j20336j01388j8602K2748l9117L4917R9312J00993K11415
14182B79758j05014k66014o4661r176p8131M9880J00096o9349j91979j14834J23243
14171c46181L73916J83266j53783j03367J53039J11309k0102j16871k04822m8048
14161a71644K16646K22993j92024l66261k1553J38663J05699O1634K10219J69596
$$ y = [-253218, -465087, -593029, -286596, -11439, -101271, -143023, -125675, -88851, -33028, -67588, -216452, -222776, -138981, -171764, -337586, -428062, -327515, -248765, -225670, -120704, 56440, 16692, -318408, -577248, -580631, -525772, -444245, -388780, -340839, -328755, -312766, -271486, -210057, -401519, -591433, -452978, -174707, 28340, 168365, 350396, 333964, 206793, 225602, 145954, 89816, -30520, -131908, -150510, -127762, -166879, -131962, -32650, 68343, 279758, 174744, -91270, -155931, -165107, -243238, -193358, -93262, -162611, -354590, -469424, -346181, 27735, 211001, 57218, -46149, 106890, 218199, 198097, 81226, -123596, -171644, 45002, 267995, 75971, -290290, -311843, -173180, -67481, -5847, 204372, 373968]
14151C73968L2889k0861o619J5811j48342j42420L1870K27980K59891K77333R9567
14140A001067J77q8345k22546j63741j11656M3317L5582j77120j2594J35771l5631
14129D04281n0160l38663j18906J6861l21294j08678L41046J27586j32220j74578
14119c54725n5722J38569J89047K18038j12212j37109j2565j59455l97628l09574
14109i93336K09036L27921K19337J86364O8444p6673j53213k6893J13699K06772
14099H1458K02923j6015j12502l0078P1323n2827L7612P9045K7619P311j75723
14088A20146j24420k5249J827k5603q6368j22349j31553Q4830K71179P2587j56095
14077a21068r0785J30783O3542q1932P0197J67676J32103L1008k06104k79516
$$ y = [373968, 406857, 385996, 379377, 395188, 246846, 104426, 136296, 364276, 624167, 901500, 1001067, 1001244, 912899, 690353, 526612, 414956, 458273, 493855, 316735, 304141, 439912, 404281, 354121, 15458, -103448, -86587, -407881, -516559, -175513, -47927, -180147, -354725, -410447, -271878, -82831, 135207, 22995, -114114, -126679, -286134, -683762, -993336, -784300, -456379, -237042, -50678, 17766, -58907, -212120, -239013, -125314, 81458, 284381, 268366, 155864, 125786, 197109, 144282, 181894, 260939, 288558, 295869, 120146, -4274, -29523, -27696, -53299, -139667, -262016, -393569, -308739, -37560, 35027, -121068, -211853, -81070, -17528, -99460, -29263, 138413, 270516, 301524, 95420, -184096]
14067a84096j39252N9424J00105P914p9914o9248Q1879R6900P2376J34512N4403
14056A35003j49725j86641j37767k7188Q3958J74333L58684K42219P2506R2889
14046F58271J36591O5101K29534L07329k120j17802m8745k38596k19131l811O6168
14035H32789j35025j44109J6558m9561J59758J73610L7908r5139j65959j73030
14025D57800O5505J87638L57342K82008P2606J98865N23582N27774O36499R60220
14015D269839J444127K041337L146980M823490O598629L637827m211870o312002
14007A5438357m440805l041974j907847j441667j028781o26707o34535n87718
13999A728323n6306j0078l0679k42564k08215P0418j7826R0505L6727j93786k39191
$$ y = [-184096, -323348, -263924, -163819, -155905, -235819, -305067, -223188, -126288, -53912, 80600, 135003, -14722, -201363, -339130, -366318, -282360, -108027, 250657, 492876, 565382, 658271, 794862, 859963, 1089497, 1396826, 1394706, 1276904, 1228159, 989563, 770432, 766621, 832789, 697764, 553655, 570213, 520652, 680410, 854020, 891928, 796789, 630830, 457800, 523305, 710943, 1068285, 1350293, 1422899, 1621764, 2145346, 2673120, 3309619, 4269839, 5713966, 7755303, 10902283, 15725773, 22324402, 25962229, 21750359, 15438357, 10997552, 7955578, 6047731, 4606064, 3577283, 2950576, 2316041, 1728323, 1672017, 1661939, 1631260, 1388696, 1180481, 1250899, 1233073, 1323578, 1360305, 1166519, 927328]
13988I27328l4603j58086k92137j35840J0697n1345K02M0589J11444o7619k24709
13977A25921o2668M4768K49290K40817J96089J13398l61639l08453R6756J37433
13967D71712O3724n4119j34573j90544k43866k5837P8084j35269k0056L88127
13957A97383K63496o8008Q5201K4119k99357l6982O8660J47337m3390j12047J64038
13946C90450J12044j18264k55229k41233n6110p890k39229k01614p1097M9504
13936f38668P3937K8823Q8189K60573J07830Q6319J27110J5592j85326j52798
13926a88419n2984L7489J21931K09239R8833K7952j98177r7466J30331j81037
13916i2308l41513j50958J16585L11633K90429n2483k57361j91919k61943j73926
$$ y = [927328, 892725, 734639, 442502, 306662, 317359, 266014, 266216, 306805, 418249, 350630, 125921, 63253, 108021, 357311, 598128, 794217, 907615, 545976, 237523, 334279, 471712, 535436, 481317, 346744, 156200, -87666, -113503, -35419, -170688, -190744, 197383, 460879, 392871, 478072, 502191, 202834, 165852, 234512, 381849, 338459, 226412, 390450, 502494, 384230, 129001, -112232, -168342, -176232, -415461, -617075, -688172, -638668, -564731, -535908, -447719, -187146, -79316, 7003, 134113, 149705, -35621, -188419, -241403, -203914, -81983, 127256, 226089, 254041, 55864, -41602, 88729, -92308, -433821, -584779, -468194, -156561, 133868, 81385, -175976, -367895, -629838, -803764]
13906h03764l7072K35308L60442O9122j17716O010K35278R3972J24757J14077
13896B80414r0956o7101N1836M4239j9193J29444k1982k3162j4744k03884k92470
13885b27559o5755l5006j76342k35437m7162P0073Q1433J79045L77566K18307
13875A39163p0393o0817r874k8652P0857J23300P3987N416m1399r0608j34794
13864b3814R4853P2718M2772J01990k02870o7296O335o8908K03413J48364j47178
13853A60379k11651j18657j10882j0307o442Q3457p27k857r212l33775j49226
13842g09900L84505L55727n5400j19691M875k9385m5265k15044j40851J40199
13832d30230J95876K01741K01644j18622j56590r9243j24018N6368K54063K02638
$$ y = [-803764, -840836, -605528, -245086, -175964, -293680, -287670, -52392, 41580, 166337, 280414, 189458, 122357, 174193, 218432, 199239, 328683, 306701, 283539, 268795, 64911, -227559, -293314, -328320, -504662, -740099, -787261, -717188, -635755, -456710, -79144, 139163, 68770, 7953, -1921, -30573, 40284, 163584, 237571, 242987, 201588, 110980, -23814, 71039, 143757, 186529, 288519, 85649, 18353, 24688, -44220, 159193, 307557, 160379, -51272, -169929, -280811, -291118, -297560, -214103, -214830, -217687, -226899, -560674, -709900, -325395, 30332, -25068, -144759, -139884, -169269, -214534, -429578, -570429, -430230, -234354, -32613, 169031, 50409, -106181, -205424, -329442, -273074, -19011, 183627]
13822A83627k28062k47511m5158j90640M9266R6553M9668O0846N1916K62950J28515
13811A71970q130L9658q56l0097k5648j36125n8754J75186L42201n2438m00919
13800A6048j68153o2621r9525P5060J80547J40962P4138m3695l10881j62722L5712
13789c25130l1586j85324l08772J15790L02784K84065J80671l1631r2214j73583
13779b64930j9084K6830j09926J07880L0895j72579r7328J42458o7635q3973J66324
13768c41068J88255K09168J1258j97864L0572p095o7614J98195J13022k8727q0959
13757B7143k41064l7025J31525J76017J8314j08385l81973k91896L5905K50143
13747d21296J92648o4659j98950m1553K18979K54281m6040j72338P4270N5139
$$ y = [183627, -44435, -291946, -337104, -527744, -478478, -381925, -332257, -271411, -219495, 43455, 171970, 163840, 203498, 202642, 172545, 146897, 10772, -47982, 127204, 469405, 416967, 16048, -152105, -214726, -314251, -239191, -58644, 82318, 156456, 112761, -198120, -360842, -325130, -356716, -542040, -850812, -735022, -432238, -148173, 32498, 867, -91347, -264930, -284014, -257184, -367110, -259230, -228335, -400914, -498242, -355784, -423419, -507392, -341068, -152813, 56355, 67613, -130251, -99679, -106774, -174388, 23807, 136829, 108102, 27143, -213921, -250946, -119421, 56596, 74910, -33475, -415448, -707344, -671439, -421296, -228648, -293307, -492257, -533810, -314831, -60550, -106590, -278928, -204658, -149519]
13737a49519J85841J29476N8789l6922j95186j55750O9216J66454K08915o7214
13727B14100k34216j15242J19205q6426p8550R8597K5080m8768k9677J24443q2551
13716i4005R1132K23691J72698O1594r827j63187j94333J5321j5844k976P0853
13705A55117K42410L80036K18297n6408l73204l38145j70604j40083O0679J60249
13695A38344j02290k7038J36784r9571n5388K38788N0276p7636O1394R6729R4220
13684D54612j7014j00407j99384n6140J1893J53135J99770R2869j95205l70767
13674b6638J5627J14045j26598p9076j79299j68922j27810l3539K08529K96716
13664a06965J44985l6648P8336M1677q6900j35635r6248k7339R6922N6609O2165
$$ y = [-149519, 36322, 165798, 224587, 187665, -7521, -163271, -94055, 72399, 281314, 214100, -20116, -135358, -16153, -102579, -181129, -82532, -57452, -106220, -135897, -11454, -94005, -2873, 220818, 393516, 455110, 445283, 282096, 87763, 103084, 87240, 84264, 155117, 397527, 777563, 995860, 939452, 566248, 228103, 57499, -82584, -21905, 138344, 36054, 9016, 145800, 46229, -9159, 229629, 279905, 202269, 263663, 360392, 454612, 437598, 337191, 137807, 81667, 93560, 246695, 446465, 539334, 344129, -26638, -11011, 103034, -23564, -102640, -281939, -450861, -578671, -612210, -403681, -106965, 38020, 1372, 79708, 121385, 34485, -101150, -197398, -224737, -127815, -71206, -9041]
13653i041l0272q3368K20394L54981J55957j33612j40728l09947k11813p286J76980
13642a7755J05315R091j47703j61384J07857j09460j86247J7654P3401J12633
13632a96598K5803k1187k8174j03418j25641m1466M3108J53691K30900J56286
13622I3304J72606K21154J18333m6932j96538j78392j6857o4280r5470j92783
13612a85855l72034j97914J15019K29274J84152K08369J31489j39781k22114j19126
13602c68521m6406j2531J13463J04913K15471R1235j83188m1256J35813K94092
13592C03085j4799k24764q9735j75987k88220j53231J79857K81301K13526L09520
13582C40553J83316j17935O0302J01847K9721j51812k7013J13621J83101J49045
$$ y = [-9041, -39313, -122681, 97713, 452694, 608651, 475039, 334311, 24364, -187449, -194735, -17755, 87560, 96651, -51052, -212436, -104579, -214039, -400286, -382632, -309231, -196598, -170795, -191982, -220156, -323574, -449215, -490681, -447573, -293882, -62982, 93304, 265910, 487064, 605397, 558465, 361927, 183535, 166678, 102398, 6928, -185855, -557889, -755803, -640784, -411510, -227358, -18989, 112500, -27281, -249395, -368521, -414927, -427458, -313995, -209082, 6389, 97624, -85564, -126820, 8993, 303085, 288286, 63522, -26213, -202200, -490420, -643651, -463794, -182493, 31033, 340553, 523869, 405934, 466236, 568083, 597804, 445992, 418979, 532600, 715701, 864746]
13572H64746L7216j55642l53833k28267L0367K10531L8366k01500j62725N3580
13562A32839J45156L466j75717n0K62301J71429J24386O6987j29026k37461j29964
13551B34346j5721k05038k85475N1785K55031K49469N1352J3778R3985L1272j34156
13540C40628m1719J28102K531j71864p9112k8094m6928L3136J16576J3233n7620
13529B08869L7728n6589j6907j23511l76260q1827M02879J72493k34540j53021
13519b20686j9414o1626J43200J5559j63865J19060R3647k59538k71845K7857
13509e97651N4918n2973P7663L31359L10289O6444J97935P3927k26330q6631K64983
13498D13933K4119k73060j30553j73987k05387Q7774K06861R0745k25044J0429
$$ y = [864746, 901962, 746320, 392487, 164220, 194587, 405118, 443484, 241984, 79259, 132839, 277995, 281461, 105744, 105694, 367995, 539424, 663810, 730797, 601771, 364310, 234346, 218625, 13587, -271888, -220103, 34928, 284397, 335749, 349527, 443512, 474784, 340628, 298909, 427011, 429542, 257678, 178566, 150472, 103544, 136680, 253256, 266489, 208869, 246597, 190008, 173101, 49590, -326670, -408497, -5618, 166875, -67665, -220686, -240100, -301726, -158526, -142967, -306832, -187772, -94125, -353663, -625508, -597651, -542733, -595706, -518043, -186684, 123605, 190049, 387984, 461911, 235581, 148950, 413933, 438052, 164992, 34439, -139548, -344935, -257161, -50300, 40445, -184599, -174170]
13488a74170N5716P6581j88780m50945j51874O8716R6422K50483J48984j266m0828
13477c10961M9137J26958J01479J54520j32964k91316r7532q0347m2814J61845
13467c61995K33300M5017j85483k33085j3944R5455J44626Q2290R8209Q0117o0057
13456g5550K10001K69794J85636P9598l1882n6541j41629k83325j92274L2426
13446c746J35439J14939J53974l1448p6785J37609J83684n6337k98201j49534
13436A09594O7343k3986k4398L74740K65009k15134l78368k41728Q0361J46769
13426A60202O242j10217n1211j53301k6516J91643L1652J50939R9179o2864j04071
13415A31677j96237j10914n6267r0869J46656M15637Q0262j49951n0228q8287
$$ y = [-174170, -118454, -41873, -230653, -681598, -833472, -764756, -668334, -417851, -268867, -270133, -310961, -261824, -134866, -33387, 121133, -11831, -303147, -400679, -481026, -523840, -361995, -128695, -83678, -269161, -502246, -516190, -420735, -276109, -193819, -95610, -15493, -75550, 134451, 404245, 589881, 669479, 637597, 581056, 439427, 156102, -36172, -3746, 131693, 246632, 400606, 369158, 292373, 429982, 613666, 557329, 259128, 109594, 176937, 152951, 128553, 503293, 768302, 553168, 174800, -66928, 13433, 160202, 166444, 56227, 5016, -148285, -174801, 16842, 48494, 199433, 298612, 235748, 131677, -64560, -175474, -231741, -322610, -175954, 239683, 319945, 169994, 119766, 31479]
13405C1479R7072J29494P248O9494n6232p0321P5530J34955J19095j61250k65607
13394A10957j22751O0540J54146J51238P7516k02041j5507R5001M7604m670q4335
13383B67698J0324k3602j69431m10484l31501p299K13604K20202J25932K47711
13373A43154L8334p4701J36232K56276k5719j72807n3820J53801N9768j75048
13363B85470j62221o1927K16982Q2991o8602J1192l8270M3943j91874k92682r1958
13352b66956K11359K67232K92728J10089j66116k04783j67376j45413J56477N5246
13342A42487k05601j95627j5718J10390Q4534J09167n6016p6781J75674J36340
13332B08849J20401P2318k36288m54917k49305Q3667L23695L04713K74012K7125
$$ y = [31479, 128551, 258045, 265293, 334787, 278555, 208234, 283764, 418719, 537814, 376564, 110957, -11794, 48746, 202892, 354130, 431646, 229605, 214098, 309099, 356703, 352033, 267698, 278022, 254420, 84989, -325495, -656996, -664295, -450691, -230489, -104557, 143154, 181488, 106787, 243019, 499295, 473576, 300769, 246949, 400750, 460518, 285470, 123249, 61322, 278304, 361295, 292693, 303885, 265615, 309558, 117684, -174998, -266956, -55597, 211635, 504363, 614452, 448336, 243553, 76177, -69236, 87241, 142487, -63114, -258741, -274459, -164069, -79535, 29632, -26384, -103165, 72509, 208849, 329250, 401568, 165280, -289637, -538942, -455275, -131580, 173133, 447145, 474270]
13322D74270j21826j13657j04994k6055l1525o7140j21832L32926M48997L49614
13312A018778R4971k48722p7266K3714n3132j72543q9493p5957o0655M0551P6726
13301D76972N5342M4222l8308k9300j50077l4135P0941o3631r0866n4247l4367
13290A52546Q3253J46373N5243M8838n2919k18820k07653j63547O5196K45573
13280A54083l8883j35028P7706Q0701R1817K35333N8829k2913P2649M0965k716
13269F12543N4335r3940j35777j50128k36219k82441M6409J16456K26993J7995
13259A76226k27520R9880J64117O5796k6902j81492l3501L05567N43387K81102
13249A166660p3485k54307j86131J8968J45433J78427K10864k46899k99207k06760
$$ y = [474270, 352444, 238787, 133793, 107738, 76213, 9073, -112759, 220167, 669164, 1018778, 1113749, 865027, 787761, 811475, 758343, 585800, 496307, 420350, 359695, 400246, 476972, 532314, 576536, 538228, 508928, 358851, 324716, 395657, 332026, 241160, 186913, 152546, 235799, 382172, 437415, 486253, 433334, 214514, 6861, -156686, -91490, 154083, 115200, -19828, 57878, 138579, 230396, 465729, 524558, 501645, 574294, 615259, 612543, 666878, 572938, 437161, 287033, 50814, -231627, -185218, -68762, 158231, 176226, -51294, 48586, 212703, 278499, 251597, 70105, 36604, 342171, 885558, 1166660, 1093175, 838868, 652737, 671705, 817138, 995565, 1206429, 959530, 660323, 453563]
13239D53563J4620o1656k08474j66542k1712J32038J71525J63793Q2688J608j48951
13228D12500k27996k52509K5916J57336J1098L4363n9555k233m18k48349l5195
13217a85042J01846J61728J90901Q6178q2542K9679K10174O8172k01033k01341
13207A78720J52379K95529K25861Q3006K905p7266Q8173k743K8999Q8430k11669
13196H52324k67015p6397N3469j3784j28236o5788P2359J10812R2470N3743j43116
13185E40841n9680l4179j07780L202j65350j3324J44663J71855P7981j72913k95902
13174H9414j90254k0907K57291L83052K55511J37308N2673Q0013N0336k53937
13164H40500k21601q3617M9018J67732j64975k33422j21242k38150k51108Q4700
$$ y = [453563, 468183, 406527, 198053, 31511, 9799, 141837, 313362, 477155, 559843, 561451, 412500, 184504, -68005, -42089, 115247, 126345, 160708, 101153, 98920, 98502, -149847, -185042, -83196, 78532, 269433, 355611, 273069, 302748, 512922, 581094, 380061, 178720, 331099, 626628, 852489, 935495, 938400, 861134, 949307, 946564, 975563, 1063993, 852324, 585309, 508912, 562381, 548597, 420361, 354573, 426932, 537744, 630214, 683957, 540841, 481161, 446982, 339202, 342404, 177054, 163730, 308393, 480248, 558229, 385316, 89414, -100840, -121747, 135544, 518596, 774107, 911415, 964088, 1044101, 1094437, 840500, 618899, 535282, 584300, 752032, 587057, 353635, 232393, -5757, -256865, -172165]
13154a72165J44494J04470O0744J20118J08848L9669J81873K74707J38329k5110
13144I75977k25108k47849O3783K21106J8752l03609k11512n5652p4085J30666
13134B92469J82889j19727p4350K86043L62259L7017j87693j99173j30127J42939
13124E92546K64418J4199l9589K3266j85459k03525P425J18647J93932Q8004j25380
13113G48484k51264k3025R7124o2650m3796K28343Q7750j5103q774J13863J14577
13102I85529R0628N0077j62437j54055r9330j72567J359R3655P9160J88744P7851
13091I78614j88078k86675l60358j59879J13186J91101K67625M13996K82288J58625
13081A410445Q7835l9354p7266j84869k78878j65330j86798j33183K02617J90769
$$ y = [-172165, -27671, 76799, 137543, 257661, 366509, 406178, 588051, 862758, 1001087, 975977, 750869, 503020, 566803, 787909, 806661, 503052, 291540, 235888, 161803, 292469, 475358, 355631, 281281, 567324, 929583, 966600, 778907, 579734, 449607, 592546, 856964, 871163, 831574, 854840, 669381, 465856, 473281, 591928, 785860, 873864, 748484, 497220, 474195, 571319, 508669, 464873, 693216, 780966, 765863, 757089, 870952, 985529, 1076157, 1126234, 963797, 809742, 710412, 537845, 539204, 632859, 712019, 900763, 978614, 790536, 503861, 143503, -16376, 96810, 287911, 555536, 969532, 1251820, 1410445, 1498280, 1458926, 1381660, 1196791, 917913, 752583, 565785, 432602, 635219, 825988]
13071H25988R8637M3442j51122j92475m86J58705K31259J32024l6058n5941J4422
13060A068395P008m86J7506Q4226J54132J66232P3475J4554R210P1254M6864m1155
13048A671215l6661Q4419J5993j3104R2967k5273q5222q6096j82673j33912k11590
13037A090063k23345Q3133K93340K72526K06043J2576j3930L93957L32718J09692
13027B556773J55425P6382j46733k7122Q5391J7290k05226M0703N6260j16684
13017B492459J82753L68113L31406K14922J65213L1399m4504J30766J51848q0436
13007C943939k0008N8796K54367M27765M58253K52221K86133L29501L73441N92787
12997F957195N78189M54084M27103O06576Q75460Q60332J033574J082141J171373
$$ y = [825988, 924625, 968067, 816945, 624470, 623984, 782689, 1013948, 1145972, 1109914, 1053973, 1068395, 1075403, 1074917, 1092423, 1176649, 1330781, 1497013, 1570488, 1585042, 1594252, 1665506, 1712370, 1671215, 1634554, 1718973, 1734966, 1721862, 1814829, 1789556, 1704334, 1618238, 1435565, 1301653, 1090063, 866718, 949851, 1243191, 1515717, 1721760, 1734336, 1720406, 2114363, 2447081, 2556773, 2712198, 2788580, 2641847, 2614725, 2700116, 2717406, 2512180, 2552883, 2609143, 2492459, 2675212, 3043325, 3374731, 3589653, 3754866, 3786265, 3741761, 3872527, 4024375, 3943939, 3923931, 3982727, 4237094, 4664859, 5123112, 5375333, 5661466, 5990967, 6364408, 6957195, 7535384, 7989468, 8416571, 9023147, 9898607, 10758939, 11792513, 12874654, 14046027]
12988A4046027J694622K075018K308906L017629M047784N180927O153434P063857
12980D5588204R011986J1696966J5108810K0053467K6828834L5275478M3589530
12973B07153275M5472851L0547380k338487l2797164m4387387m0773077l2452597
12966A30424794k4915163j9039381j4607863j1470277r124428p382410o105789
12959C7779483m998062l991550l359806k739115k087642j894675j743777j566847
12951A5398009j225601j232911j123481p20347n21095o06029o18327n39548n58324
12942H252346n31648n33076l09045j21217k06085l84668k14279j16157L5614J4101
12932E885886j30431k7688K04195J02915n1117L8489J54915M56078N72191J41114
$$ y = [14046027, 15740649, 17815667, 20124573, 23142202, 27189986, 32370913, 38524347, 45588204, 54600190, 66297156, 81405966, 101459433, 128288267, 163563745, 207153275, 252626126, 283173506, 280835019, 248037855, 203650468, 162877391, 130424794, 105509631, 86470250, 71862387, 60392110, 51267682, 43885272, 37779483, 32781421, 28789871, 25430065, 22690950, 20603308, 18708633, 16964856, 15398009, 14172408, 12939497, 11816016, 11095669, 10574574, 9968545, 9350218, 8810670, 8252346, 7720698, 7187622, 6878577, 6757360, 6551275, 6166607, 5952328, 5836171, 5871785, 5885886, 5755455, 5727767, 5931962, 6034877, 5983760, 6022249, 6177164, 6633242, 7205433, 7346547]
12922G346547k7999L39310M58331N18322N55473P21840R82770J314971J313649
12913A3523214J177334K02080o89420q46286n00881r2942J13711L61684N83117
12904A3831611P65456P91740R10873J471212K106006K693878L226768M002602
12896B9800146M795389O066591P733480R890135J2901847J6665354K1906899K9201444
12888A38961285L8268992M6482444M5120179K2934971j3610430l9968688m5679504
12881A92509249l9424955l0811615k3417239j7701919j3550548j0633965q379086
12874D8589922o613018n523096m657642l659820l061140k598303k227003j983227
12866A8266673j583881j303940j131976r87915q06404o62157o28068p99960q66928
$$ y = [7346547, 7318548, 7657858, 8116189, 8634511, 9189984, 9911824, 10894594, 12209565, 13523214, 14700548, 14902628, 14213208, 13366922, 12866041, 12773099, 12886810, 13248494, 13831611, 14597067, 15388807, 16299680, 17770892, 19876898, 22570776, 25797544, 29800146, 34595535, 40662126, 48395606, 58285741, 71187588, 87852942, 109759841, 138961285, 177230277, 223712721, 268832900, 291767871, 278157441, 238188753, 192509249, 153084294, 122272679, 98855440, 81153521, 67602973, 56969008, 48589922, 41976904, 36453808, 31796166, 28136346, 25075206, 22476903, 20249900, 18266673, 16682792, 15378852, 14246876, 13258961, 12452557, 11790400, 11162332, 10362372, 9495444]
12857I495444q78504n65758k53452j59243k83944m55495n38503l08425j62472
12848E889648j91165j0201M8523p260J19100N3782N9560J29092l4371j98985r8522
12837E759201l8905l1547K53365K97772K12540j02924k17184J47865K41238L55586
12827F877007M88010L32802K78850K10665K73394M28039N36004O87614Q10626
12818A0923011Q39178J119639J334631J546250J892605K313964K856463L574981
12810B6400722M480214N399509O723876Q392743J0495737J3517157J7769429K3536212
12802A16715599L1389768M0594609M6262808L9309496J2037684k2752688m2268018
12795B21289258m3620184l6384030k8129643k1235440j6262453j2637182j0040607
$$ y = [9495444, 8616940, 8051182, 7797730, 7638487, 7354543, 6899048, 6360545, 6052120, 5889648, 5698483, 5688282, 5736805, 5729545, 5848645, 5902427, 5961987, 6091079, 6056708, 5857723, 5759201, 5720296, 5688749, 5942114, 6239886, 6452426, 6349502, 6132318, 6280183, 6521421, 6877007, 7365017, 7697819, 7976669, 8187334, 8460728, 8888767, 9424771, 10112385, 10923011, 11762189, 12881828, 14216459, 15762709, 17655314, 19969278, 22825741, 26400722, 30880936, 36280445, 43004321, 51397064, 61892801, 75409958, 93179387, 116715599, 148105367, 188699976, 234962784, 274272280, 286309964, 263557276, 221289258, 177669074, 141285044, 113155401, 91919961, 75657508, 63020326, 52979719]
12788E2979719q021935o452376n512825m507521l518664k797046k373965j936834
12780A7858553j622578j499013j365668j061547j060237j075626r73941q78849
12772H321094p14965m72789l71275m50626m96740n46400o02223l64489q9859J9537
12762D231265j4855k38702k63454k7801p5580l12076k59312l80198m43514k29567
12752A986206J33582R5373k92202j51290Q1406N8290M0469L19L7608P3572R6720
12741B160053R0459N1208k2944j90606k74002k46160o1590Q0322J40586J62804
12731A890130j47249l69152j95988j24388j63940q5181L976N9085O2847m470j14095
12720H11575M9126K57142J07687J130P9515j76981r3809N8757k29602j13392N7576
$$ y = [52979719, 44957784, 38505408, 32992583, 28485062, 24966398, 22169352, 19795387, 17858553, 16235975, 14736962, 13371294, 12309747, 11249510, 10173884, 9199943, 8321094, 7606129, 7133340, 6762065, 6311439, 5814699, 5268299, 4666076, 4301587, 4211728, 4231265, 4216410, 3977708, 3714254, 3686453, 3610873, 3298797, 3039485, 2659287, 2215773, 1986206, 2119788, 2215161, 1922959, 1771669, 1853075, 1911365, 1951834, 1952153, 1989761, 2063333, 2160053, 2250512, 2301720, 2278776, 2088170, 1814168, 1568008, 1506418, 1586740, 1727326, 1890130, 1742881, 1373729, 1177741, 1053353, 889413, 804232, 808208, 867293, 930140, 925670, 811575, 860701, 1117843, 1225530, 1226660, 1306175, 1129194, 1035385, 1094142, 864540, 751148, 808724]
12709H08724l1572r4831k18112k88256q8747K97045K70661O7758o6746p8132O9290
12698F47082J39393J41606L4733l8525j72441q8361j01665j3352J04081k1755
12688F30796j60631j95968o6589J4157L6355J01964J02788r0333j38323J02026
12678C36242J05042J63638L89155O076l29433p0827k6295n2161j2241q9606k22369
12667A97221M7478J39352L5167J22472R721l16924m84472L1821K05620J70949
12657A58405L20409L7947k91668r9719J19431K0522j55790J08000L93245Q2802
12647F93584k5979j11731o0044O3067q8731j35258j23336M4732j558M5928J51083
12636D51757j59778k59569Q1489N4255j5338N1798n0624j29872J89401M94831
$$ y = [808724, 777152, 682321, 464209, 175953, 87206, 384251, 654912, 722670, 655924, 577792, 647082, 786475, 928081, 962814, 924289, 751848, 663487, 561822, 548470, 652551, 630796, 470165, 274197, 207608, 221765, 258120, 360084, 462872, 372539, 234216, 336242, 441284, 604922, 994077, 1000153, 670720, 599893, 573598, 521437, 509196, 419590, 197221, 244699, 384051, 419218, 541690, 551411, 234487, -249985, -218164, -12544, 158405, 478814, 516761, 225093, 125374, 244805, 265327, 109537, 217537, 610782, 693584, 667605, 555874, 495830, 558897, 470166, 334908, 211572, 256304, 254746, 300674, 451757, 291979, 32410, 113899, 168154, 152816, 204614, 153990, 24118, 213519, 708350]
12626G08350K85705r2986l05204k23535j12243N7934J65056q4015k4240J7290
12616C92112J13140J33383p8703j16275l6993j63482o7253J81547K62384K43503
12606H63363J12404j4996k23153k51787M4971M3039q8328j59950p7276j3659J20182
12595C54810J88130J16334J7749K2392j03836j35992j55539q0535j33539k17033
12585a27059j11591r3097N7839q2528j3059p6453n1697J45710J85564K61097J78714
12574B73440K0795N1269R5940j21547j992Q5686J6056j44374k16901N3168J97316
12563C08856O3187J11931j22129k02933r2089m5327j21546j67638L9020J66552
12553f2116M38464L15438P1077j08127k98434l46088l59305j26486J37683J35406
$$ y = [708350, 994055, 901069, 595865, 372330, 260087, 318021, 483077, 399062, 374822, 392112, 505252, 638635, 559932, 443657, 406664, 243182, 175929, 357476, 619860, 863363, 975767, 960771, 737618, 485831, 530802, 573841, 485513, 325563, 248287, 234628, 354810, 542940, 659274, 677023, 699415, 595579, 459587, 304048, 223513, 89974, -127059, -238650, -331747, -273908, -356436, -369495, -445948, -497645, -351935, -166371, 94726, 273440, 294235, 345504, 441444, 319897, 317905, 403591, 419647, 275273, 58372, 111540, 308856, 372043, 483974, 361845, 158912, 66823, 21496, -100050, -267688, -228668, -62116, 376348, 691786, 762863, 654736, 356302, 10214, -349091, -475577, -337894, -202488]
12543b02488o7478k67455J5953J62349J90033Q8617j03319O8650K56475K30553
12533C71890K16954J04022j44457k30962J36986J74948j22520j01741J19203J31544
12523F55867j56856k6435j03224k24978j97324M5519K0518j53902k36759r0127
12513d67701K29432J49160k4797j60511q1499J11295K70862J19867j77316k37908
12503b69116j36459P1719N61305K21535j42104p4617j96182j66722k6137j52908
12493c09686r5140M5812K1764m4661K12729K42501k1505m6929P6624M4852l9443
12482H6918j77136k2132J43291K9383K09628K02796m7718j89379p1173J72398
12472C36876q7500l12256j55114J7822l4349j23243p7367J54707L27223J27089
$$ y = [-202488, -269966, -537421, -521468, -359119, -169086, -80469, -183788, -115138, 141337, 371890, 588844, 692866, 548409, 317447, 454433, 629381, 506861, 405120, 524323, 655867, 499011, 472576, 369352, 144374, -52950, -7431, 13087, -140815, -377574, -467701, -238269, -89109, -113906, -274417, -355916, -244621, 26241, 146108, -31208, -269116, -405575, -333856, 227449, 448984, 306880, 232263, 36081, -130641, -156778, -309686, -404826, -359014, -337250, -381911, -169182, 73319, 51814, 4885, 81509, 126361, 86918, -90218, -112350, 30941, 60324, 269952, 472748, 425030, 235651, 164478, 336876, 249376, -62880, -217994, -200172, -234521, -357764, -435131, -280424, 46799, 173888]
12462A73888J77120P8208q1235o0672K5023n9148j17171O5810L1299j37598j4480
12451H1044J22910k8150k25643m6765J40720J85949J5612k54089K8638Q0685j02705
12440a794R9578J62574n5983j73095k0324J03442J72407J01073o4719K76378J65662
12429G65199k08658k21397o7862q358P0696J73057M7598k46730l28497j16101
12419a41053K4180l6712O4158K13716p5180k03035J27052n8435j55196J7674N7260
12408a65571j5523N9610J16845K19319j9672l6417J5732p5764j94722k7789K15420
12397I1468K22083O0236J84795K6507k58377l28846k16999j2345J7506J30378
12387h3594M8219K18933L65179p9345k46028k38208k7089J47679R3312K7886l3213
$$ y = [173888, 351008, 429216, 347981, 287309, 312332, 253184, 136013, 201823, 233122, 95524, 81044, 203954, 175804, -49839, -96604, 44116, 230065, 245677, -8412, 20226, 100911, -1794, 97784, 260358, 204375, 31280, 10956, 114398, 286805, 387878, 323159, 599537, 765199, 556541, 335144, 267282, 258924, 329620, 502677, 550275, 303545, -24952, -141053, -116873, -153585, -89427, 124289, 49109, -153926, -26874, -85309, -240505, -222831, -165571, -181094, -121484, -4639, 214680, 195008, 158591, 174323, 98559, -96163, -123952, 91468, 313551, 373787, 558582, 585089, 326712, -2134, -219133, -231478, -213972, -83594, -35375, 183558, 548737, 469392, 223364, -14844, -41933, 105746, 199058, 226944, 193731]
12376A93731R8249N6433q4674j17193q4943j43791J20094K17193k7377o1531J93521
12365C59712L11409P7218j49163j59470k21890j67208l4440J40992q2603j14761
12355d0204K4132j26340l5833J7282J96880J53104J61192J39135m3905q7264l06847
12344E1332k88930j71362r2019Q9223K82638j1825j50463J48556J14934n9358
12334h7274k9895K16272J78972k8806J62910l6051k24457q8739j42468j7432Q7080
12323i888j99842q1231J37158J63703P8608n4450k9468K28304J19117l19708j68748
12312a36445p9065R5302L59872k1293j38570K4143j70293j23397J29621J15253
12302E5128J02725N3237q0397l20655j91279L4025K12441J27407j038J08323L6220
$$ y = [193731, 291980, 348413, 263739, 146546, 61603, -82188, 37906, 255099, 227722, 166191, 359712, 671121, 748339, 599176, 439706, 217816, 50608, 16168, 157160, 74557, -40204, -16072, -142412, -178245, -160963, 35917, 189021, 350213, 489348, 445443, 358179, 51332, -237598, -408960, -500979, -411756, -129118, -140943, -291406, -142850, -27916, -87274, -117169, 99103, 278075, 249269, 412179, 376128, 151671, 62932, -79536, -96968, -9888, -209730, -290961, -153803, 9900, 88508, 34058, 4590, 232894, 352011, 32303, -136445, -215510, -120208, 239664, 218371, 79801, 103944, -66349, -189746, -60125, 55128, 157853, 211090, 130693, -189962, -381241, -347216, -134775, -7368, -8406, 99917, 136137]
12291A36137m5871j65951k0935R2318K07959J22263J63637J97289k8156k64391
12281C94299k16740r6295L6643n0631j57109J06034K06579K70707J52342j3785
12271F32044n1216j23930k25152n929M9495r1651n0418j1733o3125l2131r0452
12260f4198J76915J73520k7769j86661j52817m4489k8074l4248J62551J19409
12250I4139q870k48111q2603J02980Q8469l8049j10771P7940J71954j32577p6553
12239a62052K3521N3626Q2866j81275k35791M3360K04828Q0149P4870j13854j6881
12228a46633L14209J79135J09932q5522l15424n5374L13868J67686k93191j39853
12218D8833J28459K15009j626j76185j07977j943O5480j08431k88321j10316L3005
$$ y = [136137, 90266, -75685, -96620, -4302, 203657, 325920, 489557, 686846, 658690, 394299, 177559, 81264, 117907, 67276, -89833, 16201, 222780, 493487, 645829, 632044, 580828, 456898, 231746, 225817, 275312, 183661, 133243, 121510, 58385, 26254, -64198, 112717, 286237, 258468, 71807, -81010, -125499, -153573, -187821, -25270, 94139, 85269, -162842, -245445, -142465, -53996, -92045, -202816, -124876, 47078, -85499, -162052, -138531, -84905, -2039, -183314, -419105, -375745, -170917, -90768, -15898, -129752, -146633, 167576, 346711, 456643, 371121, 55697, 323, 314191, 481877, 188686, 48833, 177292, 392301, 390675, 214490, 106513, 104570, 170050, 61619, -226702, -337018, -304013]
12207c04013k9186o4556J15899K28618J64800l6758j24438J81499J10818J31840
12197C74523J6847L9852j8884j09588k89940l18535L2016J94287q4243k26678
12187c90343n5514R1548k5859j83952j5321J94618L01241K01618o5330l34017
12177b81311k48428n0005P7445J40091n38m0014j66064q864J91548K9076N6697
12166c00367j9780o2286R1814K29652K46761N1053j46017j05413j04565P0173
12156d8975J49410J27161n5583j51635k03829j03894K16235J22853j38267l6663
12146a23187Q9312p5098p8810M8082l4201j78543j98138l3961J97591J92113J94458
12135c82K32179r010p5577k52824j79145k6372J223N682L1238J11338J72556Q9142
$$ y = [-304013, -333199, -397755, -281856, -53238, 111562, 74804, -49634, 131865, 242683, 374523, 391370, 431222, 412338, 302750, 12810, -305725, -273709, -79422, -163665, -390343, -445857, -354309, -380168, -564120, -579441, -384823, -83582, 118036, 52706, -281311, -529739, -579744, -502299, -362208, -362746, -402760, -568824, -577688, -386140, -357064, -300367, -320147, -382433, -290619, -60967, 185794, 236847, 90830, -14583, -119148, -48975, 100435, 227596, 172013, 20378, -183451, -287345, -71110, 51743, -86524, -123187, -33875, -108973, -187783, -139701, -173902, -352445, -550583, -584544, -386953, -194840, -382, 231797, 222787, 147210, -105614, -284759, -311131, -309908, -304226, -272988, -161650, 10906, 100048]
12123A00048K7390L8816O5129k82141j15230K30758K24122J44403j17739j87377
12113A28179q644M0911R9718n0910j50237n7385o4799j2515q7105O5215J12813
12102A5241j09066j05141R2776Q7005r4350p4281L3290L1518M5143Q413L8069
12091c1383O4693K15790J23934L5819J03760p7691j43233j33393j18892j08442
12081f9038l3917J18510K04131n3897p9728R4472K12507J0810l23976m60877l30933
12070g11936j5123J16424K33987J76007J10400J14009J0907P3501j06377j35816
12060a34017R7627k0457o0386J05549K14511M8582j85912k05190k6302J57986
12050h009j69667k57647N6996n6965j25100L4445K31945K19743J48315j5891j41572
$$ y = [100048, 127438, 166254, 231383, -50758, -165988, 64770, 288892, 433295, 315556, 128179, 119535, 160446, 260164, 209254, 59017, 1632, -63167, -75682, -162787, -97572, 15241, -93825, -198966, -106190, -19185, -113535, -187816, -154526, -123008, -77865, -69452, -31383, 33310, 249100, 373034, 408853, 512613, 434922, 291689, 158296, 39404, -69038, -102955, 15555, 219686, 165789, 86061, 180533, 393040, 403850, 79874, -381003, -711936, -727059, -610635, -376648, -200641, -90241, 23768, 34675, 108176, 1799, -134017, -36390, -56847, -117233, -11684, 202827, 251409, 65497, -139693, -165995, -8009, -177676, -435323, -378327, -435292, -560392, -525947, -294002, -74259, 74056, 58165, -83407]
12039h3407m6741o3325J21116Q0838l0863L2013n0017l894L6813P1407Q0181j01961
12027D2160q1697P808K6982k00741k66892j52971P3306J47243O5336R95J4220
12016c24251k33160k17090J80433N01382K45153K1704K08031q546j84487j28793
12006F0376j6398j10877k87917j72651O9474P2493J29247J82428L8757K9531q2286
11995h7823P3825J11252r436M3571n5146K62108L21940K3851p8107k36211k06072
11984A63752k72701j59162J8953q3596q3462j6340l1782m9000K46330K03935j16034
11973a79107j98520j72178j3331J17261K3117J04305J45473j33674O5484M25404
11963A84234L00680J3993j71257k10227j09758j09819j22738K27209L81045k8096
$$ y = [-83407, -130148, -193473, -72357, 8481, -22382, 9631, -40386, -44280, -7467, 63940, 144121, 42160, -39537, -31729, -4747, -205488, -472380, -625351, -552045, -404802, -339466, -338471, -324251, -557411, -774501, -594068, -92686, 152467, 174171, 382202, 373656, 189169, 60376, 43978, -66899, -354816, -527467, -457993, -385500, -256253, -73825, -35068, -5537, -87823, -13998, 97254, 87818, 131389, 76243, 338351, 660291, 684142, 606035, 369824, 163752, -108949, -268111, -249158, -332754, -416216, -432556, -464338, -513338, -267008, -63073, -179107, -377627, -549805, -563136, -445875, -422758, -318453, -172980, -306654, -241170, 184234, 484914, 498907, 327650, 117423, 7665, -102154, -224892, 2317, 383362, 355266]
11953C55266j7236R3528k08153l52676n1932P3313K4298k08637l01527K0136J28361
11942d45259J04705J65105J57535J39198J28193n7113q4013j21498j78912l2317
11932b24376N4661n6470j95127p1439K35797L76644R0904n6308O3413m1121k17031
11921d0453j76813Q0294j4075k70213j36831Q5584M3127J6116J36474N0077q6290
11910c13003n8806j17519O1412R8851j19120r3744m3029J492O5428J06299P2336
11899c39403o8317J6336R866k4497m2713K14591L23938J34005J5031j8278j78647
11888D1912j39083M3005K04730K13076o2449k41818k32268k33999M938L21371
11878h0585R3342l05704j46076O8331J10917L1271J5730K09771L72810K81375
$$ y = [355266, 338030, 431558, 223405, -129271, -181203, -107890, -83592, -292229, -593756, -573620, -445259, -340554, -175449, -17914, 121284, 249477, 192364, 108351, -13147, -192059, -224376, -169715, -226185, -421312, -492751, -256954, 119690, 210594, 154286, 217699, 176578, -40453, -217266, -136972, -151047, -421260, -558091, -472507, -429380, -413264, -276790, -226713, -313003, -371809, -489328, -427916, -329065, -448185, -541929, -584958, -583466, -518038, -411739, -339403, -407720, -391384, -381518, -406015, -448728, -234137, 89801, 223806, 238837, 220559, 41912, -97171, -54166, 150564, 363640, 301191, 59373, -172895, -406894, -401956, -80585, 12757, -292947, -439023, -370692, -259775, -228504, -212774, -3003, 369807, 651182]
11868F51182j17650k72623o4289n1171k30069j05244J97711K10436l2950j70318
11858A5015k65697l15868n0591L08720J36963p9656J78223J51445n0501j87748
11848a59695j39660P2802J28232o753K3816J55628O9555N167m2400J40074K95348
11837E42114L2150q5292j17132j46914k6047Q8789j27771j28371L536Q1653J13832
11826B30547p5720l15369l27847l44297j01676J19673l3129J126J19964J53329
11816e73399J3897K38038K94991N387R0737J3222j23401O5672J49581J63227J25060
11805D63012J56993o3122j92252j11901j73419j05525j47136j47758J25701K10858
11795A5451Q0609M7397O1125K20759J90527p4845k33205k27227j32490J2782J23543
$$ y = [651182, 533532, 260909, 196620, 145449, -84620, -189864, 7847, 218283, 185333, 15015, -250682, -566550, -617141, -308421, -171458, -251114, -72891, 78554, 28053, -159695, -299355, -226553, -98321, -105074, -81258, 74370, 143925, 149092, 106692, 246766, 542114, 574264, 488972, 371840, 224926, 198879, 287668, 159897, 31526, 35062, 116715, 230547, 154827, -160542, -488389, -832686, -934362, -814689, -847818, -846692, -726728, -573399, -559502, -321464, -26473, -21086, 69651, 82873, -40528, 25144, 174725, 337952, 463012, 620005, 556883, 364631, 252730, 79311, -26214, -173350, -321108, -195407, 15451, 96060, 143457, 204582, 425341, 615868, 541023, 307818, 80591, -51899, -39117, 84426]
11784H4426J18835J25100J596j58074j43229n1461j35077j11097o1515P1839J82826
11773g5831P8963L0460K0278n5861j72404j6774K8433P5099J21587J6231j46032
11762i5851j76755j02255k2285J22610K02936Q8386K8693k0849j21220n7391J14243
11751c9738K1006O2285L06369J47361L5765K31132m83581n66920J64596K29996
11741A08271J18248j4394P3503K09451J39059J33293j69505j82219j63965j18690
11731A33052m9290j64092j70642j81471k39950j00938P0241P9045K84119J65713
11721a74213J02482n893R4277l1745k20007k0880K21606K5615K498q8988n0323
11710a45571P8963J70047R9824l910n6445k27360q1152J7295Q3393O2910p1499
$$ y = [84426, 203261, 328361, 329957, 171883, 28654, -22807, -157884, -268981, -330496, -258657, -75831, 3132, 33592, 53870, -1991, -174395, -191169, -162736, -87637, 33950, 50181, -95851, -272606, -374861, -397146, -274536, -71600, 16786, 45479, 24630, -96590, -153981, -39738, -18732, 43553, 349922, 497283, 533048, 764180, 280599, -286321, -121725, 108271, 226519, 212125, 285628, 495079, 634138, 767431, 597926, 415707, 251742, 133052, 83762, -80330, -250972, -432443, -672393, -773331, -703090, -624045, -339926, -174213, -71731, -77624, 16653, -15092, -235099, -255979, -34373, -8758, -6260, -95248, -145571, -66608, 103439, 203263, 199353, 142908, -84452, -165604, -148309, -64916, -2006, -73505]
11699g3505J3927m8158j29206J6401o2155j47067J8194J09530R3464n8698J25689
11688a41584O9895q3708M3051o0294k6131r965O6880Q543O918J88338Q3317l631
11676A41629R9452o2564K5871K677j00189j09055j38254q1615Q0588L52042K50749
11665D61331j61038l21370l1678J77682j6132j57364o464J23124J1238j25625
11655d6296o4234q0656K14323K52018p5369k8544O433k8638k6564k0229k56007
11644a53763j73305q723q088p0529J24879M7293j12918j93168p0499J99440K12412
11633b06969J55910P4598L18996K04606K3274k3954m328k05088l06795j99238
11623a68988K9784m0339j3900j36182k5486J97886j1075j36793o897P156l3967
$$ y = [-73505, -59578, -107736, -236942, -220541, -282696, -429763, -411569, -302039, -208575, -267273, -141584, -71689, -155397, -112346, -172640, -198771, -208736, -141856, -133313, -126395, 61943, 145260, 141629, 241081, 178517, 204388, 207065, 106876, -2179, -140433, -222048, -141460, 210582, 461331, 300293, -21077, -52755, 124927, 108795, -48569, -55033, 68091, 79329, -46296, -110530, -191186, 23137, 275155, 199786, 171242, 177675, 149037, 122473, 102244, -153763, -327068, -335791, -343879, -414408, -289529, -242236, -355154, -548322, -618821, -419381, -206969, -51059, 23539, 342535, 547141, 570415, 546461, 542133, 337045, 30250, -168988, -139204, -179543, -193443, -329625, -355111, -157225, -168300, -305093, -311990, -304834, -338801]
11612c38801J82479k2227j37344K13371J19201K02780o0797l07900r5097r6630
11602c40965j34338j97141m9317K39430K79569N67q6840q1235j0679Q7238o699
11591c00410j63178j05404K34634L46101R1149j27188j82309Q019J68449L5309
11581E172j45438m0583K82371K06649m1374J15091P8941k12435k73100j76453
11571b01159k4240j35702j65152K4476M402L4480l9175K23717J32195k8170p5586
11560b49914j22355J70875J74934K6266L2347J06985J08372j41311k91558k4380
11550b09739R7646j62227k49888J05324K29970q13j29283J44563J45610Q8510
11540E9673N6549l16896j90810J76471L5065n5982m820J88966J99502m3462j61162
$$ y = [-338801, -156322, -178549, -315893, -102522, 16679, 219459, 158662, -149238, -244335, -340965, -475303, -672444, -721761, -482331, -202762, -202195, -289035, -370270, -380949, -293711, -300410, -463588, -568992, -334358, 11743, 102892, -24296, -206605, -198586, -30137, 5172, -140266, -180849, 101522, 308171, 266797, 381888, 460829, 248394, -24706, -201159, -225399, -361101, -526253, -501777, -497375, -462895, -502070, -278353, -146158, -174328, -249914, -372269, -201394, -26460, -194, 32153, 139138, 247510, 106199, -185359, -209739, -112093, -274320, -524208, -418884, -188914, -189727, -319010, -174447, -28837, 59673, 116222, -200674, -391484, -215013, -179948, -235930, -240750, -51784, 147718, 104256, -56906]
11529e6906j52784O0660J8263K8081K21416R2619J33329O0274l73335l60911N8663
11518b70631K47892M2952M0013m781j86776j61140J0975K1244j28711j93998Q3682
11507d99279J83251K02778l237k72819p973l3598L8368J82673J29918J88529J90976
11496B99587K5717n3969j28240k85728l21458j80785J89369K27075L16603K03152
11486B91323J28660k010q1162r8031j80365l49300k03622J89203J44287M6875
11476a14142O712J27664J46076Q5324M4916J96745R0382K6121j6269M2923J5531
11465F51983r5244K00436J73349M7054k49480l63950k07092k43969k05221J04529
11455a87605J04509k08048J09344K46561j65523p5128R9873J10016K1819j33617
$$ y = [-56906, -209690, -149030, -130767, -102686, 118730, 211349, 344678, 404952, 31617, -329294, -270631, -22739, 20213, 60226, 55445, -131331, -292471, -281496, -260252, -388963, -582961, -499279, -316028, -113250, -116487, -389306, -397279, -430877, -392509, -209836, -79918, 108611, 299587, 325304, 271335, 143095, -142633, -464091, -644876, -455507, -228432, 88171, 291323, 419983, 417973, 336811, 238780, 58415, -290885, -494507, -305304, -161017, -114142, -107430, 20234, 166310, 251634, 296550, 493295, 583677, 609798, 593529, 636452, 651983, 556739, 757175, 930524, 977578, 728098, 364148, 157056, -86913, -292134, -187605, -83096, -291144, -181800, 64761, -100762, -175890, -76017, 33999, 55818, -77799]
11445g7799k45525j97955R0917J24255R2922K3876J73791k8395k1927K25028L2250
11434A91438j79679p0559M11J84810K19519R1518M1569j23376m24289k13588J55766
11423a26460J26214j53804j69102J7808l3804J02829K49655O1726j3574o2556
11413a068k5349K40j35035P2750J61229R4468j60887l4912K08718R2804R2912
11402C65870M1281j83250j65257L5374q9812o534M75O5977J25745P4358N0003
11391C14230j87979l0888r2917L5609J42885K3477o3891k00460j32648j11747
11381c04329j00278J54788L31973J08708J58570P5827j01321j08557j45769j5067
11371E4545N0535J84623K70286n0460k09712j91095r7360l2203O9327J2532n6625
$$ y = [-77799, -323324, -521279, -430362, -306107, -213185, -189309, -15518, -43913, -65840, 159188, 191438, 11759, -58800, -58389, 126421, 345940, 437458, 479027, 355651, -68638, -282226, -126460, -246, -154050, -323152, -305344, -339148, -236319, 13336, 75062, 61488, -1068, -26417, -26177, -161212, -88462, 72767, 167235, 6348, -28564, 180154, 272958, 365870, 407151, 223901, 58644, 94018, 4206, -2328, -1853, 64124, 189869, 264227, 314230, 126251, 95363, 2446, 38055, 180940, 204417, 140526, -59934, -192582, -304329, -404607, -249819, 82154, 190862, 349432, 425259, 323938, 215381, 69612, 54545, 105080, 289703, 559989, 509529, 299817, 108722, 11362, -20841, 48486, 61018, 4393]
11360D393L4765Q2770q0834l5229J24260L8772j5726k8198p2535J7047J48390
11349B17875j15909j47304j24397q4358p9935J86779J47550P8086o1271o708P6213
11338H6621l7149L3505j05691k32390q9629J96392J60658O6467Q3628J64070J0494
11327C36976o8558o3521k18465p8977J16565K30789J63937j57106l30256l32952
11317d01568l14430K05006O44973K85239P7854J81968j52402l27780k16676m7246
11307f5062p3062o6308J69557K56625K57851J18780j14479r3933j0621j63454
11297B15894j68758k41483R1230K13772m1053m089n5725o6298l7447R6088J68158
11286A70289K35500r4233m18231j19735J10040m117j73237R968k791o2444J79452
$$ y = [4393, 39158, 121928, 41094, 5865, 130125, 168897, 153171, 124973, 52438, 69485, 217875, 101966, -45338, -169735, -254093, -334028, -147249, 301, 78387, 17116, 10408, 86621, 49472, 82977, -22714, -255104, -344733, -148341, 12317, 78784, 162412, 326482, 336976, 268418, 204897, -13568, -92545, 24020, 254809, 418746, 261640, -68616, -401568, -715998, -510992, 133981, 419220, 497074, 679042, 526640, 198860, -17816, -65062, -138124, -204432, -34875, 221750, 479601, 598381, 483902, 389969, 379348, 215894, 47136, -194347, -103117, 110655, 69602, 65513, 9788, -56510, -93957, 2131, 170289, 405789, 311556, -106675, -226410, -116370, -120487, -293724, -283756, -286547, -348991, -169539]
11275a69539R4223j51736j36246k1289k13204k7145J60802K28852K26519J75485
11265A66722R6838j69840k76094j81300p5942K9721j20938m9993M6404Q0175J69057
11254b85190k3423L6871J38191J2387r3536l4533N0545M4491L23922J33564j83230
11243A20059J25853J52124j28106k22484j04351q1488j10376l360J98650L00391
11233B46912R7655j5777l5736M2053l9129k23499j49880j29385p9138R4150N3619
11222a38155m7365q1331o0027r9299l7102p3481R5586N0785k01938O4914J68955
11211c58458N5427k2585k2832Q7690p820p3987J08616J156j09982m385L2252k17410
11199e32318J231K93544O0662k0778j77698l00892J5298K71427K93847J22574
$$ y = [-169539, -75316, -227052, -363298, -384587, -597791, -624936, -464134, -235282, -8763, 166722, 263560, 93720, -182374, -363674, -439616, -409895, -530833, -580826, -534422, -454247, -285190, -308613, -271742, -133551, -121164, -214700, -249233, -198688, -154197, 169725, 303289, 120059, 245912, 398036, 269930, 47446, -56905, -138393, -248769, -252129, -53479, 246912, 344567, 328790, 293054, 335107, 295978, 72479, -77401, -206786, -285924, -191774, -138155, -185520, -266851, -326878, -426177, -463279, -536760, -441174, -390389, -592327, -527413, -358458, -303031, -325616, -348448, -260758, -268578, -342565, -233949, -232793, -342775, -347160, -314908, -532318, -531087, -237543, -176881, -197659, -375357, -676249, -660951, -389524, -95677, 26897]
11189B6897J9667o1208j75177n7129M0988J45876n8136k73636k30991K9663J57431
11178d35755L8190L4562J45558J61661j17325j88325j83587P8442O877J32762
11168c26940Q0828L2525M4040l0823J48979L3473O1994K51828K76140P0494k80585
11157C61953j20023k39069j05595J67517J78393j34463l59182j07276M9013K74091
11147c4641k4228j62532m2891J17336K43001o3673o3676J46923M5858k3480J94626
11136C32623J28962P7788Q7515k0039N4928q9351j00548m2513j52446q2598J46262
11125C40583N0520j0292K3967Q5329M537n24o9145j26914k24784j66952K9912
11114f3763K5597J49788K62529j0836j47356j25980j04013q5648K28372K09971
$$ y = [26897, 46564, -14644, -189821, -246950, -205962, -60086, -118222, -391858, -622849, -593186, -435755, -397565, -363003, -217445, -55784, -173109, -361434, -545021, -466579, -459702, -326940, -246112, -213587, -169547, -200370, -51391, -17918, 44076, 295904, 572044, 642538, 361953, 241930, 2861, -102734, 64783, 243176, 108713, -250469, -357745, -308732, -34641, -58869, -221401, -264292, -146956, 96045, 32372, -31304, 115619, 161477, 137997, 332623, 461585, 539373, 626888, 606849, 661777, 572426, 471878, 429365, 276919, 194321, 340583, 391103, 380811, 404778, 490107, 494644, 494120, 424975, 298061, 73277, -93675, -63763, -38166, 111622, 374151, 363315, 215959, 89979, -14034, -99682, 128690, 338661]
11104C38661j30788j19431j18146j12510m3934q4789m8228N4627K2629L34059
11094I2150J42731n7884j24352j31188q2299k26717j41700J64596J34933J64388
11084f5342K2597j66285k2466K42568J57477J01420j35391m25154l29998R505
11074f11069J46402J66366L8820k8152j57097o1244l7021n7886J75269J41621
11064b83991P0821l6268J38639Q0486m7991J33871k516q2737p958j50951k86108
11053d74703O5644M14421L16932Q7108m838o7956J27531J36857k69878k44359
11043H6759m0000O8092Q7643R133L910j7450m1784O4218j14925k42919j09958
11032b47281J46301K50269r702r9224J11528K15542L3373n5904j27052l50066
$$ y = [338661, 207873, 88442, -29704, -142214, -186148, -270937, -319165, -264538, -241909, 92150, 234881, 176997, 52645, -78543, -160842, -387559, -529259, -364663, -229730, -65342, -42745, -209030, -231496, 11072, 168549, 269969, 134578, -290576, -620574, -611069, -464667, -298301, -259481, -287633, -444730, -505974, -542995, -600881, -425612, -283991, -213170, -249438, -110799, -30313, -78304, 55567, 53051, -29686, -37644, -188595, -474703, -409059, 5362, 322294, 409402, 404564, 336608, 464139, 600996, 331118, 86759, 46759, 114851, 202494, 211627, 215537, 198087, 156303, 220521, 105596, -137323, -247281, -100980, 149289, 139587, 40363, 151891, 367433, 400806, 344902, 217850, -132216]
11022a32216j08282L38774K95453j0995o7992j20962o1338R8410O7211j81592
11012A16471l43219R55J00877j45723p5233J30620J05519J55150J53702L6522
11002B35641j43555k75115l82728j39374J72681K19155J9069k23753K7635J08151
10992c82193Q6679K25871J71447Q9266j07979l71004k81732j76579J2735L31146
10982d02343K36430P8880R1207J10913k965j5416J22726j51076k38618M7873J56088
10971C3699l4028j40200q2280P3076K53284Q7104r5062o785l5444j02826k80538
10960c30000j65104K17928J80571J49967m5341k55290j04720P0660J13308P4529
10950i3492j75549k27595o7683k6965K9509j12706K10567K45271R4024L0522l0250
$$ y = [-132216, -240498, 98276, 393729, 382734, 314742, 193780, 132442, 230852, 298063, 116471, -226748, -225793, -124916, -270639, -345872, -215252, -109733, 45417, 199119, 235641, 92086, -183029, -565757, -705131, -532450, -313295, -294226, -517979, -490344, -382193, -295514, -69643, 101804, 191070, 83091, -287913, -569645, -746224, -733489, -402343, -165913, -87033, 4174, 115087, 112122, 96706, 219432, 68356, -170262, -122389, 33699, -329, -140529, -222809, -149733, 103551, 190655, 95593, 88808, 53364, -49462, -330000, -495104, -277176, -96605, 53362, 8021, -247269, -351989, -281329, -168021, -93492, -269041, -496636, -564319, -591284, -561775, -674481, -463914, -218643, -124619, -94097, -124347]
10939a24347p7814J39985k2599j72906j78473n1271J13634J09069J22951O0015
10929h1756n4902N6016K7604M4757J85386N4187L6759j82235j26583K40386J83874
10918C83493K6711r3954j42669j58304m0676L2430Q9823K4281j24298M6271P8537
10907A21645Q6482j24514k5347r7835r9689P4842k6354J42527K51529Q8648p5690
10896C16244k0143j65714j4231K13058O6935m9176K866L7020j80584j26261m031
10885G5983m554P6149j6352l8841J52413J19521n789m8464j98089L307p0358k02651
10873a57725k00322o4832N3396K37833K05711M9508n1461o8216l2762m4002J42384
10862F9512J7125k90917k76493r9118J39739K07643J16220K24385K61158K14652
$$ y = [-124347, -202161, -62176, -84775, -257681, -436154, -487425, -373791, -264722, -141771, -81756, -136658, -80642, -53038, -8281, 177105, 231292, 268051, 85816, -40767, 199619, 383493, 410204, 316250, 173581, 15277, -25399, 7031, 96854, 121135, -3163, 43108, 121645, 208127, 83613, 58266, -39569, -139258, -64416, -90770, 51757, 303286, 391934, 316244, 296101, 130387, 116156, 329214, 396149, 346973, 349839, 386859, 206275, 80014, 75983, 71429, 147578, 131226, 92385, 244798, 364319, 358530, 310066, 111977, 115284, 44926, -157725, -358047, -422879, -369483, -131650, 74061, 123569, 72108, 3892, -28870, -72872, 69512, 86637, -204280, -480773, -579891, -440152, -232509, -116289, 108096, 369254, 583906]
10852E83906r6507j54595k0054j88696k37288p6969M1052L7586J14012Q5341n9613
10841B8175o1019l2819J6016K30642L39437n6519k13321k04789j74522J14733
10831a3986K16217P8393J5447j60653o3661N5794j12515P2005k2842q5471l3192
10820e4464k7425n312r3858j53711p831J37802J45742P0813m2J07859J79218J45134
10808D43925j76515l30608n445K72200Q0888J07085J21851n6545m7716k91330
10798A17790j37081j25055j9018K27904R7500R2812q2463r5078K20022L08952
10788F06285M7390j69946j18747r8127j33578k08833l44180j68915J15383K33565
10778b39703K67607J79298m7590p6796K38898L21491O8253k14577k35445j57754
$$ y = [583906, 487399, 332804, 312750, 124054, -113234, -190203, -149151, -111565, 2447, 87788, 28175, -32844, -65663, -49647, 180995, 520432, 463913, 250592, 45803, -128719, -13986, 202231, 280624, 296071, 135418, 71757, 127551, 15036, 87041, 64199, -21272, -54464, -81889, -87201, -181059, -334770, -342601, -204799, -59057, 11756, 11714, 119573, 298791, 443925, 267410, -63198, -68643, 203557, 284445, 391530, 513381, 456836, 409120, 117790, -19291, -144346, -163364, 64540, 162040, 254852, 172389, 77311, 297333, 606285, 653675, 483729, 364982, 266855, 133277, -75556, -419736, -588651, -473268, -239703, 27904, 207202, 159612, 82816, 321714, 643205, 711458, 496881, 261436, 103682]
10768A03682j62409R861l8397l5622J29805J54005J5646p5128m8235k0335m7816
10757a4943j26878P5352n8912k37192J98134J27600k11116o4020Q9352J58816
10747f3807J18589R0979J7009j11332k00797j88170J24939j20658j08921K0523
10737d21646o7082J19979L98642K61249j3593j42127j87614p4142N8709M8600
10727a9025j10392n4705P5706o4540k63803k36013O9102K71795M58435K22318
10717C48878Q0463K6295J20693K6192j75322j30140k4858N8801J20620p3200k00877
10706A77545O117J40097j20975j24756Q5656M7211M0679p6130k21154m4454J14389
10695B4225R0289J24624K64631J25786l8296p3064q8097K204l3043r6294l16710
$$ y = [103682, -58727, -48866, -87263, -122885, 6920, 160925, 176571, 101443, 53208, 32873, -14943, -141821, -66469, -125381, -362573, -164439, -36839, -247955, -311975, -222623, -63807, 54782, 145761, 162770, 51438, -149359, -337529, -212590, -333248, -442169, -421646, -488728, -368749, 29893, 291142, 277549, 135422, -52192, -126334, -67625, -19025, -129417, -184122, -108416, -172956, -436759, -672772, -603670, -331875, 126560, 348878, 429341, 455636, 576329, 602521, 427199, 297059, 272201, 331002, 451622, 378422, 177545, 183662, 323759, 202784, 78028, 163684, 210895, 251574, 175444, -45710, -90164, 24225, 114514, 239138, 503769, 629555, 591259, 518195, 430098, 432302, 399259, 302965, -13745]
10684a3745k83718l3358J84931K63839K62958k0382k77686j61838n8430j09186
10674b46615j1362L9769l3232N051k1319J04148n359k92361k33057K36906O11100
10663A53669L12917p816j88283k75995k03810J36101K22144J48908R5308j42764
10653B50379j52665J9404L3774M2557L6274J17145j47634l66380k23690L8935
10643c51901K18031K79377J04668r6517j40766k8769k0031J5253O076o5321M2593
10632c7307O3167K03586L42709R5820k5729n7791n4906j61153k83932L2514M9394
10621A66372p7834r0769l234o1689R9590K18836P5077r3518k39906r9597L8355
10610f8317j66990k80782J00195M10247K58348j12091k31720J3498K06034J05846
$$ y = [-13745, -297463, -330821, -145890, 117949, 380907, 360525, 82839, -78999, -137429, -246615, -257977, -218208, -251440, -246389, -267708, -163560, -168919, -461280, -694337, -457431, 153669, 466586, 458770, 270487, -5508, -209318, -73217, 148927, 297835, 393143, 250379, 97714, 117118, 150892, 193449, 229723, 346868, 199234, -167146, -390836, -351901, -133870, 145507, 250175, 153658, 12892, -15877, -35908, -20655, -14579, -79900, -37307, 25860, 229446, 572155, 667975, 642246, 584455, 529549, 368396, 84464, 116978, 166372, 88538, -2231, -5465, -67154, 32436, 251272, 326349, 232831, -7075, -106672, -68317, -235307, -516089, -415894, -5647, 252701, 140610, -91110, -77612, 128422, 234268]
10600B34268L6502j39277l40054k00238n7857k5002P81L15948K87908N1493j8496
10589A45976j19861j16441j31178k6085J58182q1829n68J17353J12129m5339k27172
10578b14833J67619J6107l1102K71738J18393l0921J3417j16048k15683Q589J35189
10567A22465K16885R6885k59062k90249n5756M5830r6432k29969j70050J5276
10557f04177K79535J55992o3340k6758P3914R6082M4512j43952k67810l8066J01280
10546c92788Q1424J10317Q1451p9489q7852R6970J42327j9308J11930J61666J63897
10535C70545J21589l7800l3999n2161j78020k72097P2534J54302K55186L2744
10525D32823k15039k0671J18531M8681j82017J3489R351j29500p0804R7410j5108
$$ y = [234268, 270770, 131493, -208561, -408799, -466656, -491658, -490877, -174929, 112979, 164472, 145976, 26115, -90326, -221504, -247589, -89407, -171236, -171804, -54451, 57678, 12339, -214833, -47214, -31107, -62209, 209529, 327922, 297001, 310418, 194370, -21313, -12724, 122465, 339350, 436235, 177173, -113076, -168832, -123002, -219434, -449403, -619453, -604177, -324642, -168650, -231990, -258748, -184834, -88752, -44240, -188192, -456002, -494068, -392788, -311364, -201047, -119596, -199085, -286937, -189967, -47640, -66948, 44982, 206648, 370545, 492134, 454334, 420335, 368174, 190154, -81943, -9409, 144893, 400079, 432823, 217784, 197113, 315644, 364325, 182308, 195797, 205148, 75648, 4844, 102254, 87146]
10514H7146K0111J59371p6146j15069k10315j79574n0378J11456J96549J31463
10504G4614r9850k25474j65283j12096N9990n8p2996M1076K63945K90833K20593
10493B75294j17979j00651n1798k01520p0275K71763K88469j21407k21099M075
10483d5128K24543K60463l2103q6953r3602r9573J9697j06644j94001K0006O6630
10472f6665R5475J19274n7477m452o5701k10852j05146j11800j29945J38733K04601
10461a93955n9470P1741J54774J11596l6867j13233n2848j0263J15685k08133
10451b20973k42922N4418J55788K32034Q3218Q8175o7451q6729J1133o2060O8532
10440A3163J0153j57955j26415k3557k9182J12753j05449k55844l4016K36837
$$ y = [87146, 107257, 266628, 190482, 75413, -134902, -314476, -364854, -253398, -56849, 74614, -25236, -250710, -415993, -528089, -468099, -468157, -541153, -500077, -236132, 54701, 275294, 157315, 56664, 4866, -196654, -266929, 4834, 293303, 171896, -49203, -45128, 179415, 439878, 407775, 320822, 227220, 127647, 147344, 40700, -153301, -133295, -66665, 28810, 148084, 90607, 86155, 20454, -190398, -295544, -407344, -537289, -398556, -193955, -253425, -181684, -26910, 84686, 47819, -65414, -118262, -128525, -12840, -220973, -463895, -409477, -253689, -21655, 61563, 149738, 82287, -4442, 6691, -55369, 13163, 23316, -134639, -261054, -284611, -313793, -201040, -306489, -562333, -596349, -359512]
10430c59512M78923L89338P2525k52062l18385k84499j2940J94866K17458m6592
10420G9120j42800q0861m429M9342P2287O2768o2691K1746L3044m1627n5852o1821
10408a31774j41067j91900J96322J71040n3561j30815j10879P3653j17392k06539
10398f42912j3370J41253J67093J60356J36622R5448J96915Q9602Q6788j18165
10388B99630j44464N4865K9058m0067l6774j56743O5776J96684J2673J00605J12377
10377D93620J6881k28275p5576K77012J89843j65188j48654j03363k44489m17662
10367d05851j68667K81956M58690K50299j42735j20710J4716J07476L240k43238
10357C5176p1396Q8109O3098K39426J83089L0077J5852k23627k76908k24886n6083
$$ y = [-359512, 119411, 508749, 581274, 329212, 10827, -273672, -286612, -91746, 125712, 79120, -63680, -144541, -148970, -99628, -27341, 35427, -27264, -5518, 27526, -14101, -69953, -131774, -272841, -464741, -268419, -97379, -150940, -281755, -392634, -318981, -436373, -642912, -656282, -515029, -347936, -187580, -50958, 44490, 241405, 331007, 417795, 299630, 155166, 210031, 239089, 199022, 162248, 5505, 71281, 267965, 280638, 381243, 493620, 510501, 282226, 206650, 483662, 673505, 508317, 359663, 256300, 11811, -405851, -574518, -292562, 166128, 416427, 273692, 152982, 167698, 275174, 278414, 35176, -36220, 51889, 114987, 354413, 537502, 567579, 583431, 359804, 82896, -141990, -198073]
10346a98073k02904k22872J27078L13161J34515r4980q3747N9248N8867j11742
10336b21449n0420J40264k7469j24244J91993P6607j01717j43195j19810r3399
10326d72839J14593K06528J56256J54105k43186k99746R6124J17434J78279J53628
10316A61176j63602p168k438l02409j88103J16283L8895r2212l4547j1112L4485
10305d50752Q2698J28027J38209N582m4487K12053O6287k63535k5438P9797j51798
10294b23357o0023K45228K48221K5186O0834o6918k31287J26716J42240p4675
10284A92165l37088k09551j1627O6041j29O1937J75403J16764r6984m0929p4576
10273a58574o3591J3758K8418J12338j89009j2078J43341j151J20701L38227J24041
$$ y = [-198073, -400977, -623849, -496771, -183610, -49095, -144075, -227822, -168574, -109707, -221449, -271869, -131605, -159074, -283318, -91325, -14718, -116435, -259630, -379440, -472839, -358246, -151718, 4538, 158643, -84543, -384289, -288165, -170731, 7548, 161176, -2426, -9594, -12032, -314441, -502544, -386261, -347366, -439578, -474125, -485237, -450752, -368054, -240027, -101818, -96236, -140723, 71330, 137617, -125918, -151356, -71559, -223357, -283380, -38152, 210069, 235255, 296089, 229171, -2116, 124600, 266840, 192165, -144923, -354474, -366101, -300060, -300189, -238252, -62849, 53915, -43069, -83998, -158574, -222165, -208407, -179989, -67651, -256660, -268738, -125397, -126548, -5847, 332380, 456421]
10262D56421P8831J21116o4494l0925l35596k26793l2879L9214R2288O1688K5577
10251A84448k2331o9374o1638R0983R2175J1864j02984q8924j338j24385j13652
10240b05156j51023n1075O9633q489k71377k47997J17207K44894K10891Q166p8721
10229c63047J16384M7403p4603J06629J17980J77355J41390j10370l5591K8985
10219A52515j3644k46439k67924k0506p7323k2207j42013j21242Q5965K14631
10209d58187J39186R1124J35520L6006J08047J33419R021J39312R8485o773j66380
10198B58780k74525j34790P0906Q1831P7310Q5009k776k3597R6413m0946j49465
10187D4150j25028k14231r6509K69025M10858K83087L9129j9449K05268J24432
$$ y = [456421, 535252, 656368, 591874, 560949, 225353, -1440, -34319, 4895, 97183, 158871, 184448, 162117, 92743, 31105, 122088, 214263, 226127, 123143, 34219, 32881, -91504, -205156, -356179, -407254, -337621, -346110, -617487, -865484, -748277, -503383, -292492, -284326, -363047, -246663, -199260, -273863, -167234, -49254, 128101, 269491, 159121, 123530, 152515, 138871, -107568, -375492, -395998, -473321, -495528, -637541, -758783, -672818, -458187, -319001, -227877, -92357, -56351, 51696, 185115, 194136, 333448, 431933, 425160, 258780, -15745, -150535, -79629, 2202, 79512, 164521, 161745, 138148, 234561, 193615, 44150, -80878, -295109, -391618, -122593, 288265, 571352, 610481, 591032, 796300, 920732]
10177I20732o2506j26329j12036l03724l69041k6491Q7755k80241p0709K29615
10167a12975J27830k8247k90731j97947J33264M61859L53595J37650Q3650j71655
10157D96293l11264l17902j80412P888K38k1317K87219K75588J54579r251j69595
10146B12064O397J6021p198J62229J59807J4996n1528l7180p6131q8328j52610
10135A58539r9573N1307P3451m725K03780l126j43043j57314j63732j25924J65776
10124d4584L15235K5532k05722j75591q6896l7903M8878J10195O5141J58048K56591
10113D28924J56365n360j63218j55227r3665o770j36999J4379j8488j04159q6672
10102a70890r3708N6045L0560N0351K827L0174O4q9331k603L3697K18134O2926
$$ y = [920732, 858226, 731897, 619861, 316137, -52904, -79395, 8360, -271881, -342590, -112975, 14855, -13392, -304123, -502070, -368806, 93053, 446648, 584298, 667948, 496293, 185029, -132873, -313285, -305397, -305159, -326476, -39257, 236331, 390910, 381659, 212064, 218461, 234482, 227284, 389513, 549320, 564316, 512788, 475608, 399477, 311149, 158539, 58966, 110273, 183724, 178999, 382779, 379653, 236610, 79296, -84436, -210360, -44584, 270651, 296183, 90461, -85130, -172026, -209929, -161051, -50856, 14285, 172333, 428924, 585289, 579929, 416711, 261484, 167819, 161049, 24050, 38429, 19941, -84218, -170890, -264598, -208553, -177993, -127642, -124815, -94641, -94577, -183908, -186511, -152814, 65320, 128246]
10090A28246Q2802R3210r329l0623J39455K92329J03531r9607j18095q2766L5493
10079E34646L42362L31476Q2097q1866k7293k13521m49578j72868l23404j27284
10069a05233Q8686R5678R8505K9664r6008k16850N210J29932K71533K99031J72106
10058G72254R7271L38696L37413n5051k08564q6470j32372k66735l32452l46271
10048A17719r8727J61024J44764M7482J11380J54081j763k7899L1926K5660r0652
10037E74995O020O3377P3691J75085L56361M70824N11694N62851O37323J096812
10027D529033J558161K182493L384355N014478O371889K522646m790472n998474
10019A4774109m082385k629677j795779j445534r58147p56209n93102k69787j53373
$$ y = [128246, 211048, 304258, 294929, 264306, 403761, 696090, 799621, 700014, 581919, 499153, 534646, 877008, 1208484, 1290581, 1208715, 1181422, 967901, 518323, 345455, 22051, -105233, -16547, 79131, 177636, 207300, 111292, -105558, -100348, 29584, 301117, 600148, 772254, 869525, 1208221, 1545634, 1490583, 1282019, 1195549, 1063177, 796442, 463990, 117719, 18992, 180016, 324780, 372262, 483642, 637723, 635960, 608061, 639987, 665647, 574995, 581015, 644392, 718083, 893168, 1249529, 1720353, 2232047, 2794898, 3432221, 4529033, 6087194, 8269687, 11654042, 16668520, 23040409, 25563055, 20772583, 14774109, 10691724, 8062047, 6266268, 4820734, 3862587, 3106378, 2513276, 2243489, 2090116]
10010B090116j63853l23006k47326O1707m7783k20626j55188l02914k25978k24739
10000B40410j57253O9358L33637L30021J36522r1615k64274j71977k80207j91554
9990d6932O2992J14419n2534M362o202j37515j6507J54397N3310l1959J7302J8926
9978A34059j29341j98644m6414J73977J89057j38673j0241K58082J37029K0365
9968C89256J65146m9593k40928k02243k49846l1406P9097n2747K13498K59777
9958B80011j4409n4902N0997K6534o3949j17481j03458O1308J77546J53367j2942
9947C82622j00311k12803k00806N6557Q707q7350k5259Q480J2428J85239J12546
9936A40050p5045J30249M6640k57418k30476J65760L39667J30904k77990j05562
$$ y = [2090116, 1926263, 1603257, 1355931, 1417638, 1369855, 1149229, 994041, 691127, 465149, 240410, 83157, 152515, 486152, 816173, 952695, 861080, 596806, 424829, 144622, -46932, 16060, 130479, 77945, 82307, 76105, -61410, -77917, 76480, 129790, 97831, 115133, 134059, 4718, -193926, -240340, -66363, 122694, -15979, -26220, 231862, 368891, 389256, 554402, 504809, 263881, 61638, -188208, -219614, -140517, -193264, 20234, 280011, 265602, 210700, 261697, 288231, 224282, 106801, 3343, 64651, 242197, 395564, 382622, 282311, 69508, -131298, -74741, -66034, -153384, -178643, -170163, -157735, 27504, 140050, 65005, 195254, 241894, -15524, -246000, -80240, 259427, 390331, 112341, 6779]
9926F779O9902q7026k09034q5780J03413P559m1230J65385K46269K4007m6493
9915A53751L0729j95509j21005j8735J60297J57380j11709J75666J39800l140
9905C67525M8722j6082O116L2549K13964n3410l23336k64403j00306m8194j33589
9894b70444J4185j3367m977J07922r1072m2K48077R2997k5067N6797N5640J26891
9882B97540J6572k32423j02918q7635r3847P6037p8493j12786n0614J12403R6211
9871a59953K2250J18276l4143J9899J67098k8367P588J52219P6639k08877n50266
9860d17637m83422L2524J08494J08812j72008k81604J16088L38831K10639m2988
9850d82271l7642K02178K08967J28463J91081M6269j21381j04930r923q8288k12265
$$ y = [6779, 76681, -10345, -219379, -305159, -201746, -194187, -235417, -70032, 176237, 200244, 153751, 184480, -11029, -132034, -150769, 9528, 166908, 55199, 230865, 370665, 367525, 416247, 400165, 406281, 438830, 652794, 599384, 276048, 11645, -88661, -136855, -270444, -256259, -269626, -274603, -166681, -257753, -257795, -9718, 83279, 58212, 115009, 170649, 297540, 314112, 81689, -21229, -108864, -202711, -126674, -205167, -317953, -368567, -256164, -159953, -137703, -19427, -53570, -33671, 133427, 105060, 112648, 264867, 341506, 132629, -417637, -901059, -868535, -760041, -651229, -823237, -1104841, -988753, -649922, -439283, -482271, -519913, -317735, -108768, 19695, 210776, 257045, 135664, 30734, 20811, -67477, -279742]
9839b79742j34018J39614K00080J11529J7947L9633J4717n221j8913J05174r411
9828A81389n7786K8061j57074l38442j95474n2645p3194J27971J98819N8911j59555
9817d39019j03083J82880J91184j12967r3429j11529m2518J85897M05400M7777
9807A10593k27390l9682N0211r2322j91080j51942Q9995L48006L29730L7693r8278
9796A65534j35957j51502J1989P0611J61108k8549o7545J19986l2794j74944j18036
9785a80099p4371j06663Q611K48814J51685r1994o0989p8675j52829p826k6265
9774c70601k1705N1128P2447N0221j84796j42199Q8207J18431J53115J96962l76472
9763c65262l03312K86349M15268R9556l6786J42158R8927p2826j25472r8069k11480
$$ y = [-279742, -413760, -274146, -74066, 37463, 55410, 95043, 109760, 104539, 85626, 190800, 181389, 123603, 151664, -5410, -343852, -539326, -591971, -665165, -537194, -338375, -279464, -439019, -542102, -359222, -168038, -281005, -374434, -485963, -528481, -342584, 62816, 110593, -116797, -156479, -106268, -198590, -389670, -541612, -451617, -103611, 226119, 263812, 165534, 29577, -121925, -109936, -39325, 121783, 93234, 25689, 145675, 112881, -62063, -180099, -254470, -361133, -352522, -103708, 47977, -44017, -105006, -183681, -336510, -344336, -370601, -392306, -341178, -268731, -218510, -403306, -545505, -457298, -338867, -185752, 11210, -365262, -668574, -382225, 33043, 132599, 95813, 237971, 336898, 264072, 138600, 40531, -170949]
9752a70949j30207n0360m3260J3195j66387l1366J72477K45242K1085N1402K19161
9741A30033J50082N315P4650J72225N956L0687P4315j6069q5585l26498l73139
9730a58028j35260k00020J47643J65784K35309K73526J34993J47399J38066J25370
9720H74782q3885l29273j73910L4389j49391l46240j85990K11042L05773J91708
9710C49005N2975Q9164K34061n3752l14569l36000j67125J45849J83132J42100
9700C24840p7645k03404N1366K33117K41805J03590n4698k37811k09418J26974
9690B98716R2548q8331j59482J5358L9053j68808j51961r6560j35351N2014K22355
9679h0449k1112k05430l40544k57166j11766J93961K02761j3482N5314K32169
$$ y = [-170949, -301156, -351516, -394776, -381581, -547968, -579334, -406857, -161615, -140530, -89128, 130033, 280115, 285430, 360080, 532305, 538261, 568948, 643263, 627194, 541609, 215111, -158028, -293288, -493308, -345665, -179881, 55428, 328954, 463947, 611346, 749412, 874782, 790897, 461624, 287714, 322103, 172712, -173528, -359518, -148476, 157297, 349005, 401980, 491144, 725205, 671453, 356884, 20884, -146241, -392, 182740, 324840, 247195, 43791, 95157, 328274, 570079, 673669, 618971, 381160, 171742, 298716, 391264, 302933, 143451, 158809, 197862, 29054, -122907, -219467, -354818, -302804, -80449, -101561, -306991, -647535, -904701, -1016467, -822506, -619745, -633227, -577913, -345744]
$$ [...]
##END NTUPLES=NMR SPECTRUM
##END=
