##TITLE=C13_SL62-I2-A-isomer
 CDCl3,  20400 sc

 27.07.2021
##JCAMPDX= 6.0         $$ Bruker NMR JCAMP-DX V2.0
##DATA TYPE= NMR SPECTRUM
##DATA CLASS= NTUPLES
##ORIGIN= UXNMR, Bruker Analytische Messtechnik GmbH
##OWNER= root
$$ XWIN-NMR		Version 3.5
$$ Thu Jul 29 09:05:55 2021 Russian Standard Time (UT+4h)  she@DPX200
##.OBSERVE FREQUENCY= 50.327896
##.OBSERVE NUCLEUS= ^13C
##.ACQUISITION MODE= SIMULTANEOUS
##.ACQUISITION SCHEME= undefined
##.AVERAGES= 20400
##.DIGITISER RES= 17
##SPECTROMETER/DATA SYSTEM= spect
##.PULSE SEQUENCE= zgpg30
##.SOLVENT NAME= CDCl3
##.SHIFT REFERENCE= (INTERNAL, CDCl3, 0, 222.697)
##AUDIT TRAIL= $$ (NUMBER, WHEN, WHO, WHERE, WHAT)
$$ ##TITLE= Audit trail, XWIN-NMR		Version 3.5
$$ ##JCAMPDX= 5.01
$$ ##ORIGIN= Bruker BioSpin GmbH
$$ ##OWNER= she
$$ F:/spectra/data/she/nmr/c13/1/pdata/1/auditp.txt
$$ ##AUDIT TRAIL=  $$ (NUMBER, WHEN, WHO, WHERE, WHAT)
(   1,<2021-07-29 09:04:22.50 +0400>,<she>,<DPX200>,
      <created by zg, POWCHK disabled, PULCHK disabled
       terminated by command 'halt'
       configuration hash MD5:
       00 E9 B6 7A A2 85 ED C7 34 08 36 98 17 FE 4E 26
       data hash MD5: 32K
       C5 3A BF 6A F4 FF 99 0B 1E 3C FA 94 0F CB 0D B1>)
(   2,<2021-07-29 09:04:28.21 +0400>,<she>,<DPX200>,
      <Start of raw data processing
       efp BC_mod = 2 LB = 1 FT_mod = 6 PKNL = 1 PHC0 = -340.0174 PHC1 = 35.36238 SI = 32K 
       data hash MD5: 32K
       D2 4F F8 EF 15 93 D9 42 93 1C 33 E2 DF 91 1F 79>)
(   3,<2021-07-29 09:04:34.71 +0400>,<she>,<DPX200>,
      <abs ABSG = 5 
       data hash MD5: 32K
       18 4E 8F 9C 8E 31 97 15 06 F3 8E 65 A2 98 2C 2C>)
(   4,<2021-07-29 09:05:04.85 +0400>,<she>,<DPX200>,
      <pk PHC0 = 0.6285753 PHC1 = 0 
       data hash MD5: 32K
       5F 8C 75 93 29 69 95 21 89 56 02 69 37 7E 75 AC>)
(   5,<2021-07-29 09:05:08.96 +0400>,<she>,<DPX200>,
      <abs ABSG = 5 
       data hash MD5: 32K
       09 B7 35 E5 28 26 ED D8 82 33 AB CA 8E DC 40 9E>)
$$ ##END=
$$ 
$$ hash MD5
$$ 86 AB 41 A4 E4 2D 89 29 8B 45 12 8F 59 59 6C 8C
##$RELAX= 
##$RELAX= 
##$RELAX= 
##$RELAX= 
##$RELAX= 
##$RELAX= 
##$RELAX= 
##$RELAX= 
$$ Bruker specific parameters
$$ --------------------------
##$DU= <F:/spectra>
##$EXPNO= 1
##$NAME= <c13>
##$PROCNO= 1
##$TYPE= <nmr>
##$USER= <she>
##$AMP= (0..31)
100 100 100 100 100 100 100 100 100 100 100 100 100 100 100 100 100 100 
100 100 100 100 100 100 100 100 100 100 100 100 100 100 
##$AQSEQ= 0
##$AQ_mod= 1
##$AUNM= <au_zg>
##$AUTOPOS= <>
##$BF1= 50.322709
##$BF2= 200.13
##$BF3= 50.322709
##$BF4= 500.13
##$BF5= 500.13
##$BF6= 500.13
##$BF7= 500.13
##$BF8= 500.13
##$BYTORDA= 1
##$CFDGTYP= 0
##$CFRGTYP= 5
##$CHEMSTR= <none>
##$CNST= (0..31)
1 1 145 1 1 1 1 1 1 1 1 1 1 1 1 1 1 1 1 1 1 1 1 1 1 1 1 1 1 1 1 1 
##$CPDPRG= <waltz16>
##$CPDPRG1= <>
##$CPDPRG2= <waltz16>
##$CPDPRG3= <>
##$CPDPRG4= <mlev>
##$CPDPRG5= <mlev>
##$CPDPRG6= <mlev>
##$CPDPRG7= <mlev>
##$CPDPRG8= <mlev>
##$CPDPRGB= <>
##$CPDPRGT= <>
##$D= (0..31)
$$ [...]
##$SUBNAM4= <"">
##$SUBNAM5= <"">
##$SUBNAM6= <"">
##$SUBNAM7= <"">
##$SUBNAM8= <"">
##$SUBNAM9= <"">
##$SW= 239.972175391363
##$SWIBOX= (0..15)
0 1 3 0 0 0 0 0 0 0 0 0 0 0 0 0 
##$SW_h= 12077.2946859903
##$TD= 32768
##$TD0= 1
##$TE= 0
##$TE2= 300
##$TE3= 300
##$TEG= 300
##$TL= (0..7)
120 120 120 120 120 120 120 120 
##$TP= (0..7)
150 150 150 150 150 150 150 150 
##$TP07= 0
##$TPNAME0= <>
##$TPNAME1= <>
##$TPNAME2= <>
##$TPNAME3= <>
##$TPNAME4= <>
##$TPNAME5= <>
##$TPNAME6= <>
##$TPNAME7= <>
##$TPOAL= (0..7)
0.5 0.5 0.5 0.5 0.5 0.5 0.5 0.5 
##$TPOFFS= (0..7)
0 0 0 0 0 0 0 0 
##$TUNHIN= 0
##$TUNHOUT= 0
##$TUNXOUT= 0
##$USERA1= <user>
##$USERA2= <user>
##$USERA3= <user>
##$USERA4= <user>
##$USERA5= <user>
##$V9= 5
##$VALIST= <valist>
##$VCLIST= <CCCCCCCCCCCCCCC>
##$VD= 0
##$VDLIST= <DDDDDDDDDDDDDDD>
##$VPLIST= <PPPPPPPPPPPPPPP>
##$VTLIST= <TTTTTTTTTTTTTTT>
##$WBST= 1024
##$WBSW= 4
##$XGAIN= (0..3)
0 0 0 0 
##$XL= 0
##$YL= 0
##$YMAX_a= 124140592
##$YMIN_a= -30622768
##$ZGOPTNS= <>
##$ZL1= 120
##$ZL2= 120
##$ZL3= 120
##$ZL4= 120
##$ABSF1= 222.6973
##$ABSF2= -17.29953
##$ABSG= 5
##$ABSL= 3
##$ALPHA= 0
##$AQORDER= 0
##$ASSFAC= 0
##$ASSFACI= 0
##$ASSFACX= 0
##$ASSWID= 0
##$AUNMP= <proc_1d>
##$AZFE= 0.1
##$AZFW= 0.5
##$BCFW= 0
##$BC_mod= 2
##$BYTORDP= 0
##$COROFFS= 0
##$CY= -3
##$DATMOD= 1
##$DC= 0
##$DFILT= <>
##$DTYPP= 0
##$F1P= 0
##$F2P= 0
##$FCOR= 0.5
##$FTSIZE= 32768
##$FT_mod= 6
##$GAMMA= 0
##$GB= 0
##$INTBC= 1
##$INTSCL= 4.134877e-10
##$ISEN= 128
##$LB= 1
##$LEV0= 0
##$LPBIN= 0
##$MAXI= 10000
##$MC2= 0
##$MEAN= 0
##$ME_mod= 0
##$MI= 0.1934396
##$NCOEF= 0
##$NC_proc= 2
##$NLEV= 6
##$NOISF1= 120.0001
##$NOISF2= 80.00006
##$NSP= 0
##$NTH_PI= 0
##$NZP= 0
##$OFFSET= 222.6973
##$PC= 1.4
##$PHC0= -339.3888
##$PHC1= 35.36238
##$PH_mod= 1
##$PKNL= yes
##$PPARMOD= 0
##$PSCAL= 0
##$PSIGN= 0
##$REVERSE= no
##$SF= 50.3227279136918
##$SI= 32768
##$SIGF1= 140
##$SIGF2= 120
##$SINO= 11.81781
##$SIOLD= 32768
##$SREGLST= <13C.CDCl3>
##$SSB= 0
##$STSI= 32768
##$STSR= 0
##$SW_p= 12077.2946859903
##$SYMM= 0
##$S_DEV= 0
##$TDeff= 32768
##$TDoff= 0
##$TI= <>
##$TILT= no
##$TM1= 0
##$TM2= 0
##$TOPLEV= 0
##$USERP1= <user>
##$USERP2= <user>
##$USERP3= <user>
##$USERP4= <user>
##$USERP5= <user>
##$WDW= 1
##$XDIM= 32768
##$YMAX_p= 348784386
##$YMIN_p= -2529329
$$ End of Bruker specific parameters
$$ ---------------------------------
##NTUPLES= NMR SPECTRUM
##VAR_NAME=  FREQUENCY,     SPECTRUM/REAL,   SPECTRUM/IMAG
##SYMBOL=    X,             R,               I
##VAR_TYPE=  INDEPENDENT,   DEPENDENT,       DEPENDENT
##VAR_FORM=  AFFN,          ASDF,            ASDF
##VAR_DIM=   32768,         32768,           32768
##UNITS=     HZ,            ARBITRARY UNITS, ARBITRARY UNITS
##FACTOR=    0.368581032318806, 1,           1
##FIRST=     11206.7354408978, 0,            0
##LAST=      -870.559245092494, 0,           0
##MIN=       -870.559245092494, -2529329,    0
##MAX=       11206.7354408978, 348784386,    0
$$ Real data points
##PAGE= N=1
##DATA TABLE= (X++(R..R)), XYDATA
$$ [...]
$$ plain form
15929 1063693 1372616 1270291 1100923 1267655 1460532 1610438 1193477 487263 -76299
15920 -76299 -696133 -1008153 -416270 250745 579772 818618 980109 688100 425753 769724
15910 769724 1252112 1424690 1014343 839314 663243 463924 676867 1035675 1109130 817541
15900 817541 577764 179079 -121990 -100085 138526 15044 -236157 -257972 -284115 -129105
15890 -129105 41220 379941 216367 -103720 -157298 -6141 10566 -295362 -195579 53573
15880 53573 65258 333826 662793 412268 -82687 43599 344784 389658 -85197 -270772
15870 -270772 -183370 -105996 -64439 -399466 -946211 -1326567 -1145317 -1315842 -1228729 -978770
15860 -978770 -1073705 -790469 -655467 -945446 -1122988 -1143648 -914964 -1060808 -1403783 -1423916
$$ packed form
15929A063693L08923j02325j69368J66732J92877J49906m16961p06214n63562
15920g6299o19834l12020N91883O67015L29027K38846J61491k92009k62347L43971
15910G69724M82388J72578m10347j75029j76071j99319K12943L58808P3455k91589
15900H17541k39777l98685l01069K1905K38611j23482k51201k1815k6143J55010
15890a29105J70325L38721j63574l20087n3578J51157J6707l05928R9783K49152
15880E3573J1685K68568L28967k50525m94955J26286L01185M4874m74855j85575
15870b70772Q7402P7374M1557l35027n46745l80356J81250j70525Q7113K49959
15860i78770r4935K83236J35002k89979j77542k0660K28684j45844l42975k0133
$$ plain form
15850 -1423916 -1414014 -952529 -366136 -416913 -374899 -168041 -189950 -237714 -451712 -759338
15840 -759338 -893904 -1126181 -1067703 -305822 103704 124087 93555 85760 181789 -28012 -521767
15829 -521767 -1085524 -1141202 -426760 -83032 15151 -207015 -329658 -127145 115944 279758
15819 279758 71621 -352685 -293638 -159025 -106233 -399486 -743196 -373974 -40228 60527
15809 60527 343795 750524 828198 438267 251106 38464 -453171 -230989 -202092 -322784
15799 -322784 -78469 82213 24965 85035 99633 9846 -362778 -755559 -407533 -76964
15789 -76964 -66763 11679 242325 393843 304252 203058 91547 -57487 79127 -14923
15779 -14923 -274562 -69395 336199 276834 -156032 -422626 -381247 -153590 -142036 -118570
$$ packed form
15850a423916R902M61485N86393n0777M2014K06858k1909m7764k13998l07626
15840g59338j34566k32277N8478P61881M09526K0383l0532p795R6029k09801m93755
15829e21767n63757n5678P14442L43728R8183k22166j22643K02513K43089J63814
15819B79758k08137m24306N9047J34613N2792k93253l43710L69222L33746J00755
15809F0527K83268M06729P7674l89931j87161k12642m91635K22182K8897j20692
15799c22784K44315J60682n7248O0070J4598q9787l72624l92781L48026L30569
15789g6964J0201P8442K30646J51518q9591j01194j11511j49034J36614r4050
15779a4923k59639K05167M05594n9365m32866k66594M1379K27657J1554K3466
$$ plain form
15769 -118570 168428 167286 -124873 -538430 -473348 -138379 -386032 -935526 -1176368 -1246392
15759 -1246392 -1319411 -1356653 -1252548 -1095842 -1106320 -806084 -392461 -421484 -566808 -832180
15749 -832180 -792294 -408040 -272754 54816 478241 341898 -234411 -332120 -175083 -516736
15739 -516736 -690747 -546426 -228450 242073 361669 260368 396264 296141 -33376 -230106
15729 -230106 -143777 247924 596673 610458 638235 378281 118848 -280396 -475501 -209499
15719 -209499 101555 189245 135392 276874 168520 120268 67298 340357 771385 367601
15709 367601 -233253 -825318 -1075323 -790686 -646008 -623721 -192564 250669 332943 274367
15699 274367 291089 405211 320723 32563 -426055 -616196 -934608 -1215566 -1175970 -847006
$$ packed form
15769a18570K86998j142k92159m13557O5082L34969k47653n49494k40842p0024
15759a246392p3019l7242J04105J56706j0478L00236M13623k9023j45324k65372
15749h32180L9886L84254J35286L27570M23425j36343n76309r7709J57037l41653
15739e16736j74011J44321L17976M70523J19596j01301J35896j00123l29517j96730
15729b30106Q6329L91701L48749J3785K7777k59954k59433l99244j95105K66002
15719b09499L11054Q7690n3853J41482j08354m8252n2970K73059M31028m03784
15709C67601o00854n92065k50005K84637J44678K2287M31157M43233Q2274n8576
15699B74367J6722J14122q4488k88160m58618j90141l18412k80958L9596L28964
$$ plain form
15689 -847006 -430970 -245177 -209041 -256252 -692532 -1110803 -921987 -571958 -559417 -744487
15679 -744487 -737119 -517731 -340003 -119321 109588 327711 251133 115119 214763 126696
15669 126696 491917 1244998 1223470 722897 676051 602764 543038 700788 591897 536270
15659 536270 576031 474569 47047 24832 316111 464308 364372 237307 -80161 -289733
15649 -289733 -135341 -206638 -121061 -149506 -196693 -324103 -386553 -615687 -698526 -594181 -706024
15638 -706024 -400299 -453315 -839485 -1271545 -1724993 -1517513 -1058459 -671560 -538999 -680172
15628 -680172 -685712 -759636 -697001 -428813 -356106 -396310 -335943 -178224 -217432 -558540 -675425
15617 -675425 -629080 -552426 -617866 -451742 -44499 124913 -152036 -623323 -888582 -1166017
$$ packed form
15689h47006M16036J85793L6136m7211m36280m18271J88816L50029J2541j85070
15679g44487P368K19388J77728K20682K28909K18123p6578j36014R9644q8067
15669A26696L65221P53081k1528n00573m6846p3287n9726J57750j08891n5627
15659E36270L9761j01462m27522k2215K91279J48197r9936j27065l17468k09572
15649b89733J54392p1297Q5577k8445m7187j27410o2450k29134q2839J04345j11843
15638g06024L05725n3016l86170m32060m53448K07480M59054L86899J32561j41173
15628f80172n540p3924O2635K68188P2707m0204O0367J57719l9208l41108j16885
15617f75425M6345P6654o5440J66124M07243J69412k76949m71287k65259k77435
$$ plain form
15607 -1166017 -1250089 -1065768 -1057070 -949750 -895271 -704723 -306461 -287712 -335863 -175274
15597 -175274 -66452 -167042 -277464 -485331 -259708 46170 28936 286244 600084 671812
15587 671812 478542 -39200 -161388 182681 279216 -149405 -330179 -293051 -721289 -937083
15577 -937083 -730108 -537487 -437849 -460989 -547385 -548360 -712993 -660001 -389458 -135976 1450
15566 1450 351558 379553 23043 -261213 -468098 -836488 -1214907 -957557 -829701 -1102248
15556 -1102248 -815700 -552689 -450255 -672601 -1027303 -902505 -555704 -185605 -60545
15547 -60545 -77404 26342 -162526 -217055 -78211 -95916 -633821 -835541 -683096 -345594
15537 -345594 345237 946367 1461972 1408936 1233332 1300613 1220554 1075881 1054252 960166
$$ packed form
15607a166017q4072J84321Q698J07320N4479J90548L98262J8749m8151J60589
15597a75274J08822j00590j10422k07867K25623L05878j7234K57308L13840P1728
15587F71812j93270n17742j22188L44069R6535m28621j80774L7128m28238k15794
15577i37083K06975J92621R9638k3140q6396r75j64633N2992K70543K53482J37426
15566A450L50108K7995l56510k84256k06885l68390l78419K57350J27856k72547
15556a102248K86548K63011J02434k22346l54702J24798L46801L70099J25060
15547f0545j6859J03746j88868n4529J38844j7705n37905k01720J52445L37502
15537c45594O90831O01130N15605n3036j75604O7281q0059j44673k1629r4086
$$ plain form
15527 960166 635798 391514 175955 -41694 -91714 -333804 -238165 33750 -136513 -318071
15517 -318071 -601529 -538871 -321571 -638780 -623767 -823661 -1194774 -1417059 -1556769 -1546344
15507 -1546344 -1263669 -767148 107210 664007 821805 700509 381468 -96033 -401701
15498 -401701 -440694 -819357 -1103014 -864323 -373219 -284273 -374473 -112596 -107923 -90629 373691
15487 373691 559202 532175 475766 225644 265926 243692 -72855 -243698 -121035 6355
15477 6355 -322635 -594488 -73763 474977 454375 674972 931119 1033028 630406 171785
15467 171785 157364 201222 188788 121153 55398 -276827 -419624 -295489 -139929 -80671 -263107
15456 -263107 -909998 -1234009 -1198784 -1211374 -910081 -469815 -178189 -268290 -289441 -461786
$$ packed form
15527I60166l24368k44284k15559k17649n0020k42090R5639K71915j70263j81558
15517c18071k83458O2658K17300l17209J5013j99894l71113k22285j39710J0425
15507a546344K82675M96521Q74358N56797J57798j21296l19041m77501l05668
15498d01701l8993l78663k83657K38691M91104Q8946r0200K61877M673J7294M64320
15487C73691J85511k7027n6409k50122M0282k2234l16547j70843J22663J27390
15477F355l28990k71853N20725N48740k0602K20597K56147J01909m02622m58621
15467A71785j4421M3858j2434o7635o5755l32225j42797J24135J55560N9258j82436
15456b63107o46891l24011L5225j2590L01293M40266K91626r0101k1151j72345
$$ plain form
15446 -461786 -522084 -583495 -600184 -598632 -695799 -570983 -310412 -237894 -328445 -191741 244914
15435 244914 721015 879999 1035617 1088686 737721 533263 612979 927983 1417964 1925933
15425 1925933 2387682 2628002 1848546 1042753 694338 535132 551684 530772 892715 1301403
15415 1301403 1206008 1155951 837829 267455 -234774 -748608 -878775 -629984 -555759 -450432
15405 -450432 -251170 -160453 -313725 -697203 -770616 -741842 -788945 -604114 -388581 -269268
15395 -269268 -414296 -524218 -304141 147157 244403 328156 672528 664972 524686 475524
15385 475524 173875 -221249 -175843 -138260 -573224 -865129 -882514 -478078 26725 272978
15375 272978 662083 380062 13835 -67614 -92236 -482096 -539388 -488103 -642660 -646728 -658749
$$ packed form
15446d61786o0298o1411j6689J552r7167J24816K60571P2518r0551J36704M36655
15435B44914M76101J58984J55618N3069l50965k04458P9716L15004M89981N07969
15425A925933M61749K40320p79456q05793l48415j59206J6552k0912L61943M08688
15415A301403r5395n0057l18122n70374n02229n13834j30167K48791P4225J05327
15405d50432J99262R0717j53272l83478p3413K8774m7103J84831K15533J19313
15395b69268j45028j09922K20077M51298R7246Q3753L44372p556j40286m9162
15385D75524l01649l95124M5406L7583m34964k91905j7385M04436N04803K46253
15375B72978L89105k82021l66227q1449k4622l89860n7292N1285j54557m068j2021
$$ plain form
15364 -658749 -866545 -1040173 -966771 -618170 -159581 -406811 -781057 -580976 -504074 -319514
15354 -319514 134728 475308 579053 716946 919177 624902 326864 2331 -178488 -375438
15344 -375438 -546355 -400535 24373 424536 377286 468379 538924 165970 -201104 -201404 -394195
15333 -394195 -498991 -203606 -138437 -16149 54719 66691 185091 236853 34461 -522579
15323 -522579 -388111 -39277 137685 491986 666962 426692 428539 668531 787704 700482
15313 700482 290793 -18915 -160635 35843 215567 146280 248998 106009 -119129 -101149
15303 -101149 -183030 -548890 -804300 -657247 -613274 -652606 -425238 -230759 -128717 -114686
15293 -114686 -135246 42947 326132 351626 676606 965399 1056130 884736 785689 751116
$$ packed form
15364f58749k07796j73628P3402L48601M58589k47230l74246K00081P6902J84560
15354c19514M54242L40580J03745J37893K02231k94275k98038l24533j80819j96950
15344c75438j70917J45820M24908M00163m7250R1093P0545l72954l67074l00j92791
15333c94195j04796K95385O5169J22288P0868J1972J18400N1762k02392n57040
15323e22579J34468L48834J76962L54301J74976k40270J847K39992J19173q7222
15313G00482m09689l09708j41720J96478J79724o9287J02718j42989k25138J7980
15303a01149q1881l65860k55410J47053M3973l9332K27368J94479J02042J4031
15293a14686k0560J78193K83185K5494L24980K88793R0731j71394r9047l4573
$$ plain form
15283 751116 579352 377113 308113 2975 -387166 -362249 151425 519254 675794 532756
15273 532756 -83451 -172575 290764 638008 865520 863560 920453 837900 482993 142993
15263 142993 -251055 -596972 -393578 335472 531083 480491 1021646 1014621 588550 283718
15253 283718 53507 -77263 140059 303601 415732 453038 220744 -120280 84475 428550
15243 428550 382453 421845 319211 212967 -16584 -419315 -80127 203828 27528 -118413
15233 -118413 -67435 104203 571163 1049316 788716 801281 1121166 1454877 1970953 2330512
15223 2330512 3433010 4344901 3852255 3038428 1869687 776003 616473 797113 649126
15214 649126 487970 701487 493802 -137733 -200792 195988 82075 -72165 -121007 -297976
$$ packed form
15283G51116j71764k02239o9000l05138l90141K4917N13674L67829J56540j43038
15273E32756o16207q9124M63339L47244K27512j960N6893q2553l54907l40000
15263A42993l94048l45917K03394P29050J95611n0592N41155p025m26071l04832
15253B83718k30211j30770K17322J63542J12131L7306k32294l41024K04755L44075
15243D28550m6097L9392j02634j06244k29551m02731L39188K83955j76300j45941
15233a18413N0978J71638M66960M78153k60600J2565L19885L33711N16076L59559
15223B330512J102498R11891m92646q13827j168741j093684j59530J80640j47987
15214F49126j61156K13517k07685o31535o3059L96780j13913j54240m8842j76969
$$ plain form
15204 -297976 -511275 -1021147 -1193904 -1164708 -808643 -334260 -428385 -1007465 -766884 -513399
15194 -513399 -623752 -382313 -50466 -279977 -646522 -519129 -294565 -314302 -99708 -137272
15184 -137272 -343646 -752186 -777836 -636015 -525731 -415249 -381999 -286425 337339 529780
15174 529780 521510 1146473 1392075 1290998 1018563 395668 -67296 -232054 -145414 -254477
15164 -254477 -327666 -417332 -688442 -981076 -970948 -943999 -894606 -716610 -378412 -299903 -589990
15153 -589990 -953349 -973554 -370823 -18079 -50410 -405673 -655533 -496789 -346764 -126875
15143 -126875 -254637 -51464 257934 191074 -204906 -525855 -381603 -29332 -28937 -168320
15133 -168320 273352 630755 569387 228111 97314 213382 174754 30331 172423 143123
$$ packed form
15204b97976k13299n09872j72757K9196L56065M74383r4125n79080K40581K53485
15194e13399j10353K41439L31847k29511l66545J27393K24564j9737K14594l7564
15184a37272k06374m08540k5650J41821J10284J10482L3250R5574O23764J92441
15174E29780q270O24963K45602j01077k72435o22895m62964j64758Q6640j09063
15164b54477p3189q9666k71110k92634J0128K6949M9393J77996L38198P8509k90087
15153e89990l63359k0205O02731L52744l2331l55263k49860J58744J50025K19889
15143a26875j27762K03173L09398o6860l95980l20949J44252L52271L95j39383
15133a68320M41672L57403o1368l41276j30797J16068l8628j44423J42092k9300
$$ plain form
15123 143123 12500 405925 706669 631891 450662 223474 -43913 -3923 261437 266369
15113 266369 438566 549296 809841 1014208 600340 331955 209991 28238 -183557 -194844
15103 -194844 42398 257587 242603 -21610 -365633 -437510 -243844 11369 491085 678285
15093 678285 786047 703535 257801 136999 144913 -8228 23203 235803 344736 218930
15083 218930 351838 490404 311256 56907 -93376 -368776 -862853 -650001 -114365 297148
15073 297148 424466 386559 121990 -259408 -69275 -114930 3803 268969 -24946 -561803
15063 -561803 -973625 -1093006 -808793 -263261 127007 145856 377697 322930 313367 281798
15053 281798 -309507 -670073 -625281 -542892 -568176 -271575 231016 282244 199710 410104
$$ packed form
15123A43123j30623L93425L00744p4778j81229k27188k67387L9990K65360M932
15113B66369J72197J10730K60545K04367m13868k68385j21964j81753k11795j1287
15103a94844K37242K15189j4984k64213l44023p1877J93666K55213M79716J87200
15093F78285J07762q2512m45734j20802P914j53141L1431K12600J08933j25806
15083B18930J32908J38566j79148k54349j50283k75400m94077K12852N35636M11513
15073B97148J27318l7907k64569l81398J90133m5655J18733K65166k93915n36857
15063e61803m11822j19381K84213N45532L90268J8849K31841n4767r563l1569
15053B81798n91305l60566M4792Q2389k5284K96601N02591N1228q2534K10394
$$ plain form
15043 410104 395009 351009 263582 -143250 -698069 -958010 -416609 62958 -81280 -469988
15033 -469988 -469526 -616914 -902824 -714268 -841276 -907488 -703000 -454175 -334004 -297539
15023 -297539 -174109 -324110 -500286 -466888 -404168 -340731 -283801 -71209 71564 12648
15013 12648 -141563 -529539 -722275 -653013 -266573 37047 140525 -28701 -160707 -303780
15003 -303780 -513652 -756059 -866195 -616223 -352646 82524 500001 430930 361518 344899
14993 344899 396648 179817 -310621 -282571 -86048 -268364 -347180 -338208 -248336 -376309 -691736
14982 -691736 -900660 -706847 -424504 -348856 -464793 -635991 -405934 -453860 -675969 -574499
14972 -574499 -283596 -161174 -360031 -577356 -545050 -263013 28876 -24373 -242279 -57279
$$ packed form
15043D10104j5095m4000q7427m06832n54819k59941N41401M79567j44238l88708
15033d69988M62j47388k85910J88556j27008o6212K04488K48825J20171L6465
15023b97539J23430j50001j76176L3398O2720O3437N6930K12592J42773n8916
15013A2648j54211l87976j92736O9262L86440L03620J03478j69226j32006j43073
15003c03780k09872k42407j10136K49972K63577M35170M17477o9071o9412j6619
14993C44899N1749k16831m90438K8050J96523j82316p8816Q972Q9872j27973l15427
14982f91736k08924J93813K82343P5648j15937j71198K30057m7926k22109J01470
14972e74499K90903J22422j98857k17325L2306K82037K91889n3249k17906J85000
$$ plain form
14962 -57279 -97 -139217 -47802 351144 671844 387830 -81054 15373 419100 587056
14952 587056 841009 880903 555691 465867 348159 335168 375432 -77144 -24839 427907
14942 427907 406205 212925 -110622 -176810 -156765 -268921 -124779 -67949 35240 297287
14932 297287 987859 1546261 1385914 740615 710484 1078705 1077236 479880 -182209 -590489
14922 -590489 -548581 -395885 -306202 -208387 -499216 -686906 -470303 -271489 -110998 94503
14912 94503 -89973 -325498 -212646 25124 -59495 -387570 -718663 -738386 -590329 -490217
14902 -490217 -486884 -814099 -999789 -905629 -575166 -506733 -737353 -802230 -993831 -963721 -242678
14891 -242678 326046 541812 569518 475990 801220 859782 245304 -196055 -87936 -110941
$$ packed form
14962e7279N7182j39120R1415L98946L20700k84014m68884R6427M03727J67956
14952E87056K53953L9894l25212q9824j17708j2991M0264m52576N2305M52746
14942D27907k1702j93280l23547o6188K0045j12156J44142N6830J03189K62047
14932B97287O90572N58402j60347o45299l0131L68221j469n97356o62089m08280
14922e90489M1908J52696Q9683R7815k90829j87690K16603J98814J60491K05501
14912I4503j84476k35525J12852K37770q4619l28075l31093j9723J48057J00112
14902d90217L333l27215j85690R4160L30463O8433k30620o4877j91601L0110P21043
14891b42678N68724K15766K7706r3528L25230N8562o14478m41359J08119k3005
$$ plain form
14881 -110941 -69981 304490 492557 185432 -222213 -681322 -882595 -659254 -156116 173062
14871 173062 440518 233721 -137369 -183187 -151248 -49680 77341 566206 960218 923133
14861 923133 852867 1019919 1095297 933860 708776 153517 -104423 61269 111706 -39692
14851 -39692 -463698 -661476 -771075 -717843 -631926 -294782 127128 305002 719087 802949
14841 802949 333680 -88275 -685509 -929470 -1090174 -1282772 -784234 180340 446771 186404
14831 186404 110216 -193363 -775667 -1493928 -1739792 -1553189 -1624649 -1421928 -961220 -339752
14821 -339752 -249916 -652742 -414436 190087 226077 -411876 -932017 -1013886 -1093924 -1166574
14811 -1166574 -1116685 -957061 -689284 -441634 -217589 -6769 251949 525271 473478 330176
$$ packed form
14881a10941M0960L74471J88067l07125m07645m59109k01273K23341N03138L29178
14871A73062K67456k06797l71090m5818L1939J01568J27021M88865L94012l7085
14861I23133p0266J67052P5378j61437k25084n55259k57940J65692N0437j51398
14851c9692m24006j97778j09599N3232Q5917L37144M21910J77874M14085Q3862
14841H02949m69269m21955n97234k43961j60704j92598M98538R64574K66431k60367
14831A86404p6188l03579n82304p18261k45864J86603p1460K02721M60708O21468
14821c39752Q9836m02826K38306O04523L5990o37953n20141q1869q0038p2650
14811a166574M9889J59624K67777K47650K24045K10820K58718K73322n1793j43302
$$ plain form
14801 330176 181175 -291223 -774945 -998882 -945957 -815848 -309929 -283388 -540979 -566456
14791 -566456 -556912 -513752 -491407 -401825 20980 415886 552461 419657 -92938 -467042
14781 -467042 -606900 -894029 -1090468 -1143527 -1006403 -679232 -478611 -85183 373173 445704
14771 445704 563953 819819 1045390 1107600 1182746 1113144 903020 895559 971905 1143594 1088435
14760 1088435 695981 692459 938347 746448 389671 287160 186700 -243865 -197178 -391369
14750 -391369 -739727 -277152 275710 442543 88063 -315395 -126576 -312060 -850871 -1032056
14740 -1032056 -903609 -805480 -754811 -486928 58019 331198 227673 155204 539410 870252
14730 870252 603176 167404 -256394 -728567 -646809 -607890 -1119727 -1166562 -775851 -454686
$$ packed form
14801C30176j49001m72398m83722k23937N2925J30109N05919K6541k57591k5477
14791e66456R544M3160K2345Q9582M22805L94906J36575j32804n12595l74104
14781d67042j39858k87129j96439n3059J37124L27171K00621L93428M58356P2531
14771D45704J18249K55866K25571O2210P5146o9602k10124p461P6346J71689n5159
14760A088435l92454l522K45888j91899l56777j02511j00460m30565M6687j94191
14750c91369l48358M62575N52862J66833l54480m03458J88819j85484n38811j81185
14740a032056J28447R8129N0669K67883N44947K73179j03525p2469L84206L30842
14730H70252k67076m35772m23798m72173Q1758L8919n11837m6835L90711L21165
$$ plain form
14720 -454686 -248014 -278540 -388267 -174441 -277536 -336716 -341821 -638787 -1007742 -1269201
14710 -1269201 -1233655 -926633 -658214 -322773 311421 354708 71109 -159951 -58454 466193
14700 466193 654654 231805 -297751 -623261 -709772 -656688 -923548 -1281424 -1157691 -967031
14690 -967031 -861910 -541164 -110183 17527 -270807 -428466 -445923 -108988 110127 -106076
14680 -106076 -77743 -13550 -314639 -651094 -746466 -385773 -240644 -118890 342591 625344
14670 625344 618431 543705 304667 -25464 -83126 -267874 -305474 -624623 -789873 -1033957
14660 -1033957 -927187 -728682 -642357 -319881 -41191 209216 -28791 -327436 -406236 -268144
14650 -268144 -36319 -22988 -54821 148245 320458 318031 7303 -71045 72036 262022
$$ packed form
14720d54686K06672l0526j09727K13826j03095n9180n105k96966l68955k61459
14710a269201L5546L07022K68419L35441O34194M3287k83599k31060J01497N24647
14700D66193J88461m22849n29556l25510q6511N3084k66860l57876J23733J90660
14690i67031J05121L20746M30981J27710k88334j57659j7457L36935K19115k16203
14680a06076K8333O4193l01089l36455r5372L60693J45129J21754M61481K82753
14670F25344o913p4726k39038l30131n7662j84748l7600l19149j65250k44084
14660a033957J06770J98505Q6325L22476K78690K50407k38007k98645p8800J38092
14650b68144K31825J3331l1833K03066J72213k427l10728p8348J43081J89986
$$ plain form
14640 262022 296442 61091 -148293 -113653 93086 251334 316804 588545 576596 212690
14630 212690 -3241 20627 87986 112334 187400 246070 252895 391444 178259 -147771 -250661
14619 -250661 -219899 -30842 144448 -21930 -228421 -141408 -132879 -271300 -39009 -189962
14609 -189962 -533328 -553795 -657202 -697172 -617330 -314724 39378 -204163 -688508 -880882
14599 -880882 -824601 -619901 -275408 -49669 156961 -100108 -235407 -263547 -494317 -254622
14589 -254622 133801 169629 219675 437154 522582 629311 544909 436778 81441 -17011
14579 -17011 -75785 -140510 38478 223748 370318 312753 257371 391302 391092 86552 -298753
14568 -298753 -320676 -144100 53893 474272 612299 574471 350096 130259 -162314 -181846
$$ packed form
14640B62022L4420k35351k09384L4640K06739J58248O5470K71741j1949l63906
14630B12690k15931K3868O7359K4348P5066N8670O825J38549k13185l26030j02890
14619b50661L0762J89057J75290j66378k06491Q7013Q529j38421K32291j50953
14609a89962l43366k0467j03407l9970P9842L02606L54102k43541m84345j92374
14599h80882N6281K04700L44493K25739K06630k57069j35299k8140k30770K39695
14589b54622L88423L5828N0046K17479Q5428J06729q4402j08131l55337r8452
14579a7011n8774o4725J78988J85270J46570n7565n5382J33931k10l04540l85305
14568b98753k1923J76576J97993M20379J38027l7828k24375k19837k92573j9532
$$ plain form
14558 -181846 -138482 -309475 -297604 -192827 -235859 -432932 -664865 -892968 -1080450 -848370
14548 -848370 -594359 -629232 -749412 -907763 -876502 -974131 -1188412 -1062882 -734422 -973893
14538 -973893 -1363463 -1567392 -1549658 -1192635 -952150 -871779 -480465 -336981 -533813 -702724
14528 -702724 -851086 -663286 -460924 -668023 -621621 -297228 -205215 -194062 -132594 -420243
14518 -420243 -746662 -525872 -421209 -646884 -275793 264835 159122 -310720 -707830 -649656
14508 -649656 -421751 -527651 -854813 -803385 -524361 -714679 -669495 -33853 335801 372225
14498 372225 -63362 -749138 -742473 -264930 82195 -108276 -186334 -18095 33136 168708
14488 168708 116809 -170789 -290377 -170871 110020 -75221 -417533 -442236 -12767 628618
$$ packed form
14558a81846M3364j70993J1871J04777m3032j97073k31933k28103j87482K32080
14548h48370K54011l4873j20180j58351L1261r7629k14281J25530L28460k39471
14538i73893l89570k03929J7734L57023K40485Q0371L91314J43484j96832j68911
14528g02724j48362J87800K02362k07099M6402L24393R2013J1153O1468k87649
14518d20243l26419K20790J04663k25675L71091N40628j05713m69842l97110N8174
14508f49656K27905j05900l27162N1428K79024j90318M5184O35642L69654L6424
14498C72225m35587o85776O665M77543L47125j90471p8058J68239N1231J35572
14488A68708n1899k87598j19588J19506K80891j85241l42312k4703M29469O41385
$$ plain form
14478 628618 706790 402785 214202 264251 451405 271542 215835 244393 203508 261086 166411
14467 166411 85489 -246221 -159430 368310 670346 556287 238360 195525 100486 70233
14457 70233 316704 526145 754332 702841 546719 6883 -631566 -874843 -609268 45445
14447 45445 705053 1041232 831458 538434 221699 179853 123752 -386472 -471917 -175712
14437 -175712 -143017 -289309 -331416 -459549 -592175 -605583 -297590 57351 -198384 -514349
14427 -514349 -319927 -393665 -1141820 -1190225 -741416 -580778 -534405 -392101 206381 918632
14417 918632 1042452 1093283 1068331 888754 864973 536104 -457469 -863315 -650419 -321993
14407 -321993 -269545 -61153 142371 129983 120989 196489 168622 20336 36097 -62898 -141026
$$ packed form
14478F28618P8172l04005j88583N0049J87154j79863n5707K8558m0885N7578r4675
14467A66411q0922l31710Q6791N27740L02036j14059l17927m2835r5039l0253
14457G0233K46471K09441K28187n1491j56122n39836o38449k43277K65575O54713
14447D5445O59608L36179k09774k93024l16735m1846n6101n10224q5445K96205
14437a75712L2695j46292m2107j28133j32626j3408L07993L54941k55735l15965
14427e14349J94422p3738p48155m8405M48809J60638M6373J42304N98482P12251
14417I18632J23820N0831k4952j79577k3781l28869r93573m05846K12896L28426
14407c21993N2448K08392K03524j2388q994P5500k7867j48286J5761r8995p8128
$$ plain form
14396 -141026 -168187 -340158 -488272 -474222 -159474 -64040 -247419 -586461 -468105 -123786
14386 -123786 1811 191267 411753 472975 426167 307105 242065 389628 472817 403197
14376 403197 61268 -384373 -828441 -1121175 -1229106 -1048738 -854838 -294060 18611 16605
14366 16605 -126640 98264 652544 911303 983406 859046 320927 47846 -839 114023
14356 114023 -33201 -284388 -542916 -490897 -470650 -852014 -992582 -1027616 -1237024 -1200604
14346 -1200604 -714733 -367948 -580712 -650077 -489111 -684230 -1075034 -1393518 -1012173 -252843
14336 -252843 244875 48659 -82897 -388869 -284927 250948 191093 -69380 -101834 -8297
14326 -8297 -27009 -560771 -818477 -870076 -1081060 -999673 -785222 -647838 -436898 -330457
$$ packed form
14396a41026k7161j71971j48114J4050L14748R5434j83379l39042J18356L44319
14386a23786J25597J89456K20486O1222m6808j19062o5040J47563Q3189o9620
14376D03197l41929m45641m44068k92734j07931J80368J93900N60778L12671k006
14366A6605j43245K24904N54280K58759P2103j24360n38119k73081m8685J14862
14356A14023j47224k51187k58528N2019K0247l81364j40568l5034k09408L6420
14346a200604M85871L46785k12764o9365J60966j95119l90804l18484L81345P59330
14336b52843M97718j96216j31556l05972J03942N35875n9855k60473l2454R3537
14326h297j8712n33762k57706n1599k10984Q1387K14451J37384K10940J06441
$$ plain form
14316 -330457 -744128 -1052900 -1003277 -1444096 -1683674 -1329750 -682734 -409383 -858328 -1431198
14306 -1431198 -1533271 -941283 -442697 -530545 -777303 -538418 -203244 -209828 -287421 -467050
14296 -467050 -433377 -412086 -789619 -1428959 -1871037 -1804949 -1082775 -804680 -1018637 -881261
14286 -881261 -470484 -52436 -156859 -434134 -544599 -694892 -686836 -552565 -98532 542270
14276 542270 -20647 -904830 -994363 -660925 -163073 318680 209355 119254 -189401 -210542
14266 -210542 -318766 -827234 -1142625 -1014410 -707537 -279179 74952 -42178 -639813 -1075335
14256 -1075335 -1039467 -724008 -399880 -543930 -747938 -701605 -193759 96323 173228 182838
14246 182838 55354 275293 911274 1532427 1200590 583365 629094 495199 243944 -105500
$$ packed form
14316c30457m13671l08772M9623m40819k39578L53924O47016K73351m48945n72870
14306a431198j02073N91988M98586q7848k46758K38885L35174o584p7593j79629
14296d67050L3673K1291l77533o39340m42078O6088P22174K78095k13957J37376
14286h81261M10777M18048j04423k77275j10465j50293Q056J34271M54033O40802
14276E42270n62917q84183q9533L33438M97852M81753j09325r0101l08655k1141
14266b10542j08224n08468l15391J28215L06873M28358L54131j17130n97635m35522
14256a075335L5868L15459L24128j44050k04008M6333N07846K90082P6905R610
14246A82838j27484K19939O35981O21153l31837o17225M5729j33895k51255l49444
$$ plain form
14236 -105500 -50615 63167 59409 5769 -332384 -474987 -562256 -587595 -290053 -318734 -646889
14225 -646889 -866367 -1011546 -914606 -896222 -889771 -518935 -89404 -75914 31752 -173522
14215 -173522 -288527 -1454 337831 661751 670767 406329 115315 -215700 -491244 -487575
14205 -487575 -713782 -1110292 -1208301 -958922 -776541 -401096 222561 555064 410493 120417
14195 120417 -64691 -232720 -447506 -375138 47959 -106736 -174819 141907 165979 -373110
14185 -373110 -580531 -546532 -165235 92495 -147340 -530220 -697695 -977425 -1557100 -1555739
14175 -1555739 -1053752 -776545 -554869 -443737 -448961 -606132 -680657 -621511 -587730 -896198
14165 -896198 -1067790 -478862 156514 485536 265270 -353849 -641064 -350121 -68712 138827
$$ packed form
14236a05500N4885J13782l758n3640l38153j42603q7269k5339K97542k8681l28155
14225f46889k19478j45179R6940J8384O451L70836M29531J3490J07666k05274
14215a73522j15005K87073L39285L23920R016k64438k91014l31015k75544L669
14205d87575k26207l96510r8009K49379J82381L75445O23657L32503j44571k90076
14195A20417j85108j68029k14786P2368M23097j54695o8083L16726K4072n39089
14185c73110k07421L3999L81297K57730k39835l82880j67475k79730n79675J361
14175a555739N01987K77207K21676J11132n224j57171p4525N9146L3781l08468
14165h96198j71592N88928O35376L29022k20266o19119k87215K90943K81409K07539
$$ plain form
14155 138827 771831 1263947 1156064 873357 634678 658847 1027761 1527931 1633433 1939675
14145 1939675 2872332 4639763 7032542 9918168 11243943 9331758 6681275 4649098
14137 4649098 2887704 1263764 770547 640230 65293 -543045 -872363 -799135 -755663
14128 -755663 -658471 -327762 185116 493696 530840 344501 -453990 -837118 -1027020 -917775
14118 -917775 -477368 -486497 -612921 -788816 -666132 -469304 -96811 306669 475722 140208
14108 140208 -118904 -159073 31884 163527 12059 -199891 -261970 409631 698873 409381
14098 409381 37987 -192789 -37401 80821 36095 -34363 38536 -57119 -149818 91353
14088 91353 -30576 3164 9976 -253301 -448929 -621923 -354609 -135772 -60911 -97099 -398230
$$ packed form
14155A38827O33004M92116j07883k82707k38679K4169L68914N00170J05502L06242
14145A939675R32657J767431K392779K885626J325775j912185k650483k032177
14137D649098j761394j623940m93217j30317n74937o08338l29318P3228M3472
14128g55663R7192L30709N12878L08580L7144j86339p98491l83128j89902J09245
14118i17775M40407r129j26424j75895J22684J96828L72493M03480J69053l35514
14108A40208k59112m0169J90957J31643j51468k11950o2079O71601K89242k89492
14098D09381l71394k30776J55388J18222m4726p0458P2899r5655r2699K41171
14088I1353j21929L3740O812k63277j95628j72994K67314K18837P4861l6188l01131
$$ plain form
14077 -398230 -331015 -446112 -439557 -333445 -330112 -391504 -265982 -137008 -201410 53814 278107
14066 278107 214307 83996 -113415 -140799 152263 175331 561555 1439269 2236583 3239044
14056 3239044 3972685 4300612 5021108 6599477 8557395 10771624 14086884 18982259 26111675
14047 26111675 35821735 50151875 71244391 88826446 80538960 58436456 41938559
14040 41938559 30882079 23372796 17841543 13976873 10742192 8564693 7429096 6978244
14032 6978244 6399407 5625206 4941153 4408173 3529885 2392119 1841015 1300897 1033024
14023 1033024 1098902 1356977 1750661 2048424 2483550 3009905 3918823 4388170 4134640 4210786
14013 4210786 4902464 5658874 5686725 4876422 3913473 2932919 2190379 1718432 1164958 614343
$$ packed form
14077c98230O7215j15097O555J06112L333o1392J25522J28974o4402K55224K24293
14066B78107o3800j30311j97411k7384K93062K3068L86224Q77714P97314J002461
14056C239044P33641L27927P20496J578369J957918K214229L315260M895375P129416
14047B6111675R710060J4330140K1092516J7582055q287486k2102504j6497897
14040D1938559j1056480p509283n531253l864670l234681k177499j135597m50852
14032F978244n78837p74201o84053n32980q78288j137766n51104n40118k67873
14023A033024O5878K58075L93684K97763M35126N26355R08918M69347k53530P6146
14013D210786O91678P56410K7851q10303r62949r80554p42540m71947n53474n50615
$$ plain form
14003 614343 635644 690160 348977 290299 78708 312550 568971 907854 1297869 900800
13993 900800 52690 -316821 -202634 -308570 -649516 -488921 -187756 -335694 -670173 -863220
13983 -863220 -684942 -620970 -278862 -191912 295153 800350 979006 1008428 831003 269717
13973 269717 -62434 95096 457052 527705 176737 398017 958484 773662 239086 -376260
13963 -376260 -564689 -272534 -94190 -206644 -325544 -342582 -553284 -483293 -419717 -832618
13953 -832618 -1113042 -1064576 -788384 -549310 -105920 370855 330326 -25011 -283328 -685823
13943 -685823 -1014666 -782246 -589142 -473286 -572458 -452580 53009 -94331 -257120 -203673
13933 -203673 -160597 -325216 -388020 -164714 351760 660146 572348 553681 543722 651969 474288
$$ packed form
14003F14343K1301N4516l41183n8678k11591K33842K56421L38883L90015l97069
13993I00800q48110l69511J14187j05936l40946J60595L01165j47938l34479j93047
13983h63220J78278O3972L42108Q6950M87065N05197J78656K9422j77425n61286
13973B69717l32151J57530L61956P0653l50968K21280N60467j84822n34576o15346
13963c76260j88429K92155J78344j12454j18900j7038k10702O9991O3576m12901
13953h32618k80424M8466K76192K39074M43390M76775m0529l55337k58317m02495
13943f85823l28843K32420J93104J15856r9172J19878N05589j47340j62789N3447
13933b03673M3076j64619o2804K23306N16474L08386q7798j8667r959J08247j77681
$$ plain form
13922 474288 446998 524693 -16958 -92525 195083 205237 -86088 -310372 -400008 -303593 73252
13911 73252 487294 809087 776483 559041 188637 41102 -3238 -323523 -486233 -361127
13901 -361127 -339697 156583 1057588 1714588 2029768 2432235 3173872 3897882 4612998 4860055
13891 4860055 4108564 3238321 2700364 2060622 1430878 910829 819863 866803 567382 332742
13881 332742 385610 405513 495594 488779 263038 498108 675000 77329 -245558 -240334 -376782
13870 -376782 -126545 277197 808428 1102476 1076252 1065929 708459 549774 657578 795675
13860 795675 932198 908720 1078074 1095677 860579 610322 434300 293413 403470 713068
13850 713068 1059941 964535 768413 826200 906411 641357 237606 -178863 -109401 441513
$$ packed form
13922D74288k7290P7695n41651p5567K87608J0154k91325k24284q9636R6415L76845
13911G3252M14042L21793l2604k17442l70404j47535m4340l20285j62710J25106
13901c61127K1430M96280R01005O57000L15180M02467P41637P24010P15116K47057
13891D860055p51491q70243n37957o39742o29744n20049r0966M6940k99421k34640
13881C32742N2868J9903R0081o815k25741K35070J76892n97671l22887N224j36448
13870c76782K50237M03742N31231K94048k6224j0323l57470j58685J07804J38097
13860G95675J36523k3478J69354J7603k35098k50257j76022j40887J10057L09598
13850G13068L46873r5406j96122N7787Q0211k65054m03751m16469O9462N50914
$$ plain form
13840 441513 484010 171088 49913 -333253 -543037 -239434 -521931 -597599 -70515 88796
13830 88796 -139236 -27160 -195871 -538671 -662877 -510446 -347663 -82198 452043 815689
13820 815689 1026894 1109772 738240 86512 -393855 -630856 -613052 -337426 -134155 33555
13810 33555 196169 -10661 -135095 -51666 224589 350389 73603 28346 -83436 -259185
13800 -259185 -341622 -487167 -407021 -248077 190150 347940 251747 236479 426326 619743
13790 619743 589992 115439 -223492 13245 590633 944945 739809 974048 1387833 1259570
13780 1259570 724559 785192 1788308 3408498 5119683 5754314 4607498 3330034 2429395
13771 2429395 2155082 2097595 1595277 1411323 1358852 1147675 865199 820826 658300 770099
$$ packed form
13840D41513M2497l12922j21175l83166k09784L03603k82497p5668N27084J59311
13830H8796k28032J12076j68711l42800j24206J52431J62783K65465N34241L63646
13820H15689K11205Q2878l71532o51728m80367k37001J7804K75626K03271J67710
13810C3555J62614k06830j24434Q3429K76255J25800k76786m5257j11782j75749
13800b59185q2437j45545Q0146J58944M38227J57790r6193j5268J89847J93417
13790F19743k9751m74553l38931K36737N77388L54312k05136K34239M13785j28263
13780A259570n35011O0633J003116J620190J711185O34631j146816j277464r00639
13771B429395k74313n7487n02318j83954n2471k11177k82476m4373j62526J11799
$$ plain form
13761 770099 888622 985422 1211969 1233329 1022699 696539 496712 608206 914424 968213
13751 968213 674556 140496 121947 155740 121531 170461 53449 233549 442682 461571
13741 461571 759858 888226 348856 -38432 52101 299664 306333 26642 -7302 -125841
13731 -125841 -395040 -85851 342588 154556 -212400 -228148 -637520 -736278 -390321 -437537
13721 -437537 -590427 -526928 -266989 -121062 -59823 -122457 -276429 -170582 172990 692996
13711 692996 707656 450777 811727 640163 178761 218183 94031 -468067 -546276 -750943
13701 -750943 -794941 -637423 -455287 -6563 403613 632680 269451 -189550 -354479 -453025
13691 -453025 -410081 -120055 52732 113188 390398 802907 1318940 2052850 2811233 3403005
$$ packed form
13761G70099J18523R6800K26547K1360k10630l26160j99827J11494L06218N3789
13751I68213k93657n34060j8549L3793l4209M8930j17012J80100K09133J8889
13741D61571K98287J28368n39370l87288R0533K47563O669k79691l3944j18539
13731a25841k69199L09189M28439j88032l66956j5748m09372r8758L45957m7216
13721d37537j52890O3499K59939J45927O1239o2634j53972J05847L43572N20006
13711F92996J4660k56879L60950j71564m61402L9422j24152n62098p8209k04667
13701g50943m3998J57518J82136M48724M10176K29067l63229m59001j64929r8546
13691d53025M2944K90026J72787O0456K77210M12509N16033P33910P58383N91772
$$ plain form
13681 3403005 3565187 3065130 2243565 1034917 259670 87825 99282 65628 -30941 -98027
13671 -98027 -202763 -258037 -387546 61917 595330 674124 377358 -139730 -766783 -978542
13661 -978542 -1164209 -1139050 -956692 -715408 -369362 -66231 8302 -254939 -655222 -822492
13651 -822492 -835125 -753774 -595058 -912664 -1329684 -1350231 -758305 -207507 -308264 -332943
13641 -332943 11382 554801 664215 647204 387267 -276958 -705831 -361251 235485 721218
13631 721218 1175127 1183736 1063675 985106 822247 683192 554171 714735 808665 687133
13621 687133 807662 991380 1319636 1399187 1817865 3112216 4602441 5095388 4409357
13612 4409357 3362344 2577011 1445868 780584 611838 426198 408075 524080 651557
$$ packed form
13681C403005J62182n00057q21565j208648p75247j71845J1457l3654r6569o7086
13671i8027j04736n5274j29509M49463N33413P8794k96766n17088o27053k11759
13661i78542j85667K5159J82358K41284L46046L03131P4533k63241m00283j67270
13651h22492j2633Q1351J58716l17606m17020k0547N91926N50798j00757k4679
13641c32943L44325N43419J09414j7011k59937o64225m28873L44580N96736M85733
13631G21218M53909Q609j20061p8569j62859j39055j29021J60564R3930j21532
13621F87133J20529J83718L28256P9551M18678J294351J490225M92947o86031
13612D409357j047013p85333j131143o65284j68746j85640j8123J16005J27477
$$ plain form
13603 651557 595517 290739 273841 314434 -80783 -463040 -839188 -747886 -302770 112436
13593 112436 737661 1170052 1134401 697188 427015 391702 277684 163673 377562 509950
13583 509950 544390 380414 -128632 -418230 -345567 -228673 -196009 65202 174276 -87819
13573 -87819 107515 328009 471483 544876 359041 403653 423246 93487 -297092 -403011
13563 -403011 -310552 -115081 -100644 -335936 -513063 -672220 -389317 59837 240703 238950
13553 238950 257344 466923 634021 530324 463943 1059140 1652188 1811064 1335724 607802
13543 607802 368465 561126 507550 349175 137628 75249 -24870 -133278 -285131 -461753
13533 -461753 -696488 -538130 -134027 -37666 174024 304446 308665 458259 704066 623510
$$ packed form
13603F51557n6040l04778j6898M0593l95217l82257l76148R1302M45116M15206
13593A12436O25225M32391l5651m37213k70173l5313j14018j14011K13889J32388
13583E09950L4440j63976n09046k89598P2663J16894L2664K61211J09074k62095
13573h7819J95334K20494J43474P3393j85835M4612J9593l29759l90579j05919
13563d03011R2459J95471J4437k35292j77127j59157K82903M49154J80866j753
13553B38950J8394K09579J67098j03697o6381N95197N93048J58876m75340p27922
13543F07802k39337J92661n3576j58375k11547o2379j00119j08408j51853j76622
13533d61753k34735J58358M04103R6361K11690J30422M219J49594K45807q0556
$$ plain form
13523 623510 298487 -1107 -456737 -667390 -506362 -290891 100995 277873 315335 549495
13513 549495 848659 745611 415355 61528 -50279 -21418 11324 194370 461820 664440
13503 664440 663814 562619 485993 702116 591591 -306631 -1103150 -859187 -58385 875207
13493 875207 1064082 520959 56864 -238634 -540575 -637553 -750164 -541590 237896 495648
13483 495648 388686 430660 695761 474424 -113986 -322768 -506651 -808459 -943200 -373047
13473 -373047 -31008 -561491 -1207284 -1219110 -823040 -495535 -248326 -78861 8169 234735
13463 234735 417894 161902 -316974 -748919 -957145 -878672 -874225 -851578 -779664 -595007
13453 -595007 -144121 -291212 -640394 -308185 70284 -177627 -823976 -689147 -267937 -345502
$$ packed form
13523F23510l25023k99594m55630k10653J61028K15471L91886J76878L7462K34160
13513E49495K99164j03048l30256l53827j11807K8861L2742J83046K67450K02620
13503F64440o26j01195p6626K16123j10525q98222p96519K43963Q00802R33592
13493H75207J88875n43123m64095k95498l01941r6978j12611K08574P79486K57752
13483D95648j06962M1974K65101k21337n88410k08782j83883l01808j34741N70153
13473c73047L42039n30483o45793j1826L96070L27505K47209J69465Q7030K26566
13463B34735J83159k55992m78876m31945k08226P8473M447K2647P1914J84657
13453e95007M50886j47091l49182L32209L78469k47911o46349J34829M21210p7565
$$ plain form
13443 -345502 -336728 -153353 -258323 -279433 -495525 -598332 -872912 -1410772 -1196199 -643074
13433 -643074 -598770 -989039 -1162677 -684257 -94635 10354 -231174 -369914 -446569 -543853
13423 -543853 -358325 -416558 -478345 -153805 74819 32822 -78472 -232435 -270823 -86993
13413 -86993 28497 -167415 -672486 -1073043 -1031830 -646512 -348919 -566458 -855659 -734570
13403 -734570 -1020330 -1519196 -1261588 -499124 144599 168745 -105066 -41732 378705 260194
13393 260194 -254208 -469083 -465454 -403297 -118382 54324 62525 92656 -29061 -735524 -1150138
13382 -1150138 -913794 -624753 -850468 -1007483 -352651 309234 536271 304871 -241375
13373 -241375 -281654 351837 714006 601012 275593 10655 -390308 -468320 -123327 511373
$$ packed form
13443c45502Q774J83375j04970k1110k16092j02807k74580n37860K14573N53125
13433f43074M4304l90269j73638M78420N89622J04989k41528j38740p6655r7284
13423e43853J85528n8233o1787L24540K28624m1997j11294j53963l8388J83830
13413h6993J15490j95912n05071m00557M1213L85318K97593k17539k89201J21089
13403g34570k85760m98866K57608P62464O43723K4146k73811O3334M20437j18511
13393B60194n14402k14875L629O2157K84915J72706Q201L0131j21717p06463m14614
13382a150138K36344K89041k25715j57015O54832O61885K27037k31400n46246
13373b41375m0279O33491L62169j12994l25419k64938m00963p8012L44993O34700
$$ plain form
13363 511373 788843 331250 -37226 62402 264332 372731 164669 -373754 -537831 -96874
13353 -96874 598585 811125 343686 7132 -127039 -102074 31406 91901 314238 421156
13343 421156 489613 876771 1444175 1671119 1610822 1087654 440026 62407 -173092 185701
13333 185701 649605 500161 98787 -161768 98495 539553 635855 494050 237088 71931
13323 71931 6415 -38689 -168575 -250490 -326333 -391446 -407548 -202263 26414 315310 302122
13312 302122 468410 744309 690266 722372 1021385 1148105 526157 29191 -89919 -153316
13302 -153316 -209180 -405639 -522635 -214892 115484 76837 -373793 -483997 -291970 -110374
13292 -110374 209863 220061 -223735 -591056 -874520 -898430 -1260143 -1745715 -1291040 -748718
$$ packed form
13363E11373K77470m57593l68476R9628K01930J08399k08062n38423j64077M40957
13353i6874O95459K12540m67439l36554j34171K4965J33480O0495K22337J06918
13343D21156O8457L87158N67404K26944o0297n23168o47628l77619k35499L58793
13333A85701M63904j49444m01374k60555K60263M41058R6302j41805k56962j65157
13323G1931o5516m5104j29886q1915p5843o5113j6102K05285K28677K88896j3188
13312C02122J66288K75899n4043L2106K99013J26720o21948m96966j19110o3397
13302a53316n5864j96459j16996L07743L30376l8647m50630j10204J92027J81596
13292a10374L20237J0198m43796l67321k83464k3910l61713m85572M54675N42322
$$ plain form
13282 -748718 -459639 -169829 69218 341344 93081 47758 -156015 -789163 -777669 -391470
13272 -391470 -32715 -95733 -174288 226512 478558 636478 767312 648680 489010 194971
13262 194971 -335543 -530113 -758319 -1009330 -1055812 -723252 -237908 -85968 -223141 -658969
13252 -658969 -801352 -633844 -385545 -515125 -722177 -900072 -600849 -192364 -432015 -496175
13242 -496175 -283363 137679 188301 -39455 -241413 -190889 32940 -266758 -374858 16993
13232 16993 380470 310514 196915 441796 274233 -383708 -805168 -432199 -230313 -123611
13222 -123611 176551 369591 301920 240899 116892 -275955 -697792 -479732 -216709 17485
13212 17485 -32207 28122 456227 893949 1232304 1125922 786375 654169 812961 977031
$$ packed form
13282g48718K89079K89810K39047K72126k48263m5323k03773o33148J1494L86199
13272c91470L58755o3018p8555M00800K52046J57920J30834j18632j59670k94039
13262A94971n30514j94570k28206k51011m6482L32560M85344J51940j37173m35828
13252f58969j42383J67508K48299j29580k07052j77895K99223M08485k39651o4160
13242d96175K12812M21042N0622k27756k01958N0524K23829k99698j08100L91851
13232A6993L63477o9956j13599K44881j67563o57941m21460L72969K01886J06702
13222a23611L00162J93040o7671o1021j24007l92847m21837K18060K63023K34194
13212A7485m9692O0329M28105M37722L38355j06382l39547j32206J58792J64070
$$ plain form
13202 977031 630312 63346 -188384 -72591 52714 283946 398378 340878 515182 439784
13192 439784 -22705 -412557 -267573 221155 513014 611519 587005 884097 945490 619216
13182 619216 378526 262130 313561 492783 664556 840053 1119628 1171554 1214019 1231475
13172 1231475 925488 314063 121589 469915 766379 737633 653394 259707 -223536 -271704
13162 -271704 -27310 -41696 -63106 -32151 106796 -102437 -744786 -1077661 -520460 268669
13152 268669 749474 678252 661934 622119 825945 634635 406345 631818 987834 1178348
13142 1178348 1164227 1296751 1460089 1666967 1500440 1087745 1040933 1134741 1184198 1249732
13132 1249732 1115162 797969 618523 690943 491396 113849 -159871 -449805 -331590 -283505
$$ packed form
13202I77031l46719n66966k51730J15793J25305K31232J14432n7500J74304p5398
13192D39784m62489l89852J44984M88728K91859R8505k4514K97092O1393l26274
13182F19216k40690j16396N1431J79222J71773J75497K79575N1926M2465J7456
13172A231475l05987o11425j92474L48326K96464k8746q4239l93687m83243m8168
13162b71704K44394j4386k1410L0955J38947k09233o42349l32875N57201P89129
13152B68669M80805p1222j6318l9815K03826j91310k28290K25473L56016J90514
13142A178348j4121J32524J63338K06878j66527m12695m6812R3808M9457O5534
13132A249732j34570l17193j79446P2420j99547l77547k73720k89934J18215M8085
$$ plain form
13122 -283505 -318686 -621354 -663813 -597909 -415129 -51063 -46236 9844 333635 1123795 1524122
13111 1524122 1740327 2028382 1648154 937906 504451 523328 838787 1022397 1234995 1226003
13101 1226003 760482 194699 46750 -371056 -755014 -465226 -41071 -163864 -50038
13092 -50038 -88301 -75056 300783 276779 207402 482935 639037 833330 969189 1315870
13082 1315870 1453661 956894 476481 507921 747295 1625515 2572566 2566123 2101454 1496223
13072 1496223 1112715 1103500 1218650 1586211 2115950 1889179 1438511 1369366 1593586 1520539
13062 1520539 1668661 2137295 2165029 1958838 1720235 1858887 2170535 2409719 2552973 2541977
13052 2541977 2952483 3415742 3330022 3252085 3449546 3221801 2971737 2785163 2960861 3089730
$$ packed form
13122b83505l5181l02668m2459O5904J82780L64066M827N6080L23791P90160M00327
13111A524122K16205K88055l80228p10248m33455J8877L15459J83610K12598q992
13101A226003m65521n65783j47949m17806l83958K89788M24155j22793J13826
13092e0038l8263J3245L75839k4004o9377K75533J56102J94293J35859L46681
13082A315870J37791m96767m80413L1440K39374Q78220R47051o443m64669o05231
13072A496223l83508r215J15150L67561N29739k26771m50668o9145K24220p3047
13062A520539J48122M68634K7734k06191k38603J38652L11648K39184J43254j0996
13052B541977M10506M63259q5720p7937J97461k27745k50064j86574J75698J28869
$$ plain form
13042 3089730 2876512 2813732 2939244 3238639 3432724 2990741 2614966 2052274 1598792 1222814
13032 1222814 907853 1025561 1214729 1608711 1931397 2515178 2970472 3161104 3426727
13023 3426727 3519254 2848078 2426438 2871235 3114153 3326164 3863605 4295811 4262828 4045680
13013 4045680 3906693 4187397 4414519 4508640 4741854 4981536 5513361 5780009 5716770 5813189
13003 5813189 5807484 5956425 6478697 7404819 8347291 8936626 9444562 10021830 10584552 11305872
12993 11305872 11838178 12905217 14104368 15751010 17672882 19852442 22541730 25747702
12985 25747702 30169713 35355648 41737887 49952003 60439205 73562274 90178503 112462529
12977 112462529 142684719 182880784 233875288 291133661 336090351 343944382 311339737
$$ packed form
13042C089730k13218o2780J25512K99395J94085m41983l75775n62692m53482l75978
13032A222814l14961J17708J89168L93982L22686N83781M55294J90632K65623
13023C426727R2527o71176m21640M44797K42918K12011N37441M32206l2983k17148
13013D045680j38987K80704K27122R4121K33214K39682N31825K66648o3239R6419
13003E813189n705J48941N22272R26122R42472N89335N07936N77268N62722P21320
12993A1305872N32306J067039J199151J646642J921872K179560K689288L205972
12985B5747702M422011N185935O382239Q214116J0487202J3123069J6616229K2284026
12977A12462529L0222190M0196065N0994504N7258373M4956690P854031l2604645
$$ plain form
12970 311339737 259281731 208198317 166371680 134416473 110197318 91315330 76511083
12963 76511083 64835956 55806763 48788534 42984448 38198922 33893457 30062511 26737892
12955 26737892 24089091 22009642 20204181 18583445 17634412 16691913 15477650 14492224
12947 14492224 13410863 12194207 11314838 10803564 10548983 10246085 9978068 10024169 9924228
12938 9924228 9514665 9036389 8702380 8411890 8389131 8396098 8343949 8420286 8408796 8079896
12928 8079896 7974175 7986789 7911752 7787448 7678368 8083767 8781533 9491900 10295433 11498536
12918 11498536 13408923 15927068 18404079 20847765 22721851 23194532 22047827 20395850
12910 20395850 18809811 17806160 17385147 17512074 17847538 18258478 18866442 19728652 21406523
$$ packed form
12970C11339737n2058006n1083414m1826637l1955207k4219155j8881988j4804247
12963G6511083j1675127r029193p018229n804086m785526m305465l830946l324619
12955B6737892k648801k079449j805461j620736r49033r42499j214263r85426
12947A4492224j081361j216656q79369n11274k54581l02898k68017M6101r9941
12938I924228m09563m78276l34009k90490k2759O967n2149P6337j1490l28900
12928H079896j05721J2614p5037j24304j09080M05399O97766P10367Q03533J203103
12918A1498536J910387K518145K477011K443686J874086M72681j146705j651977
12910B0395850j586039j003651m21013J26927L35464M10940O07964Q62210J677871
$$ plain form
12901 21406523 23475463 25944004 29300149 33374421 38848848 45660727 54249393 64889933
12893 64889933 78743265 97071593 120961217 153079786 196491581 251728894 310016860
12886 310016860 348784386 344775289 302274862 247079541 197529049 158192647 128092722
12879 128092722 105192508 87258490 73009903 61767516 52745570 45496094 39288812
12872 39288812 34215584 30542670 27662940 25017998 23036989 21731663 20225415 18616676
12864 18616676 17316599 16634641 15859055 14959546 13896160 13060753 12433106 11567267 10824375
12855 10824375 10699019 10754521 10628115 10358270 9821949 9240225 8597442 7872791 7328363
12846 7328363 6997870 6922531 6787568 7044584 7190346 7026422 6802217 6790207 6648381 6341916
$$ packed form
12901B1406523K068940K468541L356145M074272N474427O811879Q588666J0640540
12893F4889933J3853332J8328328K3889624L2118569M3411795N5237313N8287966
12886C10016860L8767526m009097m2500427n5195321m9550492l9336402l0099925
12879A28092722k2900214j7934018j4248587j1242387r021946p249476o207282
12872C9288812n073228l672914k879730k644942j981009j305326j506248j608739
12864A8616676j300077o81958p75586q99509j063386q35407o27647q65839p42892
12855A0824375j25356N5502j26406k69845n36321n81724o42783p24651n44428
12846G328363l30493p5339j34963K57016J45762j63924k24205j2010j41826l06465
$$ plain form
12836 6341916 6592900 6755540 7103907 7770996 7861483 7989823 8027072 7910764 8443990 9036478
12826 9036478 9355883 9678580 10276057 10787001 11563762 12399806 13141107 13954757 15210640
12817 15210640 16905244 18720727 20965496 23244068 25685051 29121185 33655382 39702893
12809 39702893 47461542 56790612 68273635 83146608 103038985 129604389 164684867
12802 164684867 210383732 265721873 319139279 346300654 330716197 283965045 229999234
12795 229999234 183165393 146784263 119113135 97799111 81100042 68119976 57911979
12788 57911979 49725292 43205333 37888423 33312145 29446739 26141019 23001408 20367734
12780 20367734 18393914 16891360 15518944 14213459 12811566 11535244 10454912 9780550
$$ packed form
12836F341916K50984J62640L48367O67089R0487J28340L7249j16308N33226N92488
12826I036478L19405L22697N97477N10944P76761Q36044P41301Q13650J255883
12817A5210640J694604J815483K244769K278572K440983L436134M534197O047511
12809C9702893P758649R329070J1483023J4872973J9892377K6565404L5080478
12802A64684867M5698865N5338141N3417406K7161375j5584457m6751152n3965811
12795B29999234m6833841l6381130k7671128k1314024j6699069j2980066j0207997
12788E7911979q186687o519959n316910m576278l865406l305720l139611k633674
12780B0367734j973820j502554j372416j305485j401893j276322j080332o74362
$$ plain form
12772 9780550 9360647 8818349 8367033 7978654 7819031 7479555 7027664 6456495 5983472
12763 5983472 5812211 5455927 5028364 4869281 4987615 5013084 4900027 4741309 4433114 4190615
12753 4190615 4104315 3707387 3191525 3023657 2719750 2311305 2665837 3055833 3145624 3275114
12743 3275114 3353874 3170305 2874139 2515539 2186712 2023609 1854861 2161111 2475444 2564198
12733 2564198 2478228 2519248 2985957 3115328 2869777 2297443 1294058 576639 343516 1020967
12723 1020967 1608765 1648339 1676458 2330895 2737708 2703392 2796091 2914894 2945401 2542737
12713 2542737 1739201 1481413 1539909 1290138 1018079 893699 697189 269526 215730 1060410
12703 1060410 1788882 1756174 1628567 1705298 1658345 1449681 1029276 606081 526491 637957
$$ packed form
12772I780550m19903n42298m51316l88379j59623l39476m51891n71169m73023
12763E983472j71261l56284m27563j59083J18334K5469j13057j58718l08195k42499
12753D190615q6300l96928n15862j67868l03907m08445L54532L89996Q9791J29490
12743C275114P8760j83569k96166l58600l28827j63103j68748L06250L14333Q8754
12733B564198q5970M1020M66709J29371k45551n72334j003385p17419k33123O77451
12723A020967N87798L9574K8119O54437M06813l4316R2699J18803L0507m02664
12713B542737q03536k57788N8496k49771k72059j24380j96510m27663n3796Q44680
12703A060410P28472l2708j27607P6731m6953k08664m20405m23195p9590J11466
$$ plain form
12693 637957 586506 106471 -470203 -434856 140521 589304 801758 617581 332545 -113467
12683 -113467 -253010 121443 205705 6467 102924 488874 1106968 1406538 1515046 1613986
12673 1613986 1423514 1321422 1066004 973612 1089374 1136115 1270915 1354174 1503428 1184609
12663 1184609 909928 841326 780571 705950 570979 528934 309143 215345 346321 759772
12653 759772 1241710 1211364 883259 831745 382731 81803 124277 -53680 249082 746013
12643 746013 680756 421281 374211 696537 681137 383017 434284 377734 276049 -186996
12633 -186996 -671664 -34142 1101221 1959402 2251314 2107314 2098805 1493038 769354 466282
12623 466282 346872 82379 87270 -156660 -353539 -156456 117932 234621 171978 81645
$$ packed form
12693F37957n1451m80035n76674L5347N75377M48783K12454j84177k85036m46012
12683a13467j39543L74453Q4262j99238R6457L85950O18094K99570J08508R8940
12673A613986j90472j02092k55418r2392J15762M6741J34800Q3259J49254l18819
12663A184609k74681o8602o0755p4621j34971m2045k19791r3798J30976M13451
12653G59772M81938l0346l28105n1514m49014l00928M2474j77957L02762M96931
12643G46013o5257k59475m7070L22326j5400k98120N1267n6550j01685m63045
12633a86996m84668O37522J135363Q58181K91912j44000q509o05767p23684l03072
12623D66282j19410k64493M891k43930j96879J97083K74388J16689o2643r0333
$$ plain form
12613 81645 -4073 228741 355146 254693 -88065 -594485 -701101 -764080 -721404 -440590
12603 -440590 -379928 -326521 -470479 -351924 140521 442116 430440 499848 425817 -90015
12593 -90015 -491128 -288664 90742 115156 265104 691476 789265 583921 257300 22994
12583 22994 235930 31888 32997 -87381 -656164 -1075589 -866108 -508988 -330275 33124
12573 33124 357159 448360 573200 555194 294218 41321 200385 481732 522179 289885
12563 289885 -295487 -626307 -273515 265726 296192 315909 476840 504895 189424 -7909
12553 -7909 24757 7571 -353366 -176717 151039 377314 310234 17130 184584 451990
12543 451990 570103 694336 227678 -203830 82659 593281 538014 -10356 -418562 -147144
$$ packed form
12613H1645q5718K32814J26405j00453l42758n06420j06616o2979M2676K80814
12603d40590O0662N3407j43958J18555M92445L01595j1676O9408p4031n15832
12593i0015m01113K02464L79406K4414J49948M26372R7789k05344l26621k34306
12583B2994K12936k04042J109j20378n68783m19425K09481L57120J78713L63399
12573C3124L24035R1201J24840j8006k60976k52897J59064K81347M0447k32294
12563B89885n85372l30820L52792N39241L0466J9717J60931K8055l15471j97333
12553g909L2666j7186l60937J76649L27756K26275o7080k93104J67454K67406
12543D51990J18113J24233m66658m31508K86489N10622n5267n48370m08206K71418
$$ plain form
12533 -147144 14140 33459 194028 337583 675820 459297 -12294 -39930 -17941 -318431
12523 -318431 -593574 -429055 -290744 1346 211108 436718 161422 -384425 -637725 -906426
12513 -906426 -860870 -521505 109800 829651 980104 513544 12947 -509675 -688061 -348802
12503 -348802 97187 321275 238549 299079 595280 402934 284399 618380 692330 440329
12493 440329 397803 415540 456771 289186 225870 295405 325359 628102 1132150 1001178 766335
12482 766335 1056743 1142691 708786 372514 445753 501414 434709 378074 399967 124889 -412433
12471 -412433 -1004723 -1216239 -950656 -776135 -617739 -544601 -575347 -506623 -576144 -322398
12461 -322398 -13479 140923 -37847 -617079 -1131641 -1295604 -693109 -7370 44092 -228382
$$ packed form
12533a47144J61284J9319J60569J43555L38237k16523m71591k7636K1989l00490
12523c18431k75143J64519J38311K92090K09762K25610k75296n45847k53300k68701
12513i06426M5556L39365O31305P19851J50453m66560n00597n22622j78386L39259
12503c48802M45989K24088q2726O0530K96201j92346j18535L33981P3950k52001
12493D40329m2526J7737M1231j67585o3316O9535K9954L02743N04048j30972k34843
12482G66335K90408Q5948m33905l36272P3239N5661o6705n6635K1893k75078n37322
12471d12433n92290k11516K65583J74521J58396P3138l0746O8724o9521K53746
12461c22398L08919J54402j78770n79232n14562j63963O02495O85739N1462k72474
$$ plain form
12451 -228382 -341617 37160 508132 504081 377832 220593 -19309 -129526 -198683 -45177
12441 -45177 346401 387054 340307 620119 631617 361569 555273 944675 822582 650085
12431 650085 688056 424530 176091 38236 -364314 -508975 -205825 15266 -63047 -543661
12421 -543661 -905728 -989660 -623087 -17687 157320 129199 116030 99535 -39842 -35299 140899
12410 140899 367427 665357 698327 716780 597419 335740 543021 717758 907378 966876
12400 966876 937942 509662 -172871 -717049 -561364 -253467 -282019 -216634 -313216 -351039
12390 -351039 -585334 -902463 -846639 -397019 -119200 123170 332289 148013 -430087 -629083
12380 -629083 -289995 553427 1054495 1300263 1193576 1181820 760416 -4091 -299557 -209024
$$ packed form
12451b28382j13235L78777M70972m051j26249j57239k39902j10217o9157J53506
12441d5177L91578M0653m6747K79812J1498k70048J93704L89402j22093j72497
12431F50085L7971k63526k48439j37855m02550j44661L03150K21091p8313m80614
12421e43661l62067q3932L66573O05400J75007k8121j3169j6495j39377M543J76198
12410A40899K26528K97930L2970J8453j19361k61679K07281J74737J89620N9498
12400I66876k8934m28280o82533n44178J55685L07897k8552O5385r6582l7823
12390c51039k34295l17129N5824M49620K77819K42370K09119j84276n78100j98996
12380f29083L39088Q43422N01068K45768j06687j1756m21404p64507k95466R0533
$$ plain form
12370 -209024 106532 309685 19554 -687391 -701136 -275451 328670 633300 645734 481207
12360 481207 400467 493138 843615 1050725 532164 219770 275808 103006 -92916 1243
12350 1243 213955 419943 512643 406431 199798 100499 183662 354525 132597 41222 262047
12339 262047 251240 -13398 283816 640502 720851 784340 701001 523526 382617 361791
12329 361791 169671 -118591 -251766 -207347 -163070 -304484 -670679 -1008753 -1122683 -869993
12319 -869993 -780251 -804390 -752970 -955831 -1552628 -1987678 -1945124 -1640712 -1403344 -1211305
12309 -1211305 -958989 -855881 -757491 -539917 -477643 -457767 -181560 118562 131593 276481
12299 276481 202771 -517200 -757939 -617861 -414067 -337470 -619934 -431085 102480 193888
$$ packed form
12370b09024L15556K03153k90131p06945j3745M25685O04121L04630J2434j64527
12360D81207q0740R2671L50477K07110n18561l12394N6038j72802j95922R4159
12350A243K12712K05988R2700j06212k06633r9299Q3163J70863k21928r1375K20825
12339B62047j0807k64638K97214L56686Q0349O3489q3339j77475j40909k0826
12329C61791j92120k88262j33175M4419M4277j41414l66195l38074j13930K52690
12319h69993Q9742k4139N1420k02861n96797m35050M2554L04412K37368J92039
12309a211305K52316J03108R8390K17574O2274J9876K76207L00122J3031J44888
12299B76481p3710p19971k40739J40078K03794P6597k82464J88849N33565R1408
$$ plain form
12289 193888 62581 8445 -29968 57578 167177 168273 142396 94151 213543 532353 761412
12278 761412 781218 622456 310122 -169141 -155755 582346 939929 506251 104833 52201
12268 52201 290674 14629 131549 -139821 -560640 -260214 302046 851324 888657 551567
12258 551567 96818 -264610 -365335 -35810 -91302 -268289 -358915 -430394 -479507 -452549
12248 -452549 -437776 -326315 -20256 131526 -251967 -219105 236358 451675 467805 475123
12238 475123 207173 264777 857217 1165337 1179465 1015282 676415 529017 266714 -317774
12228 -317774 -601057 -382596 -281358 -40127 164837 171081 -37688 -265386 -59938 343494
12218 343494 601671 569761 611701 683266 908442 911756 724197 607245 794094 616319
$$ packed form
12289A93888j31307n4136l8413Q7546J09599J096k5877m8245J19392L18810K29059
12278G61412J9806j58762l12334m79263J3386P38101L57583m33678m01418n2632
12268E2201K38473k76045J16920k71370m20819L00426N62260N49278L7333l37090
12258E51567m54749l61428j00725L29525n5492j76987r0626p1479m9113K6958
12248d52549J4773J11461L06059J51782l83493L2862M55463K15317J6130P318
12238D75123k67950N7604N92440L08120J4128j64183l38867j47398k62303n84488
12228c17774k83283K18461J01238K41231K04964O244k08769k27698K05448M03432
12218C43494K58177l1910M1940P1565K25176L314j87559j16952J86849j77775
$$ plain form
12208 616319 228615 112649 62679 -37211 -152444 -250569 -445894 17849 475199 294290
12198 294290 27684 178303 431672 86607 -37731 139829 171942 85479 -281813 -332198
12188 -332198 -446836 -908886 -1179629 -840671 -307318 126712 541438 329189 8445 -406832
12178 -406832 -621500 -519056 -343631 373207 1114204 987131 1040515 1250366 1056834 679551
12168 679551 581661 711120 685653 524582 315173 228269 468515 458100 156720 120483
12158 120483 246085 12913 -28348 -240494 -712183 -945993 -821405 -604462 -633334 -926634
12148 -926634 -759399 -4883 884463 1134628 1046209 981228 867975 656823 457924 581468
12138 581468 526429 169714 -66444 -90239 -117076 -341701 -605770 -1094577 -1555702 -1695927
$$ packed form
12208F16319l87704j15966m9970r9890j15233r8125j95325M63743M57350j80909
12198B94290k66606J50619K53369l45065j24338J77560L2113q6463l67292n0385
12188c32198j14638m62050k70743L38958N33353M34030M14726k12249l20744m15277
12178d06832k14668J02444J75425P16838P40997j27073N3384K09851j93532l77283
12168F79551r7890J29459k5467j61071k09409q6904K40246j0415l01380l6237
12158A20483J25602k33172m1261k12146m71689k33810J24588K16943k8872k93300
12148i26634J67235P54516Q89346K50165q8419o4981j13253k11152j98899J23544
12138E81468n5039l56715k36158k3795k6837k24625k64069m88807m61125j40225
$$ plain form
12128 -1695927 -1609301 -1624515 -1802059 -2072344 -1891236 -1284290 -879947 -849879 -545393 -112895
12118 -112895 -131253 -119850 -338551 -356418 -413523 -68008 373307 328059 -119742 -55012 12065
12107 12065 -4060 306708 410458 247668 -135225 -585069 -655216 -231979 92168 -39575
12097 -39575 -319784 -153368 82404 -248237 -993119 -1370926 -1096191 -626362 -330816 -180593
12087 -180593 -1590 55941 103615 -254536 -543678 -711728 -870713 -852527 -964049 -837341
12077 -837341 -189556 48436 45922 138520 243603 578889 843441 721660 511318 188564
12067 188564 259235 368980 26263 -193569 -312396 -461036 -369258 -225912 -14895 94652
12057 94652 -86164 -469715 -350606 -36463 -212578 -251093 -29981 62173 257180 486145
$$ packed form
12128a695927Q6626j5214j77544k70285J81108O06946M04343L0068L04486M32498
12118a12895j8358J1403k18701j7867n7105L45515M41315m5248m47801O4730O7077
12107A2065j6125L10768J03750j62790l82893m49844p0147M23237L24147j31743
12097c9575k80209J66416K35772l30641p44882l77807K74735M69829K95546J50223
12087a80593J79003N7531M7674l58151k89142j68050j58985J8186j11522J26708
12077h37341O47785K37992k514R2598J05083L35286K64552j21781k10342l22754
12067A88564P0671J09745l42717k19832j18827j48640R1778J43346K11017J09547
12057I4652j80816l83551J19109L14143j76115l8515K21112R2154J95007K28965
$$ plain form
12047 486145 283090 197201 221668 253642 266641 344655 545250 987564 634394 301009
12037 301009 330171 140017 290429 655028 880215 655562 538370 391433 197510 62122
12027 62122 -9908 -280510 -416660 -312113 129461 367086 250332 275901 600254 577197
12017 577197 126763 -135848 -224704 -182516 -500117 -764081 -854228 -821161 -767383 -842574 -824894
12006 -824894 -407115 -253174 -629959 -805359 -705310 -404272 -103994 109951 351811 462730
11996 462730 294082 558033 695088 652509 420349 49172 -150696 -157127 -24049 91509
11986 91509 19905 -342956 -479527 -477896 152015 704534 503906 529089 757903 504073
11976 504073 2808 -79014 440455 850488 748964 -186210 -678877 -682150 -707532 -727200
$$ packed form
12047D86145k03055q5889K4467L1974J2999P8014K00595M42314l53170l33385
12037C01009K9162j90154J50412L64599K25187k24653j17192j46937j93923j35388
12027F2122p2030k70602j36150J04547M41574K37625j16754K5569L24353k3057
12017E77197m50434k62611q8856M2188l17601k63964r0147L3067N3778p5191J7680
12006h24894M17779J53941l76785j75400J00049L01038L00278K13945K41860J10919
11996D62730j68648K63951J37055m2579k32160l71177j99868o431J33078J15558
11986I1509p1604l62861j36571J631O29911N52519k00628K5183K28814k53830
11976E04073n01265q1822N19469M10033j01524r35174m92667l273k5382j9668
$$ plain form
11966 -727200 -635762 -518684 -651100 -663284 -589166 -646671 -748849 -725771 -599233 -678613 -455016
11955 -455016 -173660 -189722 -132094 -17483 84520 -142438 -712824 -1131925 -1300482 -772807
11945 -772807 -28628 91300 222942 504869 248219 -208632 -669845 -1110130 -985969 -412573
11935 -412573 251474 135100 -234926 -764825 -957422 -917891 -1026663 -925336 -630517 -600614
11925 -600614 -830259 -914820 -743366 -132782 84260 -15871 -168430 -192177 -105597 -341291
11915 -341291 -369270 42224 44005 -91728 113616 135477 -206246 -266092 -299548 -276597 -74104
11904 -74104 -216998 -317020 -316565 -940281 -1554077 -1789390 -1816737 -1436176 -1082223 -943397
11894 -943397 -903381 -635195 -365195 -439090 -738283 -1044915 -926699 -646380 -285412 28158
$$ packed form
11966g27200R1438J17078j32416j2184P4118n7505j02178K3078J26538p9380K23597
11955d55016K81356j6062N7628J14611J02003k26958n70386m19101j68557N27675
11945g72807P44179J19928J31642K81927k56650m56851m61213m40285J24161N73396
11935d12573O64047j16374l70026n29899j92597L9531j08772J01327K94819K9903
11925f00614k29645q4561J71454O10584K17042j00131j52559k3747Q6580k35694
11915c41291k7979M11494J781j35733K05344K1861l41723n9846l3456K2951K02493
11904g4104j42894j00022M55o23716o13796k35313k7347L80561L53953J38826
11894i43397M0016K68186K70000p3895k99193l06632J18216K80319L60968L13570
$$ plain form
11884 28158 -219170 -997285 -1338389 -885697 -281128 188643 -149962 -565382 -389712 -224599
11874 -224599 -494586 -745197 -662656 -559384 -464884 -159341 322419 583079 392967 279032
11864 279032 -175053 -712019 -847085 -763522 -499535 -111441 -85468 -458463 -576079 -418055
11854 -418055 -348213 -248814 -60899 34440 -120410 -93851 -36360 47425 544470 533785 317867
11843 317867 -80764 -346221 -464867 -688274 -740712 -517904 118804 461247 346136 245408
11833 245408 61817 50711 337577 331417 366793 358180 -38841 -260530 -680049 -841948 -618570
11822 -618570 -498659 -712099 -808510 -583760 -440360 -465268 -280405 -332164 -482689 -450358
11812 -450358 -381323 -362631 -286586 -102961 162144 363531 152252 213843 423219 626572
$$ packed form
11884B8158k47328p78115l41104M52692O04569M69771l38605m15420J75670J65113
11874b24599k69987k50611Q2541J03272R4500L05543M81760K60660j90112j13935
11864B79032m54085n36966j35066Q3563K63987L88094K5973l72995j17616J58024
11854d18055O9842R9399J87915R5339j54850K6559N7491Q3785M97045j0685k15918
11843C17867l98631k65457j18646k23407n2438K22808O36708L42443j15111j00728
11833B45408j83591j1106K86866o160L5376q613l97021k21689m19519j61899K23378
11822f18570J19911k13440r6411K24750J43400k4908J84863n1759j50525L2331
11812d50358O9035J8692P6045J83625K65105K01387k11279O1591K09376K03353
$$ plain form
11802 626572 420488 314906 633184 604239 352330 190683 261178 360785 479115 645422
11792 645422 588466 163281 -169011 -198007 -408112 -562412 -221087 104177 76256 -485290
11782 -485290 -552446 11747 401653 417031 177192 469657 445505 282166 324241 528943
11772 528943 969062 1087681 973570 1180878 1552260 1445536 1422034 1563384 1536721 1461450
11762 1461450 1373668 1178647 1075318 949726 912106 1187561 961995 599380 596213 192980
11752 192980 -357814 -183077 141571 1142882 1177479 222513 -143048 -150092 -330663 -524348
11742 -524348 -440180 -566313 -817205 -901398 -792534 -525388 -327340 -272367 -256520 -405889
11732 -405889 -805880 -1114439 -989152 -410732 -246436 -459312 -246859 60461 -62687 -538157
$$ packed form
11802F26572k06084j05582L18278k8945k51909j61647P0495R9607J18330J66307
11792F45422n6956m25185l32292k8996k10105j54300L41325L25264k7921n61546
11782d85290o7156N64193L89906J5378k39839K92465k4152j63339M2075K04702
11772E28943M40119J18619j14111K07308L71382j06724k3502J41350k6663p5271
11762A461450q7782j95021j03329j25592l7620K75455k25566l62615l167m03233
11752A92980n50794J74737L24648J001311L4597r54966l65561p044j80571j93685
11742e24348Q4168j26133k50892q4193J08864K67146J98048N4973J5847j49369
11732d05889l99991l08559J25287N78420J64296k12876K12453L07320j23148m75470
$$ plain form
11722 -538157 -957736 -1029204 -779408 -592122 -295467 64672 299774 375929 230571 -144645
11712 -144645 -319352 -235929 -427329 -724484 -588354 -463683 -297332 -103578 -467385 -857261
11702 -857261 -702191 -446987 -305878 -315756 -404670 -527223 -586965 -357026 171934 178045 -176320
11691 -176320 -245754 -284732 -156302 -119842 -276612 -247594 -205774 14009 60205 -366978 -991523
11680 -991523 -1099846 -621600 87940 777560 1230703 1492893 1401635 1187085 1088064 1161167
11670 1161167 1573109 1611459 1156035 693483 762856 630237 -76746 -701150 -958666 -1182714
11660 -1182714 -1523758 -1408610 -974346 -440813 -181744 186044 32802 -355118 -295663 -477515
11650 -477515 -263554 -89443 -94015 -205052 -500219 -387279 -1579 463780 520673 280103
$$ packed form
11722e38157m19579p1468K49796J87286K96655L60139K35102P6155j45358l75216
11712a44645j74707Q3423j91400k97155J36130J24671J66351J93754l63807l89876
11702h57261J55070K55204J41109r878q8914j22553n9742K29939N28960O111l54365
11691a76320o9434l8978J28430L6460j56770K9018M1820K19783M6196m27183o24545
11680i91523j08323M78246P09540O89620M53143K62190r1258k14550r9021P3103
11670A161167M11942L8350m55424m62552O9373j32619p06983o24404k57516k24048
11660a182714l41044J15148M34264N33533K59069L67788j53242l87920N9455j81852
11650d77515K13961J74111m572j11037k95167J12940L85700M65359N6893k40570
$$ plain form
11640 280103 173202 -51211 73115 593864 612273 410288 22259 -242408 -2061 -205150
11630 -205150 -189751 236526 38113 -153082 99610 258159 83003 -174050 -546055 -881337
11620 -881337 -826961 -323580 150002 314410 72461 -217217 -436246 -291720 341837 802283
11610 802283 624535 223618 203244 500609 839519 964050 942429 730945 203051 -62819
11600 -62819 361215 748439 655461 756630 828778 424698 -88860 -599922 -882065 -830632
11590 -830632 -1045280 -984938 -708832 -80491 495859 127477 -172409 -52171 261656 610895
11580 610895 960856 1109439 754093 586709 502025 362408 425299 548606 578665 467868
11570 467868 274280 -49336 -359246 -616421 -657829 -657202 -659663 -405472 -70702 -487604 -784423
$$ packed form
11640B80103j06901k24413J24326N20749J8409k01985l88029k64667K40347k03089
11630b05150J5399M26277j98413j91195K52692J58549j75156k57053l72005l35282
11620h81337N4376N03381M73582J64408k41949k89678k19029J44526O33557M60446
11610H02283j77748m00917k0374K97365L38910J24531k1621k11484n27894k65870
11600f2819M24034L87224r2978J01169P2148m04080n13558n11062k82143N1433
11590h30632k14648O0342K76106O28341N76350l68382k99886J20238L13827L49239
11580F10895L49961J48583l55346j67384q4684j39617O2891J23307L0059j10797
11570D67868j93588l23616l09910k57175m1408O27k461K54191L34770m16902k96819
$$ plain form
11559 -784423 -440700 -41652 -191485 -703178 -1050177 -1334800 -1345618 -395720 171596 235724
11549 235724 315525 322889 -105487 -492844 -921369 -824040 -505332 -517720 -708921 -1235227
11539 -1235227 -1446748 -1051809 -371028 -81684 -169660 -375738 -386261 -477427 -586965 -383666
11529 -383666 -274417 -361324 -173254 -339494 -420223 -144100 -18493 -237214 -289315 -477838
11519 -477838 -946268 -1074956 -733101 -295197 -152425 -388795 -657555 -452642 17788 295681
11509 295681 188472 55271 270526 603220 459966 331460 17169 -544667 -576428 -327592
11499 -327592 -568540 -925244 -1218237 -1324439 -1062839 -807016 -473101 -135454 336262 684955
11489 684955 585381 459586 454977 149006 -185856 -307581 -211142 -72686 9893 -519062
$$ packed form
11559g84423L43723L99048j49833n11693l46999k84623j0818R49898N67316O4128
11549B35724P9801P364m28376l87357m28525R7329L18708j2388j91201n26306
11539a235227k11521L94939O80781K89344q7976k06078j0523r1166j09538K03299
11529c83666J09249q6907J88070j66240q0729K76123J25607k18721n2101j88523
11519d77838m68430j28688L41855M37904J42772k36370k68760K04913M70430K77893
11509B95681j07209j33201K15255L32694j43254j28506l14291n61836l1761K48836
11499c27592k40948l56704k92993j06202K61600K55823L33915L37647M71716L48693
11489F84955r9574j25795m609l05971l34862j21725R6439J38456Q2579n28955
$$ plain form
11479 -519062 -1361914 -1382310 -826467 -674143 -548884 -605440 -1023044 -1251444 -988077 -761833
11469 -761833 -660173 -749690 -923144 -856108 -507348 -412352 -591472 -708759 -715961 -387116
11459 -387116 -80421 73865 -81741 -123539 51999 241856 512012 1344744 1747311 596165
11449 596165 -885590 -1393762 -943620 -688620 -438529 241550 335002 428573 629049 193384
11439 193384 -132611 -2723 23499 -150062 -66075 24588 19179 -32070 5825 -151860 -171256
11428 -171256 3458 -54470 -372985 -329134 136063 871238 973124 -13056 -345089 206174
11418 206174 620348 832763 638145 200666 -437715 -892169 -1001622 -1069914 -1167290 -1169679
11408 -1169679 -1071246 -737996 -232108 -161504 -639545 -932649 -533285 -336320 -453888 -664055
$$ packed form
11479e19062q42852k0396N55843J52324J25259n6556m17604k28400K63367K26244
11469g61833J01660q9517j73454O7036L48760R4996j79120j17287p202L28845
11459c87116L06695J54286j55606m1798J75538J89857K70156Q32732M02567j151146
11449E96165j481755n08172M50142K55000K50091O80079R3452R3571K00476m35665
11439A93384l25995J29888K6222j73561Q3987R0663n409n1249L7895j57685j9396
11428a71256J74714n7928l18515M3851M65197P35175J01886r86180l32033N51263
11418B06174M14174K12415j94618m37479o38381m54454j09453o8292r7376k389
11408a169679R8433L33250N05888P0604m78041k93104L99364J96965j17568k10167
$$ plain form
11398 -664055 -659896 -230264 -266486 -435607 -422465 -496624 -314223 -82243 270416 286978 145220
11387 145220 -201237 -377376 -49630 33891 19003 39565 -257153 -723361 -745187 -715355
11377 -715355 -1118535 -1171136 -953789 -1013244 -1012996 -875175 -1002600 -1100350 -911387 -925020 -815216
11366 -815216 -612332 -443435 -182662 42567 69784 66503 180675 550098 449072 236801
11356 236801 -12135 -166462 27276 -52528 -383651 -588734 -920150 -1202776 -1236020 -991576
11346 -991576 -440471 -50010 -404013 -680175 -684814 -551106 -177059 256376 580498 599984
11336 599984 489109 343352 -63592 -304376 -1958 231395 383292 300669 54714 -113439
11326 -113439 -11674 97712 46255 349479 1151914 1742894 1271344 476876 -37137 -161325
$$ packed form
11398f64055M159M29632l6222j69121J3142p4159J82401K31980L52659J6562j41758
11387A45220l46457j76139L27746Q3521j4888K0562k96718m66208k1826K9832
11377g15355m03180n2601K17347n9455K48J37821j27425r7750J88963j3633J09804
11366h15216K02884J68897K60773K25229K7217l281J14172L69423j01026k12271
11356B36801k48936j54327J93738p9804l31123k05083l31416k82626l3244K44444
11346i91576N51105L90461l54003k76162m639J33708L74047M33435L24122J9486
11336E99984j10875j45757m06944k40784L02418K33353J51897q2623k45955j68153
11326a13439J01765J09386n1457L03224Q02435N90980m71550p94468n14013j24188
$$ plain form
11316 -161325 58584 203384 128742 -106464 -124920 -202814 -259015 -160089 406455 902062
11306 902062 956749 527832 364342 383669 374112 116324 -485393 -880704 -919949 -677569
11296 -677569 -369812 -702680 -908208 -498476 -376161 -612595 -881163 -902036 -953652 -866661
11286 -866661 -502388 -442430 -595857 -684472 -599727 -685437 -543624 -599262 -619134 -533965 -234054
11275 -234054 -34208 -115748 66927 350322 131065 128337 183311 448517 635604 108027
11265 108027 -174731 -239940 -411102 -534555 -37041 494845 607393 538601 442820 -156698
11255 -156698 -1011510 -1152228 -742358 -470658 -194330 -172255 -430206 -339966 -83289 -124889
11245 -124889 -465452 -385976 -308492 -252419 -66878 136189 103349 -215544 -411603 -153130
$$ packed form
11316a61325K19909J44800p4642k35206j8456p7894n6201R8926N66544M95607
11306I02062N4687m28917j63490J9327r557k57788o01717l95311l9245K42380
11296f77569L07757l32868k05528M09732J22315k36434k68568k0873n1616Q6991
11286h66661L64273N9958j53427q8615Q4745q5710J41813n5638j9872Q5169K99911
11275b34054J99846q1540J82675K83395k19257k728N4974K65206J87087n27577
11265A08027k82758o5209j71162j23453M97514N31886J12548o8792r5781n99518
11255a56698q54812j40718M09870K71700K76328K2075k57951R0240K56677m1600
11245a24889l40563P9476P7484N6073J85541K03067l2840l18893j96059K58473
$$ plain form
11235 -153130 429089 854463 829287 339389 307851 543962 586255 416657 353408 417972
11225 417972 347463 324214 -9650 -561655 -859970 -704022 -769189 -931123 -940625 -984266 -843218
11214 -843218 -1031797 -1200799 -882037 -474683 -62800 -122507 -224361 -167377 -315669 -290707
11204 -290707 -138124 180115 401626 396832 580643 751614 855923 1068881 1046835 822943
11194 822943 487585 440820 438300 235274 119862 195212 377958 127113 -243801 -271209
11184 -271209 -173189 -295352 -501287 -755349 -719358 -376940 -148344 -267913 -251895 -126454
11174 -126454 104481 359477 18337 -433536 -687693 -756486 -525164 -442798 -546956 -571503
11164 -571503 -514176 -333493 47570 404581 82511 -420269 -911170 -1097864 -1055975 -973869
$$ packed form
11235a53130N82219M25374k5176m89898l1538K36111M2293j69598o3249O4564
11225D17972p0509k3249l33864n52005k98315J55948o5167j61934r502m3641J41048
11214h43218j88579j69002L18762M07354M11883n9707j01854N6984j48292K4962
11204b90707J52583L18239K21511m794J83811J70971J04309K12958k2046k23892
11194H22943l35358m6765k520k03026j15412P5350J82746k50845l70914k7408
11184b71209R8020j22163k05935k54062L5991L42418K28596j19569J6018J25441
11174a26454K30935K54996l41140m51873k54157o8793K31322Q2366j04158k4547
11164e71503N7327J80683L81063L57011l22070n02780m90901j86694M1889Q2106
$$ plain form
11154 -973869 -550169 -310931 -248075 -123070 -512421 -972673 -1039735 -1131388 -1331481 -1289000
11144 -1289000 -1077491 -811641 -638689 -473477 -401792 -200793 -142313 -190598 64627 89238
11134 89238 -60743 -176034 -105530 351885 401030 -36209 -314080 -321301 -86231 492561
11124 492561 476797 253746 36254 -110319 -362764 -299623 -88712 -370424 -473296 -687288
11114 -687288 -785697 -502545 114849 487261 468947 455623 678172 602974 200048 130825
11104 130825 68987 -73374 -45071 -134138 -163559 169721 640977 967874 669985 373221
11094 373221 124294 -185100 -131569 60848 -135812 -139149 206507 225502 -147056 -268034
11084 -268034 -74226 -220860 -445584 -257422 -7732 336875 608940 461795 268859 38920
$$ packed form
11154i73869M23700K39238O2856J25005l89351m60252o7062r1653k00093M2481
11144a289000K11509K65850J72952J65212P1685K00999N8480m8285K55225K4611
11134H9238j49981j15291P0504M57415M9145m37239k77871p221K35070N78792
11124D92561j5764k23051k17492j46573k52445O3141K10911k81712j02872k13992
11114f87288r8409K83152O17394L72412j8314j3324K22549p5198m02926o9223
11104A30825o1838j42361K8303q9067k9421L33280M71256L26897k97889k96764
11094C73221k48927l09394N3531J92417j96660l337L45656J8995l72558j20978
11084b68034J93808j46634k24724J88162K49690L44607K72065j47145j92936k29939
$$ plain form
11074 38920 111852 9241 -244544 -371422 -329822 -385998 -349579 -301562 -227448 -53202 195637
11063 195637 -256280 -724258 -624892 -751614 -929525 -482974 -322616 -695629 -1139375 -1339712
11053 -1339712 -1458066 -1517623 -937054 -127609 304176 395098 713301 974233 952689 488619
11043 488619 506185 269275 -152391 -103460 -250880 -394421 -379349 -291130 -75464 -226775
11033 -226775 -384521 -104034 -262986 -839844 -950416 -861116 -780254 -579811 -254196 163840
11023 163840 647669 577357 525547 613391 611614 58271 -220726 15212 -108715 -371628
11013 -371628 -176573 111942 -3958 -123080 -455446 -1040644 -1198108 -1269513 -1518469 -1398073
11003 -1398073 -1333381 -1558383 -1693541 -1511019 -1057968 -1045984 -1219138 -1258083 -917827 -211132
$$ packed form
11074C8920P2932j02611k53785j26878M1600n6176L6419M8017P4114J74246K48839
11063A95637m51917m67978R9366j26722j77911M46551J60358l73013m43746k00337
11053a339712j18354n9557N80569Q09445M31785R0922L18203K60932k1544m64070
11043D88619J7566k36910m21666M8931j47420j43541J5072Q8219K15666j51311
11033b26775j57746K80487j58952n76858j10572Q9300Q0862K00443L25615M18036
11023A63840M83829p0312n1810Q7844j777n53343k78997K35938j23927k62913
11013c71628J95055K88515j15900j19122l32366n85198j57464p1405k48956J20396
11003a398073O4692k25002j35158J82522M53051J1984j73154l8945L40256P06695
$$ plain form
10993 -211132 224004 74168 -351243 -345132 -133631 -219093 -558936 -1090579 -1266155 -1078665
10983 -1078665 -752359 -473713 -240132 -312601 -773609 -1052334 -655812 -58068 382483 176957
10973 176957 -92378 -1419 279055 468230 338434 78895 -137233 -67208 -82535 -802289
10963 -802289 -1150367 -709282 -639992 -594649 -618004 -755000 -766203 -546233 -430868 -274652
10953 -274652 -53690 -162907 -521181 -783116 -715126 -301122 -105919 -230839 -586655 -958582
10943 -958582 -1200932 -1418220 -1589136 -1286037 -1260517 -1347824 -847663 -209120 127390 290938
10933 290938 300136 13845 174685 458959 153161 -248506 -438294 -282187 -124483 -267565
10923 -267565 -728937 -994190 -1104487 -1061072 -954071 -585846 -239041 244757 699565 822250
$$ packed form
10993b11132M35136j49836m25411O111K11501q5462l39843n31643j75576J87490
10983a078665L26306K78646K33581p2469m61008k78725L96522N97744M40551k05526
10973A76957k69335R0959K80474J89175j29796k59539k16128P0025j5327p19754
10963h02289l48078M41085O9290M5343k3355j36996j1203K19970J15365J56216
10953b74652K20962j09217l58274k61935O7990M14004J95203j24920l55816l71927
10943i58582k42350k17288j70916L03099K5520q7307N00161O38543L36510J63548
10933B90938R198k86291J60840K84274l05798m01667j89788J56107J57704j43082
10923b67565m61372k65253j10297M3415J07001L68225L46805M83798M54808J22685
$$ plain form
10913 822250 757836 692158 529673 393778 745636 1364438 1441924 1189117 1118109 744648
10903 744648 207104 52146 270358 515443 522756 130089 -120666 175701 383872 610760
10893 610760 674109 621818 595926 398469 114563 -219004 -503698 -663956 -601281 -413742
10883 -413742 -448448 -456307 -41063 230477 248104 257220 227864 187549 462245 1264066 1512574
10872 1512574 807483 550894 454571 312095 394196 233727 19881 -42049 -406893 -816162
10862 -816162 -624180 -250525 85757 342801 332978 339477 10296 -596640 -742313 -635643
10852 -635643 -346794 -220994 -441989 -669240 -350660 -17864 -13732 -17378 3366 247798
10842 247798 563840 618956 178581 -141799 126506 151994 -288098 -551345 -726460 -1067183
$$ packed form
10913H22250o4414o5678j62485j35895L51858O18802P7486k52807p1008l73461
10903G44648n37544j54958K18212K45085P313l92667k50755K96367K08171K26888
10893F10760O3349n2291k5892j97457k83906l33567k84694j60258O2675J87539
10883d13742l4706p859M15244K71540J7627R116k9356m0315K74696Q01821K48508
10872A512574p05091k56589r6323j42476Q2101j60469k13846o1930l64844m09269
10862h16162J91982L73655L36282K57044r823O499l29181o06936j45673J06670
10852f35643K88849J25800k20995k27251L18580L32796M132l646K0744K44432
10842B47798L16042N5116m40375l20380K68305K5488m40092k63247j75115l40723
$$ plain form
10832 -1067183 -1120478 -779559 -447096 64569 507782 489039 269486 326948 346080 394277
10822 394277 308593 -25984 -493416 -639712 -398718 -188399 -347692 -942696 -1129457 -619331
10812 -619331 157112 366718 408129 -111418 -536557 -175190 163599 293594 457253 375481
10802 375481 356228 554146 564601 420767 177869 -186340 -222873 -534873 -1199620 -1349635
10792 -1349635 -1229620 -1025706 -730276 -330851 -213029 -371717 -392765 -276228 267790 765877
10782 765877 801145 569333 455450 69315 -411586 -498265 -531330 -470900 -225891 383552
10772 383552 539421 474304 361837 -341235 -784390 -734304 -413405 -518237 -1027071 -1036651
10762 -1036651 -867002 -848366 -1105340 -943526 -907862 -901868 -563275 -300926 -380706 -384553 86627
$$ packed form
10832a067183n3295L40919L32463N11665M43213j8743k19553N7462J9132M8197
10822C94277q5684l34577m67432j46296K40994K10319j59293n95004j86761N10126
10812f19331P76443K09606M1411n19547m25139L61367L38789J29995J63659q1772
10802C75481j9253J97918J0455j43834k42898l64209l6533l12000o64747j50015
10792a349635J20015K03914K95430L99425J17822j58688k1048J16537N44018M98087
10782G65877L5268k31812j13883l86135m80901q6679l3065O0430K45009O09443
10772C83552J55869o5117j12467p03072m43155N0086L20899j04832n08834r580
10762a036651J69649J8636k56974J61814L5664N994L38593K62349p9780l847M71180
$$ plain form
10751 86627 539528 646403 774302 899071 527155 -92760 92712 382575 186787 617681
10741 617681 847991 225905 -127365 249359 307870 112866 -47933 -323567 -181340 160852
10731 160852 396700 725617 341159 -402944 -436416 -445053 -488072 -102187 -220611 -684877
10721 -684877 -676649 -334467 -135605 117839 219906 274571 118557 -150950 -37954 188081
10711 188081 300882 263444 -121293 -578600 -722373 -724049 -495340 -467510 -693531 -638687
10701 -638687 -633107 -485894 -656014 -912849 -855111 -749255 -785795 -542458 -149454 -87216
10691 -87216 -56686 381113 549910 203270 -499624 -728711 -546295 -232478 145847 -177502
10681 -177502 -450477 -95620 153297 172923 136378 -89063 -249462 -353404 -216659 -244400
$$ packed form
10751H6627M52901J06875J27899J24769l71916o19915J85472K89863j95788M30894
10741F17681K30310o22086l53270L76724N8511j95004j60799k75634J42227L42192
10731A60852K35848L28917l84458p44103l3472q637m3019L85885j18424m64266
10721f84877Q228L42182J98862K53444J02067N4665j56014k69507J12996K26035
10711A88081J12801l7438l84737m57307j43773j676K28709K7830k26021N4844
10701f38687N580J47213j70120k56835N7738J05856l6540K43337L93004O2238
10691h7216L0530M37799J68797l46640p02894k29087J82416L13817L78325l23349
10681a77502k72975L54857K48917J9626l6545k25441j60399j03942J36745k7741
$$ plain form
10671 -244400 -364647 -564132 -601343 -246627 -12605 -3629 -251510 -566976 -366537 -153509
10661 -153509 188220 383930 289351 -108486 -147652 65706 268456 158830 57964 110649
10651 110649 9995 -144641 -622866 -888587 -874651 -1072422 -1085491 -886575 -775148 -604274
10641 -604274 -212055 485244 686972 544314 402446 102761 -382122 -1305438 -1671227 -1695177
10631 -1695177 -1353758 -1153470 -756953 -506722 -430758 -580342 -529158 -296686 -212745 -2409
10621 -2409 -230131 -510376 -373780 -436119 -642298 -862182 -559168 -452195 -714308 -867370
10611 -867370 -856214 -818028 -659806 -487727 -590021 -715813 -435419 90277 615141 382942
10601 382942 -18334 231916 423229 587075 1033624 1032624 493907 -40595 -100136 17644
$$ packed form
10671b44400j20247j99485l7211L54716K34022Q976k47881l15466K00439K13028
10661a53509L41729J95710r4579l97837l9166K13358K02750j09626j00866N2685
10651A10649j00654j54636m78225k65721J3936j97771j3069J98916J11427J70874
10641f04274L92219O97299K01728j42658j41868k99685m84883r23316l65789k3950
10631a695177L41419K00288L96517K50231P5964j49584N1184K32472Q3941K10336
10621b409k27722k80245J36596o2339k06179k19884L03014J06973k62113j53062
10611h67370J1156L8186J58222J72079j02294j25792K80394N25696N24864k32199
10601C82942m01276K50250J91313J63846M46549j000n38717n34502n9541J17780
$$ plain form
10591 17644 -30679 308332 325799 220172 380556 158172 -323612 -309646 -357765 -262222 132525
10580 132525 334017 167584 -198031 -210486 -94478 -704338 -874492 -917115 -923244 -599529
10570 -599529 -328068 -10046 43640 -202950 -595682 -1132027 -1126496 -597258 -46096 -168816
10560 -168816 -382535 -266116 -511517 -804896 -1087825 -1420471 -1249559 -1045751 -746913 -289395
10550 -289395 -320831 -401417 -241051 -238109 -228561 49929 259707 309379 199384 356135 667504
10539 667504 1155600 1112308 607584 195137 -105473 -409746 -431453 -59661 336621 218992
10529 218992 -299835 -100920 283668 197533 164501 -182509 -534223 -490353 -208430 189563
10519 189563 75223 -440616 -908095 -798208 -703864 -656245 -684734 -864522 -928787 -764464
$$ packed form
10591A7644m8323L39011J7467j05627J60384k22384m81784J3966m8119R5543L94747
10580A32525K01492j66433l65615j2455J16008o09860j70154m2623o129L23715
10570e99529K71461L18022N3686k46590l92732n36345N531N29238N51162j22720
10560a68816k13719J16419k45401k93379k82929l32646J70912K03808K98838M57518
10550b89395l1436q0586J60366K942R548K78490K09778M9672j09995J56751L11369
10539F67504M88096m3292n04724m12447l00610l04273k1707L71792L96282j17629
10529B18992n18827J98915L84588q6135l3032l47010l51714M3870K81923L97993
10519A89563j14340n15839m67479J09887R4344M7619k8489j79788o4265J64323
$$ plain form
10509 -764464 -553033 -507670 -825197 -1084854 -650749 61905 308830 603279 921663 841285
10499 841285 828685 921518 824700 684039 455113 384446 154453 11819 28126 231289
10489 231289 572044 765076 815198 819893 498813 312529 295760 -178426 -611390 -659616
10479 -659616 -521259 -162661 266101 197362 -45747 -218609 -405352 -510562 -429513 -621825
10469 -621825 -698699 -504854 -431206 -296203 -172332 153095 810132 1192394 980123 755988
10459 755988 656477 883606 851888 432230 370585 499852 404065 389300 565141 683399
10449 683399 423171 19015 -212203 -31750 254584 192887 111345 136870 90187 239561
10439 239561 476696 678160 1189308 1881255 3491824 5440895 6507786 5479475 3668797
$$ packed form
10509g64464K11431M5363l17527k59657M34105P12654K46925K94449L18384q0378
10499H41285j2600R2833r6818j40661k28926p0667k29993j42634J6307K03163
10489B31289L40755J93032N0122M695l21080j86284j6769m74186m32964m8226
10479f59616J38357L58598M28762o8739k43109j72862j86743j05210Q1049j92312
10469f21825p6874J93845P3648J35003J23871L25427O57037L82262k12271k24135
10459G55988r9511K27129l1718m19658o1645J29267r5787j4765J75841J18258
10449F83399k60228m04156k31218J80453K86334o1697q1542K5525m6683J49374
10439B39561K37135K01464N11148O91947J610569J949071J066891j028311j810678
$$ plain form
10430 3668797 2569376 1913556 1435035 943969 841371 1124910 921407 549490 190690
10421 190690 61775 -28693 -261753 -384168 -45082 721589 978095 577746 60686 -494093
10411 -494093 -765581 -344532 43949 33286 -135759 -384573 -436452 -191418 -262885 -374087
10401 -374087 -418673 -434647 -445729 -411691 -326466 -129426 128851 91309 -54082 322647 450508
10390 450508 557549 789669 823533 299704 -115612 -91086 -202300 -137891 172792 470963
10380 470963 410321 210399 317000 67408 -534460 -1002476 -1129048 -964337 -862281 -548975
10370 -548975 -332887 -488014 -757831 -914312 -911217 -621982 -120073 -217906 -366800 -293183
10360 -293183 -343114 -435914 -858057 -900525 -486383 -398617 -405940 -462665 -406920 -364754 -555510
$$ packed form
10430C668797j099421o55820m78521m91066j02598K83539k03503l71917l58800
10421A90690j28915r0468k33060j22415L39086P66671K56506m00349n17060n54779
10411d94093k71488M21049L88481j0663j69045k48814n1879K45034p1467j11202
10401c74087m4586j5974j1082L4038Q5225J97040K58277l7542j45391L76729J27861
10390D50508J07041K32120L3864n23829m15316K4526j11214O4409L10683K98171
10380D70963o0642j99922J06601k49592o01868m68016j26572J64711J02056L13306
10370e48975K16088j55127k69817j56481L095K89235N01909r7833j48894P3617
10360b93183m9931r2800m22143m2468M14142Q7766p323n6725N5745M2166j90756
$$ plain form
10349 -555510 -389684 -526916 -844213 -860536 -631885 -681761 -1190834 -1419075 -1715270 -1560066
10339 -1560066 -658004 -190956 -317242 -464922 -177981 -68391 -103020 -4747 302997 599347
10329 599347 519666 493923 662692 944487 1067372 879106 742715 636774 277291 -110999
10319 -110999 -346999 -246936 57887 298621 611458 761387 132865 -799471 -1247726 -1204128
10309 -1204128 -769504 -471251 -284775 218650 275545 1777 87184 427590 536034 157929
10299 157929 -621884 -861839 -50666 353543 145671 -61776 -210452 -210018 -198587 -243597
10289 -243597 -331234 -495044 -572232 -762915 -679793 -538652 -355260 -186205 -329893 -434015
10279 -434015 249119 485942 181581 149666 -218589 -702668 -917151 -533075 142986 103810
$$ packed form
10349e55510J65826j37232l17297j6323K28651m9876n09073k28241k96195J55204
10339a560066R02062M67048j26286j47680K86941J09590l4629R8273L07744K96350
10329E99347p9681k5743J68769K81795J22885j88266j36391j05941l59483l88290
10319a10999k36000J00063L04823K40734L12837J49929o28522r32336m48255M3598
10309a204128M34624K98253J86476N03425N6895k73768Q5407L40406J08444l78105
10299A57929p79813k39955Q11173M04209k07872k07447j48676M34J1431m5010
10289b43597q7637j63810p7188j90683Q3122J41141J83392J69055j43688j04122
10279d34015O83134K36823l04361l1915l68255m84079k14483L84076O76061l9176
$$ plain form
10269 103810 -363856 -194554 128057 212931 287231 558859 838544 1037609 787001 518698
10259 518698 53170 -161339 -25473 -245250 -619766 -996333 -1022087 -884959 -646509 -323762
10249 -323762 81005 438134 621634 528520 51472 -651257 -1197418 -1167784 -1076502 -869614
10239 -869614 -862467 -888183 -585708 -397292 -220571 393550 907727 873195 535594 441693
10229 441693 550050 442496 262328 190925 290074 -18195 -364059 -848369 -1296919 -1377496
10219 -1377496 -1474368 -1817344 -1654644 -895349 -536572 -366066 -253813 -188197 -161275 -229379
10209 -229379 -152380 -36258 -252948 -559741 -967256 -1279185 -1257815 -1021571 -803742 -827837
10199 -827837 -1304723 -1549965 -1195489 -771148 -733590 -348541 -91536 -307800 -695956 -636014
$$ packed form
10269A03810m67666J69302L22611Q4874P4300K71628K79685J99065k50608k68303
10259E18698m65528k14509J35866k19777l74516l76567k5754J37128K38450L22747
10249c23762M04767L57129J83500r3114m77048p02729n46161K9634R1282K06888
10239h69614P147k5716L02475J88416J76721O14121N14177l4532l37601r3901
10229D41693J08357j07554j80168p1403R9149l08269l45864m84310m48550q0577
10219a377496r6872l42976J62700P59295L58777J70506J12253O5616K6922o8104
10209b29379P6999J16122k16690l06793m07515l11929K1370K36244K17829k4095
10199h27837m76886k45242L54476M24341L7558L85049K57005k16264l88156N9942
$$ plain form
10189 -636014 97116 479125 193673 -355188 -670632 -642800 -569831 -923206 -1136542 -884178
10179 -884178 -493432 -427726 -593712 -524614 -39364 346572 583474 690940 242827 -88343
10169 -88343 82901 69828 -175936 6882 222396 266671 -13618 -189073 -121822 88676
10159 88676 469690 718593 567640 57060 -369024 -558126 -285433 112163 463668 487847
10149 487847 150199 -60760 -244919 -84304 401486 477186 308208 -6002 -114739 -237462
10139 -237462 -152885 -89969 19039 -37829 -81274 48717 194798 -50564 -747307 -1361505
10129 -1361505 -1222920 -671751 -368791 -389274 -559315 -634615 -405462 110839 485595 909732
10119 909732 1013329 473221 293259 526924 562383 408165 559303 529812 286806 172713
$$ packed form
10189f36014P33130L82009k85452n48861l15444K7832P2969l53375k13336K52364
10179h84178L90746O5706j65986O9098M85250L85936K36902J07466m48113l31170
10169h8343J71244j3073k45764J82818K15514M4275k80289j75455O7251K10498
10159H8676L81014K48903j50953n10580m26084j89102K72693L97596L51505K4179
10149D87847l37648k10959j84159J60615M85790P5700j68978l14210j08737j22723
10139b37462Q4577O2916J09008n6868m3445J29991J46081k45362o96743o14198
10129a361505J38585N51169L02960k0483j70041p5300K29153N16301L74756M24137
10119I09732J03597n40108j79962K33665L5459j54218J51138k9491k43006j14093
$$ plain form
10109 172713 430929 798180 741733 660909 628964 457382 120319 387656 846142 766443
10099 766443 579445 168350 -211444 -92002 62388 -7571 167604 395707 462593 938237
10089 938237 1947201 3110695 3745750 3048787 1974337 1485833 1656758 1727061 1097460
10080 1097460 554735 435939 385332 589491 867040 1183264 1050367 902750 842766 715547
10070 715547 912421 1455155 2124598 2637755 3524630 5213173 6796581 8444724 10557523
10061 10557523 13496898 17047442 22228696 30282783 43962780 63983460 84875455 84646633
10053 84646633 63708984 45004070 32791511 24827110 19214841 15369757 12450962 10559459
10045 10559459 9143540 7744618 6285241 5257279 4702147 4391975 3741954 2862905 2498860
$$ packed form
10109A72713K58216L67251n6447q0824l1945j71582l37063K67337M58486p9699
10099G66443j86998m11095l79794J19442J54390o9959J75175K28103O6886M75644
10089I38237J008964J163494O35055o96963j074450m88504J70925P0303o29601
10080A097460n42725j18796n0607K04159K77549L16224j32897j47617n9984j27219
10070G15547J96874N42734O69443N13157Q86875J688543J583408J648143K112799
10061A0557523K939375L550544N181254Q054087J3679997K0020680K0891995k28822
10053H4646633k0937649j8704914j2212559p964401n612269l845084k918795j891503
10045A0559459j415919j398922j459377j027962n55132l10172o50021q79049l64045
$$ plain form
10036 2498860 2083541 1425335 1206144 1199937 1338206 1564141 1621864 1795838 1984777 1845070
$$ packed form
10036B498860m15319o58206k19191o207J38269K25935N7723J73974J88939j39707
$$ [...]
##END NTUPLES=NMR SPECTRUM
##END=
