##TITLE=C13_SL59-Yellow-point
 CDcl3, 2000 sc

 10.6.2022
##JCAMPDX= 6.0         $$ Bruker NMR JCAMP-DX V2.0
##DATA TYPE= NMR SPECTRUM
##DATA CLASS= NTUPLES
##ORIGIN= UXNMR, Bruker Analytische Messtechnik GmbH
##OWNER= root
$$ XWIN-NMR		Version 3.5
$$ Fri Jun 10 16:30:08 2022 Russian Standard Time (UT+4h)  she@DPX200
##.OBSERVE FREQUENCY= 50.327896
##.OBSERVE NUCLEUS= ^13C
##.ACQUISITION MODE= SIMULTANEOUS
##.ACQUISITION SCHEME= undefined
##.AVERAGES= 2017
##.DIGITISER RES= 17
##SPECTROMETER/DATA SYSTEM= spect
##.PULSE SEQUENCE= zgpg30
##.SOLVENT NAME= CDCl3
##.SHIFT REFERENCE= (INTERNAL, CDCl3, 0, 222.653)
##AUDIT TRAIL= $$ (NUMBER, WHEN, WHO, WHERE, WHAT)
$$ ##TITLE= Audit trail, XWIN-NMR		Version 3.5
$$ ##JCAMPDX= 5.01
$$ ##ORIGIN= Bruker BioSpin GmbH
$$ ##OWNER= she
$$ F:/spectra/data/she/nmr/c13/1/pdata/1/auditp.txt
$$ ##AUDIT TRAIL=  $$ (NUMBER, WHEN, WHO, WHERE, WHAT)
(   1,<2022-06-10 16:28:11.54 +0400>,<she>,<DPX200>,
      <created by zg, POWCHK disabled, PULCHK disabled
       terminated by command 'halt'
       configuration hash MD5:
       00 E9 B6 7A A2 85 ED C7 34 08 36 98 17 FE 4E 26
       data hash MD5: 32K
       14 5D 55 C4 C7 0E 03 2A 18 D8 58 12 AA 6B 55 9B>)
(   2,<2022-06-10 16:28:14.60 +0400>,<she>,<DPX200>,
      <Start of raw data processing
       efp BC_mod = 2 LB = 1 FT_mod = 6 PKNL = 1 PHC0 = -353.5875 PHC1 = 24.4847 SI = 32K 
       data hash MD5: 32K
       81 53 55 6B 17 B7 5D F4 36 BC BD C9 6E 51 8C 25>)
(   3,<2022-06-10 16:28:17.40 +0400>,<she>,<DPX200>,
      <abs ABSG = 5 
       data hash MD5: 32K
       27 34 89 BD 1A A7 1B C1 17 AC 59 08 45 F7 F1 84>)
(   4,<2022-06-10 16:29:16.62 +0400>,<she>,<DPX200>,
      <pk PHC0 = -33.90261 PHC1 = 56.19999 
       data hash MD5: 32K
       2E D3 88 2B 41 A4 68 72 2C CE F7 CB 0C 04 D8 58>)
(   5,<2022-06-10 16:29:19.96 +0400>,<she>,<DPX200>,
      <abs ABSG = 5 
       data hash MD5: 32K
       42 FD 7B AA 0A C8 1F 48 D0 4A 87 F6 90 75 A9 16>)
$$ ##END=
$$ 
$$ hash MD5
$$ E0 6B C3 14 1C 9A FF A7 2C 19 B8 5A BC 89 D6 F6
##$RELAX= 
##$RELAX= 
##$RELAX= 
##$RELAX= 
##$RELAX= 
##$RELAX= 
##$RELAX= 
##$RELAX= 
$$ Bruker specific parameters
$$ --------------------------
##$DU= <F:/spectra>
##$EXPNO= 1
##$NAME= <c13>
##$PROCNO= 1
##$TYPE= <nmr>
##$USER= <she>
##$AMP= (0..31)
100 100 100 100 100 100 100 100 100 100 100 100 100 100 100 100 100 100 
100 100 100 100 100 100 100 100 100 100 100 100 100 100 
##$AQSEQ= 0
##$AQ_mod= 1
##$AUNM= <au_zg>
##$AUTOPOS= <>
##$BF1= 50.322709
##$BF2= 200.13
##$BF3= 50.322709
##$BF4= 500.13
##$BF5= 500.13
##$BF6= 500.13
##$BF7= 500.13
##$BF8= 500.13
##$BYTORDA= 1
##$CFDGTYP= 0
##$CFRGTYP= 5
##$CHEMSTR= <none>
##$CNST= (0..31)
1 1 145 1 1 1 1 1 1 1 1 1 1 1 1 1 1 1 1 1 1 1 1 1 1 1 1 1 1 1 1 1 
##$CPDPRG= <waltz16>
##$CPDPRG1= <>
##$CPDPRG2= <waltz16>
##$CPDPRG3= <>
##$CPDPRG4= <mlev>
##$CPDPRG5= <mlev>
##$CPDPRG6= <mlev>
##$CPDPRG7= <mlev>
##$CPDPRG8= <mlev>
##$CPDPRGB= <>
##$CPDPRGT= <>
##$D= (0..31)
$$ [...]
##$SUBNAM4= <"">
##$SUBNAM5= <"">
##$SUBNAM6= <"">
##$SUBNAM7= <"">
##$SUBNAM8= <"">
##$SUBNAM9= <"">
##$SW= 239.972175391363
##$SWIBOX= (0..15)
0 1 3 0 0 0 0 0 0 0 0 0 0 0 0 0 
##$SW_h= 12077.2946859903
##$TD= 32768
##$TD0= 1
##$TE= 0
##$TE2= 300
##$TE3= 300
##$TEG= 300
##$TL= (0..7)
120 120 120 120 120 120 120 120 
##$TP= (0..7)
150 150 150 150 150 150 150 150 
##$TP07= 0
##$TPNAME0= <>
##$TPNAME1= <>
##$TPNAME2= <>
##$TPNAME3= <>
##$TPNAME4= <>
##$TPNAME5= <>
##$TPNAME6= <>
##$TPNAME7= <>
##$TPOAL= (0..7)
0.5 0.5 0.5 0.5 0.5 0.5 0.5 0.5 
##$TPOFFS= (0..7)
0 0 0 0 0 0 0 0 
##$TUNHIN= 0
##$TUNHOUT= 0
##$TUNXOUT= 0
##$USERA1= <user>
##$USERA2= <user>
##$USERA3= <user>
##$USERA4= <user>
##$USERA5= <user>
##$V9= 5
##$VALIST= <valist>
##$VCLIST= <CCCCCCCCCCCCCCC>
##$VD= 0
##$VDLIST= <DDDDDDDDDDDDDDD>
##$VPLIST= <PPPPPPPPPPPPPPP>
##$VTLIST= <TTTTTTTTTTTTTTT>
##$WBST= 1024
##$WBSW= 4
##$XGAIN= (0..3)
0 0 0 0 
##$XL= 0
##$YL= 0
##$YMAX_a= 12202047
##$YMIN_a= -3143974
##$ZGOPTNS= <>
##$ZL1= 120
##$ZL2= 120
##$ZL3= 120
##$ZL4= 120
##$ABSF1= 222.6533
##$ABSF2= -17.34351
##$ABSG= 5
##$ABSL= 3
##$ALPHA= 0
##$AQORDER= 0
##$ASSFAC= 0
##$ASSFACI= 0
##$ASSFACX= 0
##$ASSWID= 0
##$AUNMP= <proc_1d>
##$AZFE= 0.1
##$AZFW= 0.5
##$BCFW= 0
##$BC_mod= 2
##$BYTORDP= 0
##$COROFFS= 0
##$CY= -3
##$DATMOD= 1
##$DC= 0
##$DFILT= <>
##$DTYPP= 0
##$F1P= 0
##$F2P= 0
##$FCOR= 0.5
##$FTSIZE= 32768
##$FT_mod= 6
##$GAMMA= 0
##$GB= 0
##$INTBC= 1
##$INTSCL= 4.134877e-10
##$ISEN= 128
##$LB= 1
##$LEV0= 0
##$LPBIN= 0
##$MAXI= 10000
##$MC2= 0
##$MEAN= 0
##$ME_mod= 0
##$MI= 0.1934396
##$NCOEF= 0
##$NC_proc= -1
##$NLEV= 6
##$NOISF1= 120.0001
##$NOISF2= 80.00006
##$NSP= 0
##$NTH_PI= 0
##$NZP= 0
##$OFFSET= 222.6533
##$PC= 1.4
##$PHC0= -387.4901
##$PHC1= 80.68469
##$PH_mod= 1
##$PKNL= yes
##$PPARMOD= 0
##$PSCAL= 0
##$PSIGN= 0
##$REVERSE= no
##$SF= 50.322730123286
##$SI= 32768
##$SIGF1= 140
##$SIGF2= 120
##$SINO= 11.81781
##$SIOLD= 32768
##$SREGLST= <13C.CDCl3>
##$SSB= 0
##$STSI= 32768
##$STSR= 0
##$SW_p= 12077.2946859903
##$SYMM= 0
##$S_DEV= 0
##$TDeff= 32768
##$TDoff= 0
##$TI= <>
##$TILT= no
##$TM1= 0
##$TM2= 0
##$TOPLEV= 0
##$USERP1= <user>
##$USERP2= <user>
##$USERP3= <user>
##$USERP4= <user>
##$USERP5= <user>
##$WDW= 1
##$XDIM= 32768
##$YMAX_p= 392093267
##$YMIN_p= -5646002
$$ End of Bruker specific parameters
$$ ---------------------------------
##NTUPLES= NMR SPECTRUM
##VAR_NAME=  FREQUENCY,     SPECTRUM/REAL,   SPECTRUM/IMAG
##SYMBOL=    X,             R,               I
##VAR_TYPE=  INDEPENDENT,   DEPENDENT,       DEPENDENT
##VAR_FORM=  AFFN,          ASDF,            ASDF
##VAR_DIM=   32768,         32768,           32768
##UNITS=     HZ,            ARBITRARY UNITS, ARBITRARY UNITS
##FACTOR=    0.368581032318806, 1,           1
##FIRST=     11204.5221812756, 0,            0
##LAST=      -872.772504714734, 0,           0
##MIN=       -872.772504714734, -5646002,    0
##MAX=       11204.5221812756, 392093267,    0
$$ Real data points
##PAGE= N=1
##DATA TABLE= (X++(R..R)), XYDATA
$$ [...]
15562b432035J020868J344343J333329L34308j15046L31493N87994P48029O49459
15553C802742l73246r94875n51572k19329q98239R2447P00797J031066r21673
15544A668118o82519Q67165n53204p95161J39142m6540n78776J25397m53692q97694
15534a207764k87957M36013P98242R0581m37054l93217l45933l94319M11178M90709
15524h39521Q35569N71236k58332n94495m86098p39368j44054j621n707P34775
15514i27616L31204p02348O42644N00202l85079l81891o38714o91318j159546
15505c412462p66208P54572J028889M86179J98670K24179J134355n599r02369
15496a259794l47952n97584o95743n03853J75562P53110P93654J369758J301819
$$ plain form
15562 -2432035 -1411167 -66824 1266505 1600813 1485767 1817260 2405254 3153283 3802742
15553 3802742 3429496 2434621 1883049 1663720 765481 857928 1558725 2589791 1668118
15544 1668118 985599 1852764 1299560 504399 643541 597001 18225 143622 -310070 -1207764
15534 -1207764 -1495721 -1059708 -261466 -170885 -607939 -1001156 -1347089 -1741408 -1330230 -839521
15524 -839521 -3952 567284 308952 -285543 -771641 -1511009 -1655063 -1656684 -1662391 -927616
15514 -927616 -596412 -1298760 -656116 -155914 -540993 -922884 -1561598 -2252916 -3412462
15505 -3412462 -4178670 -3424098 -2395209 -1909030 -1710360 -1486181 -351826 -357425 -1259794
15496 -1259794 -1607746 -2205330 -2901073 -3404926 -3229364 -2476254 -1682600 -312842 988977
15487I88977O73618j165772l24633k12542n16022l24575q161P9022L15607N06896
15477A2415o6969q07105j039598R11919J580254K4742l64447k28413n88419r49002
15467a514623l13179O11234R79498J018130J25000p63102l48309K24548k13135
15458a93938k10175J8937J88633L95024k61776K91469M13322j362059j056005
15449a776568O69805R8122m44176K75416j26750l60944l3917O35147N26827k44374
15439g81412R03228O58071m60828m00941L14760P84031P74529O3778j13500k97477
15429A444239K84693J7960o30350n86478m96442m78493k69190L61075K37575o42398
15419g57809J17659l2117p9861N43736J209804L88827p1310K49692P9819P6026
$$ plain form
15487 988977 1662595 496823 172190 -40352 -556374 -880949 -889110 -810088 -494481 12415
15477 12415 -54554 -861659 -1901257 -989338 590916 615658 251211 22798 -565621 -1514623
15467 -1514623 -1827802 -1216568 -237070 781060 906060 142958 -205351 19197 -193938
15458 -193938 -404113 -385176 -196543 198481 -63295 228174 641496 -720563 -1776568
15449 -1776568 -1106763 -1008641 -1452817 -1177401 -1304151 -1665095 -1699012 -1063865 -537038 -781412
15439 -781412 121816 779887 319059 -81882 232878 1016909 1791438 1855216 1741716 1444239
15429 1444239 1728932 1746892 1116542 530064 33622 -444871 -714061 -352986 -115411 -757809
15419 -757809 -640150 -672267 -752128 -208392 1001412 1390239 1318929 1568621 1648440 1724466
15409A724466q40641k68660j32839k34115o58652p28656q7910N94662J74483J3798
15399d44064O5440P12323Q65204l70218o09903J41100J69902k74398j57627P4689
15389A72448N19387J352950J550577k7138p02002J4554o67686o78991l99390K50263
15379A384972O84270m61337o58331K19601O03247l64284j103910j163953l38416
15370a198141O76608J160095N83385q17352j679616j538072o3776R34070J463716
15361d79083J106009Q83081Q61253K10604o47079k55637Q79802l47586j188987
15352A022377o80853r20158m15277N83056j6319M24972J528276O42646l45575
15343A823145j665188j700503n51935K72236R93311L55957r92924j206157j053003
$$ plain form
15409 1724466 883825 615165 482326 248211 -410441 -1139097 -1227007 -632345 -457862 -444064
15399 -444064 -378624 333699 1198903 828685 218782 359882 529784 255386 97759 172448
15389 172448 691835 2044785 3595362 3568224 2866222 2880776 2213090 1534099 1134709 1384972
15379 1384972 2069242 1607905 949574 1169175 1772422 1408138 304228 -859725 -1198141
15370 -1198141 -521533 638562 1221947 404595 -1275021 -2813093 -2876869 -1942799 -479083
15361 -479083 626926 1510007 2371260 2581864 1934785 1679148 2558950 2211364 1022377
15352 1022377 341524 -578634 -993911 -410855 -427174 -2202 1526074 2168720 1823145
15343 1823145 157957 -1542546 -2094481 -1822245 -828934 -472977 -1465901 -2672058 -3725061
15334c725061j74682J130278J427109J720847J007467n01036k52500Q02702k08539
15325A226585q97181l34699J045478N63712R399M91356k84518j284409o66893
15316a31170N5330N99319N97377m42367R9850P8782o63333o20629q7573j92356
15306g06770Q50369O60509P48989j8645p69886j043448j187290q92716L13480
15297b045408J175010J243254J344348L49361l90752q25462k18902q41039o40640
15288h50230j055420j014967L61972M20731L4542L82264J019991J184862J080086
15279A563831J41508l39461r56868j182963k28554O20554M64368M3684j034671
15270i08572j60219K359010J837611M49821q91277j504370j311873k12337K60674
$$ plain form
15334 -3725061 -3899743 -2769465 -1342356 378491 1385958 884922 632422 1435124 1226585
15325 1226585 329404 -5295 1040183 1603895 1613294 2104650 1820132 535723 -131170
15316 -131170 -75840 523479 1120856 678489 778339 857121 193788 -426841 -514414 -706770
15306 -706770 143599 804108 1553097 1534452 764566 -278882 -1466172 -2358888 -2045408
15297 -2045408 -870398 372856 1717204 2066565 1675813 850351 631449 -209590 -850230
15288 -850230 -1905650 -2920617 -2558645 -2137914 -2103372 -1721108 -701117 483745 1563831
15279 1563831 1705339 1365878 409010 -773953 -1002507 -381953 82415 126099 -908572
15270 -908572 -1068791 1290219 3127830 3577651 2686374 1182004 -129869 -342206 -81532
15261h1532Q3429J52575O30644P7506j6850J70456r73451j79460J242469J151355
15251B257141P98472L78247M7416n49819m55934K11003q7480Q87098M68934O18366
15241D573444J255141J865319L533875M345005N768121M160154m034851o929598
15233A4536610n056691m018800k935195j087083N49050P75395M19713Q8588q80887
15224B390700j507402j290100Q73364Q59491J72825J236510P05653q45687p52425
15215A842929O83712L83970K64275J07251j505172j396478o67461N48594P44125
15206A005745l78602J47743J68816k02310r02121O9327J213403N50991n32710
15197A140282k46051m23765j79407R89779P02280q99235k98962o08717j700580
$$ plain form
15261 -81532 1897 154472 785116 862622 845772 1016228 42777 -136683 1105786 2257141
15251 2257141 3055613 3433860 3481276 2931457 2475523 2686526 2599046 3486144 3955078 4573444
15241 4573444 5828585 7693904 11227779 15572784 21340905 25501059 21466208 14536610
15233 14536610 9479919 5461119 2525924 1438841 1987891 2763286 3182999 3271587 2390700
15224 2390700 883298 -406802 466562 1326053 1498878 2735388 3441041 2595354 1842929
15215 1842929 2526641 2910611 3174886 3282137 1776965 380487 -286974 261620 1005745
15206 1005745 627143 774886 943702 741392 -160729 -91402 1122001 1672992 1140282
15197 1140282 894231 470466 291059 1280838 1983118 1083883 784921 176204 -1524376
15188a524376p03324N97486o5997k47411L48990R49579J115354O85342R78202
15179B133845J168526l07737j590326q33205j5227P55795N2603r6265q01126n96765
15169a29882N53942Q42704M31035N09838l37007j203233o62718m11040j31505
15160e37866l26873m60352L92089J52774n95357m20545o15717j58473O88333J078295
15150h03692J006006J63958K14198l21600j134483m72342L8275M17752K03845
15141f88083P1207k61059p6840m76198K64623J507215J060493K40725k29288m41
15131A412354j344981j122626L34660R90338N96390N29967l95695j279940n40008
15122h19541J41008L20298J774264R56116j565428j213013k33396P65626K20420
$$ plain form
15188 -1524376 -2227700 -1630214 -1696211 -1943622 -1594632 -645053 470301 1155643 2133845
15179 2133845 3302371 2994634 1404308 571103 555876 1311671 1364274 1268009 466883 -129882
15169 -129882 424060 1266764 1697799 2207637 1870630 667397 4679 -406361 -537866
15160 -537866 -864739 -1325091 -933002 -780228 -1375585 -1796130 -2411847 -2570320 -1881987 -803692
15150 -803692 202314 366272 580470 258870 -875613 -1347955 -1309680 -891928 -688083
15141 -688083 -616876 -877935 -954775 -1430973 -1166350 340865 1401358 1642083 1412795 1412354
15131 1412354 67373 -1055253 -720593 269745 866135 1396102 1000407 -279533 -819541
15122 -819541 -678533 -358235 1416029 2372145 806717 -406296 -639692 125934 346354
15113C46354k53243J68074O09674P87856o52540j326567p29685j57956R60768
15104b47265Q32218R83953K60834K13547m66259J00435K41369j30722j448942
15095C39168j814179M87116J287884M48909K32661l55709j396996j566739l12578
15086b650463N50782J495726P83509q56663J59002Q58949R72263J38808K99880
15077A751793O65203N16263q2811n53296j84354M09047k63845r04530p75523n8371
15067E19576j092037j30181J190194K7825N1786K46469O64156K41375O08776n9721
15057B268218n86722j605993j287741J18454O22871m95200L79660J013167k09530
15048B17184m4865m57015p21138n40273J000651J029480K10500o12178k76622
$$ plain form
15113 346354 93111 261185 870859 1658715 1006175 -320392 -1050077 -1208033 -247265
15104 -247265 584953 1568906 1829740 2043287 1577028 1677463 1918832 1788110 339168
15095 339168 -1475011 -987895 299989 748898 981559 625850 -771146 -2337885 -2650463
15086 -2650463 -2099681 -603955 179554 -677109 -518107 340842 1313105 1451913 1751793
15077 1751793 2416996 2933259 2850448 2297152 2112798 2521845 2258000 1353470 577947 519576
15067 519576 -572461 -702642 487552 515377 567163 813632 1477788 1719163 2327939 2268218
15057 2268218 1681496 75503 -1212238 -1093784 -470913 -966113 -586453 426714 217184
15048 217184 172319 -284696 -1005834 -1546107 -545456 484024 694524 82346 -194276
15039a94276P11756M66052K09489J07434k7433n9411p61993o48231R17236J584661
15029B305284K50705k14435L27622J181787M01928l36396m37117l74872j97423
15020B907083O93223L90706j258530k332091j323678q7430M43466J82974k50871
15011f35148n48063r37443m12495n65218r93293o73347O15071J221010J753013
15002a175913J016241N45948M77913q1944j24549K41784M61423n09077j066557
14993b14731m43179K74902P25l54060O42416J207117O91586P7720j238383k174499
14983a530386n13312Q76979R88053L62688M69592L15528M86937J796589N68001
14974C820669r66263j260071j176118k28171J9151m89185l14282K5705L46536
$$ plain form
15039 -194276 517480 983532 1193021 1300455 1273022 1213611 451618 -196613 720623 2305284
15029 2305284 2555989 2341554 2669176 3850963 4252891 3916495 3479378 3104506 2907083
15020 2907083 3600306 3991012 2732482 400391 -923287 -1010717 -567251 -384277 -635148
15011 -635148 -1183211 -2120654 -2533149 -3098367 -4091660 -4765007 -4149936 -2928926 -1175913
15002 -1175913 -159672 386276 864189 782245 657696 899480 1360903 851826 -214731
14993 -214731 -657910 -383008 -382283 -736343 -93927 1113190 1804776 1882496 644113 -1530386
14983 -1530386 -2043698 -1166719 -178666 184022 653614 969142 1456079 3252668 3820669
14974 3820669 2854406 1594335 418217 190046 209197 -279988 -594270 -568565 -222029
14965b22029m4003r21631j395259m44313J013403J370616R69298K97696j05509
14956E18269j37556l58214J8317O22988K59993Q720n07585k58462j27424r24519
14946h85473j270249k60839M80486L67211J58406J19369P78312L98760r5141m48089
14936f57247k07413K13677j63098K59425O29222J362278j21403n56369l06189
14927D52883R8111N13446j88197o16766m77243m73107M39695J032826m17069j336832
14917i72253l40260J2508L43386K185670J671023l79892r88694j388127n07335
14908c63974L72654K13935o58075n27021q35631j527249j196290M84298J309727
14899b727626R35778k38137P2034J034122J429911J141014M26121Q5739q84527
$$ plain form
14965 -222029 -266032 -1187663 -2582922 -3027235 -2013832 -643216 326082 623778 518269
14956 518269 380713 22499 40816 663804 923797 932517 424932 166470 39046 -885473
14946 -885473 -2155722 -2416561 -1936075 -1568864 -1410458 -1291089 -512777 -114017 -209158 -657247
14936 -657247 -864660 -650983 -814081 -554656 74566 1436844 1315441 759072 452883
14927 452883 550994 1064440 876243 259477 -217766 -690873 -251178 781648 364579 -972253
14917 -972253 -1312513 -1300005 -956619 1229051 2900074 2520182 1531488 143361 -363974
14908 -363974 8680 222615 -435460 -962481 -1798112 -3325361 -4521651 -4037353 -2727626
14899 -2727626 -1791848 -2029985 -1957951 -923829 506082 1647096 2073217 2158956 1274429
14890A274429J64960P00811m49340k03571p03295j581131q19733l15944L40757
14881a592057N99391J388494R33887P6816L933l0559m80369j189428q09667j78614
14871a278173N39664R51452J063812j74612p51973N04493J96166p95069n76281
14862c20521q8842n66156L17412P93948M91393o29624m71958K80839K8768M95041
14852C30300l5586n40015k27862n19381j70366L47426P60751Q19072N56533q78720
14842D42152r33017l88885k32786K49454P70900Q15198J9533k72251J212218L38444
14832B020960j177615m08698m41417q03007L36673K81314J29824O21196P33673
14823A292903J0651k75706Q1011m7558j27648o51414o34150q1686L5089p36J51276
$$ plain form
14890 1274429 1439389 2140200 1690860 1487289 783994 -797137 -1616870 -1932814 -1592057
14881 -1592057 -992666 395828 1329715 1406531 1410464 1379905 899536 -289892 -1099559 -1278173
14871 -1278173 -738509 212943 1276755 1102143 350170 854663 1050829 255760 -320521
14862 -320521 -409363 -975519 -658107 135841 627234 -2390 -474348 -193509 -164741 330300
14852 330300 294714 -245301 -473163 -992544 -1162910 -815484 -54733 764339 1320872 442152
14842 442152 -490865 -879750 -1112536 -863082 -92182 723016 742549 470298 1682516 2020960
14832 2020960 843345 434647 -6770 -809777 -473104 -191790 -61966 559230 1292903
14823 1292903 1303554 1027848 1108859 1061301 933653 282239 -351911 -433597 -398508 -399244 -247968
14812b47968L20910M72006M01838o08991j188650K95607O99533L59913n38370
14803c4172q81714m56123k32718L35639n50299J15213J057244O32692N98222K79182
14793H63166N74229M13534N4275o6044N59740L89931n94286p07681o42831n89600
14783B54433o62471p07034k34596J93775j07977L09185R22542P88213k47332p65250
14773b56512m94985J65544Q02604R17549r5157r72587r39997q33554j134941p91446
14763c633482j352315p7599J806814J939371P16552J73005K60952k75754R1954
14754c50502R39493o28069j264031o09234k42991J631875J416076j19125N0303
14745H23795P22630l1214r28964O10178K90667p65459p61161n54152M84341M14650
$$ plain form
14812 -247968 72942 544948 946786 337795 -850855 -555248 144285 504198 -34172
14803 -34172 -915886 -1372009 -1604727 -1269088 -1819387 -1704174 -646930 -14238 583984 863166
14793 863166 1437395 1850929 1905204 1839160 2398900 2788831 2194545 1486864 844033 254433
14783 254433 -408038 -1115072 -1349668 -1155893 -1263870 -954685 -32143 756070 508738 -256512
14773 -256512 -751497 -585953 216651 1134200 1039043 66456 -873541 -1707095 -2842036 -3633482
14763 -3633482 -4985797 -5063396 -3256582 -1317211 -600659 -427654 -166702 -442456 -350502
14754 -350502 588991 -39078 -1303109 -1912343 -2155334 -523459 892617 773492 823795
14745 823795 1546425 1515211 586247 1196425 1487092 721633 -39528 -593680 -109339 305311
14735C05311m6396K21275N52543m76148l72320R20459R09459j191732l82360R12695
14725A352786O75013m64986n40610j16622n24210m34650l70773l57871J24749
14716f57174O01686J032014J329119L0588j562957n33755O68309K95316j38302
14707A064844o93068k12256P54784O40984o86636l51644j21985l10149m00693
14698c15819j13784m84438L17106l08o2294q6602L66516N48994M92716R61232
14688A623319R48381q35317p29302j53155m67855M05178J093002J572961Q37791
14679D295003J37897p93384j141429j677626l88933L54095N30341L7285q01884
14670E51365k43761M01741k76712j93519Q08104Q02072j43854q94295o35729l5692
$$ plain form
14735 305311 258915 480190 1032733 556585 184265 1104724 2014183 822451 440091 1352786
14725 1352786 2027799 1562813 1022203 905581 381371 -53279 -424052 -781923 -657174
14716 -657174 -55488 976526 2305645 2336233 773276 239521 907830 1203146 1064844
14707 1064844 371776 159520 914304 1555288 868652 517008 395023 84874 -315819
14698 -315819 -429603 -914041 -596935 -597243 -659537 -746139 -379623 169371 662087 1623319
14688 1623319 2571700 1736383 1007081 853926 386071 791249 1884251 3457212 4295003
14679 4295003 4432900 3639516 2498087 820461 431528 785623 1315964 1353249 551365
14670 551365 307604 709345 432633 239114 1047218 1849290 1705436 811141 175412 139720
14660A39720K29926Q926p65385N5034Q75277O77627p05984n86725j80306r06830
14650a158720j125242m20992Q60201J253677O22847o55618j332327n12334q01383
14641c269891p68328L49150J680335O41223P9588K65861k23603m98342m31307
14632b175314Q5761j41984k33581M16292J390158P95053l76352J55898R43933
14623H59864K017427J308754m04149q83374J39190L08352j033099r04275j95732
14614A212958j34397m75937k14478m33755j87572m35737L83142J261650J15315
14605A091189m85611q98365j542064j304260O20686R90620K54775j45826n58p96166
14595b215580j012784J81947k5006J04074Q50887J8835j288926l1181J032600
$$ plain form
14660 139720 369646 378572 -386813 -331779 543498 1221125 515141 -71584 -251890 -1158720
14650 -1158720 -2283962 -2704954 -1844753 -591076 31771 -623847 -1956174 -2468508 -3269891
14641 -3269891 -4038219 -3689069 -2008734 -1367511 -1287923 -1022062 -1245665 -1744007 -2175314
14632 -2175314 -2089553 -2231537 -2465118 -2048826 -658668 136385 -239967 -84069 859864
14623 859864 2877291 4186045 3781896 2898522 3037712 3346064 2312965 1408690 1212958
14614 1212958 1078561 602624 388146 -45609 -233181 -668918 -285776 975874 1091189
14605 1091189 605578 -292787 -1834851 -3139111 -2518425 -1527805 -1273030 -1418856 -1419414 -2215580
14595 -2215580 -3228364 -3046417 -3071423 -2967349 -2116462 -2097627 -3386553 -3417734 -2385134
14586b385134N75140O03126Q90933P19171M13508Q47599M70801j267600j878870
14577a011326r86902k3789P97932J404473N65512K15107O93424J36256o18577
14568A172110j169854j25785l87499r48825o23729l9666k84215o74310O97685
14559b384088J464535Q98831l01473q42737n81902j26561L59771J73946P86982
14550e52696O52312l83879O4757l86765o90352L17450M96779k10004n53216k47673
14540a493287j79153P23190J587303N56796r97547j122749N81062J457363O49645
14531A762623m32291k60386M19627l05620k17260l65579j592090l23504m7815
14522a362295l80126J070732J805250P52441L04046N17988l01198o61690k8051
$$ plain form
14586 -2385134 -1809994 -1206868 -315935 403236 816744 1664343 2135144 867544 -1011326
14577 -1011326 -1998228 -2022017 -1224085 180388 745900 961007 1654431 1790687 1172110
14568 1172110 2256 -123529 -511028 -1459853 -2083582 -2123248 -2407463 -3081773 -2384088
14559 -2384088 -919553 -20722 -322195 -1164932 -1746834 -1873395 -1513624 -1339678 -552696
14550 -552696 99616 -284263 -219506 -606271 -1296623 -979173 -482394 -692398 -1245614 -1493287
14540 -1493287 -1672440 -949250 638053 1194849 197302 -925447 -344385 1112978 1762623
14531 1762623 1330332 1069946 1489573 1183953 966693 601114 -990976 -1314480 -1362295
14522 -1362295 -1742421 -671689 1133561 1886002 2190048 2708036 2406838 1745148 1717097
14513A717097n06774j399406r50024K98714J21250O56400M72810k99972p44505
14504f34410q9305m34209m15743L5035M06357O94434J354019Q33708K47272j11142
14494A886016q70995l6795q4815q68070l12163o41822Q7002P18186k76700k32053
14484f32209k92291P18402O18133l00048q05518j266246J04900P36523N44442
14475e73912J23935R0770m5751j627323j950299l23094J819006J189496L75778
14466i21394J057302J242956m47295j511370o62372J64548q6235k02751r13252
14457b279863K19760R15269P60680P96812k20545q1763O58534m35513l03212K80630
14447C10789L37481n8271M19349M57261o77580j226586m35968J68706r3939N74386
$$ plain form
14513 1717097 1210323 -189083 -1139107 -840393 -719143 -62743 410067 110095 -634410
14504 -634410 -723715 -1157924 -1573667 -1538632 -1132275 -437841 916178 1749886 1997158 1886016
14494 1886016 1015021 978226 893411 25341 -286822 -928644 -841642 -123456 -400156 -632209
14484 -632209 -924500 -206098 412035 111987 -693531 -1959777 -1854877 -1118354 -573912
14475 -573912 -449977 -359207 -404958 -2032281 -3982580 -4305674 -2486668 -1297172 -921394
14466 -921394 135908 1378864 931569 -579801 -1242173 -1077625 -1163860 -1366611 -2279863
14457 -2279863 -2060103 -1144834 -384154 412658 192113 110350 768884 333371 30159 310789
14447 310789 648270 589999 1009348 1466609 789029 -437557 -873525 -704819 -798758 -224372
14437b24372P22655j14878k31136J175838K201158R01140j445948j321347j007751
14428F55359j079469o30602N48688M37232O7977L97434J84374k36737n45441r6042
14418b97227n11581m70387l15459r81188q0635R03451q5747q39703p27688K87392
14408c118772J16762L68950M50556J104573R46379J15503k76725J00486M91401
14399B99113Q42976J12094j92797L77016L04430j71740m27334j532587j771005
14390b159834j01914N26348M01717R7774J24611R05298N15818N39188P28606q70224
14380G07388j331220J5287O42650J498624L9614n98053j99854l68211j60585P88782
14370A034422J064597L37754r83952j545228j098862R2416O18388j5087p0499
$$ plain form
14437 -224372 498283 383405 152269 1328107 3529265 4430405 2984457 1663110 655359
14428 655359 -424110 -1054712 -506024 -68792 -815 396619 580993 344256 -201185 -297227
14418 -297227 -808808 -1279195 -1594654 -2575842 -2656477 -1753026 -1838773 -2678476 -3406164 -3118772
14408 -3118772 -3002010 -2633060 -2182504 -1077931 -131552 -16049 -292774 -192288 299113
14399 299113 1142089 1254183 1061386 1438402 1742832 1571092 1143758 -388829 -2159834
14390 -2159834 -2261748 -1735400 -1333683 -1235909 -1111298 -206000 309818 849006 1577612 707388
14380 707388 -623832 -608545 34105 1532729 1572343 974290 774436 406225 245640 1034422
14370 1034422 2099019 2436773 1452821 -92407 -1191269 -1098853 -480465 -495552 -566051
14361e66051O24179M50855m313K08068K34826j37995m00742p34842r27155n33482
14351a786652n88611N43176J320591N12634r29168K83296L36367m07237p9714
14342g95318l7573j98927K99280o95212r70852L19724P40037Q72947R49668N90073
14332A073847N90846k23279j848525k520639o91861K32358J054310J096143L51341
14323h85459K20503J237254Q37792j6354k9546k81544K00436K14368j171577j419044
14313a093171j299059k82990O82057J24308n7316R51892M42757L090M1996m10026
14303h96462j190810k10067q8399K20525N34940M65322m80692l86099n85775j163599
14293c781116L07876J342654Q06258J313j89515O48388j05540p66883J08063Q47675
$$ plain form
14361 -566051 58128 508983 504670 712738 947564 809569 408827 -326015 -1253170 -1786652
14351 -1786652 -2375263 -1832087 -511496 1138 -928030 -644734 -308367 -715604 -795318
14342 -795318 -832891 -1031818 -732538 -1427750 -2398602 -2078878 -1338841 -465894 483774 1073847
14332 1073847 1664693 1441414 -407111 -2927750 -3619611 -3387253 -2332943 -1236800 -885459
14323 -885459 -664956 572298 1410090 1393736 1364190 1082646 1283082 1497450 325873 -1093171
14313 -1093171 -2392230 -2675220 -1993163 -1868855 -1926171 -974279 -531522 -528432 -486436 -896462
14303 -896462 -2087272 -2297339 -2385738 -2165213 -1630273 -1164951 -1645643 -2031742 -2617517 -3781116
14293 -3781116 -3473240 -2130586 -1324328 -1323015 -1512530 -864142 -969682 -1736565 -1628502 -780827
14283g80827J670737O20758P5484l30183N52235Q03510o65792k084795j482088
14274a620961K29355j7914o32385r58836l9753J132777J712259J100235l50114
14265E54663r19980q76137K61017P91428L79411P39403q79561j421803M3654l3295
14255a361200M12575J212065j22521q03042j4391P75852K2550o50256J84911K00183
14245a43274P24601J557092Q44263l40000M96880K36912r40687p07425K69137
14236A997499K48018k69549K96872k90149L9100o83217n81044J75558n02542j663967
14226a233421l78141j95982q71798j4228M63607J157242Q34276Q83933O23201
14217A268689R70818J43078n71160j42042p39611r50841r99792r34397k0372M67987
$$ plain form
14283 -780827 889910 1510668 1586152 1255969 1808204 2611714 1945922 -138873 -1620961
14274 -1620961 -1391606 -1409520 -2041905 -3000741 -3040494 -1907717 -195458 904777 554663
14265 554663 -365317 -1241454 -980437 -189009 190402 929805 50244 -1371559 -1327905 -1361200
14255 -1361200 -948625 263440 140919 -662123 -676514 99338 121888 -528368 -343457 -143274
14245 -143274 581327 2138419 2982682 2642682 3139562 3376474 2435787 1728362 1997499
14236 1997499 2245517 1975968 2272840 1982691 2021791 1338574 757530 933088 430546 -1233421
14226 -1233421 -1611562 -1807544 -2679342 -2693570 -2229963 -1072721 -238445 645488 1268689
14217 1268689 2239507 2382585 1811425 1669383 929772 -21069 -1020861 -1955258 -1975630 -1507643
14207a507643R25730P65963J13696R92623M10636n33086o36250j099658n47795
14198a115784l65915K9257Q9110K72684O80206L32736O26534L05605p6901q29063
14188e1531j366670k04653l09131R4904K53913L56905m40338o86614Q38245P77432
14178g37538r27184j214468R24788K044725N31493k73213l99772K66843J50137
14169C65811Q87325R63909n59780j37615J2034m15711N74859n64895q32549L03822
14159E97210L2825m2675o9630O47522M93n97118M6948n79437o52485Q59624O92161
14148I35438L74128R05424J025501p14559j307142q54763p70199m10873M88196
14139c28849M37943M45303K8376l72963M45790k58870j01853m16526q49604q74873
$$ plain form
14207 -1507643 -581913 184050 297746 1290369 1701005 1167919 531669 -567989 -1115784
14198 -1115784 -1481699 -1452442 -1363332 -1090648 -410442 -77706 548828 854433 777532 -51531
14188 -51531 -1418201 -1622854 -1931985 -1837081 -1583168 -1226263 -1666601 -2353215 -1514970 -737538
14178 -737538 -1664722 -2879190 -1954402 90323 621816 348603 -51169 215674 365811
14169 365811 1253136 2217045 1657265 1519650 1531684 1115973 1690832 1125937 293388 597210
14159 597210 630035 587360 517730 1165252 1165745 568627 615575 36138 -616347 243277 935438
14148 935438 1309566 2214990 3240491 2525932 1218790 364027 -406172 -817045 -328849
14139 -328849 109094 554397 582773 209810 655600 396730 294877 -121649 -971253 -1846126
14129a846126m9295M38872j25567j511620r73202r8037R59950J379008Q84667
14120i41350O44766j179364j285858P3147r5797m03090P31546J090935J372140
14111G075P73746P2881J86289k21553k09008o12050j382261l26662Q06175P66433
14101a38935R36546M21857N48782L05781j71246L59236K9668k48806j022402j823536
14091h03055M8667R84804J01973l20198J65155n8888j77364K72203l06675r08827
14081a002205r64871j149765K31381N07207K03256J285374J679293M78105m7353
14072A220422k31889j065635q35332R4872L88569j19122k42273J020677Q40556
14063A070845q20316j520000k042193p25855R85209R47701M84695L40515k93479
$$ plain form
14129 -1846126 -1895421 -1456549 -1582116 -3093736 -4066938 -4164975 -3205025 -1826017 -941350
14120 -941350 -296584 -1475948 -2761806 -2688659 -2784456 -3187546 -2456000 -1365065 7075
14111 7075 780821 853702 1039991 818438 609430 -2620 -1384881 -1711543 -905368 -138935
14101 -138935 797611 1219468 1768250 2074031 1902785 2262021 2291689 2042883 1020481 -803055
14091 -803055 -754388 230416 332389 12191 177346 118458 -58906 213297 -93378 -1002205
14081 -1002205 -1967076 -3116841 -2885460 -2378253 -2174997 -889623 789670 1267775 1220422
14072 1220422 988533 -77102 -912434 -817562 -428993 -548115 -790388 230289 1070845
14063 1070845 250529 -1269471 -3311664 -4037519 -3052310 -2104609 -1619914 -1279399 -1572878
14054a572878Q2372J123858Q08525L18018p3064K70647O29916j115247o99756
14045b27609J114298J812049P51513j033654j465274j096844j09619N92372N89192
14036I26424Q2126M77005O16050k89029o39277k84358K49114L80204o99671p33100
14026H5488Q2139J033167K18676k42998k87457l5765j1986p77433r95689q9964
14016a021822Q26151J450698M52679n23186l93909k02291p17650r09162r27517
14007a966009o46349m0421l13962K65681L6392l61292K16736Q49002K83831n42821
13997b219212l59137Q63431P91891p07k0351j139609m34287L63216O30213Q14698
13987g09854R40117N08782p62929n5097R54035K08516N01171J073875j38497p57919
$$ plain form
14054 -1572878 -1490506 -366648 441877 759895 686831 957478 1587394 472147 -227609
14045 -227609 886689 2698738 3450251 2416597 951323 -145521 -255140 337232 926424
14036 926424 1008550 1485555 2101605 1812576 1173299 888941 1138055 1518259 818588 85488
14026 85488 167627 1200794 1419470 1176472 889015 853250 841264 63831 -931858 -1021822
14016 -1021822 -195671 1255027 1707706 1184520 790611 588320 -129330 -1038492 -1966009
14007 -1966009 -2612358 -2652779 -2966741 -2701060 -2664668 -3025960 -2809224 -1960222 -1676391 -2219212
13997 -2219212 -2578349 -1714918 -923027 -923734 -944085 -2083694 -2517981 -2154765 -1524552 -709854
13987 -709854 230263 739045 -23884 -78981 875054 1083570 1584741 2658616 2520119 1762200
13977A762200o08351M02255J93431q03724p03808N69509M18718j1001p3676j041086
13967A04467k35555J65256J21251J441806J193028k06873n50895l97725j074421
13958E60339j086079k35943j18771k69343r1584K69670M17556M85584J62544M53275
13948E47248l4003r98103n45684K76399P40584R60242Q44024L75633p6496l66973
13938A722871K53994P87540J61617q63108n37407o31840j952118r45548L59869
13929a644130l43209Q23260J712498J590954O63941m80749o87317l17307k93685
13920A024256P0614N35225Q37137J642351Q86894j156248j345395k9777P56693
13911C221750k80606j496402j827649r0089R40136J36070m68695r75314L56154
$$ plain form
13977 1762200 1153849 1556104 1749535 945811 242003 811512 1230230 1219229 1145553 104467
13967 104467 -131088 34168 155419 1597225 2790253 2583380 2032485 1634760 560339
13958 560339 -525740 -761683 -880454 -1149797 -1241381 -971711 -554155 -68571 93973 547248
13948 547248 513245 -484858 -1030542 -754143 -13559 946683 1790707 2166340 2089844 1722871
13938 1722871 1976865 2764405 2926022 2062914 1525507 893667 -1058451 -2003999 -1644130
13929 -1644130 -1987339 -1164079 548419 2139373 2803314 2322565 1635248 1317941 1024256
13920 1024256 1094870 1630095 2467232 4109583 4996477 3840229 2494834 2465057 3221750
13911 3221750 2941144 1444742 -382907 -472996 467140 603210 134515 -840799 -484645
13902d84645J690187P40008j88915q4289r29596j659540j386453k26415J006599
13893a523059R52429Q46034K10500P8044p1402l42388j182512j392981o41035
13884c066370n15139Q87046J929318R74814k58773p13497m13653N36449O20901
13875a8904J14872l11866K61180N97016l8307l47845o86278n56356j125049Q0061
13865b031476J540897R91039k84106q1166j86562k34393Q7032n28171p17105J90614
13855a253397J91781M07245M86410k20352J30556K62022J87169J9090r1735o53662
13845e34873j357141J005252J172869j85277K43084Q89645j31393j25500Q08487
13836A785153k01790o0958P34767Q30972N19831p37274k55496j47172r34997r58715
$$ plain form
13902 -484645 1205542 1945550 1756635 1672346 742750 -916790 -2303243 -2529658 -1523059
13893 -1523059 -570630 275404 485904 563948 492546 150158 -1032354 -2425335 -3066370
13884 -3066370 -3581509 -2694463 -765145 209669 -49104 -762601 -1176254 -639805 -18904
13875 -18904 95968 -215898 45282 642298 603991 256146 -430132 -986488 -2111537 -2031476
13865 -2031476 -490579 500460 216354 135188 -51374 -285767 -198735 -726906 -1444011 -1253397
13855 -1253397 -1061616 -654371 -167961 -388313 -257757 4265 191434 210524 118789 -534873
13845 -534873 -1892014 -886762 286107 100830 343914 1233559 1102166 976666 1785153
13836 1785153 1583363 1522405 2257172 3088144 3607975 2870701 2615205 2468033 1533036 574321
13826E74321q35701K88771L74183L42037L32801L17633p3098r59548p20796K72469
13816h6928K18726R5998M38917K12624p53076j007173j344789j294898n37448
13807d058047J768646K626127N50358o2091m07478p46827l09159n96864j70297
13798a405632R50467O60583P8831r53555j573445k49779Q26649J360143P41994
13789D36256r8233q79071q90225N43794m6611n55689J52605k62083r57986j124793
13779c682036o77020O0859P66697J489814J345164M34344k59827N13240J234979
13770A226214M24192j60213K46970p1422j155918j399247n49292l90Q36213N89287
13760a3606n75102l95362N2082M49419J112405N74650j69015p45282o58607L5789
$$ plain form
13826 574321 -261380 27391 401574 743611 1076412 1394045 1320947 361399 -359397 -86928
13816 -86928 131798 227796 666713 879337 126261 -880912 -2225701 -3520599 -4058047
13807 -4058047 -2289401 336726 887084 824993 417515 -329312 -638471 -1235335 -1405632
13798 -1405632 -455165 205418 284249 -669306 -2242751 -2492530 -1665881 -305738 436256
13789 436256 338023 -541048 -1431273 -887479 -934090 -1489779 -1337174 -1599257 -2557243 -3682036
13779 -3682036 -4359056 -4298197 -3531500 -2041686 -696522 -262178 -522005 -8765 1226214
13770 1226214 1650406 1490193 1737163 1665741 509823 -889424 -1438716 -1439106 -602893 -13606
13760 -13606 -588708 -984070 -931988 -482569 629836 1204486 1035471 290189 -368418 -332629
13750c32629k75672K9152O19245J185114J44249J04143K09787n45094n02595M36305
13740A072005M06550m99437k64438m77619j051670j87094L5146L8706L42945N00165
13730h4741J086851J564418O88641r02188p69920r85678q13900N68924P71666
13721A124073o26460j235949q54916o41317l44480O58580P72257p28123k06939
13712b083274k26176P23297N67642o52519m79508N19952J349568J152518j48901
13703G22599k99295o80306k78045k78227m05390L61960J14969L0910J13920P4596
13693e22309L78030O57949P99378J79816j840360q35176j92449l13087p7241l63166
13683b128615o6185Q85648J403533N68491j9875J189495L94491m21414p65892
$$ plain form
13750 -332629 -608301 -579149 40096 1225210 1369459 1473602 1683389 1138295 635700 1072005
13740 1072005 1478555 979118 714680 237061 -814609 -1001703 -966557 -927851 -584906 -84741
13730 -84741 1002110 2566528 3255169 2352981 1583061 597383 -216517 352407 1124073
13721 1124073 497613 -738336 -1593252 -2234569 -2579049 -1920469 -1148212 -1876335 -2083274
13712 -2083274 -2309450 -1586153 -1018511 -1671030 -2150538 -1630586 -281018 871500 722599
13703 722599 423304 -257002 -535047 -813274 -1218664 -856704 -741735 -710825 -596905 -522309
13693 -522309 -144279 513670 1313048 1492864 -347496 -1182672 -1375121 -1688208 -1765449 -2128615
13683 -2128615 -2194800 -1309152 94381 662872 642997 1832492 2226983 1805569 1039677
13674A039677j149393n41044J02311L36855k82431k37314K90836P80625Q1130
13665D21252p97551l11544O81091M04832P53598J391884k44299q71517o68478
13656G59268m55957L7444O72369j86308j468283o41553j9602L82025J42239k56386
13646a034744n91611r71924r10528J95306O81855P90528P94231M64699J3080M14757
13636a54351N67481l36583o37235L7745J118256Q15085K86693n84463k57169Q98615
13626A754074R00455J18002l59495m54784o78569r65269K73593Q37102P10803
13617B135912r80187q57826K33795J60020k93584K96650L99723k71302p31837
13608I1364j246767O05992k535n46747n53602j5866J214062R61609n19867O7123
$$ plain form
13674 1039677 -109716 -650760 -548449 -211594 -494025 -731339 -440503 340122 421252
13665 421252 -376299 -687843 -6752 398080 1151678 2543562 2299263 1427746 759268
13656 759268 303311 340755 1013124 826816 -641467 -1283020 -1302622 -920597 -778358 -1034744
13646 -1034744 -1626355 -2598279 -3508807 -3313501 -2631646 -1841118 -1046887 -582188 -569108 -154351
13636 -154351 413130 76547 -560688 -522943 595313 1410398 1697091 1112628 855459 1754074
13626 1754074 2654529 2772531 2413036 1958252 1279683 314414 588007 1425109 2135912
13617 2135912 1155725 297899 531694 691714 398130 694780 1094503 823201 91364
13608 91364 -1155403 -549411 -551946 -1098693 -1652295 -1668161 -454099 507510 -12357 54766
13598E4766M87221p31451j020405J88365Q41932m52326o79154R0486J376879Q78012
13588A034325j16768j051225q21600o80281q33908p53626Q14308J451194O30319
13579c27262P21369O56219J081575R77862O23671n60428j507871j029205j494901
13570h58971j722518K73112J551419J200271P22030k93311n66533K60613M2920
13561F09032j68892L03199l6239l2714K43112l26592m77013K92931r5753n06494
13551a95423O8866K90951m05357n51232L12322k21695l39482N80868N20390j104049
13541a043841o74720M197J092156K64931r37439p25066o2151p0924m58863K83687
13531b328033J004555N067j65452R0845O21153O67016N370j171049q8365P76689
$$ plain form
13598 54766 541987 -189464 -1209869 -1021504 -179572 -631898 -1311052 -1220566 156313 1034325
13588 1034325 917557 -133668 -955268 -1635549 -2469457 -3223083 -2408775 -957581 -327262
13579 -327262 394107 1050326 2131901 3109763 3733434 3173006 1665135 635930 -858971
13570 -858971 -2581489 -2308377 -756958 443313 1165343 872032 305499 566112 609032
13561 609032 440140 743339 707100 674386 917498 590906 113893 406824 311071 -195423
13551 -195423 -126557 164394 -240963 -792195 -479873 -701568 -1041050 -460182 60208 -1043841
13541 -1043841 -1718561 -1714364 -622208 -357277 -1294716 -2019782 -2081933 -2152857 -2611720 -2328033
13531 -2328033 -1323478 -1318411 -1483863 -1393018 -771865 -104849 -99479 -1270528 -1358893 -582204
13521e82204k50587k53810r395l98851k89837m84014m67607P1554J040800J001119
13511f22832J093340J354782m61201r93805m21502j89384O10240L30212K68738
13502I68588N34967p43997o98951N38886j32740j157665j166005j74400K73134
13493a758183j8579N53013R071j02116J67281K24504J704573N78093n64420m69720
13483C23517n88950k19209p99713L48491O34027l40600k54501l44226m5698L59587
13473i27275N97629N90963P0330n14082l75869J143455P43161J05737k76638j165906
13463h495j000373P57937O79519L34108q11984j467084r53515j0888o08659L90269
13453b699165R41044N21568K19939J56872P257P99973N68337N47978J128466N7728
$$ plain form
13521 -582204 -832791 -1086601 -1095996 -1494847 -1784684 -2268698 -2736305 -2664751 -1623951 -622832
13511 -622832 470508 1825290 1364089 370284 -51218 -240602 369638 699850 968588
13502 968588 1503555 759558 60607 599493 466753 -690912 -1856917 -2031317 -1758183
13493 -1758183 -1776762 -1223749 -1214678 -1316794 -1149513 -925009 779564 1357657 793237 323517
13483 323517 -265433 -484642 -1284355 -935864 -301837 -642437 -896938 -1241164 -1286862 -927275
13473 -927275 -329646 261317 331647 -182435 -558304 585151 1328312 1434049 1157411 -8495
13463 -8495 -1008868 -250931 428588 762696 -49288 -1516372 -2469887 -2480775 -3089434 -2699165
13453 -2699165 -1758121 -1236553 -1016614 -859742 -852485 -52512 515825 1063803 2192269 2249997
13443B249997j530602r73523J175987j43608q70544K05937o9756n89086p15522
13434a260720j198363l51844J417653J390157M08929O08207J051221m37623p74885
13425H52732O8298N94025o41673k49278J049440j90680l39088J367062R20491
13416C431329J20420l7306n89623j159071p83661n74637m37595M04250O55832
13407A029938N98192m64063j406145q69058P19852k39100o70664N07841J126736
13398C33529K94885o65143J50843P39585N25879P24120l74939j131007j128300
13389e30548r42098n87921n0715o37310o18782K39003O84247R06160R49067L29612
13379b59285o24144j197890n63948R39358O71085j09738p51579j713227r95718
$$ plain form
13443 2249997 719395 -254128 921859 778251 -92293 113644 43888 -545198 -1260720
13434 -1260720 -2459083 -2810927 -1393274 -3117 405812 1014019 2065240 1627617 852732
13425 852732 921030 1515055 873382 624104 1673544 1482864 1143776 2510838 3431329
13416 3431329 3551749 3514443 2924820 1765749 982088 407451 -30144 374106 1029938
13407 1029938 1628130 1164067 -242078 -1111136 -391284 -630384 -1301048 -793207 333529
13398 333529 628414 -36729 114114 853699 1379578 2103698 1728759 597752 -530548
13389 -530548 -1472646 -2060567 -2111282 -2748592 -3367374 -3128371 -2444124 -1537964 -588897 -259285
13379 -259285 -883429 -2081319 -2645267 -1705909 -1034824 -1144562 -1896141 -3609368 -4605086
13370d605086L23093l04032n6123R09854J667897R65406l43603M21689J188554
13361A67649K30046Q1337J081392J367144L62283j239628r55884m94984j88650
13352D10705l60099L95768J260960L48961O65822o59043j587227K5770j77701
13343C23916q87522n43398l80018m98710P81292J712516K024199N34514j058816
13334B007973j594646j404401n62816j02503J267153M39256l21937P6903L15487
13325A20469P91954J503401J598725J76577q95670j313269M35563J524174M93225
13316D435149o75265j585334q22240k32929p30642M7063n92895l22059R433q2142
13306e51861j98214M29548J752591k1739j557037k67309N35370j97192j67008
$$ plain form
13370 -4605086 -4281993 -4586025 -4642148 -3732294 -2064397 -1098991 -1442594 -1020905 167649
13361 167649 397695 479032 1560424 2927568 3289851 2050223 1094339 599355 410705
13352 410705 50606 446374 1707334 2056295 2722117 2063074 475847 501617 323916
13343 323916 -563606 -1107004 -1487022 -1985732 -1204440 508076 2532275 3066789 2007973
13334 2007973 413327 -991074 -1553890 -1656393 -389240 50016 -271921 -195018 120469
13325 120469 912423 2415824 4014549 4191126 3295456 1982187 2417750 3941924 4435149
13316 4435149 3759884 2174550 1352310 1119381 388739 435802 -157093 -479152 -469719 -551861
13306 -551861 -750075 -320527 1432064 1410325 -146712 -414021 121349 -75843 -242851
13297b42851m85M36084Q48512j7065l78195l11153P09034N81477m04891j84499
13287A035968J33408l05968l11888o29014o38113R2464l35734j533806k12004
13278b704687J001337M13877k9509n4754o90978j221848o37672O39057J415774
13269a869403K080733J118362j198176l89180O03229R27141L58251p15718o18640
13260B96599o35144k29104J81669j27703K82114k35737j02986J95133l0996M13347
13250G192J01902Q46870M08762q3502K41277L40065k17010j054207j174956n05877
13240a089484N67058N24375N96223O73133k18530r21423j79803J159940J65255
13231A276744n74677L36181K36166k68602p37849p5935Q86329k15877j864816
$$ plain form
13297 -242851 -243336 192748 1041260 1024195 646000 334847 1043881 1625358 1220467 1035968
13287 1035968 1169376 863408 551520 -77494 -715607 -623143 -958877 -2492683 -2704687
13278 -2704687 -1703350 -1289473 -1318982 -1373736 -2064714 -3286562 -3924234 -3285177 -1869403
13269 -1869403 211330 1329692 131516 -257664 345565 1272706 1630957 915239 296599
13260 296599 -338545 -567649 -385980 -513683 -231569 -467306 -570292 -375159 -406155 7192
13250 7192 109094 955964 1364726 1281224 1522501 1862566 1645556 591349 -583607 -1089484
13240 -1089484 -522426 1949 598172 1271305 1052775 131352 -48451 1111489 1276744
13231 1276744 702067 1038248 1274414 1005812 267963 192028 1078357 862480 -1002336
13222a002336j022777N24496K65407O0184J415132J105796O96251l2171J81302
13213B191284j26264r71644j208751l45293O27250L99304N01123P18624l465K8277
13203A810445m48259j442739j63181R1628r56161O72431O87294p1716K29684L74369
13193G83795p76493j133028l22296Q34308P93460O26234m3502o75191o7730m28950
13183d09393n39749Q69972M83874J78751N96863L39835n80100p87134M61042R28082
13173A542043N24184K3991l59523J39573M19691q25172P1209J1359m8526J20261
13163A619090J61090N40100m68062q17251j46222L71504P29971L87326l04190
13154B073356n11184q0407N06889o18395l80690m01966j516837j715291p8918
$$ plain form
13222 -1002336 -2025113 -1500617 -1235210 -1175026 240106 1345902 2042153 2009982 2191284
13213 2191284 2065020 1093376 -115375 -460668 166582 565886 1067009 1785633 1782168 1810445
13203 1810445 1362186 -80553 -243734 -152106 -1108267 -435836 251458 179742 409426 783795
13193 783795 7302 -1125726 -1448022 -613714 179746 805980 762478 87287 19557 -409393
13183 -409393 -949142 -79170 404704 583455 1180318 1520153 940053 152919 613961 1542043
13173 1542043 2066227 2090218 1730695 1870268 2289959 1464787 1535996 1547355 1498829 1619090
13163 1619090 1780180 2320280 1852218 1034967 888745 1260249 1990220 2377546 2073356
13154 2073356 1562172 1481765 1988654 1370259 989569 587603 -929234 -2644525 -2723443
13145b723443J311850J345453J302010R92598O17583J9978l83238o92029r62769
13136H27993j210021j315489p72008l13123K34490J228206J616100P75568j6808
13127A054908l08434N08018J110142k33888l57673L77006N76561k44252j01362
13118B381026R0962p57174r87330n1357J89212r0888L93132R58630r71669o96308
13108D58236j42913l32822L61996J242839J90447r87147j325829q08979P21743
13099f22429O82557k03783K52101J400256P79940R6411m85327j14697R70533Q33718
13089C589280m2159k92765n14818m34620K54114k08079k82215k62882K14035J123038
13079C142929q2443p28026l79522j16001N11981k38581M53072N44812k58236o10145
$$ plain form
13145 -2723443 -1411593 -66140 1235870 2228468 2846051 2866029 2482791 1790762 827993
13136 827993 -382028 -1697517 -2469525 -2782648 -2548158 -1319952 296148 1071716 1054908
13127 1054908 746474 1254492 2364634 2130746 1773073 2150079 2726640 2482388 2381026
13118 2381026 2471988 1714814 727484 676127 865339 774451 1167583 2126213 1154544 458236
13108 458236 315323 -17499 344497 1587336 1777783 790636 -535193 -1344172 -622429
13099 -622429 60128 -143655 108446 1508702 2288642 2385053 1899726 1785029 2755562 3589280
13089 3589280 3547121 3254356 2739538 2304918 2559032 2350953 2068738 1805856 2019891 3142929
13079 3142929 3060486 2332460 1952938 1836937 2348918 2110337 2563409 3108221 2849985 2239840
13069B239840o74283n64448j1334n28926n49944R82456J711630O55001k33721
13060C026271j179946j251855m86328P43956P69107K68539l98187o86193o99829
13051A05535K81553J096058K33483L60428O97850n8213q23431l54580l43556N89643
13041A784770R25761J522297J461989k21842j160602j086308K74065J049958m12038
13032D138050m1545k41200l36317O07332J008301J50122m64329j207018n76429
13023C036967n28678J44123M81895M26046J37527L68170L21928j23394n00525
13014C764059N16062J307961J650998Q58082r0713K2816O37279Q68486K83751
13005I818781L50008l77578l30386j99926O7208l1749R71597J143584l00498L48803
$$ plain form
13069 2239840 1565557 1001109 989775 460849 -89095 893361 2604991 3259992 3026271
13060 3026271 1846325 594470 108142 852098 1621205 1889744 1491557 805364 105535
13051 105535 387088 1483146 1716629 2077057 2774907 2716694 1893263 1538683 1195127 1784770
13041 1784770 2710531 4232828 5694817 5472975 4312373 3226065 3500130 4550088 4138050
13032 4138050 4096505 3855305 3518988 4126320 5134621 5284743 4820414 3613396 3036967
13023 3036967 2508289 2652412 3134307 3560353 3697880 4066050 4387978 4264584 3764059
13014 3764059 4280121 5588082 7239080 8097162 8006449 8029265 8666544 9535030 9818781
13005 9818781 10168789 9791211 9460825 9260899 9328107 9296358 10267955 11411539 11111041 11459844
12995A1459844J011335J248003J531724J783535K246092K346172K233066J253461
12987B5113232J964026L118300M543082N610962O256197P663762J0566123J2704377
12979G7540061J4558120J9391487K5686816L3463415M4206168N5910480O1851322
12972C32607869M8545229O417601m1177722o3819078n9656655m6138236l4855696
12965A41923312k5325893j9388453j6652378j4480327j1164317q137481o469046
12958D0305417m961161m002415m088546l581076k116489q05687p36696j021292
12950A8992055j126000j449464j741445j323722k34717n73871l68196m30671j257642
12941A0486327j161281q68130o10032P44427M33446m90914k14251j247124j131430
$$ plain form
12995 11459844 12471179 13719182 15250906 17034441 19280533 21626705 23859771 25113232
12987 25113232 27077258 30195558 34738640 40349602 46605799 54269561 64835684 77540061
12979 77540061 92098181 111489668 137176484 170639899 214846067 270756547 332607869
12972 332607869 381153098 387570699 346392977 282573899 222917244 176779008 141923312
12965 141923312 116597419 97208966 80556588 66076261 54911944 46774463 40305417
12958 40305417 35344256 31341841 27253295 23672219 21555730 20750043 20013347 18992055
12950 18992055 17866055 16416591 14675146 13351424 13116707 12542836 12174640 11743969 10486327
12941 10486327 9325046 8456916 7846884 8591311 9024757 8533843 8319592 7072468 5941038
12932E941038q04102j409828j903976Q23979J288794J486034J393382J98038O53361
12923G666720Q67535N13606L9469j69701k32401O31051J458196J696289J175799
12914A3646563J366512K606348J429252L41613j306253j283543N57184n7681n4215
12905A7245780J052357J848008J649935J608104L255740L499574L343713M618678
12897C8121889O280177Q011337Q231773R245156J3053468J7819989K2279180K7272508
12889A50315477L5543597M7144709N9133269O1598200L8358015j0369652n2314392
12882C29409223o3936183n4952129m3886967l4746046k5716667j8830208j5259701
12875G2081322j1204855q433059p451292o316918m940348l438342k644811l050543
$$ plain form
12932 5941038 5136936 3727108 1823132 2647111 3935905 5421939 6815321 7013359 7666720
12923 7666720 8534255 9047861 9087330 8917629 8685228 9316279 10774475 12470764 13646563
12914 13646563 15013075 17619423 19048675 19390288 18084035 16800492 17357676 17299995 17245780
12905 17245780 18298137 20146145 21796080 23404184 26659924 30159498 33503211 38121889
12897 38121889 44402066 52413403 60645176 69890332 82943800 100763789 123042969 150315477
12889 150315477 185859074 233003783 292137052 353735252 392093267 381723615 329409223
12882 329409223 265473040 210520911 166633944 131887898 106171231 87341023 72081322
12875 72081322 60876467 52443408 44992116 38675198 33734850 30296508 27651697 24601154
12867B4601154k766599j502683j076069j169683j758354j703518j853100p37628
12859A2033520k58171J91995K461M06571m00923o28781j033399m58830q4813q77537
12849H892093q54493K94166J116289Q01289k41219m49893n89468j168408r20752
12840F879604n01692L24489L90010p263M01924M71250J303191J966712k67856
12831A0960369q4179r9090K42948o6244n3396N49707K94054k64357J243167Q88510
12821A3611489n63691p70698j99928K260634L530079K773035K381251K502842
12813B5525013K614129L022959M490057O604051Q243535J0184420J0923990J3254103
12805H4862257J7789260K3427397L0445562L9059939N0462992O0383462N6425062
$$ plain form
12867 24601154 21834555 20331872 19255803 18086120 16327766 14624248 12771148 12033520
12859 12033520 11775349 11967344 11969805 12376376 11975453 11346672 10313273 9854443 9769630 8892093
12849 8892093 8037600 8331766 9448055 10249344 10008125 9558232 8968764 7800356 6879604
12840 6879604 6377912 6702401 7092411 7085148 7487072 7958322 9261513 11228225 10960369
12831 10960369 10876190 10777100 11020048 10953804 10900408 11450115 11744169 11479812 12722979 13611489
12821 13611489 13047798 12277100 12077172 14337806 17867885 20640920 23022171 25525013
12813 25525013 28139142 31162101 35652158 42256209 50499744 60684164 71608154 84862257
12805 84862257 102651517 126078914 156524476 195584415 246047407 306430869 362855931
12798C62855931K4718109k3793549n6677927o0788040n1860642m1858030l1132932
12791A21462920k2667653j7167707j3852054j0512578p697581o561105n821343
12784C7182899m937404m518030l652668l791896l155749j473257q56436r91461
12776A3805998m77041j057454j690872j446406l18325q18779m96842L44259r05553
12767F938985j971570l79321K8700j516603j592493j229113j496726k18370R3991
12758a342520P1697P30694P23337J109956R73763N01843k48273q46665m89443
12749A184389P06940N92786J49065r78292j696641l25110N89524K31688K46830
12740G01179L52418N4934M19711r2850n10723p46802j002245L25492J012006K23117
$$ plain form
12798 362855931 387574040 363780491 307102564 246314524 194453882 152595852 121462920
12791 121462920 98795267 81627560 67775506 57262928 49565347 43004242 37182899
12784 37182899 32245495 27727465 24074797 20282901 17127152 15653895 14797459 13805998
12776 13805998 13328957 12271503 10580631 9134225 8815900 7997121 7500279 7844538 6938985
12767 6938985 4967415 4588094 4616794 3100191 1507698 278585 -1218141 -1436511 -1342520
12758 -1342520 -1270823 -540129 183208 1293164 2266927 2768770 2520497 1673832 1184389
12749 1184389 1891329 2484115 2633180 1654888 -41753 -366863 222661 454349 701179
12740 701179 1053597 1108531 1528242 1435392 924669 177867 -824378 -498886 513120 736237
12730G36237k79367l48465P95816O86379o35496j008897j31598J217123P29719
12721A761451l49329n16633q7007J12505L68617k28834o60036n28751p50777J30127
12711g48667R39973Q96193M90474l5065r13327L12755M86018o7004j9959o93912
12701F47479j083883k77573o63654o84651n96861n40238K32132Q78459J294107
12692g94683K26670l80487N1949J473390J022113O75502K64724m36340j185934
12683I16904m23458k16147k80434k00683k70969K26933K50157O19594K03659n07283
12673C18273k30215N79795P51526N80014j65593j099127j827522p85369J48493
12664a729725M47455l52343L3421K072881K148474M09211j116312j108945K16049
$$ plain form
12730 736237 456870 108405 904221 1590600 955104 -53793 -185391 1031732 1761451
12721 1761451 1412122 895489 808482 920987 1289604 1060770 400734 -128017 -878794 -748667
12711 -748667 191306 1087499 1577973 1542908 629581 942336 1428354 1361350 1341391 647479
12701 647479 -436404 -713977 -1377631 -2062282 -2659143 -3199381 -2967249 -2088790 -794683
12692 -794683 -568013 -948500 -896551 576839 1598952 2274454 2539178 2102838 916904
12683 916904 493446 277299 -3135 -203818 -474787 -247854 2303 621897 825556 318273
12673 318273 88058 667853 1419379 1999393 1833800 734673 -1092849 -1878218 -1729725
12664 -1729725 -1282270 -1634613 -1601192 471689 2620163 3029374 1913062 804117 1020166
12655A020166O59728o7087r67724k201606j939042R5272J847464J525558m44886
12646d72157j739411l57720P20814J645046J033040R64639J186265K25939k26126
12637B980329l26484r37880j212659L30293J270572Q84536O39886o05369j675320
12628A347904o11487p00170n11073M44488N07276q61533r73718O75410J693207
12619A010304J011776p7495p82883r81436l10898o39856r019K97290j12403Q7792
12609e06828J354530O81242o21705m99532p68206k69539J073385O61537r84311
12600A20573l08992P23542n68883n94916J26142N16675R10234M83193j02806L51989
12590A656751O8383j11696M84257p57173j07444L80726R5125j81677r27811j047563
$$ plain form
12655 1020166 1679894 1612807 645083 -1556523 -3495565 -3400293 -1552829 -27271 -472157
12646 -472157 -2211568 -2569288 -1848474 -203428 829612 1794251 2980516 3206455 2980329
12637 2980329 2653845 1715965 503306 833599 2104171 2988707 3628593 3023224 1347904
12628 1347904 736417 36247 -474826 -30338 476938 -384595 -1358313 -682903 1010304
12619 1010304 2022080 1944585 1161702 180266 -130632 -770488 -779507 -482217 -594620 -506828
12609 -506828 847702 1528944 907239 407707 -360499 -630038 443347 1104884 120573
12600 120573 -188419 535123 -33760 -628676 -502534 14141 924375 1407568 1304762 1656751
12590 1656751 1725134 1613438 2097695 1340522 1233078 1613804 1708929 1527252 599441 -448122
12580d48122n40654j062535j246916r01963j09850O44342O74030N70157P66610
12571a654901J177421J277702M42944m19084l20973l60550m93983o67735j37762
12562a156921K25498L05287n83916k51034J489699K012153m58242j673900j206703
12553a298079p52338k36561K4739k42322l0754K063939P36076j358648j128150
12544b222098K42319J880661R90598N74079R10952J102j273870r69983j658724
12535a524964j235874l81213j28404Q44897Q32551o6997Q13905P06569j55196
12526b94726k08851O51379N97923j340263r37712O57431O46330L11577o07069
12517e23981m48863n99823L89199Q80745R29532J070356M14147l56521l72976
$$ plain form
12580 -448122 -988776 -2051311 -3298227 -4200190 -4310040 -3665698 -2991668 -2421511 -1654901
12571 -1654901 -477480 800222 1243166 824082 503109 142559 -351424 -1019159 -1156921
12562 -1156921 -931423 -626136 -1210052 -1461086 28613 2040766 1582524 -91376 -1298079
12553 -1298079 -2050417 -2286978 -2262239 -2504561 -2535315 -471376 264700 -1093948 -2222098
12544 -2222098 -1979779 -99118 891480 1465559 2376511 2377613 1103743 133760 -1524964
12535 -1524964 -2760838 -3142051 -3270455 -2425558 -1593007 -1660004 -846099 -139530 -294726
12526 -294726 -503577 147802 745725 -594538 -1532250 -874819 -228489 83088 -523981
12517 -523981 -972844 -1572667 -1183468 -302723 626809 1697165 2111312 1754791 1381815
12508A381815J39623R03475O5738p71626p12304k77697P40005K12156l35858K80184
12498A625511P26722Q47260n69994j052119m80808j356548j030652J118357J487874
12489A315603k49533m02167L29848Q19596P43921j30748j260243j292257n13623
12480f39603J67313o69902m50401M4477k00177M68983Q89002O35235m6022q37185
12470f38280n72032l79163j38029N48867J036259N27531l19548j334181o10207
12461a878783R43767P08072K03467L22892P31900M30827j070947r82226j38234
12452g29265K93464k0855J02001l8411J07102R22999j75271j553271n04171j1520
12442a607198M62184N63927J25714p91914k38456O70228L32818j108070j882673
$$ plain form
12508 1381815 1521438 2424913 2490651 1719025 1006721 729024 1469029 1681185 1345327 1625511
12498 1625511 2352233 3199493 2629499 1577380 1096572 -259976 -1290628 -172271 1315603
12489 1315603 1066070 663903 993751 1813347 2557268 2426520 1166277 -125980 -639603
12480 -639603 -472290 -1142192 -1592593 -1548116 -1748293 -1279310 -390308 244927 198905 -638280
12470 -638280 -1210312 -1589475 -1727504 -1178637 -142378 385153 65605 -1268576 -1878783
12461 -1878783 -935016 -226944 -23477 299415 1031315 1462142 391195 -591031 -729265
12452 -729265 -435801 -456656 -354655 -393066 -285964 637035 461764 -1091507 -1595678 -1607198
12442 -1607198 -1145014 -581087 -455373 -1247287 -1485743 -815515 -482697 -1590767 -3473440
12433c473440m92861Q42933Q24517Q73988J560514R29965n56849r4665M58188
12424H72290n14953j263411m31372P88688O66432P64726J033097k3801J18649
12415B010345o59553j508481n56735K85114J131826J246509M00614J87485k79149
12406B257975n94984O3930K56455K1240r11350q01067l16844P49119J126547o47177
12396A203844k48082o78375p87251o35241l08647j880J145068J522462P16643
12387A928541L99946p7176m54313p43069J72993k93058r34419m12957J40655N03692
12377B30835R33752J77395k54677J43201O80369K22060P26038M21997j387694
12368A893276j371103k64877L25132n92206n08594m66617L94266M26198l65435
$$ plain form
12433 -3473440 -3966301 -3123368 -2298851 -1424863 135651 1065616 508767 414102 872290
12424 872290 357337 -906074 -1337446 -548758 117674 882400 1915497 1891696 2010345
12415 2010345 1350792 -157689 -714424 -429310 702516 1949025 2349639 2537124 2257975
12406 2257975 1662991 1726921 1983376 2004616 1093266 292199 -24645 724474 1851021 1203844
12396 1203844 955762 277387 -509864 -1145105 -1453752 -1455632 -310564 1211898 1928541
12387 1928541 2328487 2251311 1796998 1053929 1226922 933864 -555 -413512 -272857 230835
12377 230835 1164587 1341982 1087305 1230506 1910875 2132935 2858973 3280970 1893276
12368 1893276 522173 257296 582428 -9778 -518372 -984989 -590723 -164525 -529960
12359e29960j78121m23983J14663J028180O74755L24558j89715j437078j227912
12350a844613K17925L91106k70690L2035N58523N04577l73587j47586M13234M25238
12340i3838n9083P8311P00646J189018J029515M30482l66699n97242l42497K44991
12330B213604l90p16313n06761L3017n69873m42902r1922l68218l38133M66292
12320c21599N23559J16417k76061L85181J498074O85378J70073K12110L56811
12311C349943j345391j924334j123014j68769J279353L56567p42498n93568N13526
12302c98185L62855j143936j101254q66758j130282O98741M73181P7331j55679
12293c183986l16280J101599J990709J896583J076253o97124r28942m82666j313759
$$ plain form
12359 -529960 -708081 -1132064 -1017401 10779 685534 1010092 820377 -616701 -1844613
12350 -1844613 -1626688 -1235582 -1506272 -1474237 -915714 -411137 -784724 -932310 -519076 -93838
12340 -93838 -152921 -74610 626036 1815054 2844569 3275051 2908352 2311110 1968613 2213604
12330 2213604 2213214 1496901 990140 1023157 453284 10382 -81540 -449758 -787891 -321599
12320 -321599 201960 318377 42316 427497 1925571 2610949 2781022 2993132 3349943
12311 3349943 2004552 80218 -1042796 -1211565 67788 424355 -318143 -911711 -398185
12302 -398185 -35330 -1179266 -2280520 -3147278 -4277560 -3578819 -3105638 -3028307 -3183986
12293 -3183986 -3500266 -2398667 -407958 1488625 2564878 1867754 938812 456146 -857613
12284h57613m74575j35233r2210M27898L77262L19520J087599O70796j23777j277677
12274g8010k021710r99196O94289J120310L62329m18124r22882j44117P39508
12265a667603Q72209J797420R51177q43391o43533k64324k40433q23275r74715
12256a836468k27783M68034J105092O70494O49342O20026J33531m54513k24955
12247I02800K6254j167152j512205q71425L67750J224285P48638j59392p54887
12238a195334q3970P40350O59988K27667J03562m07301r1543j67236j051437N02926
12228g62328J236851Q12974l05501r97038l42453j19836m44706l25627n26228
12219a773892M99485P94134M81183L53508R25448l81699r01408J58071m63537
$$ plain form
12284 -857613 -1332188 -1467421 -1559631 -1131733 -754471 -434951 652648 1323444 1199667 -78010
12274 -78010 -2099720 -3098916 -2404627 -1284317 -921988 -1340112 -2262994 -2407111 -1667603
12265 -1667603 -795394 1002026 1953203 1109812 466279 201955 -38478 -861753 -1836468
12256 -1836468 -2064251 -1596217 -491125 179369 828711 1448737 1582268 1127755 902800
12247 902800 929054 -238098 -1750303 -2621728 -2253978 -1029693 -281055 -440447 -1195334
12238 -1195334 -1279304 -538954 121034 348701 452263 44962 -46581 -213817 -1265254 -762328
12228 -762328 474523 1287497 981996 -15042 -357495 -477331 -922037 -1247664 -1773892
12219 -1773892 -1274407 -480273 910 354418 1279866 898167 -3241 154830 -308707
12210c08707j20131Q7695P76841J369027N92153l54095j372670j628048q2923
12201a040858J521391N15231l01287m1699p20210n70579k4343r1861j38730l50097
12191a243042K4759o60498j348562j018387N38682J291567P35214O31496R16800
12182a31971M67515n05640j078195L43569J455082r3360p19150j82999J20230
12173c24919r15126m36867R06669R81304P82604J302005P31803r11928j924927
12164A90618p91689Q36846M17519r93658m7515k67878q45510j73875L87738o17275
12154a904679n24298J413647J313824M75384M41233J99634m82610k50042n81172
12145A00921k38935j81546k6755K65007M9389m25261j293501R43880J535271l79278
$$ plain form
12210 -308707 -428838 -341143 435698 1804725 2396878 2042783 670113 -957935 -1040858
12201 -1040858 480533 995764 694477 652778 -67432 -638011 -662354 -754215 -892945 -1243042
12191 -1243042 -1218283 -1878781 -3227343 -4245730 -3707048 -2415481 -1680267 -1048771 -131971
12182 -131971 335544 -170096 -1248291 -904722 550360 457000 -262150 -445149 -324919
12173 -324919 -1240045 -1676912 -770243 211061 993665 2295670 3027473 2115545 190618
12164 190618 -601071 235775 653294 -340364 -387879 -655757 -1501267 -1675142 -1287404 -1904679
12154 -1904679 -2428977 -1015330 298494 773878 1215111 1414745 932135 682093 100921
12145 100921 -138014 -319560 -346315 -81308 -31919 -457180 -1750681 -806801 728470 349192
12135C49192j041454m49479p74394k73617M71212K10842M88334Q14126J96497
12126h741k51018N26366N67533q4610o00851j391728n53238J307740J085778J97351
12116G94582J269339L22933q96088K12442J145712J96033j142290j103110p87390
12107A2163o30182q09693p83631o96289K28084N12632J251568J133624O973p59764
12097e34515r113M63644l86202l42764R28O848o37674l44395J042574O32359J90976
12086H2666Q1576n43070k62998J02121q07321q94387m81149K81259P84651L14396
12076a342256o31314l92331l77188m58119J182691J316109M1251m25166k59758
12067a346081l38673m03970k97239P19688Q16714p615K54491m25078j68521M81843
$$ plain form
12135 349192 -692262 -1141741 -1916135 -2189752 -1718540 -1507698 -1019364 -205238 -8741
12126 -8741 -259759 266607 834140 749530 148679 -1243049 -1796287 -488547 597231 794582
12116 794582 2063921 2386854 1490766 1703208 2848920 3044953 1902663 799553 12163
12107 12163 -618019 -1427712 -2211343 -2907632 -2679548 -2166916 -915348 218276 225249 -534515
12097 -534515 -543628 -79984 -466186 -808950 -808022 -801174 -1438848 -1783243 -740669 -108310 82666
12086 82666 164242 -378828 -641826 -539705 -1347026 -2241413 -2722562 -2441303 -1656652 -1342256
12076 -1342256 -1973570 -2365901 -2743089 -3201208 -2018517 -702408 -661157 -1086323 -1346081
12067 -1346081 -1684754 -2088724 -2385963 -1666275 -849561 -857176 -602685 -1027763 -1196284 -714441
12057g14441J096268R57652J61178j00977j366242r36389K93445J030994J3272
12048D34760p69209J76969L97753j92258m99680r24133k88973N45824O04413K15357
12038b99177l9844K62709R99693J050216n14046j026361j92213q29516q54267
12029a442806R3383J036064P06024k61091l52434l8354o3805K56264N88723L39306
12019H61274J40655M43008K96980K65638N96080O04188R17118j61778n30276j579021
12009A853866j680437m5981M2733l26188N69643J932468O75664p58777n28675
12000A734316j37456n81026j373931p66516j95222L53510Q1475j11177k34887
11991a230914l1687N57231p1186l97803l29979l75326l47755n70592k35542O81411
$$ plain form
12057 -714441 381827 1339479 1500657 1399680 33438 -902951 -609506 421488 434760
12048 434760 -334449 -157480 240273 48015 -451665 -1375798 -1664771 -1118947 -514534 -299177
12038 -299177 -339021 -76312 923381 1973597 1459551 433190 240977 -588539 -1442806
12029 -1442806 -1349423 -313359 392665 131574 -220860 -259214 -323019 -66755 521968 861274
12019 861274 1001929 1444937 1741917 2007555 2603635 3207823 4124941 3963163 3432887 1853866
12009 1853866 173429 127448 170181 -156007 413636 2346104 3021768 2262991 1734316
12000 1734316 1596860 1015834 -358097 -1124613 -1319835 -966325 -884850 -996027 -1230914
11991 -1230914 -1262601 -705370 -776556 -1174359 -1504338 -1879664 -2227419 -2798011 -3033553 -2352142
11981b352142J126969J473289O31686o78729R5219j06656j448628j388276K59732
11972b387536J316541J109411M27076J29830K24073o68714q06336j092603L55720
11963a392538J215037J033578J70260m80305q74766k112826n58536R37150R60938
11954a102008K22552O39155N64357j29P6551K41733j51243O14641J65263n90991
11944F79881k07680n52500j096329m30052M71652j5957m28639Q63948J425984
11935G10308J325421J63065j025058k45799l1041n76663m25086m56451j324473
11926a885777j032478m56791R85849K124677J658546m25543o24642p215k04152
11917A32474o14001n05701k97847Q7847R72728N37050O63476l87098k67456K44390
$$ plain form
11981 -2352142 -1225173 248116 879802 201073 296292 189636 -1258992 -2647268 -2387536
11972 -2387536 -1070995 38416 465492 595322 819395 150681 -655655 -1748258 -1392538
11963 -1392538 -177501 856077 1026337 546032 -328734 -2441560 -3000096 -2062946 -1102008
11954 -1102008 -879456 -240301 324056 323927 400478 642211 490968 1105609 1270872 679881
11944 679881 472201 -80299 -1176628 -1606680 -1135028 -1150985 -1579624 -715676 710308
11935 710308 2035729 2198794 1173736 927937 896896 320233 -104853 -561304 -1885777
11926 -1885777 -2918255 -3375046 -2389197 -264520 1394026 968483 343841 336626 132474
11917 132474 -481527 -987228 -1285075 -1197228 -224500 312550 976026 588928 321472 565862
11907E65862k45776o88604r69604j126584j69429Q43486Q30865L86742n28104
11898a101146r40744j029000N6385J546927J417424q45782q05175O25947J151516
11889G6352Q54944K09292o4206L17532J77381q3967p23591n64466O96364N85531
11879A481166j098876m89791J42711J94429R68346M36446L13907M37385Q0405
11870B466128n77913m94745p41731j196526o79157l0192q2304l32066M28760J152388
11860h7358K65348L23373M03591o85959o29779n60484p4990K6240m53166J55669
11850a317515K34814j03301j20806K09344J33668o22687p02488J89732J275773
11841h23466K30576O30194J927093M93778j03925j9256q32534j290155p59526
$$ plain form
11907 565862 320086 -368518 -1338122 -2464706 -2634135 -1790649 -959784 -573042 -1101146
11898 -1101146 -2041890 -3070890 -3014505 -1467578 -50154 -895936 -1701111 -1075164 76352
11889 76352 931296 1140588 1076382 1393914 1571295 1487328 763737 199271 895635 1481166
11879 1481166 382290 -107501 35210 229639 1197985 1634431 1948338 2385723 2466128
11870 2466128 1888215 1393470 651739 -544787 -1223944 -1254136 -1336440 -1668506 -1239746 -87358
11860 -87358 177990 501363 904954 218995 -410784 -971268 -1046258 -1020018 -1473184 -1317515
11850 -1317515 -1082701 -1186002 -1306808 -1097464 -963796 -1586483 -2288971 -2099239 -823466
11841 -823466 -592890 37304 1964397 2458175 2354250 2334994 1502460 212305 -547221
11832e47221K99384P1283l52826m74936K9228K10555J5403J38191R50952J004890
11822A344903o1341j110467o98184J96511J51044L3450N27060J321563n05259
11813A199280j959363j655348m92844Q0087N26253J45105J173072J264846o8745
11804B12343K8858n24420q30229k56885Q49472J676697J096191J38172P26173
11795C116372l61761r15107r56387n67398j11543m97073O8110O89395p39171q76986
11785a151549J51986J232113m77187r07312J173740M02843j209711o78629k62308
11776a726014J01865K39921O83186O34979Q58173R66006P52592k17941j941259
11767C51508o34949L83684R52439J275140M62049j302050j494811m26666k9809
$$ plain form
11832 -547221 -247837 -176554 -529380 -1004316 -975088 -764533 -749130 -610939 340013 1344903
11822 1344903 1283562 173095 -525089 -328578 -177534 -144084 382976 1704539 1199280
11813 1199280 -760083 -2415431 -2908275 -2828188 -2301935 -2156830 -983758 281088 212343
11804 212343 241201 -283219 -1113448 -1370333 -520861 1155836 2252027 2390199 3116372
11795 3116372 2754611 1839504 883117 315719 204176 -292897 -224787 464608 -274563 -1151549
11785 -1151549 -999563 232550 -244637 -1151949 21791 424634 -785077 -1463706 -1726014
11776 -1726014 -1624149 -1384228 -701042 -66063 792110 1758116 2510708 2292767 351508
11767 351508 -283441 100243 1052682 2327822 2789871 1487821 -6990 -433656 -463465
11758d63465O34973J042421m45102j951659j126567L51463Q15233Q61252O48245
11749C66794Q06609j88434J30114Q00700l99016r22696l67847m06799q58176m28997
11739a467748l18168K48702J722960R64502k68823n72383j000438m65556L45515
11730h11437m94499l92466j179863k55993M2369Q9956J056238J225445K88362
11721d31888K70837L07800K43609j440954j025346O44430n87464m88323J065349
11712a441950J647582K58697l15503M45338M44207P64369K38114l52930k03499
11703A484425k56872o29023p97395n40408k341k85091j251018k89407N41850R55239
11693a070041K21441m99045N92760L99148J26746j79853M1207O19167N60844k82596
$$ plain form
11758 -463465 171508 1213929 768827 -1182832 -2309399 -1957936 -1142703 -281451 366794
11749 366794 1173403 984969 1115083 1915783 1516767 594071 226224 -180575 -1038751 -1467748
11739 -1467748 -1785916 -1537214 185746 1150248 881425 309042 -691396 -1156952 -811437
11730 -811437 -1305936 -1698402 -2878265 -3134258 -3091889 -3001933 -1945695 -720250 -431888
11721 -431888 -161051 146749 390358 -1050596 -2075942 -1431512 -2018976 -2507299 -1441950
11712 -1441950 205632 464329 148826 594164 1038371 1802740 2040854 1687924 1484425
11703 1484425 1227553 598530 -198865 -739273 -741614 -1026705 -2277723 -2567130 -2025280 -1070041
11693 -1070041 -848600 -1347645 -754885 -355737 -228991 -408844 -367637 251530 812374 529778
11683E29778l03894m04270r62266m74609N51485J193419J106621K92540l89433
11674A139371L00378k29072J25506L32148n99347p77614j77380R7311J86978k0345
11664C77934K13513J058097L98005m72670q95651j430696o25687j12211K07346
11655a282020J329049R64063j96706p48544n59444J4470l14235M52602J20122
11646b20643r86914O6471J321709J319098p93254k333977n09822q002N65910J124301
11636d55123M41801n24797m75334j58154K05107O17544J000835O1097j815578
11627a102602j722896k04214N9097L86048Q26220P07080J13442l55503M01064
11618h92264J043425K56722j11476R1143p76348j16444M509p34230L50207J312847
$$ plain form
11683 529778 225884 -178386 -1140652 -1615261 -1063776 129643 1236264 1528804 1139371
11674 1139371 1439749 1210677 1336183 1668331 1068984 291370 113990 211301 398279 377934
11664 377934 591447 1649544 2047549 1574879 679228 -751468 -1377155 -1489366 -1282020
11655 -1282020 47029 1011092 814386 65842 -493602 -479132 -793367 -340765 -220643
11646 -220643 -1207557 -1141086 180623 1499721 706467 -1627510 -2137332 -2145334 -1579424 -455123
11636 -455123 -13322 -538119 -1013453 -1171607 -966500 -348956 651879 712976 -1102602
11627 -1102602 -2825498 -3029712 -2970615 -2584567 -1758347 -1051267 -937825 -1293328 -892264
11618 -892264 151161 407883 296407 387550 -388798 -505242 -500733 -1234963 -884756 428091
11608D28091L62084o64115j126457m45454l29211l84187K8010k12152Q05159Q99216
11598f39016l2296N97418J075915k97018o7885q71202r18301r6199q22812l54659
11588b426055R36023K17104k56988j84851O35033l27195j171325l15605P35268
11579b158591M24909L77590K15410j143729k57254M47311J051229M83082k09987
11570g70030N18613M8830p29278o76466k48580R76290J210867K91446M75114N53440
11560A650246n99722l73507N54446M81829q95248o63205O47460P59376N04193
11551B065868M84650j76452K02964p0430j16681O1695J01957j114391j730848
11542b91668j167279m27978J361690J225733R33194l35469j134349j38603R17744
$$ plain form
11608 428091 790175 126060 -1000397 -1445851 -1775062 -2159249 -2131239 -2343391 -1538232 -639016
11598 -639016 -671312 -73894 1002021 705003 637118 -234084 -1152385 -1248584 -2071396 -2426055
11588 -2426055 -1490032 -1272928 -1529916 -1714767 -1079734 -1406929 -2578254 -2893859 -2158591
11579 -2158591 -1733682 -1356092 -1140682 -2284411 -2541665 -2094354 -1043125 -560043 -770030
11570 -770030 -251417 -202587 -931865 -1608331 -1856911 -880621 330246 621692 1096806 1650246
11560 1650246 1050524 677017 1231463 1713292 818044 154839 802299 1561675 2065868
11551 2065868 2550518 2374066 2577030 2506600 2389919 2451614 2553571 1439180 -291668
11542 -291668 -1458947 -1886925 -525235 700498 1633692 1298223 163874 25271 943015
11533I43015J16475m48630M3589k84634n22114J61248J38740K55423J030304M74263
11523A907679j261928j397163o4752M77336K75544K09423Q42987k34060l20389
11514D34677k2127K78005J54800L5869j081126m16021J088285M76225L15723J008484
11504B272794j093051m56246N09526r24516L12707J001209M2250l7894N19173
11495B145952k61890k120982j552493O87079O31166l36983o86041j34476M28783
11486a199885J86605j77912Q8739J129762N16859p19815m93988K14098J71421
11477b84116n14889J60398J7187L91922J483274P11302j203224j131455M17258
11468D7657P82377P31935P4155o32428l00391l64186n59191N46585R53179Q03860
$$ plain form
11533 943015 1059490 610860 654449 369815 -152299 8949 147689 403112 1433416 1907679
11523 1907679 645751 -751412 -816164 -338828 -63284 146139 989126 755066 434677
11514 434677 412550 690555 845355 881224 -199902 -615923 472362 948587 1264310 2272794
11504 2272794 1179743 723497 1233023 308507 621214 1622423 1664673 1626779 2145952
11495 2145952 1884062 -236920 -1789413 -1102334 -471168 -808151 -1494192 -1628668 -1199885
11486 -1199885 -1013280 -1191192 -1102453 27309 544168 -175647 -669635 -455537 -284116
11477 -284116 -799005 -638607 -621420 -229498 1253776 1965078 761854 -369601 47657
11468 47657 830034 1561969 1636124 1003696 703305 339119 -220072 326513 1279692 2083552
11458B083552O78152j067064j343003j259319K35723J016085M16449m7753L59548
11449A072370N57419l40918q00826o47469o60383J24637Q37297O13877J284132
11440B040136O30970j93180q70222j96631J5810j406823j583902j290981k39357
11431c094180J124053O90466M00086L01471J20075M59508L77265P1301n44026
11422i3981m65503m16914J61528M68498J03093m16252o45606q44454p4020N39389
11412a684222l23268K94090K24198K49726M96609o3153L56907J037791N03173
11403A091851n16059j467372j154389j2626M53541j47841l41776J29123N66113
11394a399435l9568j122497q62423L51649M01294R0461K70337R60759N74985q2691
$$ plain form
11458 2083552 2761704 1694640 351637 -907682 -671959 344126 760575 712822 1072370
11449 1072370 1629789 1288871 488045 -159424 -819807 -695170 142127 756004 2040136
11440 2040136 2671106 2477926 1607704 1411073 1426883 20060 -1563842 -2854823 -3094180
11431 -3094180 -1970127 -1279661 -879575 -578104 -458029 1479 378744 450045 -93981
11422 -93981 -559484 -976398 -814870 -346372 -243279 -659531 -1305137 -2149591 -2223611 -1684222
11412 -1684222 -2007490 -1713400 -1489202 -1239476 -742867 -806020 -449113 588678 1091851
11403 1091851 575792 -891580 -2045969 -2058595 -1605054 -1752895 -2094671 -1965548 -1399435
11394 -1399435 -1439003 -2561500 -3423923 -3072274 -2670980 -2580519 -2310182 -1349423 -774438 -857129
11384h57129O59722K89022K3615M14982l2169n64849k36787r31735L16782M55985
11374d62561r14397K41267J012121J87491p12314r5191N66900m28094p71127M21694
11364i54211O70845M69632K39873n4919J06906k21780o60364j27487N89148o82058
11354f24415n62111J37162L63441k08539r2091Q7605M58649N68759L08997Q43400
11344A280857j35527j272772r79456J18226P62179O08507l6051p43744n32025
11335i29806L22852J3154m44407p92374K98750Q79155J55116r4571Q53138j39098
11325A21909r00401k39202k9226R26340M95604r02247J97411J120156Q56523n47136
11315A099731j286205r66294n0741M50485L26795m43733l58455K19356K30213
$$ plain form
11384 -857129 -197407 91615 115230 530212 498043 -66806 -303593 -1235328 -918546 -462561
11374 -462561 -1376958 -1135691 -123570 63921 -648393 -743584 -176684 -604778 -1375905 -954211
11364 -954211 -283366 186266 426139 371220 478126 256346 -404018 -531505 57643 -624415
11354 -624415 -1186526 -1049364 -685923 -894462 -986553 -898948 -440299 128460 437457 1280857
11344 1280857 1145330 -127442 -1106898 -988672 -226493 382014 345963 -397781 -929806
11335 -929806 -606954 -593800 -1038207 -1830581 -1531831 -652676 -497560 -592131 261007 121909
11325 121909 -778492 -1017694 -1046920 -120580 375024 -527223 -329812 790344 1646867 1099731
11315 1099731 -186474 -1152768 -1203509 -753024 -426229 -869962 -1228417 -1009061 -778848
11306g78848L17265K73587O69247N66028n54749m42469j83401k12098J27467O34748
11296D16777m55634q45787N25103Q6090L49998m55321q89931J8476R17244R85949
11286F52964M30852j61634J91836L62139j087962j024958j98316j05373L05575
11277f34877L60959r700K5888N87558R89714N44651o46326o17582k88470N50163
11267H61978o76997j393713q6600K31848m26561m73129P7976L69839J232683Q99931
11257F17255l15145q20014j203922o91177K71709Q15879P89218N61110M19692
11248D44605N45198l6281o50815j568067n75410N43255M14223L32772J403524
11239H53004O80970j017976n96852K96100L11630k44093l70348m50962J59131
$$ plain form
11306 -778848 -461583 -187996 481251 1047279 492530 50061 -133340 -345438 -217971 416777
11296 416777 -38857 -884644 -359541 -273451 76547 -378774 -1268705 -1250229 -332985 652964
11286 652964 1083816 922182 1114018 1476157 388195 -636763 -835079 -940452 -634877
11277 -634877 -273918 -283618 -257730 329828 1319542 1864193 1217867 600285 311815 861978
11267 861978 184981 -1208732 -1295332 -1063484 -1490045 -1963174 -1885198 -1515359 -282676 617255
11257 617255 302110 -517904 -1721826 -2413003 -2141294 -1325415 -536197 24913 444605
11248 444605 989803 953522 302707 -1265360 -1840770 -1297515 -883292 -550520 853004
11239 853004 1533974 515998 -80854 215246 526876 282783 -87565 -538527 -379396
11230c79396O57840O15904J63083l96097r00218j18018L83509M51982o34777p07672
11220h63860k49320j74620R03799J606007Q84837l50296l88629m97853m71618
11211C98447j10699o92957n26463m6092Q4373N39569j93508L35799l8968l19613
11201e70112M44524j18319n45059j254104K13298J530339R51566p09733r41550
11192i99150M69368J425785J073136J4801j221303j810573r04463m92226k30705
11183b675330J9301Q6648R98214J271236P18922J110963j80466j374691j122937
11174a148140p3867J123879L5271k09521L15541n83760k81231L52814p55287p56141
11164a980442q19892k78575M50516J870434M49863p53738o36852j00052N24150
$$ plain form
11230 -379396 278444 894348 1057431 661334 -238884 -356902 26607 478589 -156188 -863860
11220 -863860 -1113180 -1287800 -384001 1222006 2106843 1756547 1367918 870065 398447
11211 398447 287748 -405209 -931672 -977764 -893391 -353822 -547330 -211531 -250499 -570112
11201 -570112 -125588 -243907 -788966 -2043070 -1829772 -299433 652133 -57600 -999150
11192 -999150 -529782 896003 1969139 1983940 762637 -1047936 -1952399 -2444625 -2675330
11183 -2675330 -2656029 -2569381 -1571167 -299931 418991 1529954 1349488 -25203 -1148140
11174 -1148140 -1222007 -98128 -62857 -272378 43163 -540597 -821828 -469014 -1224301 -1980442
11164 -1980442 -2800334 -3078909 -2628393 -757959 -308096 -1061834 -1698686 -1798738 -1274588
11155a274588L23054O9418M87013R9296m81886j37844J77600K39769L60800J44633
11145G265m96361q62207p99046o86388n84033M9710M39230N45921K46215Q0166
11135b059528P918L74225J0392o58841J73624J146533M34368N39425o42224q17314
11125a491422K67947M09033o60217p0277M63466P82810M16253L99094m90533r01433
11115h75279p68214J4783J052637n59417k29984M54036Q25495M29692j06627L2629
11105B69751L46007o76728k26539J528458J271707N56465L9442j86555m5228n25792
11095B350988J96249J305058P37921j885039l047280j492668O07812O15978K39737
11086c71244Q0048l89571k00349p63572j403039k0626J257412M49194p08705l60912
$$ plain form
11155 -1274588 -951534 -882116 -395103 -295807 -777693 -915537 -737937 -498168 -137368 7265
11145 7265 -489096 -1351303 -2150349 -2836737 -3420770 -3371060 -2931830 -2385909 -2139694 -2059528
11135 -2059528 -2051610 -1677385 -1666993 -2325834 -2152210 -1005677 -571309 -31884 -674108 -1491422
11125 -1491422 -1223475 -814442 -1474659 -1544936 -1081470 -298660 117593 516687 26154 -875279
11115 -875279 -1643493 -1628710 -576073 -1135490 -1365474 -911438 -85943 343749 237122 269751
11105 269751 615758 -60970 -287509 1240949 2512656 3069121 3108563 2922008 2876780 2350988
11095 2350988 2547237 3852295 4590216 2705177 -342103 -1834771 -1226959 -610981 -371244
11086 -371244 -291196 -680767 -881116 -1644688 -3047727 -3068353 -1810941 -1361747 -2070452 -2431364
11076b431364J88232N22131N84195m59012K5820Q82587K84073q0272n96466k88583
11066a368659M38282l83602m73512P60430J201688P60790m10426r3705M00501
11057H31787l24500p25512k29885L56594O06323J743353Q20808q54625n63502
11048A660841n72506p56849l12025K90952J001987o2907j048604j269203m0718
11039a109032M17413P4752K54136K6633P57521N64928J52381k2426m49901n34859
11029A31546n67687m13730L41944J465211Q58801n23028n57819l29126r97872
11020e91760l98070o7964R17427J545911K68724M56139J055203N93728n05031
11011C274307j810646n52864R03157N49303k11619l65271j150302j641111l89316
$$ plain form
11076 -2431364 -2243132 -1721001 -1136806 -1595818 -1569998 -687411 -403338 -483610 -1080076 -1368659
11066 -1368659 -930377 -1313979 -1787491 -1027061 174627 935417 524991 431286 831787
11057 831787 507287 -218225 -448110 -91516 514807 2258160 3078968 2224343 1660841
11048 1660841 1088335 331486 19461 310413 1312400 1249493 200889 -1068314 -1109032
11039 -1109032 -691619 -616867 -362731 -336098 421423 986351 1138732 1116306 666405 131546
11029 131546 -436141 -849871 -507927 957284 1816085 1293057 735238 406112 -591760
11020 -591760 -989830 -1057794 -140367 1405544 1674268 2130407 3185610 3779338 3274307
11011 3274307 1463661 910797 1813954 2363257 2151638 1786367 636065 -1005046 -1394362
11002a394362P58024l4312m2298Q08708J177212o10674j653828J5310P56088R99473
10992G79341j8533l87964l39795L11782k13057m26251P02963J228218j40794j982680
10982d86770j309114k5127K27878J435974J715904M23579r93692o76643m58825
10973a46836Q70169J142201Q8094L10448j6729l20416j290847j126658M87993
10964b581Q70916M84035k53905m98464k72406j383305r70204n96264O97773J221913
10954g02492L66837K66008N7166j31646q73386p89794J130932J495425j0416R8692
10944I07326O61121m30541j288807j289107q49557m77365m47301M17011O17672
10935b179548O70069r6927o03922M81037q8386o70453M14063K206427J246243
$$ plain form
11002 -1394362 -636338 -670650 -712948 95760 1272972 662298 -991530 -976220 -220132 779341
10992 779341 760808 372844 33049 344831 131774 -294477 408486 1636704 1495910 -486770
10982 -486770 -1795884 -1821011 -1593133 -157159 1558745 1982324 988632 311989 -146836
10973 -146836 723333 1865534 1953628 2264076 2247347 1926931 636084 -490574 -2581
10964 -2581 868335 1352370 1098465 600001 327595 -1055710 -2025914 -2622178 -1924405 -702492
10954 -702492 -335655 -69647 -12481 -144127 -1017513 -1807307 -676375 819050 808634 907326
10944 907326 1568447 1137906 -150901 -1440008 -2289565 -2766930 -3214231 -2797220 -2179548
10935 -2179548 -1509479 -1606406 -2210328 -1729291 -1817677 -2488130 -2074067 132360 1378603
10926A378603j029509j169146J1997N03479K6118n51028k17319j77188N40590
10917f83403P35722j21433p34596n58193L70769O22644N74183J77516O37227L02152
10907A322588p86395j422249j433097p28461n23801K18904Q05698O00366R98812
10898i47635R70223J20674q26557j231535L5730Q80299N26787m22067j314538
10889b208619n59381L65086Q19584R98932P6864N0182j68015k43862N51192L58560
10879D0523L81873J000853M78433K60468n2937M83969r47133k478533o24083J096278
10869c60289O45874N3458K04429O32864R83695m9527l79688j145454j624104n81959
10859a620701l82263m49329L25722J104974R81373j85257J34327K16633O7252
$$ plain form
10926 1378603 349094 -820052 -808055 -304576 -278458 -829486 -1046805 -1223993 -683403
10917 -683403 52319 -69114 -803710 -1361903 -991134 -368490 205693 383209 1020436 1322588
10907 1322588 536193 -886056 -2319153 -3047614 -3571415 -3352511 -2546813 -1946447 -947635
10898 -947635 22588 143262 -683295 -1914830 -1879100 -998801 -472014 -894081 -2208619
10889 -2208619 -2768000 -2402914 -1583330 -584398 -507534 -457352 -625367 -869229 -318037 40523
10879 40523 422396 1423249 1901682 2162150 2109213 2593182 1646049 -832484 -1456567 -360289
10869 -360289 285585 339043 543472 1176336 2160031 2110504 1730816 585362 -1038742 -1620701
10859 -1620701 -2002964 -2452293 -2126571 -1021597 -40224 -225481 -91154 125479 192731
10850A92731K84933k99509o21607n59861r6265k54230j78401N84139R43928O16133
10840F11991J11178p15888j756776m12191M28581J585828J609064J62961r6663
10831A528085K0902O00149J64880o22376j026391p14739j062407r18411N85271
10822a445037J102329O58303m15865n44174p40064j292294n2657l8817k8921R73244
10812a823953N11299j12557q02150K7487N00782M67997J315706j43543o75092
10803g34024P37615M52987k36088n29927l61409K86483o7941r36478n83293J4218
10793a957857m78776p68554L74179J147683J087241N81039O125R79034J544835
10784B514949J135502M24468j597920j744799k68777M81023M25800L35988q61197
$$ plain form
10850 192731 477664 178155 -443452 -1003313 -1099578 -1353808 -1532209 -948070 -4142 611991
10840 611991 723169 7281 -1749495 -2161686 -1733105 -147277 1461787 1624748 1528085
10831 1528085 1548987 2149136 2314016 1691640 665249 -49490 -1111897 -2030308 -1445037
10822 -1445037 -342708 315595 -100270 -644444 -1384508 -2676802 -2729459 -2768276 -2797197 -1823953
10812 -1823953 -1312654 -1425211 -2227361 -2199874 -1699092 -1231095 84611 -58932 -734024
10803 -734024 3591 456578 220490 -309437 -670846 -384363 -452304 -1388782 -1972075 -1957857
10793 -1957857 -2436633 -3205187 -2831008 -1683325 -596084 -15045 -8920 970114 2514949
10784 2514949 3650451 4074919 2476999 732200 463423 944446 1370246 1706234 845037
10775H45037j425802o79199P55549J255066L8198Q95360l637j362702r17227M64547
10765a34810N29787m20121m05654L32054K09381q6945M88135N8595R82263R94940
10755B547625m23615q18613K9564L95713j55545n48675m62379m59234M8087m77109
10745c24181p89945Q40323J187951O82535o6835J81397k21652M16457P20p4858
10735A831912K75389L5199q88214j886781r00810L3O5594J154708R35283l03466
10725C18847L32570R42509p26440j065847K84580J26345M28843O23852q5245k57188
10715I22826l71525L1310m21515j854221j347640K14111R51535K75556P57712
10706h41851O6281M01822J28079l45327N57489O30620M11771Q25717L17379L07894
$$ plain form
10775 845037 -580765 -1259964 -504415 750651 788849 1684209 1680572 317870 -599357 -134810
10765 -134810 394977 -25144 -430798 -98744 110637 23692 511827 570422 1552685 2547625
10755 2547625 2124010 1305397 1334961 1730674 1575129 1026454 564075 104841 152928 -324181
10745 -324181 -1114126 -273803 914148 1596683 1529848 1711245 1489593 1906050 1906770 1831912
10735 1831912 2107301 2142500 1254286 -632495 -1533305 -1533272 -1467678 -312970 622313 318847
10725 318847 651417 1593926 867486 -198361 86219 212564 641407 1265259 1180014 922826
10715 922826 551301 582611 161096 -1693125 -3040765 -2826654 -1875119 -1599563 -841851
10706 -841851 -775570 -373748 -245669 -590996 -33507 597113 1008884 1834601 2151980 2459874
10696B459874j29950j654114j135295L38139O09915J51856k13593r3564J150263
10687A483531J137305N0298J92836m35932j895539j655564j048413j3942J616597
10678e68823K42239p37391N05437J343864L74971J97215N55959k85490n86008
10669A041973K94910J80259J74187l83696j499952l26833L47901r10252j168346
10660b249849o95888P05477J316446P32928J160312J226214k02564q04766j151862
10651C6448O6052K14285L70053m31037q88541j86069k34870L39277P75681j64449
10641a03170m34911K60142J097091O8722p69960j596277j878177j288355J73440
10632d471455J452989J348201j00588p39995L11628K35988M99321P05562J52645
$$ plain form
10696 2459874 2329924 675810 -459485 -121346 488569 640425 426832 333268 1483531
10687 1483531 2620836 2671134 2863970 2428038 532499 -1123065 -2171478 -2185420 -568823
10678 -568823 -326584 -1063975 -558538 785326 1160297 1357512 1913471 1627981 1041973
10669 1041973 1336883 1517142 1691329 1307633 -192319 -519152 -171251 -1081503 -2249849
10660 -2249849 -2945737 -2240260 -923814 -190886 969426 2195640 1993076 1188310 36448
10651 36448 102500 316785 686838 255801 -632740 -818809 -1053679 -714402 61279 -103170
10641 -103170 -538081 -277939 819152 887874 117914 -1478363 -3356540 -4644895 -4471455
10632 -4471455 -3018466 -1670265 -1770853 -2510848 -2199220 -1963232 -1463911 -758349 -605704
10623f05704O74690J18498j381576p60663n1182N52946M53432O80055L11923N8982
10613E1401m50166L86171M3511k78145o98654j033130m74556Q33022R63831M94099
10603a62616P24134K93366J2273o8127o82447q40788n08050j075470j111571L94954
10593c024342J309743R55705L16729p33637n95480P19923J035428L96126K81589
10584F61784J78243K63395L04687M58884m92517q28687j035131j804252l74121
10575b667715K22708L36200J504710J102056n65022k11002o36376l63851J30345
10566a147947N25740O19683j24471q60598l40009M98517J403O08149J244717p1506
10556I53678k57456q34908q86098k19075J58571J56174j52287n52932r0457J036319
$$ plain form
10623 -605704 68986 187484 -1194092 -1954755 -2005937 -1452991 -999559 -319504 -7581 51401
10613 51401 -398765 -12594 30917 -247228 -945882 -1979012 -2453568 -1620546 -656715 -162616
10603 -162616 561518 854884 867157 799030 116583 -724205 -1232255 -2307725 -3419296 -3024342
10593 -3024342 -1714599 -758894 -442165 -1175802 -1771282 -1051359 -15931 380195 661784
10584 661784 840027 1103422 1408109 1866993 1374476 545789 -489342 -2293594 -2667715
10575 -2667715 -2445007 -2108807 -604097 497959 -67063 -278065 -914441 -1278292 -1147947
10566 -1147947 -622207 -2524 -126995 -987593 -1327602 -829085 -827682 -219533 1025184 953678
10556 953678 696222 -138686 -1024784 -1243859 -1085288 -929114 -1081401 -1634333 -1724790 -688471
10546f88471N22085j01073p49733j2211M59748K98640n19415M2027J75468M16294
10536a56641J401538L60800p00296m87860k79767M19599p369J91586O82142j43520
10526A280212p92149n73218K37291J65405N5418n9696L52413N42172n42014j293129
10516f27295o15796J70111M18383J69502L30455m95090o34783l66185o13914m00596
10506b665208O12467J539742J427714m3762p05731j226280j248337q8818J390426
10497a007787J326180K71589N21872p1533l21479K93356q58634j107825m79155
10488a433416O57260R28608N2j63879k34991o38728m77891L03621P27468N0273
10478b81623n35803j78340Q9535M73023J96437K8776N61668J51108j92978j80209
$$ plain form
10546 -688471 -166386 -267459 -1017192 -1029403 -569655 -271015 -790430 -748403 -572935 -156641
10536 -156641 1244897 1605697 905401 417541 137774 557373 550004 741590 1423732 1280212
10526 1280212 488063 -85155 152136 317541 372959 313263 665676 1207848 665834 -627295
10516 -627295 -1243091 -1072980 -654597 -485095 -154640 -649730 -1284513 -1650698 -2264612 -2665208
10506 -2665208 -2052741 -512999 914715 870953 165222 -1061058 -2309395 -2398213 -1007787
10497 -1007787 318393 589982 1111854 1040321 718842 1012198 153564 -954261 -1433416
10488 -1433416 -776156 152452 152504 -11375 -246366 -885094 -1362985 -1059364 -331896 -281623
10478 -281623 -817426 -995766 -906231 -433208 -236771 -207995 353673 504781 311803 131594
10468A31594k51047r46135j36537N64736O78061O86003N27692j126091r48169
10459h19893j23911M04787K67433q188M81064M7676p67318j062361l6567J051357
10449e65921K31123j073699n4804J607354J389425j32851k40964p33178J44838
10440E71323J090849J053289O11626n79095m76246j30237p91262j363451n42028
10431e55232o1840j4023K43463O16801P44094J11401L68783L98915K14299n35946
10421A530715p95744l65000o82019K14313J301454M09713o61647j56588J19002
10412I14199N03115K1713o67652l59298l65776o14902K53166R05488L60899o22931
10402C28021k88030M29399p85550j447328J9916N91483Q75085R04306q28167j96293
$$ plain form
10468 131594 -119453 -1065588 -1202125 -637389 40672 726675 1254367 128276 -819893
10459 -819893 -943804 -539017 -271584 -279772 201292 248968 -518350 -1580711 -1617278 -565921
10449 -565921 -334798 -1408497 -1463301 144053 1533478 1400627 1159663 426485 571323
10440 571323 1662172 2715461 3327087 2747992 2271746 2141509 1350247 -13204 -555232
10431 -555232 -617072 -631095 -387632 229169 973263 1084664 1453447 1852362 2066661 1530715
10421 1530715 734971 369971 -312048 -97735 1203719 1613432 951785 795197 914199
10412 914199 1417314 1439027 771375 412077 46301 -568601 -315435 590053 950952 328021
10402 328021 39991 469390 -316160 -1763488 -1743572 -1152089 -277004 627302 -200865 -397158
10392c97158L22103k38771j158238j339739q74905N9643J102067Q28228Q9740
10383a607030J95914J384420J222741n81238j397452k4745J039563J01312j302188
10374i68703p65335J836777J866194J031290J224596l63651j097939p56619K67022
10365B273632l22699k27821l1114M73883O49033m37410q943j93634j260198o31876
10355B82853n30690j097538m39070Q60372J663466O18655k98475j024856j455159
10346a420442j842253j200191J62590J576416Q98140N2023M36236J49205j31538
10337a319814J08888J39168K01333j68694r41234j172950p23350O70806K248128
10328i57719J554747K41737l49530l03181m3822Q71711j22629l45374M2000J15141
$$ plain form
10392 -397158 -75055 -313826 -1472064 -2811803 -3686708 -3627065 -2524998 -1696770 -1607030
10383 -1607030 -1411116 -26696 1196045 614807 -782645 -807390 232173 333485 -968703
10374 -968703 -1734038 102739 1968933 3000223 4224819 3861168 2763229 2006610 2273632
10365 2273632 1950933 1723112 1691998 2165881 2814914 2377504 2368561 2174927 914729 282853
10355 282853 -247837 -1345375 -1784445 -924073 739393 1358048 1059573 34717 -1420442
10346 -1420442 -3262695 -4462886 -4300296 -2723880 -1825740 -1773717 -1337481 -1188276 -1319814
10337 -1319814 -1210926 -1071758 -870425 -1039119 -1980353 -3153303 -3876653 -3205847 -957719
10328 -957719 597028 838765 489235 186054 142232 1013943 891314 545940 587940 703081
10318G03081P60711q24018m10537l42886j406825j654039J8621J226759R09361
10309a019772J17782n11394O57203M68475L43212P87314k8088q28377j406274
10300a419919l04361M95631j77530j063294o61079J197279Q94381j092165j536983
10291c668040o6357J259695K565722J008648j31834j136448q42218m98326P29841
10282g79317J241815L66018N09144M62570j64983k41463m26761k03596O41731
10273A405158K02620J23913l4740l22974m49757q60693n77539r91585q31682K14885
10263b122394l842K78683J196768J469968L26872j81405k16528j130197k42054
10254f24129R98715R74572p25554j042707L05485P23441j66592j85905N13558
$$ plain form
10318 703081 1463792 639774 229237 -113649 -1520474 -3174513 -3155892 -1929133 -1019772
10309 -1019772 -901990 -1413384 -756181 -287706 55506 842820 814732 -13645 -1419919
10300 -1419919 -1724280 -1228649 -1406179 -2469473 -3130552 -1933273 -1038892 -2131057 -3668040
10291 -3668040 -3734397 -2474702 91020 1099668 967834 -168614 -1010832 -1509158 -779317
10282 -779317 462498 828516 1337660 1800230 1635247 1393784 967023 763427 1405158
10273 1405158 1607778 1731691 1696951 1373977 924220 63527 -514012 -1505597 -2337279 -2122394
10263 -2122394 -2126236 -1847553 -650785 819183 1146055 964650 748122 -382075 -624129
10254 -624129 374586 1349158 623604 -419103 -113618 609823 443231 257326 770884
10245G70884Q00507P65231l71331q66786j139870o54855O99722O67349N8884k38339
10235D91396o05168r41227q05858J47307M2116k63193N65156Q87090K32417k65228
10225e15192l98355m34489N59457M15775L1420j57379o89244o4897l1646L68744
10215i15806R69957J030492P62430J044174Q3619j430494q69859l41698O29518
10206I62333Q28763J12010j376178j431490k37792J010869J639705J73748m89515
10197A192453j020411o73540k69949j50769l64772l53112P59208K86956o2704
10188f56640l18029L76274N78386J68539m69177n69402r46819m98524q6593M36422
10178a985563R15795N69222n24010q54196m60131K66544R17059M88999k8984K16631
$$ plain form
10245 770884 1571391 2336622 1965291 1098505 -41365 -696220 3502 670851 729735 491396
10235 491396 -113772 -1054999 -1860857 -1713550 -1671434 -1934627 -1369471 -482381 -249964 -515192
10225 -515192 -913547 -1348036 -788579 -372804 -341384 -498763 -1188007 -1252904 -1284550 -915806
10215 -915806 54151 1084643 1847073 2891247 2974866 1544372 674513 332815 962333
10206 962333 1791096 1903106 526928 -904562 -1142354 -131485 1508220 1681968 1192453
10197 1192453 172042 -501498 -771447 -922216 -1286988 -1640100 -880892 -593936 -656640
10188 -656640 -974669 -598395 -20009 148530 -320647 -890049 -1836868 -2335392 -2421985 -1985563
10178 -1985563 -1069768 -500546 -1024556 -1878752 -2338883 -2072339 -1155280 -666281 -695265 -478634
10168d78634L20347N41674Q11116K72784q00386q61695K55913O23607L56023J48773
10158A189522N30785K4137k93275j267126r93873r54673j406021k96184R48689
10149b518019J122671J68220M48772N85463K81186L24994q28159j227869o03974
10140b246715j63740L3934K67306j21980k8143P47693R08768R34389Q65196J017108
10130B213816P80175n71848o87371o23655k89564k25668K79944J48623j71278
10121H53174M29290j96229j271510k62988o13769L34876J433768J325194K08447
10112B240253p89280j430496j223755P82650P59690L02075P31599j92679j107306
10103G2751p95999M2627k0936J21194l07263k81782l97076l36515J312057Q79377
$$ plain form
10168 -478634 -158287 383387 1194503 1467287 666901 -194794 61119 684726 1040749 1189522
10158 1189522 1720307 1744444 1451169 184043 -809830 -1764503 -3170524 -3466708 -2518019
10149 -2518019 -1395348 -1227128 -778356 -192893 88293 413287 -414872 -1642741 -2246715
10140 -2246715 -2410455 -2376521 -2109215 -2231195 -2259338 -1511645 -602877 331512 1196708 2213816
10130 2213816 2993991 2422143 1734772 1111117 821553 595885 875829 1024452 853174
10121 853174 1282464 1086235 -185275 -448263 -1062032 -727156 706612 2031806 2240253
10112 2240253 1450973 20477 -1203278 -420628 339062 641137 1372736 1180057 72751
10103 72751 -723248 -680621 -701557 -580363 -887626 -1169408 -1566484 -1902999 -590942 288435
10093B88435J41758O18060Q07307K89171q15410j144065m62895m14628K91105
10084d01162K12639p08947r74372l25851M36399j88280j104793j366019M1691
10075d378695O72337K71539O79230J441591R44547p46638o66214O98079P93202
10066b91022Q36711R3327l20304O68917R07645j8131r58270r8365L92246k94294
10056I18460l66170q28337n5459K14210J186492J110559M80195J43499q6390P5979
10046B793038p87287p78338k82905l60948M56458N0356M94116J92322j483379
10037B93433j484657j32808P07929K23260K44057N6260L18342Q09768K26792M58771
10027A721147O30990M07619n65758r95596r65341j163675m89654j22091J364987
$$ plain form
10093 288435 430193 1048253 1855560 2144731 1329321 185256 -277639 -692267 -401162
10084 -401162 -188523 -897470 -1871842 -2197693 -1761294 -1949574 -3054367 -4420386 -4378695
10075 -4378695 -3706358 -3434819 -2755589 -1313998 -369451 -1116089 -1782303 -1084224 -291022
10066 -291022 545689 639016 318712 987629 1895274 1877143 918873 820508 1212754 918460
10056 918460 552290 -276047 -331506 -117296 1069196 2179755 2659950 2803449 2717059 2793038
10046 2793038 2005751 1227413 944508 583560 1040018 1090374 1584490 1776812 293433
10037 293433 -1191224 -1324032 -616103 -392843 -148786 -92526 225816 1035584 1262376 1721147
10027 1721147 2352137 2759756 2193998 1198402 233061 -930614 -1420268 -1542359 -177372
10018a77372P60068r92989j410159m91601J94356J89948K69836Q42576Q53191
10009C7854j73935l12142n84746j029015o6791J67287l32898l44629J57633J064970
$$ plain form
10018 -177372 582696 -410293 -1820452 -2312053 -2117697 -1927749 -1657913 -815337 37854
10009 37854 -136081 -448223 -1032969 -2061984 -2128775 -1961488 -2294386 -2639015 -2481382 -1416412
$$ [...]
##END NTUPLES=NMR SPECTRUM
##END=
