##TITLE=C13_SL54a-Dau(f5-f5)
 CDCl3, 21500 sc

 17.2.2022
##JCAMPDX= 6.0         $$ Bruker NMR JCAMP-DX V2.0
##DATA TYPE= NMR SPECTRUM
##DATA CLASS= NTUPLES
##ORIGIN= UXNMR, Bruker Analytische Messtechnik GmbH
##OWNER= root
$$ XWIN-NMR		Version 3.5
$$ Fri Mar 18 10:25:51 2022 Russian Standard Time (UT+4h)  she@DPX200
##.OBSERVE FREQUENCY= 50.327896
##.OBSERVE NUCLEUS= ^13C
##.ACQUISITION MODE= SIMULTANEOUS
##.ACQUISITION SCHEME= undefined
##.AVERAGES= 21501
##.DIGITISER RES= 17
##SPECTROMETER/DATA SYSTEM= spect
##.PULSE SEQUENCE= zgpg30
##.SOLVENT NAME= Acetone
##.SHIFT REFERENCE= (INTERNAL, Acetone, 0, 222.961)
##AUDIT TRAIL= $$ (NUMBER, WHEN, WHO, WHERE, WHAT)
$$ ##TITLE= Audit trail, XWIN-NMR		Version 3.5
$$ ##JCAMPDX= 5.01
$$ ##ORIGIN= Bruker BioSpin GmbH
$$ ##OWNER= she
$$ F:/spectra/data/she/nmr/c13/1/pdata/1/auditp.txt
$$ ##AUDIT TRAIL=  $$ (NUMBER, WHEN, WHO, WHERE, WHAT)
(   1,<2022-03-18 10:24:21.14 +0400>,<she>,<DPX200>,
      <created by zg, POWCHK disabled, PULCHK disabled
       terminated by command 'halt'
       configuration hash MD5:
       00 E9 B6 7A A2 85 ED C7 34 08 36 98 17 FE 4E 26
       data hash MD5: 32K
       5C F3 9A E5 12 52 3B 1E 92 33 BB F6 D2 2A 59 E5>)
(   2,<2022-03-18 10:24:25.50 +0400>,<she>,<DPX200>,
      <Start of raw data processing
       efp BC_mod = 2 LB = 1 FT_mod = 6 PKNL = 1 PHC0 = -330.8955 PHC1 = 27.16232 SI = 32K 
       data hash MD5: 32K
       AA B4 0F B9 F7 A5 60 DE C3 CB 0F 01 1E F1 17 81>)
(   3,<2022-03-18 10:24:42.39 +0400>,<she>,<DPX200>,
      <pk PHC0 = 11.72777 PHC1 = 0 
       data hash MD5: 32K
       29 51 C6 2E 7E 0D 99 6F BB D0 23 F5 E2 36 93 CF>)
(   4,<2022-03-18 10:24:45.64 +0400>,<she>,<DPX200>,
      <abs ABSG = 5 
       data hash MD5: 32K
       AC 02 DD 67 3C BE 09 68 DB B1 2F B2 76 F8 69 12>)
$$ ##END=
$$ 
$$ hash MD5
$$ 07 5F E1 61 E4 81 F8 63 4C 07 61 A2 4C 18 71 08
##$RELAX= 
##$RELAX= 
##$RELAX= 
##$RELAX= 
##$RELAX= 
##$RELAX= 
##$RELAX= 
##$RELAX= 
$$ Bruker specific parameters
$$ --------------------------
##$DU= <F:/spectra>
##$EXPNO= 1
##$NAME= <c13>
##$PROCNO= 1
##$TYPE= <nmr>
##$USER= <she>
##$AMP= (0..31)
100 100 100 100 100 100 100 100 100 100 100 100 100 100 100 100 100 100 
100 100 100 100 100 100 100 100 100 100 100 100 100 100 
##$AQSEQ= 0
##$AQ_mod= 1
##$AUNM= <au_zg>
##$AUTOPOS= <>
##$BF1= 50.322709
##$BF2= 200.13
##$BF3= 50.322709
##$BF4= 500.13
##$BF5= 500.13
##$BF6= 500.13
##$BF7= 500.13
##$BF8= 500.13
##$BYTORDA= 1
##$CFDGTYP= 0
##$CFRGTYP= 5
##$CHEMSTR= <none>
##$CNST= (0..31)
1 1 145 1 1 1 1 1 1 1 1 1 1 1 1 1 1 1 1 1 1 1 1 1 1 1 1 1 1 1 1 1 
##$CPDPRG= <waltz16>
##$CPDPRG1= <>
##$CPDPRG2= <waltz16>
##$CPDPRG3= <>
##$CPDPRG4= <mlev>
##$CPDPRG5= <mlev>
##$CPDPRG6= <mlev>
##$CPDPRG7= <mlev>
##$CPDPRG8= <mlev>
##$CPDPRGB= <>
##$CPDPRGT= <>
##$D= (0..31)
0 2 0.00345 0 0 0 0 0 0 0 0 0.03 2e-05 3e-06 0 0 0 0 0 0 0 0 0 0 0 0 0 
0 0 0 0 0 
##$DATE= 1647511209
##$DBL= (0..7)
120 120 120 120 120 120 120 120 
##$DBP= (0..7)
150 150 150 150 150 150 150 150 
$$ [...]
##$SUBNAM4= <"">
##$SUBNAM5= <"">
##$SUBNAM6= <"">
##$SUBNAM7= <"">
##$SUBNAM8= <"">
##$SUBNAM9= <"">
##$SW= 239.972175391363
##$SWIBOX= (0..15)
0 1 3 0 0 0 0 0 0 0 0 0 0 0 0 0 
##$SW_h= 12077.2946859903
##$TD= 32768
##$TD0= 1
##$TE= 0
##$TE2= 300
##$TE3= 300
##$TEG= 300
##$TL= (0..7)
120 120 120 120 120 120 120 120 
##$TP= (0..7)
150 150 150 150 150 150 150 150 
##$TP07= 0
##$TPNAME0= <>
##$TPNAME1= <>
##$TPNAME2= <>
##$TPNAME3= <>
##$TPNAME4= <>
##$TPNAME5= <>
##$TPNAME6= <>
##$TPNAME7= <>
##$TPOAL= (0..7)
0.5 0.5 0.5 0.5 0.5 0.5 0.5 0.5 
##$TPOFFS= (0..7)
0 0 0 0 0 0 0 0 
##$TUNHIN= 0
##$TUNHOUT= 0
##$TUNXOUT= 0
##$USERA1= <user>
##$USERA2= <user>
##$USERA3= <user>
##$USERA4= <user>
##$USERA5= <user>
##$V9= 5
##$VALIST= <valist>
##$VCLIST= <CCCCCCCCCCCCCCC>
##$VD= 0
##$VDLIST= <DDDDDDDDDDDDDDD>
##$VPLIST= <PPPPPPPPPPPPPPP>
##$VTLIST= <TTTTTTTTTTTTTTT>
##$WBST= 1024
##$WBSW= 4
##$XGAIN= (0..3)
0 0 0 0 
##$XL= 0
##$YL= 0
##$YMAX_a= 126993142
##$YMIN_a= -28883839
##$ZGOPTNS= <>
##$ZL1= 120
##$ZL2= 120
##$ZL3= 120
##$ZL4= 120
##$ABSF1= 222.961
##$ABSF2= -17.03589
##$ABSG= 5
##$ABSL= 3
##$ALPHA= 0
##$AQORDER= 0
##$ASSFAC= 0
##$ASSFACI= 0
##$ASSFACX= 0
##$ASSWID= 0
##$AUNMP= <proc_1d>
##$AZFE= 0.1
##$AZFW= 0.5
##$BCFW= 0
##$BC_mod= 2
##$BYTORDP= 0
##$COROFFS= 0
##$CY= -3
##$DATMOD= 1
##$DC= 0
##$DFILT= <>
##$DTYPP= 0
##$F1P= 0
##$F2P= 0
##$FCOR= 0.5
##$FTSIZE= 32768
##$FT_mod= 6
##$GAMMA= 0
##$GB= 0
##$INTBC= 1
##$INTSCL= 4.134877e-10
##$ISEN= 128
##$LB= 1
##$LEV0= 0
##$LPBIN= 0
##$MAXI= 10000
##$MC2= 0
##$MEAN= 0
##$ME_mod= 0
##$MI= 0.1934396
##$NCOEF= 0
##$NC_proc= 3
##$NLEV= 6
##$NOISF1= 120.0001
##$NOISF2= 80.00006
##$NSP= 0
##$NTH_PI= 0
##$NZP= 0
##$OFFSET= 222.961
##$PC= 1.4
##$PHC0= -319.1677
##$PHC1= 27.16232
##$PH_mod= 1
##$PKNL= yes
##$PPARMOD= 0
##$PSCAL= 0
##$PSIGN= 0
##$REVERSE= no
##$SF= 50.3227146458226
##$SI= 32768
##$SIGF1= 140
##$SIGF2= 120
##$SINO= 11.81781
##$SIOLD= 32768
##$SREGLST= <13C.CDCl3>
##$SSB= 0
##$STSI= 32768
##$STSR= 0
##$SW_p= 12077.2946859903
##$SYMM= 0
##$S_DEV= 0
##$TDeff= 32768
##$TDoff= 0
##$TI= <>
##$TILT= no
##$TM1= 0
##$TM2= 0
##$TOPLEV= 0
##$USERP1= <user>
##$USERP2= <user>
##$USERP3= <user>
##$USERP4= <user>
##$USERP5= <user>
##$WDW= 1
##$XDIM= 32768
##$YMAX_p= 271317820
##$YMIN_p= -1456206
$$ End of Bruker specific parameters
$$ ---------------------------------
##NTUPLES= NMR SPECTRUM
##VAR_NAME=  FREQUENCY,     SPECTRUM/REAL,   SPECTRUM/IMAG
##SYMBOL=    X,             R,               I
##VAR_TYPE=  INDEPENDENT,   DEPENDENT,       DEPENDENT
##VAR_FORM=  AFFN,          ASDF,            ASDF
##VAR_DIM=   32768,         32768,           32768
##UNITS=     HZ,            ARBITRARY UNITS, ARBITRARY UNITS
##FACTOR=    0.368581032318806, 1,           1
##FIRST=     11220.0027064323, 0,            0
##LAST=      -857.291979557962, 0,           0
##MIN=       -857.291979557962, -1456206,    0
##MAX=       11220.0027064323, 271317820,    0
$$ Real data points
##PAGE= N=1
##DATA TABLE= (X++(R..R)), XYDATA
$$ [...]
18268 -241255 -448707 -487560 -364728 -309631 -215110 -237845 -120289 -114857 -140222 36231 143050
18257 143050 -25582 -224006 -109532 37181 16722 58089 -9192 -121128 -170441 -99142
18247 -99142 59421 -7921 25060 178778 196173 289993 105933 -176994 -236583 -188526 -148703
18236 -148703 -91906 92542 324462 395149 555430 510377 145900 -105881 -332260 -435446
18226 -435446 -403974 -400474 -405809 -351345 -272533 -476065 -679406 -642167 -425033 3071 317206
18215 317206 451343 493217 516108 555464 494279 217253 12208 3597 64378 -15066 -225813
18204 -225813 -525572 -552351 -512671 -511365 -330741 -180819 113821 296493 329371 417282 377231
18193 377231 344519 305420 110032 -157041 -331624 -498524 -562408 -575187 -525977 -380606
18183 -380606 -223694 -86082 114667 232787 241839 273736 382868 442384 411005 361739 100306
18172 100306 -282512 -340471 -74383 198980 266910 132846 -88792 -106793 6064 37884
18162 37884 -78201 -138561 -89495 -43086 135532 353349 348298 249647 156111 4422 -133506
18151 -133506 -39170 -71891 -151907 -47793 11109 51318 -50998 -67062 77320 103028 28657
18140 28657 -109642 -124717 -43233 -209272 -409049 -215987 118054 150007 161581 267564
18130 267564 221892 146009 -4224 -21104 -36323 -235201 -509279 -496057 -165333 30046
18120 30046 -136972 -165245 13130 137795 37117 -150930 -61859 34455 117584 80680 -3919
18109 -3919 -57461 -71880 -198378 -220771 -68413 124618 237955 244344 230031 60365 -71774
18098 -71774 113788 225370 56301 -159055 -351062 -306209 -273797 -226261 -183952 -248966 -354004
18087 -354004 -517732 -516008 -368803 -224054 -153184 -163835 -267973 -244762 -310072 -504100 -413587
18076 -413587 -378216 -376876 -255940 -51104 26483 -37683 65975 311164 360674 325109 337035
18065 337035 17597 -326464 -437134 -413389 -319254 -367785 -462378 -590136 -719967 -632938
18055 -632938 -514413 -348869 -18427 136892 10977 -80442 -15541 135872 308639 323669
18045 323669 343159 225454 91179 -9605 -283516 -515122 -639237 -605950 -383673 -55133
18035 -55133 111287 -33743 -263506 -170346 81108 209223 73233 -95885 -63720 -115232
18025 -115232 -218664 -215294 -292103 -301457 -124912 6594 -109360 -313106 -216913 -93774 -1761
18014 -1761 41353 23795 -125423 -328051 -294278 -177426 -42676 79397 31724 -74748 216537
18003 216537 528110 655468 538447 152027 -28311 8503 173963 287299 342673 286921
17993 286921 290740 239953 301921 403674 116646 -126631 -85851 141664 288475 275563 222832
17982 222832 175131 162825 175079 87641 107119 164863 166873 253861 462916 398447 249246
17971 249246 63441 -52331 76779 -3993 -230890 -418594 -411646 -98304 161072 280123
17961 280123 373626 261639 30188 78392 138108 -15253 -240059 -305917 -250851 -198400 48704
17950 48704 206335 210940 270525 508021 803662 1065431 1427769 1774539 1583612 940594
17940 940594 794563 763338 537271 308579 115001 -11500 -23441 206064 503625 660810
17930 660810 534015 294069 135760 -32131 -141953 -232563 -93038 96839 -54210 -276366
17920 -276366 -269200 -222784 -94099 -38567 173068 297649 180630 136983 84348 -188241 -428109
17909 -428109 -539034 -496261 -412727 -330799 -122606 5222 -35794 -198448 -392192 -358562
17899 -358562 -197213 -40661 -138396 -356127 -417725 -574176 -786022 -740100 -585847 -372829
17889 -372829 -273285 -428371 -527943 -456778 -328845 -316042 -438160 -492751 -416022 -295407 -86618
17878 -86618 101284 -53730 -127558 -70192 -99764 47713 163519 318386 374910 300298 129129
17867 129129 60762 124472 181798 173168 131942 74296 41280 88683 241116 276131 314652
17856 314652 330953 297967 322658 255682 75396 158825 208217 -51346 -427048 -512179 -225840
17845 -225840 21550 -171830 -245798 -88702 -24518 -147858 -376453 -334867 -155233 -28405
17835 -28405 -241950 -511618 -428508 -346649 -327766 -199488 -95243 -153948 -58474 67785 132644
17824 132644 34406 -97494 114620 399557 357669 166996 11544 53346 100672 36684
17814 36684 -47456 -216371 -336936 -285668 -107886 -85709 -220820 -212354 -16372 249957 215252
17803 215252 40520 3633 201611 339805 278812 178056 -173299 -448835 -407530 -248122
17793 -248122 -163868 -71051 42541 65661 283509 473675 449478 234252 64476 -6167
17783 -6167 -42910 -36002 65555 126084 179249 212665 -36521 -206691 -212177 -51581 2495
17772 2495 12525 44982 135347 120116 68859 164351 343522 531086 547978 555574 641729 489584
17760 489584 251906 244538 282133 375352 367238 274476 38519 -134587 -165736 -321079 -245000
17749 -245000 -86188 -187368 -260021 -258635 -335175 -387838 -484301 -522283 -546882 -592216 -661633
17738 -661633 -766009 -633976 -509978 -367523 -296495 -164262 215172 356541 347222 361892
17728 361892 165903 101764 79984 -161059 -357406 -439563 -300780 -30380 309229 444316
17718 444316 418114 476493 510377 434334 294801 19220 -137715 -111940 -110275 -83889 9169
17707 9169 153933 133865 -30540 -53344 -136479 -279538 -287093 -268302 -178571 -236922 -344438
17696 -344438 -195998 -238029 -449966 -626437 -606149 -299115 82045 347107 489645 394857
17686 394857 258234 131716 39132 -11025 -77443 -96941 20063 169315 291725 190810
17676 190810 16917 -76181 -135888 -65481 32314 101317 76919 133580 371521 440185 357129
17665 357129 190663 -29419 -7348 81230 198586 361328 652731 778235 644170 493218
17655 493218 428712 427711 610950 685391 643598 473510 184464 -55296 -130761 -109348 -19214
17644 -19214 -14567 -185367 -323570 -175901 57184 127082 -58899 -88946 121650 230841
17634 230841 236775 195782 209941 123189 6225 215061 310201 402102 443111 258763 180921
17623 180921 -29942 -211876 -150445 55067 156918 52540 -1606 -40027 -93492 -87462 -190792
17612 -190792 -608842 -744168 -423918 -52828 290216 416409 380886 275842 419499 613033
17602 613033 678882 554890 600338 680129 743255 1074788 1514917 2020572 2828278 4082172
17592 4082172 5092257 4420420 3277326 2537593 2014629 1628958 1327453 1049987 800554
17583 800554 752727 960712 1361493 1587078 1524448 1483963 1331681 1066800 880915 942828
17573 942828 1116118 1313654 1481664 1721511 2115275 2796826 4054492 5220598 4832349
17564 4832349 3571400 2815197 2286934 2073593 1922613 1852477 1782803 1673032 1539299 1467423
17554 1467423 1529180 1611631 1494110 1086819 662686 557391 583174 497234 324160 216700
17544 216700 91291 282068 598466 765900 602906 257870 85087 90850 178995 430580
17534 430580 587486 252228 -48527 -10553 184277 225429 348171 191079 -57869 -138367
17524 -138367 -44661 181804 282728 295131 298130 184681 6497 106043 259720 224866 125161
17513 125161 176746 323437 494690 572525 400563 138105 320730 598922 544644 165365
17503 165365 -74375 -217532 -316746 -465110 -546462 -428094 -284709 -100188 40784 92857
17493 92857 -3577 -47442 135567 137528 67535 -3523 -148441 -67912 -15667 76883 222317
17482 222317 225950 122018 80237 65291 -133692 -327905 -304893 44028 306776 344403 303658
17471 303658 228612 218694 235281 279837 175999 116686 132168 48353 -99979 -327387 -322104
17460 -322104 -30871 144337 206407 346251 625890 595841 462780 425488 398780 327938
17450 327938 300832 269058 157202 35563 -137612 -349066 -445081 -420033 -320573 -280993 -164463
17439 -164463 -222022 -404697 -579694 -611436 -511104 -262028 -64141 -172017 -301970 -152781
17429 -152781 -11519 -88957 -254821 -346582 -331679 -46148 197474 151251 31540 -12118
17419 -12118 612 -120994 -297657 -313480 -212089 -83749 8658 -34232 -109646 -105484 176247
17408 176247 326505 593942 720781 495932 252906 327587 396600 318608 60390 -30809
17398 -30809 -87558 -333062 -461987 -328935 -179452 -265829 -266026 32657 219196 251851 200174
17387 200174 156249 216644 284098 283113 373290 483085 333214 58814 203458 406946 229235
17376 229235 213796 321509 447337 477326 403927 223631 254783 322254 290760 285965 297558
17365 297558 219338 75806 14583 5995 56194 215524 268889 159491 9962 10446 146706
17354 146706 191719 150577 91840 -23366 -175654 -2973 422488 591580 462340 242518
17344 242518 -7614 -51869 161474 397164 402169 376424 472768 590345 514340 324535 102685
17333 102685 -18509 -64382 -26180 8912 -217738 -463636 -435457 -418864 -484723 -455838 -312006
17322 -312006 -207628 -294162 -471615 -472703 -454007 -417773 -324121 -445419 -586089 -336613 33751
17311 33751 188261 192873 71020 -325555 -599691 -578463 -516572 -305639 -28873 83044
17301 83044 36682 -114318 -195149 -59009 -187541 -343436 -278439 -257188 -163108 -43573 56019
17290 56019 200420 276842 240002 83408 -12281 51853 94542 28570 117222 202163 106192
17279 106192 139325 150338 136794 203511 116771 3285 -87020 -251475 -335674 -166983 18098
17268 18098 87885 170192 257958 371262 415959 322563 204500 154077 247265 414426 509566
17257 509566 542946 545178 447447 170536 170009 182655 116444 263921 416750 241418 47066
17246 47066 10850 87860 84355 -70979 -129730 -194539 -337708 -485583 -388377 -163215 16635
17235 16635 -16689 101254 163414 219052 270611 286242 171936 220259 252143 139015 86092
17224 86092 130013 173936 264796 305645 182674 -15773 -150235 -314569 -514988 -604380 -488192
17213 -488192 -313067 -295555 -177948 20335 204797 42672 -371500 -499732 -291847 -120671
17203 -120671 -263387 -297421 -98931 126914 270559 329167 182602 -5505 140353 227436
17193 227436 -36574 -135136 -54272 -71930 -70650 -267939 -301943 -295014 -309792 -83726 93506
17182 93506 52895 -109695 -282299 -268491 -159542 3942 230489 360942 353664 367452 247812
17171 247812 178636 11491 -125125 -171471 -109940 141899 462015 434245 369831 451944 241220
17160 241220 109793 142750 201590 278801 312978 451191 527807 529726 287576 -176053 -258502
17149 -258502 -237064 -241711 -169788 -45629 -67672 -140459 -130116 -97352 -203683 -225669 -5485
17138 -5485 29904 -103405 -200249 -359029 -440585 -398130 -222234 -216660 -130740 -28811 33031
17127 33031 108201 132681 -8952 -226509 -503181 -739483 -705372 -594352 -334561 -88831
17117 -88831 -9202 115068 121820 92909 69686 -45190 -110661 -128210 -140213 -170481 -165717 -104348
17105 -104348 -5863 225299 382875 414149 513860 359624 287936 287178 181092 155281 -10218
17094 -10218 -122105 -98098 -146936 -338937 -343553 -142128 64242 118971 135553 111530 99021
17083 99021 161111 152732 111364 128395 196351 216933 176769 150778 282249 313720 251992 80998
17071 80998 43512 49360 -170303 -194157 12211 150957 91972 -85288 -335447 -518455 -472770
17060 -472770 -278524 -243764 -285165 -56988 143889 62494 -74109 14220 117431 165707
17050 165707 86329 21936 32111 186461 176220 81563 -130826 -247907 -82952 74967
17040 74967 150611 194459 295192 286698 239647 254943 420405 469008 351651 236190 -56227
17029 -56227 -246955 -145113 -110657 -181247 -223629 -240458 -247332 -248149 -194034 -33969 144032
17018 144032 294451 202830 32412 9439 139959 294931 210409 -68473 -335111 -345994
17008 -345994 -38057 338876 483852 424580 361566 407285 402820 319731 36435 -181626 -270186
16997 -270186 -300187 -221626 -89011 84160 133020 160950 126877 34273 180473 187665 -4974
16986 -4974 -168226 -228536 -362847 -470159 -475633 -190288 55076 -36048 -123009 -75447 67773
16975 67773 228211 179632 59159 -84497 -236205 -235808 -239695 -100398 11097 103313 -5165
16964 -5165 -80174 -1309 44253 52498 -99511 -222039 -218621 -207936 -51651 -14618 -105865 -38441
16952 -38441 12843 -155384 -414743 -438360 -307205 -242776 -71034 -2315 10222 -82903 -225457
16941 -225457 -147807 -90427 -133310 -342580 -428361 -498124 -674088 -750488 -487008 -110658 97532
16930 97532 241815 144593 -71263 88288 357154 285447 178298 165779 272289 334860
16920 334860 458335 679582 538778 399784 509236 583958 491558 201522 69499 -58665
16910 -58665 -160418 -167254 -94544 -69195 -54097 1672 -120897 -317938 -381597 -260836 -392358
16899 -392358 -519662 -570592 -512493 -363458 -90160 213708 402817 459029 306041 205266
16889 205266 215322 257505 263141 321930 229786 -39313 -193003 -256707 -238331 -9454 89879
16878 89879 61897 -78232 -146738 31810 138656 73898 90355 234231 509641 595110 521716
16867 521716 237504 -80030 -393136 -632033 -582278 -415528 -204419 60685 179651 79993
16857 79993 -2281 -106901 -215132 -29788 113012 -54984 -277781 -275096 -123420 15042
16847 15042 98083 196722 175480 63584 -13201 -88362 88892 164226 21879 66572 78704
16836 78704 -109022 -232874 -123220 129205 448789 425456 33175 -244422 -232772 -94656
16826 -94656 -18826 47015 268804 389438 287169 237146 292191 75096 -267361 -496969
16816 -496969 -657464 -643548 -554552 -364076 -304865 -317539 -264340 -143474 -164027 -105858 -29979
16805 -29979 -147635 -289513 -293578 -325883 -322587 -242732 -280521 -30533 268601 357867 417538
16794 417538 250610 -40157 -238972 -481180 -650976 -425512 -277507 -475396 -614663 -584991
16784 -584991 -460990 -391222 -299233 -188576 -342145 -486051 -433160 -371515 -476481 -316609
16774 -316609 -150592 -163466 -277887 -254684 -113605 -214106 -309769 -219992 -185078 -244871 -223743
16763 -223743 -171337 -192493 -381059 -536525 -484593 -438782 -398003 -240984 -153375 -117607 -244071
16752 -244071 -329866 -323891 -259123 -157940 155497 258204 157081 69307 -27067 -17689 87140
16741 87140 135993 142318 65554 24597 160292 281421 298544 184034 134326 2281 -235510
16730 -235510 -450150 -371309 -173284 74251 397812 482527 335987 272439 113878 -82758
16720 -82758 -326144 -416860 -413671 -375567 -174773 -9533 124421 234608 125788 134405 21848
16709 21848 -100466 -77070 25917 45662 137870 298765 264324 99923 -59865 -25209 -65993
16698 -65993 -75306 30287 74741 214538 257105 61504 -210388 -373733 -457840 -494973 -607057
16687 -607057 -706745 -794954 -711641 -437990 -223339 -158220 -173963 -18703 45754 109990 127524
16676 127524 -2526 170761 321990 13169 -69364 199332 245212 402 -199293 -261724
16666 -261724 -283943 -324900 -104427 129796 102758 26176 16122 2204 -70283 -288090 -607692
16655 -607692 -774320 -698968 -317097 -17770 156308 187543 48922 2814 -131173 -366776
16645 -366776 -377149 -302139 -141247 90360 145125 164447 66237 -141677 -268745 -421183
16635 -421183 -438359 -262124 -220144 -42804 193244 237124 45107 -130317 15205 346457
16625 346457 610792 508528 274940 106781 -70824 -265356 -362956 -395525 -387786 -233285
16615 -233285 -160646 -177019 -354625 -270849 -230009 -242176 -124146 29616 103929 119047 105609
16604 105609 170432 304581 341445 43881 -324443 -345371 -220268 -4647 126731 -163227
16594 -163227 -428697 -579769 -754087 -649698 -328090 -148342 48523 120399 -165210 -305599
16584 -305599 -43769 292735 381187 327592 169510 118519 190934 284648 187771 -29249 -109564
16573 -109564 -99396 -204779 -449213 -680625 -576695 -342899 -144851 37304 113687 177165
16563 177165 83620 -91348 -220537 -133972 -131142 -283034 -182573 -121057 -202952 -46533 80490
16552 80490 368407 766960 703722 381146 193484 201022 426645 632721 545260 379799
16542 379799 221905 90795 16052 160226 12871 -261959 -351171 -375532 -272104 -121782
16532 -121782 159484 253656 179164 -8735 10914 111642 122554 21732 -67608 -3754 -36299
16521 -36299 -47075 -79328 -43697 102330 66898 58282 1534 -209777 -431644 -549246 -510792
16510 -510792 -357663 -374440 -226128 -84018 -73969 -173112 -222837 -99368 71592 151955
16500 151955 126031 147188 155787 43886 -218167 -533966 -715481 -746414 -575976 -295754
16490 -295754 -51151 153204 233538 266879 133051 -80934 -96883 181204 187210 91628 -123179
16479 -123179 -159939 -190810 -222923 -29534 242096 365011 440606 459410 67386 -278964
16469 -278964 -184753 -14686 21080 96925 267324 259351 54899 59630 204411 278180 305329
16458 305329 293219 144940 247220 343443 234096 289666 345451 334884 286956 334134 363548
16447 363548 252669 70178 96842 174555 34306 -45172 159593 297681 92706 -267244
16437 -267244 -365153 -534670 -721805 -693336 -507733 -217471 -69239 -20602 75118 228093
16427 228093 296566 220262 132505 39342 -128716 -128761 -74882 -103626 -155789 -153021 -141799 -126825
16415 -126825 -111313 -97355 1275 44577 192361 362649 381281 247527 307563 451381 507663
16404 507663 499817 247117 -61951 -127327 170289 498135 679630 553304 283432 169848
16394 169848 171603 190424 37980 -201001 -385695 -377641 -320247 -452792 -507124 -523890 -518133
16383 -518133 -267780 -108138 -190943 -106062 -25652 -106749 -183676 -156507 27807 113702 13405
16372 13405 87513 288729 275388 261075 126125 -377654 -616128 -600321 -526722 -461251 -626838
16361 -626838 -834641 -937292 -666671 -281580 -155809 -228120 -280210 -339520 -299690 -10255
16351 -10255 78614 -46151 -112262 -238184 -220845 -143280 -131118 11402 172123 66025 -64546
16340 -64546 -219125 -252231 -91050 37944 144114 104526 -47736 -234021 -303413 -246423
16330 -246423 -168124 -30882 172550 350967 421118 291890 48504 -113720 -342247 -444275
16320 -444275 -295748 -237497 -368341 -343611 -286160 -278380 -191124 -101658 -145972 -38857 201217
16309 201217 338369 333146 292849 390430 439668 536758 627702 628201 536940 340638 46131
16298 46131 -97050 -177790 -295818 -294126 -172107 19248 126312 -5201 -213460 -341235
16288 -341235 -310899 -281593 -222068 -220408 -403092 -399949 -266401 5014 267079 218341 116800
16277 116800 -2710 -8168 -25253 -80164 -117925 -97506 -302600 -416611 -184353 -101790 -233835
16266 -233835 -253836 -179875 -213520 -189824 -155812 -53132 -39825 5330 161662 228529 269908
16255 269908 309354 433066 558571 450184 298384 131309 90033 34766 -72578 -342271
16245 -342271 -525853 -219080 288184 539763 739259 828194 639202 508878 304325 28484
16235 28484 -204277 -245019 -149025 42205 54473 -132360 -322694 -438697 -499886 -474625 -271485
16224 -271485 -121936 -275559 -407136 -635234 -523965 -265408 -273288 -296530 -372679 -301481
16214 -301481 -247748 -356064 -398635 -469089 -477281 -380571 -264389 -205585 -156917 -124557 -99098
16203 -99098 -46497 28500 260917 331125 194494 122025 156997 24983 -210305 -344665 -250974
16192 -250974 -153030 -112705 -22849 20144 77011 212818 340158 503165 520302 269409 127987
16181 127987 153100 220877 141617 -64018 -271391 -219647 -130639 -169991 -134323 -170522 -212434
16170 -212434 20401 185412 146146 55119 25072 146039 352868 423508 249140 206273
16160 206273 455001 681164 645208 511539 571377 677847 616629 404357 416423 645733
16150 645733 670418 631267 665666 517395 350068 278906 361537 520640 660500 533300
16140 533300 459054 445213 437706 499860 498052 735690 1110198 1295718 1078869 811736 569275
16129 569275 437131 673790 1075697 1463042 1858885 2450618 3372154 4162289 4952854 5717584
16119 5717584 6038897 5782987 5264198 4587003 3755436 3003887 2783749 2620991 2250680
16110 2250680 1910729 1523284 1123223 899798 580377 302828 240011 290964 314801 446718
16100 446718 412683 322873 276554 324715 372167 341604 565970 829711 851965 688766 544099
16089 544099 430141 310713 155431 190111 286113 219797 -9674 -157378 -250747 -177704
16079 -177704 -148820 -167036 -155233 -86507 150888 315254 197324 -15315 -89918 -113991 -216540
16068 -216540 -242769 -412476 -459846 -298735 -250640 -199702 14822 194716 434192 467305
16058 467305 513808 553118 448367 219266 -61133 -249621 -362337 -239795 -109662 -224415
16048 -224415 -459944 -571819 -797350 -904575 -675527 -318426 87888 234769 98456 58007
16038 58007 23404 -6551 -50478 -240255 -217330 33618 233964 427498 523424 472399 310729
16027 310729 100834 31894 -72172 -97309 -41376 78173 33250 -173303 -650 133315
16017 133315 206882 363039 380518 307566 81381 -25852 -160644 -650946 -889534 -903721
16007 -903721 -875863 -657878 -345500 -263395 -165950 -80186 40550 181531 306448 483456
15997 483456 333748 198394 253642 305893 214009 -122306 -441020 -556013 -506158 -200152
15987 -200152 61491 141025 72381 -184696 -371954 -409481 -496172 -364932 -159159 34701
15977 34701 141030 25018 65734 235931 372457 341647 397328 461107 284820 50292
15967 50292 -119540 -215384 -264565 -169225 -75717 -3457 49184 -4769 80249 141488 233788
15956 233788 170503 7261 -115012 -206591 -28921 143567 -73628 -268937 -374304 -481629
15946 -481629 -443368 -322539 -206098 -153309 -103295 6553 -2923 -183546 -392488 -478163 -512729
15935 -512729 -667155 -793615 -737021 -388715 -208198 -164210 -11388 33101 -78475 -188610
15925 -188610 -147688 -100768 -10912 -72433 -119337 124750 473206 722033 626625 235257 121893
15914 121893 208209 276499 297285 393987 423978 347636 200490 -28404 -110437 -116972 -43086
15903 -43086 18641 -43941 -142669 -183818 -261975 -385338 -370980 -341582 -441254 -442208 -141839 139320
15891 139320 363984 705160 757199 520736 286271 142726 155403 88011 -87963 -81015
15881 -81015 -84957 -137931 -225653 -293992 -321280 -220049 -22438 -89934 -249177 -226495 -162183
15870 -162183 -144263 -62403 -67987 -116050 -76132 21680 68352 95387 90830 -80669 -206687
15859 -206687 -196297 -282799 -458873 -504795 -413527 -184884 31195 216977 252897 342441 368434
15848 368434 374524 362686 193682 92988 -154517 -134261 75349 62110 94411 18881 -10357
15837 -10357 -48832 -52906 -18512 115797 196685 144926 134396 194978 129643 -79960 -88735 -183241
15825 -183241 -157588 -9231 242837 279788 135928 73704 147669 136094 -33732 -66296 -129711
15814 -129711 -76237 -48270 -33869 85300 13165 -226296 -182392 -75984 -167972 -264500 -309749
15803 -309749 -240474 -64268 25706 6088 -41308 -113025 -9648 48608 33851 187812 135267
15792 135267 10731 -107793 -219386 -288869 -457053 -439433 -523318 -690862 -708380 -666754
15782 -666754 -563603 -407294 -198945 20125 86684 15820 -20543 27653 60778 195020
15772 195020 221972 9681 -226987 -258914 -251099 -251353 -159558 -225276 -206153 19363 116964
15761 116964 52210 119849 265447 324544 223672 70652 -152079 -217279 -26960 248769
15751 248769 376197 211389 109706 22905 -82958 -67434 75490 250156 436260 550805
15741 550805 511902 421587 329293 319092 546604 500676 19668 -506532 -751039 -689388 -543551
15730 -543551 -430793 -182539 201231 536058 716852 561742 391574 313228 171774 -106752
15720 -106752 -308834 -340022 -120873 85776 20744 9928 -13392 -156651 -289222 -483474
15710 -483474 -602805 -504767 -472545 -294219 -277348 -426513 -512031 -615515 -228233 178591
15700 178591 168158 -42194 -101601 -4893 -22124 -240032 -480628 -557790 -445568 -219393
15690 -219393 -241670 -419241 -450079 -421216 -387833 -414870 -388908 -229281 -256819 -320231 -201629
15679 -201629 65545 79608 -287166 -515104 -502322 -612508 -753958 -738499 -651058 -571896
15669 -571896 -524417 -563694 -537983 -329145 -187631 -242178 -315013 -328999 -356757 -389441 -333306
15658 -333306 -226796 -73516 179173 286492 134896 -192890 -407393 -603608 -685090 -582430
15648 -582430 -262353 -230757 -395793 -641545 -865662 -702562 -390679 -350691 -309417 -170574
15638 -170574 -88194 -77336 -149693 -273068 -369136 -283568 -197405 -240536 -247496 -127422 -111051
15627 -111051 2208 66537 31438 31029 150488 282088 279888 66123 -150509 -89867 138572
15616 138572 224346 245859 270065 227021 208089 149615 96017 -102374 -365619 -388196 -163758
15605 -163758 -138745 -251618 -29922 306530 269378 216424 365309 455923 287121 31193
15595 31193 -213588 -416739 -617830 -667812 -517454 -221644 17749 42828 -11511 79796
15585 79796 222190 207768 -110882 -328809 -332453 -376251 -487746 -593213 -632610 -589550 -581545
15574 -581545 -493233 -422993 -452809 -478852 -354641 -87588 89139 106675 -14949 -225162
15564 -225162 -527626 -611500 -515831 -318399 -199494 -334332 -342328 -170716 -19196 279735
15554 279735 187394 -149629 -147999 -24768 85501 68903 -10149 111929 204367 33664 -137068
15543 -137068 -140927 9154 91207 34286 38450 10235 -44249 16817 97451 211330 269745
15532 269745 294238 297923 196376 92789 81656 106841 -72654 -213730 -298178 -458324 -556304
15521 -556304 -345114 -86043 1334 97174 249406 441243 495693 224653 49866 167746
15511 167746 256835 153798 61105 100019 330612 598305 584599 256620 -95279 -377107
15501 -377107 -350618 -305307 -389622 -469824 -463914 -238926 6737 114860 228739 407479 419362
15490 419362 238254 154972 132009 66192 26788 160827 508959 862190 867068 549060 200032
15479 200032 132059 82667 -146071 -191183 18533 -45973 -296058 -295866 -6599 -30250 -139359
15468 -139359 -126803 -263045 -230762 -14524 -2183 -144570 -325852 -260644 -70562 -216723
15458 -216723 -381656 -374995 -437435 -736825 -764521 -557695 -386532 -83601 203977 192147
15448 192147 97083 39639 -92731 -261141 -257298 -301681 -420793 -495451 -405020 -301985 -200029
15437 -200029 -12582 94683 129629 251399 322253 315317 293642 284196 192707 80217 44190
15426 44190 -374 99461 -34435 -157598 10203 42629 -57054 -262953 -370230 -382010 -403455
15415 -403455 -288687 -133757 -71921 -113626 -170165 -187456 -160918 -125821 -74365 -22893 -45258
15404 -45258 -58231 87564 228819 198875 167919 260933 349249 371227 228037 283697 436806
15393 436806 402448 208437 139007 135784 15303 -41476 32280 257296 461074 574994 567045
15382 567045 446805 529253 410150 65413 -169167 -238266 65568 132255 -21008 30400
15372 30400 -28600 -302175 -514466 -558846 -424069 -305088 -183555 19143 89954 113479
15362 113479 117267 127973 115161 28126 217309 489851 581279 599167 383277 153483 32626
15351 32626 -263201 -304326 -82809 -173014 -272919 -330345 -199616 -1654 -65255 -33602 -173039
15340 -173039 -389804 -379402 -358392 -317732 -148876 -14757 -70365 -166531 -295973 -418431
15330 -418431 -270997 -96013 14594 -83735 -222899 -176844 -250953 -267259 -265186 -237569 -219421
15319 -219421 -59554 145198 66586 -168584 -267001 -217508 -207294 -56772 23631 159063
15309 159063 123835 -8847 -104900 -196591 -202433 -146554 -187900 -258873 -356978 -368016 -339978
15298 -339978 -487173 -521587 -495914 -485531 -354034 -149533 -53606 7489 89763 130248 170295
15287 170295 347739 329034 85469 -159719 -249627 -299546 -305344 -355929 -383416 -256142 -294115
15276 -294115 -392256 -231496 -108266 -174681 -242869 -327560 -547693 -438105 -67517 138536
15266 138536 130423 -19812 -139801 -317702 -189424 3876 -17549 71919 166295 67876 47995
15255 47995 48309 175418 275110 104617 -174957 -303731 -63181 147460 152935 -8606 -172866
15244 -172866 -136625 -9913 28389 85576 106819 119752 168926 243865 206032 35592 170978
15233 170978 299790 360730 262162 133826 112316 99970 -32136 -280432 -348446 -129925
15223 -129925 55211 133086 181068 195232 118339 45349 48139 -19846 -167295 -360262 -548752
15212 -548752 -231526 65281 181808 292509 154471 -133464 -375506 -223753 -17451 -108341
15202 -108341 -133795 -50564 34847 123212 222668 340357 240480 138913 130909 98935 117926
15191 117926 96847 -17615 -273239 -427206 -338667 -277458 -413194 -555842 -451433 -281025
15181 -281025 -179398 -96728 17970 113297 175737 315733 290460 -44757 -168925 -64376
15171 -64376 -47779 -59414 -38857 98821 22335 -141354 38894 269875 353717 261005 99498
15160 99498 36961 -63044 -116626 -140995 -69414 -74580 -114694 88130 134947 9255 -292798
15149 -292798 -675315 -755237 -394011 -137975 -12768 240312 282637 238246 229617 221454 143886
15138 143886 -693 25652 81993 57394 44237 -107218 -113923 -66824 -189298 -37472 89383
15127 89383 81533 -24145 -502877 -915610 -933914 -646809 -430704 -488959 -469932 -513905 -614610
15116 -614610 -580189 -363576 -134748 -4210 -42674 117318 222403 276646 213901 187565
15106 187565 311565 461851 336686 66083 -119572 -416585 -695319 -813497 -621513 -400861
15096 -400861 -259958 -178673 -64158 -10744 -81120 -125437 -224765 -230601 -80326 -57973 -86807
15085 -86807 -284886 -616576 -687015 -535596 -363553 -319387 -36330 194569 250472 455486
15075 455486 646697 531414 95217 -186812 -258200 -161222 38158 356717 556645 356541
15065 356541 24517 658 161684 187331 41472 -121905 -167671 -206414 -223698 -17545
15055 -17545 181681 175293 -11608 -101837 -90430 -26098 119303 223893 493849 859567 857177
15044 857177 687764 592550 384611 270985 231465 158897 50596 6284 92488 206389
15034 206389 280435 242010 263343 328241 253316 133083 30825 -661 -123203 -488564 -589389
15023 -589389 -648855 -590806 -205260 -3642 -50990 -161225 -100677 -71691 -184012 -166346 -8165
15012 -8165 -13926 -257113 -291522 -302656 -369748 -359817 -251862 -104755 -167024 -305847 -264813
15001 -264813 -23719 -11511 -244910 -359393 -359917 -259660 13833 155069 54227 -34330
14991 -34330 -145936 -228546 -147721 77923 280965 335232 267195 266166 119746 -62490 -45333
14980 -45333 -26074 89855 7592 -228640 -222785 -212877 -102534 -27301 66659 26576 -220501
14969 -220501 -315780 -238012 -112400 28429 186972 171585 -48487 -192351 9865 299537
14959 299537 227588 -78571 -172527 -33063 38320 196907 363885 355478 394041 464640 438567
14948 438567 310473 124523 68171 171209 130751 77922 -80600 -84357 -47466 44856 55437
14937 55437 -7876 20110 -62281 -210794 -201323 87185 338828 264469 85633 62753 48373
14926 48373 -135118 -120496 -124847 -223590 -135909 113624 350414 404433 195022 142755 138821
14915 138821 33576 32820 -21534 -110565 -147268 -34366 -13749 -121709 -152370 -283690 -479584
14904 -479584 -321411 -12904 49832 -22849 -95645 -204726 -241974 -295728 -378722 -219070 37962
14893 37962 87330 112070 164073 149200 -41411 -305719 -210347 73141 128553 179205 183084
14882 183084 201325 127392 27757 141315 293017 353635 436070 446846 393655 141049 -92098
14871 -92098 -139068 -112771 1878 -21087 -179740 -240496 -316797 -480716 -388162 -275870 -208593
14860 -208593 -199082 -240125 -264324 -171935 -153981 10833 76400 1450 -73011 -143887 -160241
14849 -160241 -249165 -552634 -759793 -723056 -711777 -708420 -676823 -606439 -627484 -701801 -650111
14838 -650111 -537511 -421760 -380957 -457865 -418112 -265926 -100720 -33662 793 56375 198648
14827 198648 122665 -98655 -290646 -356243 -380211 -418607 -372432 -205304 -255917 -247563 -187466
14816 -187466 -279485 -87893 -126118 -205903 -298015 -295012 -234217 -262114 -169091 -221209 -328606
14805 -328606 -518330 -652377 -487029 -293641 -346712 -273534 -2068 121780 8335 57987
14795 57987 233606 239102 185809 116587 -109307 -430172 -482343 -405042 -393365 -330979 -158698
14784 -158698 -36463 47508 55569 -98899 -87998 58235 142114 134587 56407 90716 156699
14773 156699 185905 159556 257084 354827 332005 317676 208780 196845 380489 277663 100334
14762 100334 -43951 -189885 -222161 -198358 -62838 174669 389715 239178 107978 87910
14752 87910 59079 -37206 -238729 -402311 -456304 -471902 -451513 -360252 -185231 -3999 59324
14741 59324 174366 215867 282087 268038 86676 -74867 49364 189897 119722 180208 256021
14730 256021 102663 -75856 4775 118960 125901 90875 255953 356752 370736 128505
14720 128505 -35066 -11183 -58923 -479397 -832458 -811093 -759781 -597138 -377454 -231533
14710 -231533 -160437 -186918 -299416 -216159 -33475 -44308 118314 151841 -67207 -224566
14700 -224566 -365098 -349903 -369953 -566287 -802419 -813898 -542027 -356788 -432423 -695660
14690 -695660 -708813 -541621 -547395 -521869 -328564 -120924 -5196 40776 90469 -91775 -376850
14679 -376850 -427790 -296479 -206088 -140328 -190094 -348681 -410981 -370326 -401438 -487285 -332908
14668 -332908 -168883 -266344 -222627 32250 240189 200625 -197871 -324914 -190822 -236426
14658 -236426 -186154 27216 -15706 -246382 -419026 -521758 -623733 -683639 -736035 -811636
14648 -811636 -714967 -505935 -328976 -208323 26631 216850 382816 722981 1098319 945068
14638 945068 449272 77197 -215398 -210425 103555 314172 223267 -99265 -328974 -286127
14628 -286127 -229371 -8193 243035 280995 347934 435256 230289 179604 209411 217987 -14626
14617 -14626 -335021 -396922 -261916 -290189 -330155 -177786 -131966 -85480 175681 280603 153580
14606 153580 246828 405614 538919 548629 389329 404218 452622 520464 423350 283860 257455
14595 257455 104335 -76513 -63607 45762 142841 216071 136159 -28033 -170802 -265597
14585 -265597 -231840 -203833 -76670 97400 186709 -4483 -184872 -273027 -408531 -387600
14575 -387600 -370218 -437462 -505192 -627891 -823285 -918442 -787446 -644861 -576668 -576936 -388967
14564 -388967 -265431 -430399 -433446 -278945 28708 126427 12935 -304883 -918089 -1044709
14554 -1044709 -853137 -800442 -656927 -493279 -350830 -146355 -43073 49465 322543 409764
14544 409764 423862 397803 334611 270248 -4089 -156767 -65711 114716 120322 -43281 -211028
14533 -211028 -431703 -434478 -438430 -584316 -659057 -435235 -151888 25224 -92731 -334794
14523 -334794 -436951 -377935 -348388 -263875 -3768 158187 71973 -227678 -341687 -140945
14513 -140945 -131702 -298287 -282450 -276700 -196299 -311744 -441686 -642345 -729009 -453467 -176095
14502 -176095 -142695 -116021 -57465 -218617 -392843 -506013 -445568 -282806 -14288 199429
14492 199429 262368 134591 37698 -5486 -72167 -9104 135510 166826 256870 302327 304717
14481 304717 292424 223719 31798 -217270 -328277 -311169 -284920 -233955 -224879 -409614 -534536
14470 -534536 -636094 -643213 -519673 -575759 -524241 -332206 -131100 -81535 -122505 -162292 -123695
14459 -123695 16746 172436 318388 312851 169612 26389 11967 -111044 -98817 15053
14449 15053 -159244 -382119 -446066 -433570 -476355 -535412 -596992 -633246 -493195 -272831 -201098
14438 -201098 -118950 -90479 -143261 -106443 -33766 81897 -32675 -342488 -486086 -368874
14428 -368874 -283634 -124677 -70933 -222309 -236718 -152063 -33729 -36909 -152089 -275763 -221219
14417 -221219 -104123 -35604 143439 226003 160365 185444 261162 194812 69406 114551 50442
14406 50442 11914 127452 -36096 -62442 139411 101010 -60349 -201667 -187651 98578
14396 98578 271921 264041 173810 140279 -23974 -201863 -367215 -386707 -180927 -13333 -165323
14385 -165323 -335759 -292900 -393111 -646978 -619744 -515847 -485229 -365660 -208745 -115818
14375 -115818 93180 357965 315546 144283 -345 -79499 -213249 -361666 -544196 -551869
14365 -551869 -236472 88754 246300 180830 -4719 -142852 -337078 -462182 -385387 -214505
14355 -214505 -66144 5069 -19448 35085 52397 -69576 -102520 -2726 236990 282005 177079
14344 177079 120973 -149900 -367031 -246097 -288035 -506125 -611630 -597838 -581715 -632290
14334 -632290 -752632 -645366 -392528 -165512 -107229 -26235 128695 67417 137966 230625
14324 230625 86594 -22771 67952 2008 5643 133040 193337 318466 396234 472581 306850
14313 306850 -99512 -325613 -312354 -165720 -25599 -34234 6949 -56976 -154962 77200 201693
14302 201693 -35262 -401714 -600721 -627076 -468847 -311554 -279290 -210794 -74064 -112086
14292 -112086 -49746 185374 135145 83430 95280 187167 264395 281722 182984 -53219 -133477
14281 -133477 -72517 -123156 -168368 -271924 -94486 169999 164606 128239 191499 68622 -330835
14270 -330835 -537303 -628719 -548037 -309606 -244571 -298209 -233055 -70836 178788 256969 109527
14259 109527 105988 232887 172404 35799 12018 5740 -185559 -351661 -428025 -332309 -449652
14248 -449652 -495074 -149792 279416 485041 373723 151675 132123 119397 118214 291778
14238 291778 502035 593137 594893 538722 597437 656219 713285 925257 1154945 1435512 1579106
14227 1579106 1900833 2311082 2592516 3039011 4005480 4985088 5465328 5284224 4472748
14218 4472748 3698093 3053623 2540840 2090544 1860064 1579023 1079362 611870 446027
14209 446027 432854 398763 264825 85120 75817 113101 74721 81049 153256 481415 695671
14198 695671 729330 638795 347334 -58307 -241397 -185476 -180184 -46758 73444 88844 72522
14187 72522 114247 -43972 -48590 73844 98177 97853 229100 312987 321240 216622 158687 163398
14175 163398 122356 -161588 -221404 263767 634899 428220 -14909 -197861 -194685 -85213
14165 -85213 60235 126431 1060 -282127 -283907 32279 215089 376834 561501 514223
14155 514223 471456 475896 263081 262457 450554 536991 616024 537019 303454 60862 125798
14144 125798 195593 67142 -163975 -263591 -276124 -298598 -235064 -103883 33525 -25036 -84014
14133 -84014 -126002 -85361 -178988 -107380 74123 229920 267718 138520 61016 166725 149088
14122 149088 90408 94671 35986 3548 61176 27188 39528 83571 16859 -66785 233949
14111 233949 391569 395640 392048 241595 124936 165098 240860 -21274 -253428 -124846 306
14100 306 -165255 -153520 -44575 38133 -70783 -228356 -296508 -172840 -92642 -123970 -166995
14089 -166995 -135241 -20403 80209 163423 177955 165166 51587 -139471 -1823 23429
14079 23429 -123419 -207237 -245342 -179131 -301474 -356061 -271197 -258178 -270047 -48963 272122
14068 272122 185752 -79325 -192021 -108424 -34289 -41856 157311 410227 595110 761382
14058 761382 660185 529239 226934 -90329 -336460 -430419 -399580 -318368 -91007 48762
14048 48762 27078 -116629 -326763 -527075 -481371 -220478 8785 -18555 -298396 -301475 -82688
14037 -82688 -9935 -1531 -5215 -129542 -247996 -367544 -359096 -309098 -231425 -195085 -189615 -90057
14025 -90057 -55465 -80176 -257287 -560464 -603301 -213925 25899 9654 -176849 -164817 -109474
14014 -109474 -118174 -87561 -37982 -63781 712 98089 198321 42336 -158994 -54165 123404
14003 123404 224910 287877 132110 -101783 -158614 -141157 -69042 3961 127 134839 394190
13992 394190 402649 246110 98577 -22271 -55687 101590 430173 724860 652686 312616
13982 312616 115159 37467 -105205 -282312 -290631 -261055 -398212 -524464 -644215 -402561
13972 -402561 2548 294533 437040 387901 188988 908 -61441 -47025 -14023 69092
13962 69092 -34408 -294105 -366486 -179389 -69411 20061 174162 113925 37952 360 -84360
13951 -84360 -178061 -92030 -59791 -54848 11706 -50856 -236042 -309519 -120817 86679 92877
13940 92877 79098 198700 283267 59576 -39253 11317 -21320 52694 -74433 -210295 -210131
13929 -210131 -248964 -249483 -70337 121920 201318 295000 327642 299660 225745 140262 171493
13918 171493 251184 262382 171372 148121 -82861 -309095 -267371 -39124 46258 -147408 -251532
13907 -251532 -330389 -231987 -7976 33926 59734 6763 -115031 -271847 -451775 -485502 -254428
13896 -254428 -321070 -358053 -170496 29598 225155 178385 46070 -72460 -65541 83812
13886 83812 125258 -138090 -299756 -143662 -91290 -265971 -299927 -224897 -172237 48006 174799
13875 174799 209761 220305 155785 43606 -129493 -227015 -97644 -86079 -204794 -233890 -220198
13864 -220198 -121682 -25252 -47010 -186076 -252948 -35517 188108 168463 52020 65992 158317
13853 158317 271881 52226 -58545 -86138 -223800 -302162 -180475 194762 265391 99503
13843 99503 -53675 -277960 -526890 -629230 -580485 -520374 -374288 -209007 -113402 94270
13833 94270 23900 -48475 43228 60499 68272 236288 472910 500946 476556 397682 204209
13822 204209 -185128 -479556 -586007 -570234 -371722 -67190 200651 206787 -43214 -124506
13812 -124506 8596 -40285 -174674 -244093 -348338 -574336 -680430 -752656 -772714 -645123
13802 -645123 -331270 -123283 33947 39218 40452 -24342 -68385 49551 157732 243661 219776
13791 219776 85700 6445 89834 199473 128718 38704 -50923 -164625 -142848 12417 190000
13780 190000 273916 225284 193126 83880 -9409 -93324 -13560 68823 117367 59624 -64630
13769 -64630 -318694 -329993 -273956 -420452 -436256 -335387 -168182 -64129 69562 321308
13759 321308 479440 484821 407572 115007 7307 153953 159086 247031 303892 301012 215423
13748 215423 258707 297795 269870 316380 178441 -63978 -323142 -487614 -692659 -678115
13738 -678115 -477910 -154332 -10847 106688 -32860 -151530 7493 280928 172291 -47778
13728 -47778 -161025 -261662 -235676 -104910 -81107 -267032 -286890 -295596 -521311 -726257 -619649
13717 -619649 -315348 -122925 41528 143801 175371 232833 185937 164649 90500 191462
13707 191462 235791 -6723 -325880 -299681 -81485 -12610 -132114 -78155 70583 221939
13697 221939 240419 197246 167293 -3316 -48462 55856 141845 111656 -20096 -192072 -220995
13686 -220995 -98828 -2640 109106 200026 265371 67619 -53969 -77265 -52394 128019
13676 128019 196930 249942 139125 132202 153410 129844 -103446 -268023 -127525 -44317 -72451
13665 -72451 3293 -49941 -200109 -223242 -155921 -154481 -327441 -289136 -35064 153507 112030
13654 112030 -15758 30640 150510 294292 333475 264940 323174 395591 338274 180466 160357
13643 160357 112527 77150 -17104 -110984 -347847 -505361 -368972 -194864 -155443 -195812 -99077
13632 -99077 97998 203717 239301 278463 385190 385555 381118 437949 377545 202957 82980
13621 82980 127492 312629 445861 316468 155843 175568 133378 -75601 -275707 -469017
13611 -469017 -639691 -637400 -524385 -440989 -355698 -422557 -417596 -495704 -607679 -630616 -477928
13600 -477928 -312220 -239374 39105 56443 -243069 -530353 -582777 -435949 -553753 -526142
13590 -526142 -330701 -112426 192989 351992 491472 614765 448550 103373 -225995 -334100
13580 -334100 -366257 -234000 -144490 -223474 -224098 14644 150904 171438 152705 23814 -105106
13569 -105106 -196847 -216189 -214990 -213750 -306940 -401876 -478573 -368284 -164485 -115304 -86956
13558 -86956 86527 157353 314578 565755 482906 293893 186811 71039 -38397 -263694
13548 -263694 -419536 -494539 -423494 -274079 -416302 -498326 -424689 -323221 -199802 -115168
13538 -115168 -161397 -28126 53631 19353 33788 8881 -110888 -279383 -310507 -11569 149970
13527 149970 -90050 -311660 -512990 -614546 -457337 -339682 -246169 -138268 -155215 -130063
13517 -130063 -40768 73532 -102748 -167784 -146053 -265909 -183621 51343 118132 -35247
13507 -35247 -152642 -86506 -107609 -229651 -356896 -274599 -19229 50937 -135349 -263898
13497 -263898 -369095 -296045 200163 451500 382116 315863 141843 76871 211390 470500
13487 470500 456793 223212 163175 187901 199167 18458 -20226 142710 265920 261561 124582
13476 124582 74443 70771 -5587 -159122 -176472 -119671 -203711 -351033 -374978 -345662 -344789 -331466
13464 -331466 -370871 -306725 -257061 -286786 -355175 -202196 30034 6070 -28183 -259341 -603168
13453 -603168 -712702 -522944 -206859 -106751 -33808 -25730 55352 78517 49937 -57522 13541
13442 13541 132356 21345 -25829 37353 62883 -34268 57337 379814 624776 771424 742293
13431 742293 484785 106706 -137620 -235236 -399952 -615528 -842440 -864319 -718457 -609691
13421 -609691 -414504 -310463 -431900 -388469 -271470 -221092 -367140 -499370 -383448 -321543
13411 -321543 -292769 -174231 -142167 -272494 -167273 -84215 -109762 -68522 -23223 122696 220325
13400 220325 26102 -50871 -79544 -69317 114250 245477 116241 -42659 -118909 -68949
13390 -68949 -107854 -294134 -337464 -338231 -413976 -461681 -427846 -383845 -430765 -369154 -256499 -398720
13378 -398720 -425714 -248169 -305285 -478956 -593930 -705331 -635051 -447611 -196572 -48689
13368 -48689 3444 10395 144741 144544 99088 220615 236415 157387 66955 81945 60775 -23676
13356 -23676 -42767 -87316 -355598 -680380 -743878 -373693 -195801 -339181 -413560 -332612 -143222
13345 -143222 83584 200352 326180 429758 235177 -192108 -456228 -440579 -239359 -61259
13335 -61259 -277487 -355581 -223745 -149237 -151765 -157819 -311099 -375001 -528950 -577602 -340319
13324 -340319 -104901 -83815 -325427 -377757 -199921 -134000 -142459 -279308 -372520 -447993 -484650
13313 -484650 -444876 -453140 -314128 21071 169498 152249 41167 -299303 -599607 -713375
13303 -713375 -582024 -469509 -331129 -96267 -125955 -169083 -219810 -243673 -149264 -134843 -304985
13292 -304985 -407417 -199506 -262426 -449209 -649211 -574872 -372384 -371709 -363942 -294277 -237288
13281 -237288 -283897 -343979 -190068 134750 306955 323165 319053 427515 467704 479659 477741
13270 477741 577546 447417 94359 -104410 -233000 -455207 -487861 -465821 -401770 -244844
13260 -244844 -148381 -232190 -478878 -751922 -726799 -589548 -405193 -239799 -80720 -6390
13250 -6390 50632 121120 211935 392294 667450 723270 604405 560238 525947 514708 394328
13239 394328 301594 189199 73673 121091 341362 596570 735779 640067 324999 27414
13229 27414 -104858 -150910 -118582 -54740 70793 120089 9343 -42970 -3515 -40065 -164929
13218 -164929 -48493 45156 -16017 58465 204176 159733 110046 155820 261405 323800 229620
13207 229620 200283 158415 -156931 -404920 -484782 -393589 -214549 -46951 255670 459655
13197 459655 540448 576067 490324 394143 270965 104248 21907 -16466 -20965 131290 164921
13186 164921 -85055 -269125 -370962 -6506 474236 509693 366144 286342 381012 602291
13176 602291 575723 319618 80179 51786 228564 460677 566881 675737 609435 499274
13166 499274 368841 254669 227226 123172 761 75836 197698 313066 404285 363665
13156 363665 308693 402536 528273 405472 158585 114950 355884 564668 633189 636576 568056
13145 568056 656138 838436 919254 925877 842881 825162 849267 832463 642116 461831 246381
13134 246381 103200 -21272 81939 204652 174138 171901 297943 342139 382929 471193 480346
13123 480346 489658 513758 493002 465190 383190 360608 308678 164038 84519 69017 238607
13112 238607 566571 963346 1129169 1140411 1027584 841526 679843 804007 819586 495176
13102 495176 312079 385016 530396 720315 805883 1013332 1103189 1124761 1196331 1078653
13092 1078653 921273 948386 916968 962762 1013715 931647 930264 939067 905824 801382 953543
13081 953543 1030495 1080442 1108652 870528 769565 773884 740546 948252 1251255 1304730 1139530
13070 1139530 1109130 1284644 1539796 1808929 1808106 1676799 1511195 1428852 1127159 958775
13060 958775 1037531 1011957 1159583 1205785 1039698 1256904 1463762 1351027 1251086 1119835
13050 1119835 994392 958648 949908 1085436 1267864 1404455 1596392 1589512 1454756 1408907
13040 1408907 1415862 1452313 1398535 1543663 1699154 1700618 1658108 1616981 1803634 1866033 1944736
13029 1944736 2181511 2359242 2384350 2479539 2718588 2790845 2569923 2641356 2885191 2849019
13019 2849019 2889663 3032403 3156852 3306138 3381958 3270533 3168316 3056471 3187971 3368058
13009 3368058 3426780 3496191 3851845 4300733 4559414 4575804 4818770 5264792 5700873 6180191
12999 6180191 6610703 7062965 7712608 8512116 9310856 10104053 10758373 11723694 13206147
12990 13206147 15168794 17223060 19115953 21395806 24460892 28343126 33253116 39317598
12982 39317598 46904575 56291158 68201345 83510993 103148794 128928521 162847750
12975 162847750 204549459 245636378 266413774 252318170 213443679 170207826 133664624
12968 133664624 105787990 85192972 69763266 57745441 48291134 40895459 35052739
12961 35052739 30441782 26825245 23816221 21054048 18780261 17101940 15845480 14697810
12953 14697810 13442642 12377106 11509011 10732702 10007454 9514125 8968491 8311456 7886996
12944 7886996 7650633 7287079 6772512 6510981 6381554 6318453 6250036 6103080 6052478 6209076
12934 6209076 6304888 6291836 6317613 6277481 6389077 6526928 6412428 6344774 6314153 6295928 6325986
12923 6325986 6519262 6838918 7259019 7676001 8270789 9145120 10167672 11568440 13060823
12914 13060823 13922569 13765604 12924219 12182563 11912516 11827123 11913695 12299584 12961234 13765516
12904 13765516 14782481 16273674 18040405 20101214 22894021 26385570 30730582 36011302
12896 36011302 42324322 50077424 59732766 72302190 88835922 110455182 138945188
12889 138945188 175900528 219862634 259235430 271317820 246779046 202755367 159514560
12882 159514560 124951037 98992898 79623091 65297950 54457511 45887741 39131933
12875 39131933 33949175 29762524 26248398 23309301 20654821 18414227 16746050 15473318
12867 15473318 14292363 13390257 12780219 12373948 11924068 11389934 11089416 10893201 10957682
12858 10957682 11418756 12196510 13420914 15213670 15832651 14057110 11865551 10170535
12850 10170535 9045525 8170259 7437562 6812933 6282394 5910055 5694113 5831715 6204738
12841 6204738 6339983 6144879 5947559 5816529 5755042 5805648 5938435 5820000 5669641 5764117
12831 5764117 6032059 6412535 6744414 7268641 7781916 8305686 8696849 8901484 9293980
12822 9293980 9708652 10238042 10968970 11891901 13161161 14584892 16444354 18572140 21014037
12813 21014037 23941300 27408442 31646205 37178359 44140658 52511179 63120829 76845087
12805 76845087 94572897 117532021 147490402 186010536 229055665 261312455 262732390
12798 262732390 232003850 188300440 148030902 116381599 92741417 74952746 61461763
12791 61461763 51368315 43353171 36666249 31285861 27059459 23855900 21217412 18918788
12783 18918788 16844943 14956092 13330096 12234033 11288364 10225845 9150556 8222067
12775 8222067 7648967 7188949 6712201 6151434 5578382 5228231 5053983 4815794 4704681
12766 4704681 4576654 4372161 4096406 3836649 3494256 3147956 3160925 3227758 3022271 2834338
12756 2834338 2659227 2421346 2276029 2104896 1802922 1638565 1711098 2028041 2237029 2071889
12746 2071889 1829245 1684440 1748781 1700369 1528672 1382483 1130885 954434 825602 744704
12736 744704 810109 892438 1097208 1265851 1237485 1159107 920488 866503 959045 886689 1060542
12725 1060542 1093844 891799 885406 989895 961966 852502 758948 753619 756505 681212 858553
12714 858553 1000466 773637 542571 469242 338713 176507 442401 613052 591670 655401
12704 655401 698831 914128 1070001 1145694 1136291 1017355 832789 721612 689817 746896 666937
12693 666937 654249 635034 576551 482159 314153 168928 237131 402699 443680 341700 197208
12682 197208 131312 70683 -11870 140298 403563 506528 525136 600787 562796 481531 449068
12671 449068 463966 351467 205127 220635 354173 437017 527559 597202 605057 668022 644179
12660 644179 514122 321376 78347 -172016 -300044 -241675 -283471 -308889 -113893 170494
12650 170494 359848 273314 233739 279341 188743 -77221 -208047 -138448 -43309 5785 58812
12639 58812 81501 329291 617279 764255 614706 405446 397546 509924 641187 626547
12629 626547 470652 265880 66184 -158321 -289114 -362383 -291135 -146508 -56922 -48317
12619 -48317 225914 463587 547500 344569 181296 -25890 -81015 87607 88775 17401 46760
12608 46760 132740 255411 406480 438572 482106 751266 895142 703866 396542 259780
12598 259780 144472 34760 165264 229919 190056 140111 267941 355299 438555 530449 548559
12587 548559 511617 288400 186369 190857 237934 381665 451389 487679 561925 581081 433076
12576 433076 429999 584394 506304 266631 44232 -45161 -116458 -235499 -330887 -271926 -122343
12565 -122343 -98107 -81921 -56635 8050 75358 263995 504419 628640 606174 510747 554166
12554 554166 414627 150039 30868 194008 317034 208977 9502 -214555 -355023 -298319
12544 -298319 -189645 -104975 -79920 -4334 -101298 -336531 -337283 -275587 -183981 -30475 36806
12533 36806 79441 200990 194342 -2125 -245310 -414778 -424198 -188243 -29170 -79646 -119551
12522 -119551 -255854 -405700 -412043 -459998 -327298 -90588 -81645 14663 181593 244125 309606
12511 309606 427847 410466 331041 73239 -310842 -469236 -325494 -177021 -331317 -522972
12501 -522972 -443301 -312934 -210387 -101013 -43114 36992 157011 366824 453074 230326
12491 230326 -55313 -137129 -327626 -370434 -277270 -318688 -401678 -244637 -240311 -396471 -456410
12480 -456410 -420118 -255281 -277754 -392224 -415642 -455444 -480062 -345018 -186113 -186473 -69001
12469 -69001 59850 -57200 -184365 -214699 -113885 -54492 88524 64576 -134800 -321502
12459 -321502 -455797 -370550 -141096 -197058 -260767 -169188 -5734 -12337 -134927 -149369 -128089
12448 -128089 -35577 49307 39396 29822 -7551 -122979 -143901 -55883 117757 207388 108481
12437 108481 -82055 -69774 -160120 -250101 -121702 -67336 -152407 -57947 161027 179026 150744
12426 150744 118727 -13640 -289178 -507799 -494038 -338644 -46355 57389 36348 107205
12416 107205 23977 -207112 -178149 -79660 -120295 -216276 -364403 -329511 -253985 -208854 -177971
12405 -177971 -116911 -108937 -262985 -422427 -573606 -658198 -489787 -47206 192975 171313
12395 171313 -19415 28593 62419 91056 118560 90486 -70280 -167681 -202389 -60153 291179
12384 291179 346276 85815 -110502 -90276 3804 -42998 -113564 -190617 -134410 -120883 -143957
12373 -143957 -132986 -24548 -20486 -22684 31643 -34731 -173825 -257662 -143401 -75580 24776
12362 24776 150237 243176 232387 156158 173598 -65788 -242672 -216552 -298785 -239655 -77193
12351 -77193 68576 251529 395858 341639 283712 300086 229171 88264 -66335 -145934 -362462
12340 -362462 -462064 -384056 -224536 10009 209346 92462 -93772 -206750 -276081 -372428
12330 -372428 -459365 -343896 -229467 -236002 -186530 -72327 -133486 -285574 -298802 -131104 -40832
12319 -40832 4237 74488 -160560 -331706 -194262 91284 250933 172644 -64791 -280105
12309 -280105 -314684 -255879 -81000 157660 184875 210512 380626 448749 384566 192702 104946
12298 104946 45515 -68705 -150769 -214321 -249692 -165845 -161141 -171056 -241773 -351784 -366133
12287 -366133 -236383 -252795 -170129 72583 162895 22574 -61216 -178895 -91704 29563
12277 29563 21944 -33101 89717 282520 226623 44932 171084 349895 334758 419638 641224
12266 641224 651353 416258 31994 -278356 -180065 27254 47272 -12387 -128714 -234526
12256 -234526 -582856 -599316 -222277 -229567 -353486 -396324 -337049 -247532 -218255 -80324 55390
12245 55390 -43065 -108395 -227743 -196569 50661 50741 1692 82080 -65599 -269374 -490823
12234 -490823 -557057 -392929 -307612 -210943 -1650 119872 137762 30225 -91054 -182706
12224 -182706 -369366 -661784 -705512 -679402 -827668 -651198 -388966 -341089 -440034 -405057
12214 -405057 -287022 -194926 -220845 -112155 -72968 -84229 -14116 -7319 8106 42095 -16189
12203 -16189 45161 17838 -100821 -183496 -162177 -120133 -128838 -160711 -171972 -167291 -127749 -188005
12191 -188005 -183385 -116243 55229 100180 46908 48295 47914 -9276 -92378 -141329 -71582 40860
12179 40860 53142 105180 193633 213150 146566 133678 131953 104946 151532 113190 67889 144600
12167 144600 305098 414451 225659 71941 74407 104165 309158 661907 663721 658260 682936
12156 682936 529997 317581 117148 -6066 47312 128688 68565 16185 59710 191511
12146 191511 230554 223264 273487 26676 -229720 -383502 -495484 -736713 -800204 -618940
12136 -618940 -402631 -228096 -105051 -17893 96617 211171 273762 293794 158295 35924
12126 35924 -113217 -162983 -116785 -171282 -179082 -222303 -351785 -522275 -489559 -346802 -160303
12115 -160303 -143100 -297868 -463255 -600494 -643504 -551715 -559120 -629368 -447399 -215899 -192370
12104 -192370 -256409 -189908 -193547 -156317 26152 151253 382127 381049 155382 210399 393137
12093 393137 401332 333216 168128 29480 -90939 36407 261330 423025 639873 666765
12083 666765 582928 418890 256999 288791 544517 730825 767232 570462 205290 175581
12073 175581 344602 361990 180960 -53317 -30775 92086 219588 337823 389842 396913
12063 396913 425859 297338 -41450 10184 234161 469511 688165 727641 702170 756153
12053 756153 778944 815176 749764 595022 422805 257125 329797 598409 744170 574223
12043 574223 524942 474535 288268 137634 233522 75175 -112714 -229576 -265373 -367292
12033 -367292 -452203 -443506 -382360 -390689 -412814 -474629 -298160 47718 108401 54895 -124519
12022 -124519 -307739 -382557 -352229 -188634 72430 405938 389693 161931 -131822 -360546
12012 -360546 -352973 -476878 -479587 -116795 87060 -40779 -198697 -282219 -300749 -349287 -237031
12001 -237031 -27954 22724 -169860 -328429 -471766 -442308 -229471 -96806 -68921 35850
11991 35850 191148 219831 69598 85002 136007 118755 200442 316210 411722 179684 -201433
11980 -201433 -248733 -6006 251242 288277 108060 -22811 -302627 -495575 -278443 -12986
11970 -12986 211255 216230 289147 363784 180428 72349 137119 344544 383863 202118 111066
11959 111066 358770 689320 885882 859992 695307 546869 363674 310866 394254 490017
11949 490017 464774 493244 591174 487565 425989 346290 302118 355955 450138 415978 417034
11938 417034 918097 1395726 1672609 1915181 2241340 2403869 2588055 2910573 3541808 4297628
11928 4297628 4902905 4989474 4631608 4043189 3434727 2857498 2376644 2121535 1943897 1793085
11918 1793085 1508750 1169291 1059114 1066937 1069983 971039 892205 834632 618971 486819 341933
11907 341933 223935 160336 434643 743977 702540 346084 18468 -86444 263404 539839
11897 539839 565272 519358 515687 355683 120734 111407 238820 232492 253996 291296 174003
11886 174003 116490 12553 -191759 -153562 173546 343929 333090 166552 145406 336168
11876 336168 517446 654136 719636 777792 652704 507038 423237 478234 628900 722666
11866 722666 970806 1123737 1342259 1931259 2696015 3784428 4185492 3153780 2178820
11857 2178820 1299838 409378 137099 236144 258899 158772 -70129 -282503 -189094 23812
11847 23812 275141 385874 202110 -96203 -223230 -61844 229356 476927 490779 452130
11837 452130 375117 336957 271629 256640 339980 447610 382531 135960 86795 90255 116452
11826 116452 -10718 -166528 -184937 -102192 -4703 -10064 127884 308152 328949 338869 326879
11815 326879 268236 291637 250359 232222 475463 611944 362600 78640 53219 95427 153898
11804 153898 385649 534508 510277 312953 241377 530099 821413 722322 490435 449130
11794 449130 489684 491676 221944 16779 41384 13619 -90984 -131613 -83812 -57262 -134337
11783 -134337 -150153 -21850 -26627 -99976 -105691 195612 352972 270033 334707 425416 248141
11772 248141 32088 -139794 -271886 -330309 -208996 -76396 -22687 -15577 42472 216354
11762 216354 391121 336565 137982 -23655 -90737 48328 233669 692066 943170 912851
11752 912851 663859 475859 469340 293768 115354 -97823 -325399 -481518 -541655 -508075
11742 -508075 -316478 -157176 -30726 -20696 -104685 -58172 35208 41065 -94872 -151872 -1139
11731 -1139 321751 376524 274674 124790 -98785 -263828 -369979 -339523 -297701 -310566 -728666
11720 -728666 -1015808 -719303 -533900 -876965 -920953 -526812 -312987 -302627 -463495 -472847
11710 -472847 -462464 -335954 -124603 -69362 -126971 -120412 -59129 -163628 -282300 -152876 83020
11699 83020 84039 18044 -36791 -97943 -162307 -49113 122265 261026 328847 224540 49352
11688 49352 -179342 -62236 128282 199487 269760 379328 282457 50473 68655 168982
11678 168982 129230 -6992 -280630 -546115 -712241 -763212 -468277 -71639 132141 187855
11668 187855 260705 144604 -109531 -224693 -97691 72588 128221 -5548 -56762 43532
11658 43532 229022 318533 293116 242947 279290 321263 494831 573404 484112 496178 445632
11647 445632 393722 160129 97714 262940 573432 644907 474942 370154 282616 339272
11637 339272 473935 356428 84544 -38077 -92576 -207267 128720 389353 295992 112713
11627 112713 227297 441842 682953 685343 444780 146668 -125538 -181517 -168221 -133443
11617 -133443 -173941 -165693 -99873 -153458 -115909 11391 240511 516549 652453 632196 561562
11606 561562 482405 458694 293953 117831 68981 29029 37350 152651 73906 50850 108705
11595 108705 129944 333790 503335 554267 834273 1179266 1266840 1341956 1378367 1504405
11585 1504405 1713931 2022344 2282514 2551738 3186837 4033634 4947875 5839402 6312594
11576 6312594 6328774 5760461 5027515 4365558 3761635 3419735 3018377 2526430 2218396 2199964
11566 2199964 2095197 1906418 1772552 1620886 1626958 1800455 1968120 2155667 2544335 2967558
11556 2967558 3377141 3808590 4342050 4946545 5524323 5763175 5362259 4598220 3841034
11547 3841034 3025010 2526064 2263145 2134502 2121703 2045951 1966415 1883675 1769074 1716356
11537 1716356 1611569 1684536 2010011 2369721 2588485 2577636 2671702 2950453 3446443 4021791
11527 4021791 4574193 5131336 5710472 5943408 5445586 4643159 3845349 3071548 2488774
11518 2488774 2051472 1921954 1900531 1799269 1588132 1371385 1121926 810618 609289 508054
11508 508054 412398 401204 482417 383668 274890 175985 207104 470337 725317 673655 603012
11497 603012 721112 757625 720304 784348 764626 784418 813290 673585 566769 602867 446413
11486 446413 184692 89353 157863 216366 314953 578626 707246 661087 790332 715916 362363
11475 362363 155942 174753 150312 394490 649482 637846 548142 491662 372868 240014
11465 240014 324109 519150 520967 315523 346534 497086 208470 -16467 194919 491657
11455 491657 646274 485911 446884 354747 263471 195637 344020 517199 415827 85322
11445 85322 -142147 -11800 18249 15147 217422 550630 755000 740391 519237 217935
11435 217935 83148 117235 100772 26806 -188621 -320122 -277187 -220191 -301842 -301754 -229928
11424 -229928 -51368 131716 265359 274389 165598 11288 -256241 -420394 -441219 -209286
11414 -209286 -905 -139724 19221 567585 621607 291774 -134672 -213138 -5204 120624
11404 120624 129506 -51406 2386 162277 271060 133219 -17017 8253 -76181 -94770 201175
11393 201175 478495 468032 291578 253458 228136 144032 68228 65675 88627 12673 -276950
11382 -276950 -446662 -210537 232062 606641 540915 383497 341448 291889 103533 44259
11372 44259 -73952 -197831 -45706 101819 176513 105223 114867 159196 150069 230254 216714
11361 216714 271080 396097 454189 294290 115916 66630 234892 320006 186294 148587
11351 148587 329856 508192 374349 97223 -69990 -45401 150714 126956 113832 117758
11341 117758 195188 110508 -41690 -65438 -23667 -11619 -26629 -132583 -169883 -332589 -251409
11330 -251409 33525 28233 -161455 -206588 -271572 -361459 -278792 -236729 -81342 -61614 -293899
11319 -293899 -304133 -167101 -133074 -117894 -357271 -484041 -296263 -10604 5440 -375608
11309 -375608 -727785 -722263 -432668 -54639 284138 166981 -199056 -357149 -349492 -348906 -309217
11298 -309217 -215293 -185173 -144538 -186627 -221817 -233669 -28226 123378 27151 -294614 -507467
11287 -507467 -435411 -231180 42092 287950 304008 246072 192869 93034 47656 -185380 -515989
11276 -515989 -692589 -777938 -867272 -1004901 -888167 -447603 -132158 -141458 -207701 -343619
11266 -343619 -516306 -448284 -214213 -93355 -316315 -559363 -616287 -526448 -298723 -179010
11256 -179010 -292019 -253833 -216611 -370850 -537691 -570628 -305299 -91957 -66123 -52002
11246 -52002 -34471 179854 197106 96698 190270 190696 66865 -16993 -110784 -105101 -137390 -319782
11234 -319782 -287908 -121030 67939 14907 64919 166690 217433 378543 495498 356794
11224 356794 136026 48243 -32614 -234051 -226628 -173673 -158892 71846 294860 311786 202165
11213 202165 36743 -185107 -190001 94227 330469 334635 118765 -82973 49394 222009
11203 222009 261098 218655 293040 300579 238236 99205 54593 206230 377243 283742 65249
11192 65249 -72173 -57556 -139662 -170488 13800 31716 11161 125749 85208 19953 309834
11181 309834 415364 152736 -42683 32988 115713 213948 261329 185851 160294 2154 -183155
11170 -183155 -274907 -205745 -92588 -214163 -502046 -788950 -1000334 -997722 -773439 -568619
11160 -568619 -513589 -536324 -408367 -128558 237974 418755 374003 98542 -200291 -551594
11150 -551594 -692600 -656672 -709014 -633148 -385675 -333247 -508667 -522927 -360057 -49057
11140 -49057 119774 156205 98671 96179 105253 77411 12176 91857 333952 458632 385881
11129 385881 226761 176150 136653 101857 -22392 -171757 -51848 316069 567462 675779
11119 675779 478490 366179 333858 395576 418492 173409 -43109 -292675 -414642 -253074
11109 -253074 -93315 184712 480989 478226 312409 114082 -172906 -415384 -344657 -158203
11099 -158203 66825 114808 30343 -65121 -153343 -175139 -230232 -307045 -225443 -97894 -193613
11088 -193613 -267403 -182144 -10113 -107159 -184285 -250613 -271994 -5459 239642 364192 364236
11077 364236 384930 452273 267774 291096 343150 118517 -172245 -200788 -44340 -2598 65843
11066 65843 280650 272195 184782 176610 249512 360057 173652 -103217 -113315 13076 -63457
11055 -63457 -179063 -109624 -49167 -79576 -114837 -322886 -483389 -441368 -344452 -340063 -312628
11044 -312628 -310879 -237909 -71907 99750 228739 275466 225911 201826 74196 -107196 -253428
11033 -253428 -233742 -193460 -252003 -197939 -75137 -33529 -4382 -32490 -77579 -91065 -241874
11022 -241874 -357972 -366531 -463687 -396807 -241062 -263869 -122918 226857 492413 503595 213922
11011 213922 60262 10354 -57376 -148123 -209500 -420284 -680493 -754937 -574437 -327796
11001 -327796 -331866 -341030 -239007 -193763 -180953 -129152 52293 121928 -137041 -376238 -592718
10990 -592718 -754628 -751718 -730275 -560198 -351455 -189978 -171613 -229480 -82725 -18233 -119059
10979 -119059 -84529 -54587 -212019 -475137 -477207 -395100 -125287 76129 -78235 -219989
10969 -219989 -284532 -239584 -317344 -252114 -62534 43034 17974 -117626 -43355 136362 225331
10958 225331 185689 216191 248567 371669 351122 284923 202723 -54008 -213067 -252830 -442264
10947 -442264 -549876 -561770 -694142 -725857 -628767 -435267 -212711 -105366 -228041 -305515
10937 -305515 -352008 -329848 -336600 -322209 -346693 -344456 -197230 18662 75617 -24360 -117472
10926 -117472 -130929 -16056 11673 -20073 -154563 -241742 -201204 -128566 -37792 90126 -3457
10915 -3457 -109835 -99452 -226450 -404992 -418487 -422369 -339301 -360727 -425113 -256299 -45239
10904 -45239 -44349 -169205 -305548 -413229 -294281 -3634 61400 68346 121919 236672 303239
10893 303239 105861 -110016 -205258 -66337 180735 166998 139365 244929 57879 -240957
10883 -240957 -325698 -201975 -122417 -296194 -529039 -597342 -587607 -591977 -515757 -329543 -260715
10872 -260715 -223584 -131574 -134468 -196050 -290047 -401665 -421014 -500476 -420519 -224194 -49685
10861 -49685 141699 288472 104500 -16621 15412 -157862 -470769 -605676 -586941 -416020
10851 -416020 -360556 -312811 -328783 -70435 201942 290198 234438 224528 301504 154575 -165382
10840 -165382 -429534 -543505 -426645 -384411 -389082 -569434 -685354 -681762 -634079 -466628 -369129
10829 -369129 -239478 -267268 -326666 -275301 -232660 -338024 -475858 -529943 -389286 -320239 -546782
10818 -546782 -546597 -274420 -30154 21456 -228789 -582831 -658810 -501379 -415144 -459939 -614236
10807 -614236 -764924 -832457 -755223 -541977 -215773 -16086 -12755 47169 272147 277893 90185
10796 90185 -27611 108177 257629 119150 -82295 -280517 -361780 -274437 -249392 -141395
10786 -141395 49485 105835 93007 37522 -122185 -302476 -652580 -804460 -729872 -329158
10776 -329158 105053 273864 265137 270708 181962 3426 -71492 -14276 102061 123896 -77904
10765 -77904 -223647 -185140 -188311 -133056 -14458 126331 82107 -55683 -136236 -191366 -238227
10754 -238227 -250490 -28301 6421 184 13191 -240578 -598898 -687098 -341136 55035 -26737
10743 -26737 -296770 -392300 -280372 -155280 -62938 60903 -77643 -386858 -526967 -642717
10733 -642717 -731859 -489532 -195888 -76113 -119905 -112293 -95363 -74249 -156940 -238458 -25970
10722 -25970 68827 -103288 -66734 277174 366757 212052 63354 -18644 42555 -41404 -274273
10711 -274273 -101045 229437 150799 -1920 -106552 -304040 -455671 -237394 140689 416962
10701 416962 548937 490036 321115 112266 96223 132230 83752 88498 -29651 -170558 -292517
10690 -292517 -373862 -315868 -279494 -389477 -370698 -23534 288896 314944 162633 17813
10680 17813 -106017 -207574 -198166 -303913 -606947 -774494 -853087 -870956 -695124 -614231 -700584
10669 -700584 -627987 -413544 -308225 -183475 -143575 -45603 268821 567956 466537 301083
10659 301083 402723 298432 155411 270897 473157 670490 719411 420663 186182 254193
10649 254193 217883 57348 -188065 -293444 -97869 105708 199906 68032 -38201 -52532
10639 -52532 -104580 56 228859 236563 -37889 -364248 -410615 -207168 -26503 23194 67228
10628 67228 -100853 -328059 -200820 -35429 64750 -28016 -233211 -351510 -208390 -180428
10618 -180428 -210949 -275818 -249837 -275598 -226443 -7546 117106 29050 112209 110222 12925
10607 12925 55297 236386 365039 257611 71973 40567 196705 308069 310292 334996 446287
10596 446287 335469 120832 -34335 44143 7886 -234604 -444816 -459085 -322549 -353911
10586 -353911 -378977 -138076 47077 -146942 -300196 -377241 -536707 -729759 -947118 -765336
10576 -765336 -322658 -85868 71479 216580 275720 75713 -148071 -242840 -359121 -344575
10566 -344575 -288534 -335659 -418773 -456461 -446873 -329897 -114247 -14963 92295 11757 -241141
10555 -241141 -470420 -357524 -127056 8512 169996 211115 20125 -266507 -306732 -100281
10545 -100281 131879 235166 192661 -70633 -372499 -707265 -879034 -935230 -739873 -565712
10535 -565712 -394117 -262693 -47996 84330 92154 -46671 37755 189149 346973 442844
10525 442844 296784 236897 243081 -35311 -333224 -363991 -178552 13651 63832 -159507
10515 -159507 -316271 -112890 -40022 -220287 -270701 -228981 -49558 20340 95192 64803 -65149
10504 -65149 51434 99668 30997 13951 15270 -88604 -91862 45634 107280 -56353 -255223
10493 -255223 -288334 -236424 -168567 -112344 45690 30903 -114427 -225727 -405413 -391322 -269802
10482 -269802 -301477 -453554 -590235 -627487 -613664 -564614 -525524 -239662 142026 190857 79100
10471 79100 -10324 71827 48477 51098 -52339 -224576 -213914 -102507 35396 166338 200290
10460 200290 71806 -115346 -250635 -207324 -202156 -131520 -77783 -209345 -193838 -72909 91197
10449 91197 338776 462825 270089 101354 45949 -109327 -204181 -390936 -437854 -380369
10439 -380369 -338723 -569080 -806725 -726458 -471747 -218018 -123692 -191925 -406574 -480685
10429 -480685 -535256 -491533 -219963 142880 132569 77755 209086 232832 242865 256560 63695
10418 63695 -8796 -69895 -178627 -162589 -159469 -267386 -340344 -331554 -292771 -174231 -124336
10407 -124336 -112438 -203244 -173241 -30030 15011 114039 258773 310286 438074 550931 451349
10396 451349 360606 191043 39733 1558 93554 180416 174787 160602 115682 24704 49
10385 49 230777 312229 178386 106978 -57086 -137293 -100818 -49943 -16191 -5241 -36196 -229658
10373 -229658 -438562 -486802 -389769 -300556 -275545 -364653 -304124 -214709 -266028 -225313 -316155
10362 -316155 -514441 -426102 -179015 -164148 -348242 -347777 -121317 -68192 -132350 -68565 147157
10351 147157 43881 -239773 -278616 -146382 -148913 -172539 -213132 -101425 171871 358027
10341 358027 311550 236760 258398 266116 145218 11650 -150162 -350320 -360699 -196240 -162300
10330 -162300 -155274 6276 -40558 -194793 -47668 159820 140539 321391 473607 499601
10320 499601 376865 184566 45859 -87733 -140176 -165650 -285019 -399223 -432874 -490605
10310 -490605 -506246 -446420 -473592 -437904 -254821 -43394 146272 233060 324209 187690 -23724
10299 -23724 5462 37404 89291 135561 73131 -52980 -85252 -41894 -77044 -118067 -135227
10288 -135227 23023 164152 55470 -205468 -298793 -404339 -492883 -481386 -335888 -227278
10278 -227278 -108716 179175 324519 194934 242157 400783 403180 234807 -17509 73370
10268 73370 326671 468289 328173 15791 -186169 -162185 -162461 -306385 -408139 -290769
10258 -290769 -33221 122357 41213 5008 65132 105891 70479 -68043 -336688 -551122
10248 -551122 -605152 -477015 -53093 267079 320484 191827 18204 -229218 -445486 -544374
10238 -544374 -396503 -71172 70095 133692 100996 126332 93287 181900 338102 345191 70582
10227 70582 -187488 -193018 -242497 -237167 -218079 -135945 -110671 -168910 -72438 -15571 99751 440601
10215 440601 651558 634280 405668 119204 -199032 -450147 -461894 -220216 102617 326620
10205 326620 317332 376813 514691 572813 462052 340667 26714 -43249 456847 647871
10195 647871 482638 218756 -137415 -205869 23222 172281 338211 299693 142116 93038
10185 93038 -31877 -136056 -311954 -486710 -542276 -446212 -448331 -379014 -68888 99825 159916
10174 159916 333345 485968 343921 205886 453109 590046 360988 104003 -2248 12582
10164 12582 24453 -150878 -711789 -982534 -877076 -953818 -844126 -538059 -457024 -403552
10154 -403552 -341433 -113902 35762 87678 175174 8126 -181618 23711 301920 308440
10144 308440 179870 173206 108940 178356 343417 304560 330653 512110 376904 244483 394528
10133 394528 347382 366577 305275 237670 272722 400114 622484 632684 515183 431465 465678
10122 465678 491818 469217 639937 975660 1149300 1298330 1488071 1836305 2227857 2548039
10112 2548039 3124559 4113914 5482130 6947895 8689680 10442607 10570376 8840172 6726780
10103 6726780 5058889 3871406 3111045 2411697 1919657 1740656 1702339 1432876 1080218
10094 1080218 1015185 1177441 1177111 949273 711637 643635 652326 574491 565794 741366 819474
10083 819474 636310 478724 246237 -23004 -117096 -197036 -245407 -176388 -25360 81197
10073 81197 48895 41894 -120762 -147324 -26250 -124901 -259630 -172746 148862 364338 540793
10062 540793 563116 410244 240553 148805 168643 116634 187594 260507 287119 128461 -39168
10051 -39168 -215618 -282531 -201314 -64379 -154875 -346425 -256842 54294 150871 89789 -77761
10040 -77761 -190818 -285477 -224808 -93690 -55563 52508 218180 245198 119072 81477 37439
10029 37439 29549 -3352 -35989 -99942 -271115 -208694 -42284 67279 50051 -78176 -89622
10018 -89622 -230578 -568361 -775476 -834880 -785122 -628341 -498765 -158957 132768 173093
10008 173093 125955 41907 -6907 -36383 -104158 -45969 103535 105234 158625 33942 -51242
9997 -51242 -188852 -434040 -465545 -373655 -240767 -187827 17399 119282 29460 -158594 -96594
9986 -96594 242015 515104 430936 231122 -78818 -265016 -244791 -182251 -211619 -141861 62792
9975 62792 185908 160228 -47381 -245728 -217869 -57617 192737 467284 461665 90192 -293297
9964 -293297 -478329 -339069 -251482 -351779 -398660 -252037 -238124 -308205 -454018 -483365 -344566
9953 -344566 -191835 -239621 -306990 -206757 -135976 -279824 -537592 -614571 -343645 -176133
9943 -176133 -360851 -428271 -161002 156568 288023 348759 362239 329303 202278 142697 254216
9932 254216 380528 250704 54256 45683 152037 95281 40795 -41583 -49647 2763 21409
9921 21409 86537 48825 -54313 -75169 -43633 -72044 -113723 -205344 -269332 -319650 -358076 -275297
9909 -275297 -113129 35492 121552 183424 187191 236771 481197 553093 205709 -135338 -337813
9898 -337813 -608046 -700308 -554209 -413843 -53893 159996 159951 194245 183491 31930 -188118
9887 -188118 -336397 -279311 -10760 138238 163968 242394 294550 338211 270600 -107818 -604766
9876 -604766 -791790 -699690 -461065 -214685 37592 190482 345132 492278 429458 209632
9866 209632 78473 42251 -69290 -167745 -207708 -221412 -260436 -307630 -247214 -133114 4723
9855 4723 112965 73575 -94126 -342533 -466152 -329125 -188689 -165255 -56165 -103064 -222741
9844 -222741 -48836 98928 28375 -113212 -169181 -333008 -488919 -442001 -277193 21110
9834 21110 220498 88587 -108947 -292976 -452678 -556722 -374895 -320030 -338150 -305779
9824 -305779 -380748 -470165 -268906 60933 58838 -169868 -322300 -334153 -387180 -388981 -363800
9813 -363800 -341879 -256797 -153320 -33285 142360 33524 -71408 -67955 -82414 -109446 -100926
9802 -100926 -127356 -439704 -586211 -493722 -205465 22219 74158 -18753 50033 351655 483680
9791 483680 458845 345859 312621 283543 2720 -124626 -22708 19374 80934 46442 -95986
9780 -95986 -143494 -137427 -192420 -122670 10235 229409 436835 469783 242117 32373 -114111
9769 -114111 -190902 -144025 -57514 -242843 -305262 -69158 97827 279483 483864 259725
9759 259725 -22992 -5907 -97080 -87886 -35908 -172049 -392414 -474098 -393913 -272179 -404771
9748 -404771 -435656 -328113 -232095 -161097 -8476 248048 464950 710082 678808 335901
9738 335901 81427 18464 -47751 -22246 175801 225515 198933 278282 399550 237930 81715
9727 81715 96690 280387 363878 422322 596603 589722 490860 432358 242922 51302 160713
9716 160713 549443 1106647 1841097 2929240 4526011 5820906 5370915 3814220 2528624
9707 2528624 1719845 1398625 1130410 781416 544820 476393 403758 337759 246185 104903
9697 104903 -20829 -158705 -165241 -77821 45673 -18596 -177488 -101846 -62777 -120412 -291409
9686 -291409 -440191 -277419 -146281 -122799 -158943 7622 286516 373696 264819 341057
9676 341057 425317 342499 203641 136535 79395 195784 85769 -50423 -263921 -445753
9666 -445753 -449661 -414423 -167855 38029 90256 152163 320250 547202 717124 803167 789935
9655 789935 665452 576031 636131 781759 1025425 1335584 1656631 1831693 2007996 2359238
9645 2359238 2905350 3697435 4430907 4797835 4566123 3905321 3156759 2590406 2046847 1712372
9635 1712372 1461429 1057006 649434 481655 584106 749664 762040 602567 491298 518222
9625 518222 497425 367474 189961 59289 -63180 -80005 33440 194831 514659 499849
9615 499849 198246 106135 173753 251622 130780 -54811 -122616 -95280 -32109 -35046 -118495
9604 -118495 -230783 -239518 -314651 -443040 -401771 -393949 -317861 -154650 -148858 -134001 -9575
9593 -9575 156038 96462 -95541 -144030 -57178 1822 -78287 -253544 -565712 -586445 -523695
9582 -523695 -555880 -589660 -465502 -322486 -223494 -109298 61464 139457 96336 41385 1254
9571 1254 -82168 -279988 -364838 -225082 87685 223848 185015 -59254 -186518 -365073 -515411
9560 -515411 -488171 -352580 -62012 264739 421663 306494 276837 188273 -158539 -250965
9550 -250965 -70918 87605 263029 292185 271134 153659 91241 107070 -29635 43587 -51890
9539 -51890 -113079 39917 90923 -47679 -82284 -124093 -246737 -431189 -697903 -603561 -357894
9528 -357894 -254811 -223063 -2841 60754 32437 29520 -58041 -73701 -134323 -9472 379280
9517 379280 617710 572788 383759 185915 64645 23610 -11498 -17029 -4337 126518 228642
9506 228642 325178 387356 412583 430403 295478 216549 8023 -212168 -97524 119301 139069
9495 139069 124914 187082 353664 465757 518601 427214 240177 77671 51246 170047 177815
9484 177815 165932 110557 -44120 -108327 -134974 -68278 32044 62485 5675 168069 315744
9473 315744 342257 312443 314271 478874 307601 50717 28889 124589 317562 224850 -67817
9462 -67817 -211179 5837 164009 45753 -63913 33882 281435 458695 272714 -186783
9452 -186783 -447287 -445716 -285816 -73834 220669 268572 -42744 -214206 -346831 -528879
9442 -528879 -484424 -285634 -104140 -13253 -45910 -227381 -448057 -671914 -732188 -701926 -593852
9431 -593852 -562884 -570747 -593841 -436460 -275530 -161625 -148976 -122946 134470 196030 -97539
9420 -97539 -310148 -292675 -304473 -363944 -489647 -522543 -195954 95440 167953 246308 265632
9409 265632 233460 119516 47444 68811 176053 134862 -106998 -329270 -372327 -261456 -237336
9398 -237336 -506788 -656939 -508053 -224640 40236 111451 195389 307981 225138 122981
9388 122981 149756 29220 47615 127612 125991 11998 3668 -54296 -246747 -437377 -467242
9377 -467242 -587465 -874368 -926780 -656232 -347597 -177739 -55537 -82237 -211398 -253478
9367 -253478 -91237 66219 9565 -147240 -82375 156807 458628 468775 214353 83208
9357 83208 195198 391201 576248 601171 460648 298482 268825 269166 270944 263542 265965 240539
9345 240539 314401 385560 333938 258922 192734 270212 346427 145381 -39423 -17780 207909
9334 207909 449267 438115 335739 209910 166624 98006 152313 137933 -60911 -186754 -209588
9323 -209588 -178081 -181652 -181551 -146814 -60108 20310 82112 208443 270598 102696 -155509 -215481
9311 -215481 -188357 -227637 -40771 260923 373640 385702 350390 380535 322806 43494 -295200
9300 -295200 -569500 -539278 -368085 -32289 335683 386433 379627 309035 234983 296207 429279
9289 429279 481046 380370 210169 21139 -317454 -368029 -58681 392323 544728 505042
9279 505042 473252 489186 612903 712339 739133 946974 1114337 1173738 1472360 1818820 1983707
9268 1983707 2193318 2855437 3830136 4848149 5642956 5737574 5101536 4128123 3400159 2951311
9258 2951311 2381962 1921972 1608869 1219368 696101 274684 25504 127388 416880 536175
9248 536175 495491 423452 350251 413073 475005 503838 553461 375301 230151 158279 65605
9237 65605 -9316 72668 152411 114462 87825 155671 390253 636982 666827 490954 267698
9226 267698 213848 251952 166773 -15724 -83687 205042 608684 777003 588797 334873
9216 334873 159626 14106 149336 174148 20986 -17794 8490 213164 475509 594453
9206 594453 356283 62422 102068 289589 375918 333868 311004 241297 283161 273215 94925
9195 94925 -5802 56135 -98823 -341128 -321504 -143715 -15940 234348 340385 437005
9185 437005 526260 520859 491071 427074 438447 485737 337254 108631 64612 127978 145896
9174 145896 127334 -64844 -267659 -347020 -227208 -120448 -257860 -298491 -267208 -192431 -127392
9163 -127392 -167605 -223346 -34279 254239 316465 286943 79896 3358 95398 199319 318331
9152 318331 169933 -17248 -82723 -90258 -179467 -351204 -426960 -299470 -446981 -503669 -268284
9141 -268284 26048 31683 -61897 -100499 -218182 -305591 -226790 -174730 -365567 -485365 -237861
9130 -237861 26693 50214 -102493 -310632 -452758 -440070 -364914 -304835 -215026 -160498 -143382
9119 -143382 -290845 -571065 -523088 -396058 -288152 -125777 135031 333670 353597 319689
9109 319689 414027 247264 62249 36469 59290 257734 292984 111682 -79355 -18229 275274
9098 275274 387952 451814 413232 198358 29480 -17801 -130347 -330457 -431716 -316385
9088 -316385 -267140 -214734 -219510 -114680 -56576 -104372 109386 108734 -140850 -97872 4604
9077 4604 203346 305142 306252 192979 112520 299989 352935 297984 290513 258077 118450
9066 118450 -30988 -159741 -6334 127665 -15335 -3595 79977 190575 151021 132047
9056 132047 363075 492659 634091 683578 525985 181574 836 -161534 -298289 -407143
9046 -407143 -570273 -384219 149160 328160 88018 -146572 -341690 -520762 -370986 -188558
9036 -188558 -180699 -221757 -298821 -270192 -209974 -196681 -162898 -151124 -205639 -296300 -321287 -287750
9024 -287750 -335817 -306592 -156104 -132190 -192090 -250959 -208904 -58074 -22812 -42916 -130165
9013 -130165 -123795 -136357 -57199 -17046 9953 117077 65716 30646 98626 197032 327411
9002 327411 394911 261060 229793 244210 254480 289666 324571 125297 -209534 -437696 -572186
8991 -572186 -638366 -735652 -727736 -640294 -514198 -388465 -254007 -164990 -197921 -181912 -240974
8980 -240974 -266768 -131640 -217454 -253579 -226669 -341170 -353530 -310008 -135852 -104822 -297236
8969 -297236 -257370 3060 46007 -165676 -351051 -432702 -536092 -457965 -436847 -318883 -30955
8958 -30955 32731 17937 29394 -151522 -384327 -488694 -357016 -268891 -315891 -372038 -166199
8947 -166199 -42020 -4437 28386 -115766 -239351 -346826 -383799 -346126 -236417 -143758 -353918
8936 -353918 -637811 -709077 -495828 -288760 -268983 -221801 -107438 71370 9756 -54785 -64864
8925 -64864 29961 102479 49885 49329 -91551 -255159 -251825 -250507 -251819 -340273 -552496 -644530
8913 -644530 -449714 -170256 -117002 -228558 -235110 -196060 -121312 -118978 -88797 -128768 -267198
8902 -267198 -381650 -450956 -341298 -263766 -81768 205695 265135 106897 -75959 -153483
8892 -153483 -127473 -11684 154996 66896 -257806 -406385 -404333 -411172 -402773 -228916 -107786
8881 -107786 -24884 31086 106837 43189 -142148 -265465 -247889 -150102 -60185 -69559 -187578
8870 -187578 -168529 -168128 -213944 -212722 -238498 -186780 117962 322535 227887 73561 212363
8859 212363 488513 703366 847368 881383 928305 1077778 1274779 1613917 1918284 2106820
8849 2106820 2371288 2695313 2882768 3048919 3496643 3772123 3839707 3758763 3390281 3070600
8839 3070600 2849606 2625346 2205856 1722209 1238568 1030807 911561 859391 894227 713168
8829 713168 534034 528585 472544 314211 147918 -66836 -126284 -112916 -164550 3443 134302
8818 134302 -85738 -265419 -251260 -259631 -145061 -75151 -138640 -241683 34686 420963 456161
8807 456161 242282 84623 -2578 -58437 -59695 -9567 116171 38667 -81729 -89093 -70574
8796 -70574 -182198 -379078 -493837 -421439 -255610 -146173 -134131 -180990 -180963 -9707 99328
8785 99328 135685 50567 -191023 -391936 -573037 -537978 -333542 -309402 -249513 -32439 139011
8774 139011 147308 150534 252720 428896 349356 172142 109410 -48365 -262779 -378172 -490337
8763 -490337 -379768 -273761 -275993 -177084 -221429 -178227 26331 58851 73011 173669 310983
8752 310983 534163 591681 454713 220444 169070 139089 235294 355353 321477 372851 595917
8741 595917 654482 396281 65082 -57289 -184036 -472658 -512359 -304901 80490 230095
8731 230095 117426 227852 470215 521887 373188 392618 386921 228553 98176 32414 151950
8720 151950 329771 419410 447367 361210 -21035 -311843 -390365 -365411 -310548 -74818 61389
8709 61389 242001 399774 331993 267417 262805 346732 355617 353094 268305 190492 191374 310508
8697 310508 444079 175220 -107250 -73645 -22706 -29355 -87241 -134941 -59471 -22973 125792
8686 125792 105840 -66157 -170334 -242939 -182270 48533 216518 93991 -58207 -85881
8676 -85881 -197205 -319715 -467810 -466384 -211289 -200201 -245423 -171324 38953 218826 130284
8665 130284 -47468 -203138 -367411 -457948 -571828 -556582 -463999 -552731 -731674 -708578 -488169
8654 -488169 -345814 -432723 -443127 -345389 -348281 -328914 -296336 -330989 -275103 -374088 -589860
8643 -589860 -687738 -582957 -451147 -364178 -181553 23135 -45713 -96146 -186951 -239713 -151811
8632 -151811 -143310 -57878 172993 255484 60899 -3040 216853 479131 450230 234947 124486
8621 124486 194276 253354 361025 397875 208326 54246 183297 317908 248744 -30935
8611 -30935 -181138 -235962 -260359 -226993 -188694 -53969 -185122 -361347 -438088 -488887 -447283
8600 -447283 -237253 -207673 -262657 -263550 -286810 -160503 -37397 -112923 -174491 -159534 -101458
8589 -101458 -83599 -37888 93693 -56502 -158867 -112951 -180197 -511239 -647276 -481091
8579 -481091 -226990 -130677 44989 353318 272272 13219 -110193 -311205 -522443 -567921
8569 -567921 -608401 -647740 -677436 -541692 -239377 -62720 -64873 -153137 -65209 -6816 56202
8558 56202 158798 40775 -110347 -200305 -136968 27667 41070 60249 15757 54645 140370
8547 140370 420182 600250 337796 141055 126394 -105037 -344440 -557178 -390054 -142978
8537 -142978 -22140 -86459 -87218 32072 115800 221857 232442 297770 195095 -15547 -342718
8526 -342718 -400418 -123244 -9027 -18275 -26815 -30711 139618 232987 71803 -207499 -302715
8515 -302715 -244798 -84743 -9285 -75780 -62345 -27631 43208 214538 284158 79518 -121290
8504 -121290 -103410 -136645 -163952 -102818 -30046 -107564 -336865 -464693 -487357 -450902 -364787
8493 -364787 -299523 -366074 -435974 -485304 -625660 -841275 -1029324 -940564 -809452 -622892 -439375
8482 -439375 -200315 -110772 -115789 -126207 -208649 -225168 -106708 95971 144000 106515 171081
8471 171081 141604 191521 408472 388280 244414 131016 -10566 -15431 366737 813448 816408
8460 816408 588132 453401 221944 64854 -122439 -175013 -81606 -70943 -44331 42689 181122
8449 181122 123910 -29021 -170091 -383226 -516180 -648188 -695345 -807334 -830371 -658297
8439 -658297 -534041 -324792 -144161 -226415 -111871 203996 252097 61600 -139570 -26778
8429 -26778 201606 326118 298854 173214 108432 146540 34191 43831 144611 82027 17504
8418 17504 -29019 -354 138258 311822 392381 427282 376812 402816 419494 459546 626724
8407 626724 618122 553191 471967 329599 201588 372105 626486 645558 648916 550938 289475
8396 289475 256154 371198 300266 208647 6258 -114013 -79440 79690 161185 215258 367689
8385 367689 390843 239953 186145 286898 183428 8363 -32695 37373 -30425 -31762 125556
8374 125556 -35081 -301664 -194055 -148155 -227027 -208589 -320339 -419280 -212864 34370
8364 34370 136281 -94927 -269442 -414715 -353287 -162537 -54748 47325 182373 151540
8354 151540 167964 198141 18272 -185188 -25416 121772 53035 137008 414329 453257 257279
8343 257279 70513 -132333 -331795 -313397 -61593 245063 304658 -4029 -209118 -147557
8333 -147557 -52911 75202 -89354 -189861 54209 140953 177981 91017 -5077 52922 191556
8322 191556 69695 -125827 -15795 322094 365876 161667 -89951 -398303 -491488 -528061
8312 -528061 -564400 -643170 -829455 -788802 -583398 -376501 -267743 -369193 -547452 -588743
8302 -588743 -353039 -181283 -162280 -191911 -250795 -269844 -271005 -143396 235776 272744 -51832
8291 -51832 -266464 -206808 -49018 -37978 -67055 -152037 -93802 92978 76625 -109192 -257545
8280 -257545 -302698 -132276 -116248 -134735 176814 293270 126527 -108255 -135408 23182
8270 23182 42541 239114 265501 14058 -178922 -89011 -56856 -26940 150910 84358 -125686
8259 -125686 -190420 -314106 -319297 -188208 37631 268772 380866 259004 78965 117531
8249 117531 187659 224694 379040 394362 390578 543824 656328 684732 566489 391993 142435
8238 142435 -28542 104941 156784 17437 -122651 -113098 -85167 -26465 -2441 181843 501415
8227 501415 723357 730316 593271 441619 464217 478034 437265 480948 413874 433434 354850
8216 354850 231631 263591 241496 89691 -57512 -31663 -72906 -106462 34167 193460 315034
8205 315034 284088 313694 357914 436916 388484 314175 291313 97022 -26288 32618 136559
8194 136559 143269 30372 -46762 114209 354608 507435 552530 313329 -21844 -46676 138969
8183 138969 297091 474291 727038 880140 913426 1124232 1544200 1841089 1873036 1711360
8173 1711360 1844615 2302726 2991214 3851571 5055394 6846427 8916829 8870156 6313315
8164 6313315 4093801 2819287 2233024 1945457 1781928 1560001 1286163 1101322 1104685 1070471
8154 1070471 1034810 952918 769433 774433 851851 763254 536308 559152 594631 530947 490605
8143 490605 372390 235582 190946 178643 197321 236993 280721 313981 479879 421848 248384
8132 248384 217819 301427 398871 450355 397245 153517 -39179 17573 277538 565280 776313
8121 776313 941116 1187028 1436931 1609457 1885241 2420758 3123732 4007027 4873552 5789398
8111 5789398 6240577 5906399 4979560 4024196 3333119 2647096 2135943 1842841 1557142 1224933
8101 1224933 985839 1017904 1191550 1187692 1233174 1235057 1035449 818502 801089 958358 1077578
8090 1077578 1113918 1076522 946612 848567 802307 684056 446677 349683 392010 271023 134713
8079 134713 163817 220669 297832 386058 580049 798177 934223 967869 1008876 1155505 1115324
8068 1115324 1112999 1272969 1357774 1660027 2169415 2742407 3405158 3886932 4528046 5153336
8058 5153336 5230586 4901736 4415207 3739830 2872850 2194079 1817640 1596020 1563984 1765365
8048 1765365 1888106 1740318 1468362 979386 530419 382761 340093 264861 142442 68492
8038 68492 2004 410 99768 48998 -82053 -205884 -224888 -301061 -301304 -183989 -202408 -189385
8026 -189385 -78009 -145366 -355311 -295957 -5211 197968 223809 314410 517464 631088
8016 631088 558390 428814 253421 78731 35241 134134 167447 221610 416785 362700 160448
8005 160448 71121 -31637 -94376 89490 227015 269048 284984 439091 601191 485805
7995 485805 353208 513239 676194 600297 392384 364443 500697 334789 43056 -119682
7985 -119682 59001 160131 125920 61323 24158 237018 409267 337984 291080 248820 52329
7974 52329 76576 231900 151449 36390 -118232 -122712 -10859 -109928 -204863 -60850 128987
7963 128987 106821 -147343 -358615 -201732 -62437 -32501 119500 329680 239969 106145
7953 106145 77450 233507 198158 49493 80777 72371 52619 174812 308357 272133 123453
7942 123453 63936 113257 97395 50788 175892 233062 227399 219429 -28694 -408022 -400404 -295993
7930 -295993 -236386 -177098 -170270 -188191 -117893 89758 286717 266775 159065 153432 115263
7919 115263 -63215 -289521 -345982 -365442 -257378 75487 362814 545582 506214 454187
7909 454187 622695 544836 451009 403200 553747 635964 580474 393484 154802 212220 551904
7898 551904 675159 349297 -16185 8066 170897 93230 -9606 21926 117324 171674 199272
7887 199272 154005 55529 122939 366236 442077 404669 222742 227541 358055 415312 329626
7876 329626 127537 136977 295924 262360 -50244 -337238 -362639 -115766 71446 6304 -219979
7865 -219979 -434738 -586188 -554638 -280844 -65165 64633 323613 397228 381764 371379
7855 371379 432770 491899 369930 176917 60255 55024 65876 219374 122153 -255393 -267102
7844 -267102 -187734 -141745 78266 206471 394777 550945 561488 551600 352018 245187 302025
7833 302025 158275 -46942 57576 166883 111713 -179630 -441756 -552007 -678034 -500944
7823 -500944 -130392 86877 -79401 -237121 -84558 -6262 -81916 -187308 -179473 -78709
7813 -78709 65332 203494 60698 -137621 -241869 -134498 85197 287162 185556 -54781
7803 -54781 -263839 -307386 -32040 258674 135315 24783 -72089 -213671 -6124 192923
7793 192923 266687 274835 146881 43994 30395 -61237 -225370 -308596 -39986 192667 317882
7782 317882 435428 562008 428575 252991 91987 15269 115870 76258 -145976 -181328
7772 -181328 -221357 -198922 -209686 -178607 317955 716183 727276 565667 263314 151070 -9152
7761 -9152 -12442 -64861 -316013 -212267 -15026 242709 572403 622258 380315 299400 457688
7750 457688 521631 344818 193734 93078 18028 -19952 -98631 -193227 -316198 -319812 -413560
7739 -413560 -477272 -465115 -363275 -405623 -376953 -167126 -78340 -214833 -369027 -191696 88418
7728 88418 237721 19293 -332470 -377533 -331317 -165216 74860 76748 69500 162822 193132
7717 193132 141939 -68268 -237187 -274895 -241952 -200416 47001 209945 -7325 -168659
7707 -168659 -164203 -23431 163881 177621 272927 275035 223225 150745 129172 102025 -107584
7696 -107584 -66828 135955 191435 234117 137046 -2110 -1879 87379 252788 375553 345889
7685 345889 208203 154598 12756 -74327 -37747 -118865 -347790 -452531 -253297 -17153
7675 -17153 -28096 9476 4590 61429 94993 -25170 -300055 -567592 -456199 -354950 -278052
7664 -278052 -217649 -176997 122227 312751 197500 52102 -32524 -308852 -442392 -589078
7654 -589078 -757760 -608706 -264827 -190844 -257181 -383387 -593713 -494851 -331440 -182823
7644 -182823 -157010 -343595 -398445 -176119 46873 147882 154361 139609 225205 212821 226697
7633 226697 425569 707485 798414 765551 700000 540208 487634 516861 369618 193560 132507
7622 132507 290515 444650 200324 -272779 -317010 -37639 26233 -56704 -93205 -50852 279440
7611 279440 388891 330146 248691 21010 -71336 -181214 -229278 -291981 -396298 -429822 -317083
7600 -317083 -219282 -53883 214035 355041 614592 755505 511332 394173 381829 260547
7590 260547 183894 186003 305280 337224 297804 211225 40662 -97690 45905 132833 -66830
7579 -66830 -359653 -396937 -265370 -314564 -600913 -715477 -536338 -360675 -448551 -486285 -464045
7568 -464045 -368148 -336402 -381801 -448802 -621225 -638996 -482099 -360204 -245820 -353314 -365295
7557 -365295 -188363 197658 357458 316377 286258 455037 519739 467457 611551 720549
7547 720549 627524 407394 220808 37369 35319 10354 19878 65873 -69931 -69352 55675
7536 55675 61314 58394 1821 -162430 10639 215369 221021 324627 197860 168851 219869
7525 219869 316162 438440 521299 552312 457970 453769 718377 918668 1108421 1219066 1407387
7514 1407387 1863544 2498931 2927626 3125502 3586541 4018288 3939068 3613715 3273391 2934044
7504 2934044 2635522 2428311 2257102 1977317 1745553 1517511 1150260 779421 597474 366259
7494 366259 359320 477280 460165 404682 262601 367599 469898 490059 371802 407435 457626
7483 457626 485898 434942 400406 355551 332379 224665 158758 100242 176229 301878 202815
7472 202815 92979 -8419 52990 155461 318112 471771 476361 383359 193815 -77138
7462 -77138 -331062 -311162 -138597 -79432 -130534 -117779 -63121 -110809 -228920 -267896 -361401
7451 -361401 -311477 -266874 -331445 -338942 -89083 -145749 -296898 -167134 -261824 -398904 -339498
7440 -339498 -184382 -105496 28031 245174 210375 265561 352748 307060 182432 -77089 -306952
7429 -306952 -159375 123009 181527 151084 -32973 -215458 -253288 -129492 -43811 -29496 87194
7418 87194 -104384 -467451 -351826 -155098 -141234 14762 296151 200226 181630 154021 58060
7407 58060 -120033 -317928 -480471 -469772 -244842 137274 81121 -289497 -555027 -354286
7397 -354286 -124615 166729 399360 209481 -129566 -240672 -157599 8138 20224 -41534
7387 -41534 154930 127308 48389 113544 176949 160886 295388 327820 412723 415352 93290
7376 93290 -503040 -857130 -712931 -498318 -282939 -140535 -177145 -99251 -17424 41566 141963
7365 141963 297253 241426 222192 130283 -77925 -8664 82287 96061 156733 299769 315526
7354 315526 220148 86373 -55964 -150916 -117148 -132686 -235400 -270641 -236437 42042 287939
7343 287939 316315 298588 261923 133816 131907 56795 -11831 8477 50022 115004 115333 80110
7331 80110 19231 -60837 25455 174766 333320 505532 418121 179732 -19993 -35168 -92510
7320 -92510 -297432 -434270 -376109 -273495 -171019 -264330 -340629 -65790 215730 129875 29034
7309 29034 59319 -42588 -94611 3938 187958 221203 10391 -28644 150226 236374 187717
7298 187717 45298 -83672 22639 312431 256648 213959 283943 159168 33122 124694
7288 124694 171956 49151 -164554 -257253 -252893 -212321 -100175 25301 50251 216571 357320
7277 357320 366404 251168 1430 -101001 102747 211341 189893 365587 594792 802477
7267 802477 774278 601553 594581 631915 345234 158866 -74227 -276039 -123295 185641
$$ [...]
##END NTUPLES=NMR SPECTRUM
##END=
