##TITLE=C13_SL35-Dau(f5)
 CDCl3, 20400 sc

 9.12.2021
##JCAMPDX= 6.0         $$ Bruker NMR JCAMP-DX V2.0
##DATA TYPE= NMR SPECTRUM
##DATA CLASS= NTUPLES
##ORIGIN= UXNMR, Bruker Analytische Messtechnik GmbH
##OWNER= root
$$ XWIN-NMR		Version 3.5
$$ Fri Dec 10 11:00:21 2021 Russian Standard Time (UT+4h)  she@DPX200
##.OBSERVE FREQUENCY= 50.327896
##.OBSERVE NUCLEUS= ^13C
##.ACQUISITION MODE= SIMULTANEOUS
##.ACQUISITION SCHEME= undefined
##.AVERAGES= 20401
##.DIGITISER RES= 17
##SPECTROMETER/DATA SYSTEM= spect
##.PULSE SEQUENCE= zgpg30
##.SOLVENT NAME= CDCl3
##.SHIFT REFERENCE= (INTERNAL, CDCl3, 0, 225.239)
##AUDIT TRAIL= $$ (NUMBER, WHEN, WHO, WHERE, WHAT)
$$ ##TITLE= Audit trail, XWIN-NMR		Version 3.5
$$ ##JCAMPDX= 5.01
$$ ##ORIGIN= Bruker BioSpin GmbH
$$ ##OWNER= she
$$ F:/spectra/data/she/nmr/c13/1/pdata/1/auditp.txt
$$ ##AUDIT TRAIL=  $$ (NUMBER, WHEN, WHO, WHERE, WHAT)
(   1,<2021-12-10 10:58:31.09 +0400>,<she>,<DPX200>,
      <created by zg, POWCHK disabled, PULCHK disabled
       terminated by command 'halt'
       configuration hash MD5:
       00 E9 B6 7A A2 85 ED C7 34 08 36 98 17 FE 4E 26
       data hash MD5: 32K
       F3 60 48 47 78 68 F3 56 DF 85 2C E9 25 DD D6 ED>)
(   2,<2021-12-10 10:58:35.89 +0400>,<she>,<DPX200>,
      <Start of raw data processing
       efp BC_mod = 2 LB = 1 FT_mod = 6 PKNL = 1 PHC0 = -323.9976 PHC1 = 32.96237 SI = 32K 
       data hash MD5: 32K
       B0 B2 D6 4B C1 CC 7E 41 51 02 1B 27 36 76 69 F9>)
(   3,<2021-12-10 10:58:40.14 +0400>,<she>,<DPX200>,
      <abs ABSG = 5 
       data hash MD5: 32K
       0A 39 21 D0 A5 35 0B A8 15 11 2C 2F A7 B3 D5 EB>)
(   4,<2021-12-10 10:59:18.56 +0400>,<she>,<DPX200>,
      <pk PHC0 = 4.257061 PHC1 = -6.2 
       data hash MD5: 32K
       A9 33 07 AD 96 26 25 D8 37 28 30 E2 DB CB 52 9A>)
(   5,<2021-12-10 10:59:21.85 +0400>,<she>,<DPX200>,
      <abs ABSG = 5 
       data hash MD5: 32K
       D9 67 24 E9 29 CE 55 08 A9 A2 64 95 2F 40 AD 82>)
$$ ##END=
$$ 
$$ hash MD5
$$ 72 99 F8 52 59 F4 2A 0F 2C 8C 73 DD 8C 2D A3 C5
##$RELAX= 
##$RELAX= 
##$RELAX= 
##$RELAX= 
##$RELAX= 
##$RELAX= 
##$RELAX= 
##$RELAX= 
$$ Bruker specific parameters
$$ --------------------------
##$DU= <F:/spectra>
##$EXPNO= 1
##$NAME= <c13>
##$PROCNO= 1
##$TYPE= <nmr>
##$USER= <she>
##$AMP= (0..31)
100 100 100 100 100 100 100 100 100 100 100 100 100 100 100 100 100 100 
100 100 100 100 100 100 100 100 100 100 100 100 100 100 
##$AQSEQ= 0
##$AQ_mod= 1
##$AUNM= <au_zg>
##$AUTOPOS= <>
##$BF1= 50.322709
##$BF2= 200.13
##$BF3= 50.322709
##$BF4= 500.13
##$BF5= 500.13
##$BF6= 500.13
##$BF7= 500.13
##$BF8= 500.13
##$BYTORDA= 1
##$CFDGTYP= 0
##$CFRGTYP= 5
##$CHEMSTR= <none>
##$CNST= (0..31)
1 1 145 1 1 1 1 1 1 1 1 1 1 1 1 1 1 1 1 1 1 1 1 1 1 1 1 1 1 1 1 1 
##$CPDPRG= <waltz16>
##$CPDPRG1= <>
##$CPDPRG2= <waltz16>
##$CPDPRG3= <>
##$CPDPRG4= <mlev>
##$CPDPRG5= <mlev>
##$CPDPRG6= <mlev>
##$CPDPRG7= <mlev>
##$CPDPRG8= <mlev>
##$CPDPRGB= <>
##$CPDPRGT= <>
##$D= (0..31)
$$ [...]
##$SUBNAM4= <"">
##$SUBNAM5= <"">
##$SUBNAM6= <"">
##$SUBNAM7= <"">
##$SUBNAM8= <"">
##$SUBNAM9= <"">
##$SW= 239.972175391363
##$SWIBOX= (0..15)
0 1 3 0 0 0 0 0 0 0 0 0 0 0 0 0 
##$SW_h= 12077.2946859903
##$TD= 32768
##$TD0= 1
##$TE= 0
##$TE2= 300
##$TE3= 300
##$TEG= 300
##$TL= (0..7)
120 120 120 120 120 120 120 120 
##$TP= (0..7)
150 150 150 150 150 150 150 150 
##$TP07= 0
##$TPNAME0= <>
##$TPNAME1= <>
##$TPNAME2= <>
##$TPNAME3= <>
##$TPNAME4= <>
##$TPNAME5= <>
##$TPNAME6= <>
##$TPNAME7= <>
##$TPOAL= (0..7)
0.5 0.5 0.5 0.5 0.5 0.5 0.5 0.5 
##$TPOFFS= (0..7)
0 0 0 0 0 0 0 0 
##$TUNHIN= 0
##$TUNHOUT= 0
##$TUNXOUT= 0
##$USERA1= <user>
##$USERA2= <user>
##$USERA3= <user>
##$USERA4= <user>
##$USERA5= <user>
##$V9= 5
##$VALIST= <valist>
##$VCLIST= <CCCCCCCCCCCCCCC>
##$VD= 0
##$VDLIST= <DDDDDDDDDDDDDDD>
##$VPLIST= <PPPPPPPPPPPPPPP>
##$VTLIST= <TTTTTTTTTTTTTTT>
##$WBST= 1024
##$WBSW= 4
##$XGAIN= (0..3)
0 0 0 0 
##$XL= 0
##$YL= 0
##$YMAX_a= 140526847
##$YMIN_a= -36113503
##$ZGOPTNS= <>
##$ZL1= 120
##$ZL2= 120
##$ZL3= 120
##$ZL4= 120
##$ABSF1= 225.2393
##$ABSF2= -14.75813
##$ABSG= 5
##$ABSL= 3
##$ALPHA= 0
##$AQORDER= 0
##$ASSFAC= 0
##$ASSFACI= 0
##$ASSFACX= 0
##$ASSWID= 0
##$AUNMP= <proc_1d>
##$AZFE= 0.1
##$AZFW= 0.5
##$BCFW= 0
##$BC_mod= 2
##$BYTORDP= 0
##$COROFFS= 0
##$CY= -3
##$DATMOD= 1
##$DC= 0
##$DFILT= <>
##$DTYPP= 0
##$F1P= 0
##$F2P= 0
##$FCOR= 0.5
##$FTSIZE= 32768
##$FT_mod= 6
##$GAMMA= 0
##$GB= 0
##$INTBC= 1
##$INTSCL= 4.134877e-10
##$ISEN= 128
##$LB= 1
##$LEV0= 0
##$LPBIN= 0
##$MAXI= 10000
##$MC2= 0
##$MEAN= 0
##$ME_mod= 0
##$MI= 0.1934396
##$NCOEF= 0
##$NC_proc= 2
##$NLEV= 6
##$NOISF1= 120.0001
##$NOISF2= 80.00006
##$NSP= 0
##$NTH_PI= 0
##$NZP= 0
##$OFFSET= 225.2393
##$PC= 1.4
##$PHC0= -319.7405
##$PHC1= 26.76237
##$PH_mod= 1
##$PKNL= yes
##$PPARMOD= 0
##$PSCAL= 0
##$PSIGN= 0
##$REVERSE= no
##$SF= 50.3226000198075
##$SI= 32768
##$SIGF1= 140
##$SIGF2= 120
##$SINO= 11.81781
##$SIOLD= 32768
##$SREGLST= <13C.CDCl3>
##$SSB= 0
##$STSI= 32768
##$STSR= 0
##$SW_p= 12077.2946859903
##$SYMM= 0
##$S_DEV= 0
##$TDeff= 32768
##$TDoff= 0
##$TI= <>
##$TILT= no
##$TM1= 0
##$TM2= 0
##$TOPLEV= 0
##$USERP1= <user>
##$USERP2= <user>
##$USERP3= <user>
##$USERP4= <user>
##$USERP5= <user>
##$WDW= 1
##$XDIM= 32768
##$YMAX_p= 429148199
##$YMIN_p= -9838353
$$ End of Bruker specific parameters
$$ ---------------------------------
##NTUPLES= NMR SPECTRUM
##VAR_NAME=  FREQUENCY,     SPECTRUM/REAL,   SPECTRUM/IMAG
##SYMBOL=    X,             R,               I
##VAR_TYPE=  INDEPENDENT,   DEPENDENT,       DEPENDENT
##VAR_FORM=  AFFN,          ASDF,            ASDF
##VAR_DIM=   32768,         32768,           32768
##UNITS=     HZ,            ARBITRARY UNITS, ARBITRARY UNITS
##FACTOR=    0.368581032318806, 1,           1
##FIRST=     11334.6273832426, 0,            0
##LAST=      -742.667302747745, 0,           0
##MIN=       -742.667302747745, -9838353,    0
##MAX=       11334.6273832426, 429148199,    0
$$ Real data points
##PAGE= N=1
##DATA TABLE= (X++(R..R)), XYDATA
$$ [...]
18075 552177 812952 906484 870906 617287 256261 382807 624288 432551 44067 -145120
18065 -145120 -443664 -473749 -397706 -956603 -1558814 -1696793 -1432942 -706749 -21509 289082
18055 289082 284364 125793 121424 100022 182505 256519 450213 596160 444785 184510 -117437
18044 -117437 -492020 -467469 -265725 -80055 -20679 282681 659818 876731 798393 378069
18034 378069 -56962 -181249 128560 285358 47535 406966 779319 490354 191295 135751
18024 135751 224204 119809 60937 362965 710406 890159 665981 153375 79832 369789
18014 369789 503307 583675 577385 -35201 -703630 -565148 -478639 -452018 -276996 -245776 -266881
18003 -266881 -212340 -212430 -292962 -172620 -59990 -159449 -208934 -92436 -157712 -109971 -118317 85745
17991 85745 522745 714727 665684 384770 235459 420747 368212 -398759 -747057 -518140
17981 -518140 -350703 -282799 -409537 -635576 -579672 -231608 -227783 -488190 -650446 -843037
17971 -843037 -711476 -590368 -470969 -12786 -19536 -315156 -350161 -264596 -287805 -126147
17961 -126147 172750 272016 -19095 -670389 -843607 -620822 -472970 -551259 -313382 -331414
17951 -331414 -488771 -459036 -359316 -108237 214090 180849 -161111 -506853 -550782 -337855
17941 -337855 -202074 39346 58475 -220022 -408347 -514916 -676254 -626167 -389504 145618
17931 145618 538519 526206 291157 448090 376254 333558 679999 859901 901267 1037588
17921 1037588 862979 614159 363848 172737 277586 388405 136032 -174695 -112611 296589
17911 296589 623835 674334 189466 -491452 -717228 -381537 -104833 103787 129496 23882
17901 23882 42019 256134 337430 101867 360677 878331 1018697 1203650 1159207 996777
17891 996777 635970 536882 582083 525834 392488 -18371 -398549 -412322 66932 746685
17881 746685 1071646 940030 649747 444544 351652 262847 196095 156723 102463 57225 -332746
17870 -332746 -901444 -992395 -958370 -752955 -705918 -967445 -1027359 -811361 -274181 405024
17860 405024 535159 772811 1229820 1405903 1029571 364677 26461 -26647 246224 649526
17850 649526 604948 341794 156753 -331748 -449186 -311827 -291176 -352402 -446950 -95502
17840 -95502 115578 197950 303770 203816 6604 -271243 -412304 -88789 239464 157904
17830 157904 -80241 -520294 -537978 -325909 -288018 -63964 1011452 1522665 996576 520529
17820 520529 115954 12329 324038 462036 533856 1055479 1304500 1275934 1339788 1094647
17810 1094647 856448 442220 -61757 277784 725024 895151 1007157 1011982 1143626 847544
17800 847544 234039 60257 -146866 -665748 -558903 -317033 -221426 -7275 5010 -313376
17790 -313376 -767542 -949406 -981094 -1011663 -971490 -715375 -509005 -466810 -725889 -723991 -479009
17779 -479009 -658380 -829859 -911107 -851673 -520284 -399577 -288005 -104855 -64627 -119140
17769 -119140 -356711 -339209 -61420 -177310 -189363 106629 279414 85295 196827 512550
17759 512550 803355 880540 828987 994826 1088339 1085516 880089 862880 997430 1008509 1090081
17748 1090081 1167541 1374304 1309923 1111478 1211488 1217071 951211 454789 -102596 238082
17738 238082 712211 669909 569080 501827 470209 302962 86625 269470 707088 924059
17728 924059 1084719 1275524 1181209 885888 779768 741788 383799 -70800 -633181 -681738
17718 -681738 -233745 179342 390937 307229 182045 -138848 -107626 162485 325724 494357
17708 494357 361845 59409 -41119 -231081 -245659 123883 337077 320209 235739 90536
17698 90536 129331 537525 799497 1057362 1275382 786148 46223 -227373 -318006 -199859
17688 -199859 211573 588997 773507 772680 156342 -364056 -749504 -1054202 -1003767 -871748
17678 -871748 -508673 -348258 -319553 -374648 -297409 155216 686579 756460 692527 523930
17668 523930 321139 238614 260881 269064 222518 691131 702422 429828 401930 76009 -270404
17657 -270404 -291000 -110174 91043 235420 302968 366475 604859 843875 781248 481505
17647 481505 302515 247658 348375 22211 -417029 -345358 -307977 -346753 -385824 -220810
17637 -220810 -280272 -314381 -408878 -491558 -600988 -823316 -769289 -359944 -23113 182867
17627 182867 221983 432673 345391 56713 -246626 -568574 -693917 -1158578 -1514084 -937302
17617 -937302 -4666 538937 671625 428333 201856 543430 1152430 1173034 915297 1087223
17607 1087223 1556164 2110283 3025668 3934741 4887481 5406841 4498527 3231352 2270823
17598 2270823 1480271 985829 662561 457549 344146 351423 510365 624613 670549 540892
17588 540892 610951 717976 869212 678850 470997 600527 744816 915858 1259815 1941505
17578 1941505 2874971 4165185 5159458 4683114 3707329 2809004 2350299 2177247 1905512
17569 1905512 1441488 1060059 985864 915832 909832 859025 773443 336938 279980 -79964 -470067
17558 -470067 -583347 -293189 37893 -82586 -122345 122306 275803 502534 742869 740242
17548 740242 571956 201478 -166794 133347 482995 500230 527300 719954 439724 238260
17538 238260 208916 223376 417949 1019200 1589593 1282957 561931 183609 -75163 32664
17528 32664 175829 306620 361765 286801 -79200 -431670 -977004 -1058521 -517980 -253737
17518 -253737 -38405 135845 -239469 -588030 -441479 -304928 -707479 -1491725 -2095658 -1933679
17508 -1933679 -999779 -273213 -65422 588645 1216697 1338136 1277638 934291 575215 527956
17498 527956 432250 367837 532126 323511 155487 525027 844299 688881 17450 -650669
17488 -650669 -671887 -238128 96255 220763 398532 649760 1101279 932790 285065 -129016
17478 -129016 84447 54342 -140125 -334142 -563455 -701858 -491117 -22776 192603 288282
17468 288282 252113 348701 325914 94428 16850 -82781 -217942 -178150 -196198 -119534 -72913
17457 -72913 -165016 -223060 -154612 -176150 -534426 -733533 -727164 -647528 -357662 166491 366957
17446 366957 175404 402358 746252 988238 912399 551616 662323 880412 787668 256843
17436 256843 -287844 -459972 -452941 -340613 264298 471625 261122 48146 19507 30092
17426 30092 50820 -3782 19610 149217 232424 196690 282554 566210 673593 447104 195385
17415 195385 41884 155279 134228 -47163 -404645 -575638 -147476 112245 -90686 38530
17405 38530 231580 440061 523704 662535 304769 20864 90053 11967 -474036 -540593
17395 -540593 -65142 -114464 -4696 184400 281670 228337 160763 149763 199258 698092 681636
17384 681636 378559 609620 966308 589864 -54298 -162523 -222601 -407139 -698994 -462570
17374 -462570 -311217 -774996 -1015491 -714758 35721 373582 -136350 -464566 -329079 -117421
17364 -117421 -221296 -417878 -520180 -367227 -132591 -253808 -418316 -355915 -74755 -33684
17354 -33684 -177738 -90538 -61705 -261607 -167561 -122485 -75691 197226 347954 -39425 -500022
17343 -500022 -634406 -609739 -620347 -592691 -527945 -434618 -565568 -862201 -1146400 -1437321
17333 -1437321 -1105429 -731054 -744622 -369283 -84880 -3114 238566 329953 -14805 -317975
17323 -317975 -538547 -734424 -931679 -1264618 -1341755 -1169691 -648102 -280185 -283691 -518997
17313 -518997 -494716 -143865 91691 169504 -81841 -395724 -468268 -158199 -334338 -748324
17303 -748324 -852847 -580774 -120209 105090 95735 37103 -300558 -591857 -514695 -402708
17293 -402708 -486544 -621350 -391398 75597 349733 319952 54972 -86333 -170582 -293690
17283 -293690 -156336 -55314 -89455 -223507 -305239 -326538 -500899 -833750 -491695 -161065
17273 -161065 39694 318841 454983 152482 -112298 -471169 -658079 -314511 11278 -120703
17263 -120703 -485977 -652382 -248775 -92736 -230168 -177957 123334 179339 -127815 -423534
17253 -423534 -546628 -364311 -314878 -398295 -338912 -392061 -372186 -250734 -180684 -306120 -393776
17242 -393776 -181329 181033 267360 88243 -71191 -66636 -529 191740 250827 241611 -2739
17231 -2739 -158064 -25063 -33077 -131419 -218247 -137227 -473431 -683531 -690719 -594285 -183114
17220 -183114 -127087 -180435 114400 402834 558288 760028 718185 478271 260377 -171598
17210 -171598 -332306 -576076 -958350 -1178911 -1395724 -1033499 -635750 -400873 -640971 -841502
17200 -841502 -931760 -1142527 -1170797 -877917 -761294 -496706 -340159 -266654 -341033 -339875 -87614
17189 -87614 -221519 -263793 36066 396053 472811 345935 374904 490928 484301 590846 302899
17178 302899 -6428 -1551 271320 48074 -273804 -45988 326516 196967 -88082 -79373
17168 -79373 206452 258935 4469 167797 753033 1543583 1605997 806086 59274 -378256
17158 -378256 -535447 -512274 -620964 -1013253 -951504 -837050 -463947 -55061 85772 -117519
17148 -117519 32356 464480 400098 320469 360761 393599 180985 -174403 -297423 -127599
17138 -127599 -297137 -637107 -826696 -877001 -681998 -361290 -124199 400828 930980 975266
17128 975266 873751 765840 369147 33258 255977 476701 565628 535533 -4443 -832834
17118 -832834 -1214704 -1071841 -811469 -611691 -457664 -283665 -305046 -285925 -267175 -361861
17108 -361861 -705851 -705890 -491058 -304599 178510 488356 817983 1153231 1144298 910094 299030
17097 299030 -137983 -58548 298095 437284 428056 703760 988054 1053052 789452 167104
17087 167104 -276403 -624869 -614919 -368079 -350198 -478823 -594578 -721286 -505387 10595
17077 10595 49392 -556713 -857081 -706960 -152618 437924 832791 842643 535968 520747
17067 520747 668055 778661 652550 346366 239073 398723 533091 424628 267214 322712
17057 322712 177527 -328317 -444777 -212833 -94547 118095 367854 733652 639902 175843
17047 175843 -273419 -705554 -1052648 -1140851 -906777 -467901 -439767 -321934 -81186 -347800
17037 -347800 -601273 -209651 253374 713416 1140684 1032593 981882 1054577 1252883 1215338
17027 1215338 582250 -132216 -564016 -796147 -982614 -925460 -629746 20499 278866 109859
17017 109859 -114305 -182251 -190938 -290439 -280290 -499230 -685048 -530530 -139400 -245359
17007 -245359 -740625 -621093 -407129 -246245 -115300 147788 530808 535836 362412 151052
16997 151052 -423803 -905909 -1055648 -728112 -22984 231362 103737 -5035 37536 120399
16987 120399 279636 328668 450656 360567 218954 257959 94985 87735 275369 297755 291245
16976 291245 150152 213102 637061 707579 150627 -223489 -170429 -302725 -482228 -231049
16966 -231049 225098 331382 96173 162960 393707 485446 561518 610033 919699 906429
16956 906429 580383 349783 515200 573461 520618 1096033 1632622 1296365 525601 -227672
16946 -227672 -573809 -792061 -774818 -468579 -149522 77252 -228640 -632286 -704100 -511539
16936 -511539 34236 293831 203448 333717 406133 219094 -203751 -337237 -463751 -615951
16926 -615951 -859646 -1095472 -1250456 -1271176 -830744 -461169 -271018 102867 412115 571949
16916 571949 486552 340939 471389 589238 576511 510807 375208 376649 723719 597731
16906 597731 -141025 -565518 -735190 -854056 -677083 -643037 -1036709 -1242280 -900877 -637937
16896 -637937 -171759 246109 248479 55278 34423 671967 1006173 642263 485023 699134
16886 699134 744112 97260 -312328 -125760 470477 798082 341315 -52143 -247523 -172079
16876 -172079 -53500 281333 746366 912644 898840 824919 578540 153963 -315093 -704365
16866 -704365 -918621 -837728 -518949 -321662 -420357 -524193 -516127 -452026 -447399 -550829 -565206
16855 -565206 -208264 -67566 29934 340173 672103 894842 649015 346631 -79683 -275126
16845 -275126 -337616 -76173 76824 402833 875511 858728 1245284 1744939 1863032 1573936
16835 1573936 674566 -47995 -42385 311877 611540 450604 270476 335721 152173 -171030
16825 -171030 -416673 -470731 -680494 -729780 -230041 168841 471757 661828 510267 262026
16815 262026 65220 -196821 -246921 -38596 -135197 -372447 -303684 -195654 -23733 349448
16805 349448 503736 387315 363493 309416 243529 83171 -70002 -128289 -245322 -237979 -220565
16794 -220565 -181728 -310817 -640974 -893622 -1214570 -883306 -144195 380121 567507 570740
16784 570740 912107 1117966 914292 428018 405591 708735 916647 1024437 1067032 933620
16774 933620 834000 736699 661674 616064 438039 427550 553967 898176 1080196 805526
16764 805526 580830 611172 911610 866591 484467 147866 236107 260826 259856 320035 59168
16753 59168 416366 668449 327027 -95267 -259415 -307752 -320100 -231544 -240711 -432410 -968844
16742 -968844 -1097165 -788199 -386571 -250811 -645094 -810509 -757281 -622289 -479294 -208419
16732 -208419 -100911 -406896 -736164 -818948 -879259 -1080496 -790652 -499273 -659557 -1039635
16722 -1039635 -946319 -332618 272129 604319 437459 -108837 -415362 -104857 4247 -25783
16712 -25783 54739 142661 -110761 -248283 -52487 -198322 -285952 -324902 -487026 -177243
16702 -177243 82918 -48508 -326328 -316276 -322439 -3167 574449 639583 377825 129341
16692 129341 112572 460358 347271 68683 -139560 17570 26146 -196673 -136893 31873
16682 31873 -146416 -308801 -352592 -448375 -394744 -12400 347921 -20194 -314095 -231176
16672 -231176 -97882 102558 328850 356171 200626 -55888 -327165 -587064 -360823 -274954
16662 -274954 -294626 -5122 -40264 -387970 -289310 82541 55912 -182218 -143946 -80014 -158113
16651 -158113 -372211 -378157 -148815 194422 267187 151514 181419 115544 295448 292330 -138666
16640 -138666 -300641 -157033 247663 592628 369152 35494 -86207 -171424 -405153 -167574
16630 -167574 300447 728899 813329 750394 638309 461585 340543 248515 -228497 -499084
16620 -499084 -318773 -436008 -548066 -412046 -244732 -263202 -241047 -103188 68484 197211
16610 197211 -61151 -360364 -234843 -20172 -250198 -532252 -474954 -471863 -540538 -628732
16600 -628732 -318049 275164 565977 645878 423927 203763 414981 482587 240074 -179401
16590 -179401 -384318 -528574 -575689 -271155 -65339 233561 411413 251888 8421 -379941
16580 -379941 -548197 -392796 165931 265672 11387 -363501 -717911 -605259 -436845 -458724
16570 -458724 -631152 -745957 -498619 -65809 112543 -97094 -472045 -883534 -903433 -790302
16560 -790302 -690526 -596101 -749630 -1020406 -781197 -161650 -149026 -449996 -528555 -213216
16550 -213216 105954 -184058 -353477 -95596 -172804 -30474 415520 557096 664721 855539
16540 855539 1133364 1280109 1022203 631593 286614 -52740 -241315 -73712 -47891 -177138
16530 -177138 103905 299293 278391 308562 242729 221611 21010 -142184 77794 485285
16520 485285 566983 433270 232352 68658 152888 302653 195263 219919 254476 636460
16510 636460 866886 886391 635053 346267 394377 412609 443393 317916 373680 268494
16500 268494 112366 298689 328644 -122630 -515809 -726023 -869633 -369348 180324 333267
16490 333267 202639 205424 -14405 -59496 -23564 -173786 -238897 -586261 -994039 -1051755 -719465
16479 -719465 -404494 -89896 -177081 -584387 -922585 -939156 -766042 -629147 -454569 -429170
16469 -429170 -545748 -838284 -870038 -474875 -131583 129983 102664 190657 -34429 -272215
16459 -272215 -369595 -319784 -314607 -390933 -401334 -73001 173490 139909 -137513 -314708 -193484
16448 -193484 185216 165761 -62742 -368002 -517826 -612529 -749128 -772786 -762857 -898925
16438 -898925 -797015 -459997 -177677 355566 745791 848507 825661 905770 1203067 1288255
16428 1288255 1140797 284614 -666386 -1076359 -985953 -618457 -353736 -449509 -474362 -271183
16418 -271183 -277289 -251348 -237386 -73653 97735 477545 700219 886815 741528 111503
16408 111503 -491250 -557904 -583829 -1126539 -1482142 -1011659 -357372 -393839 -945240 -965438
16398 -965438 -982708 -789474 -237175 -71061 84950 2336 -355223 -584684 -625191 -180756
16388 -180756 192649 298863 494090 617747 413464 160129 -94711 -248289 -99714 53632
16378 53632 150605 199225 211553 184293 429225 540359 504812 501699 193444 82838 368654
16367 368654 600341 1062360 1278766 948376 448333 231690 -91084 -515289 -723919 -850486
16357 -850486 -712025 -255110 -37415 -315049 -447195 -141913 9279 -52958 91451 260541
16347 260541 215938 74368 67614 -185248 -518888 -723247 -885720 -719241 -50224 59544
16337 59544 -151790 -188945 -228370 -335671 -220637 -311910 -496188 -599229 -286960 96046
16327 96046 1296 -132106 -336994 -418652 -424024 -228377 -81841 151843 454923 419901 106550
16316 106550 263213 579224 698333 992010 1149820 754191 622615 514905 22363 -168540
16306 -168540 -221545 -469703 -130287 262239 228323 208843 263934 406015 413689 354750 345798
16295 345798 -27597 -420462 -377575 -397782 -667382 -679855 -613348 -580739 -191122 120629
16285 120629 117108 452603 796658 903865 1038520 1104272 684842 128025 379885 246260
16275 246260 226749 720432 717221 881415 1037174 885392 548873 146290 -277855 -307942
16265 -307942 -34562 118732 155527 103078 414945 365281 213381 417567 392852 404826
16255 404826 316841 168651 131974 -274255 -413873 -670147 -685146 -554415 -538334 -349352
16245 -349352 -190526 64076 556380 548053 297828 139995 18119 -218547 -366975 -81656
16235 -81656 337811 908944 840800 362074 189331 293214 197801 361102 815415 1093094
16225 1093094 1087289 804028 635937 454711 194455 -163795 -252073 -183343 -189796 206419
16215 206419 659476 698621 862397 938252 828995 889034 551958 5734 -386946 -338010
16205 -338010 191405 918874 798399 167717 -159534 -429918 -288485 -101282 65806 -4576
16195 -4576 -136604 254102 581825 588640 666687 643930 541956 361694 366619 487109 763720
16184 763720 592900 238185 345142 715159 643496 95160 -289337 -217622 -336269 -402083
16174 -402083 -33730 235052 568039 350276 -81460 -232733 -484700 -961919 -958728 -659729
16164 -659729 -561284 -244573 66080 300139 329832 329504 118726 -29175 141255 522740
16154 522740 832676 903511 1081715 1078286 909661 1063097 1082332 661704 190456 -167668
16144 -167668 -493069 -278552 164903 345807 462348 694982 1203108 1498317 1513999 1161199
16134 1161199 911275 991742 1129826 1269677 1372905 1102821 1428851 2132474 3041150 4011546
16124 4011546 4940668 6101358 7062809 7438933 7007108 6177475 5033487 3841229 2694635
16115 2694635 1459829 808048 604263 820903 825320 315252 -65002 93312 371312 322812
16105 322812 -67735 -57254 464864 670608 671929 215150 -365303 -252886 201781 316695
16095 316695 230967 148055 2780 -60920 -39641 -362863 -747530 -595320 -350979 -286403
16085 -286403 -36376 160262 185544 188649 207597 318932 243007 -1275 -207317 -354661
16075 -354661 -813444 -1190530 -1061696 -1094626 -1326632 -1338198 -988166 -581196 -485692 -365363
16065 -365363 -31548 376487 551289 514212 736921 821201 592153 497176 465773 260548
16055 260548 -71099 -361060 -377938 211063 673711 612801 250266 41290 -391828 -645418
16045 -645418 -297549 397057 912057 1055839 1190627 1024554 864915 817825 894370 796896
16035 796896 603432 445273 230270 2123 26611 122591 -351601 -915093 -1079767 -1059754
16025 -1059754 -948020 -500801 242297 505823 625330 1067964 974191 411351 658463 548343
16015 548343 -54510 -624877 -822910 -859087 -934287 -525166 -284856 250204 387585 -103489
16005 -103489 -199160 -64609 -161925 103403 262981 403987 644296 603617 502993 380381
15995 380381 173490 -64776 -281497 -330583 -478260 -517340 -471130 -352483 -56612 138029
15985 138029 385643 563994 690311 811217 1115099 1382803 1371654 1249558 930387 596782
15975 596782 947102 1197102 1229985 1190539 969884 552218 193384 95580 236058 96535
15965 96535 -280127 -329875 -274163 -190762 -118642 -170604 -209927 -128087 163061 -23408 -343356
15954 -343356 -364714 245093 701799 338178 -93036 215692 949441 993661 691879 725690
15944 725690 833363 916159 748964 406465 359001 370036 181145 -113122 -265433 -50755
15934 -50755 162286 24225 -271948 -405059 -94317 226291 522167 656849 721552 872935
15924 872935 552987 -27116 -643151 -1114112 -1131148 -841339 -420093 252993 757297 557310
15914 557310 140813 -53986 -309559 -744301 -762927 -483342 -161242 -109682 -413753 -174316
15904 -174316 373058 777702 1124292 1424461 1879194 2235377 1996676 1545912 1474088 1190322
15894 1190322 764747 519480 587167 685260 603071 382724 218845 -10947 -184044 -4000
15884 -4000 -104596 -236243 -339045 -399420 -427612 -627433 -497829 -151270 -307541 -275091
15874 -275091 -126618 -149782 -152304 -141083 429768 623439 153158 -361243 -641877 -699356
15864 -699356 -596416 -123607 505672 893430 1144773 1104298 864375 732718 728398 770939
15854 770939 737181 400357 218327 216068 443424 483908 268811 -142473 -640578 -768571
15844 -768571 -979459 -791523 -282771 -139446 -171303 229991 440522 207358 -121563 -457136
15834 -457136 -657716 -793271 -1013427 -935775 -697992 -667402 -624826 -665827 -508620 -136900
15824 -136900 506957 1195742 1313917 619962 128684 26879 -348206 -658350 -661690 -263152
15814 -263152 238936 205020 -262584 -624459 -516857 -2973 389612 580119 840054 833389
15804 833389 670082 128414 -707898 -1209335 -1137636 -673542 -418837 -238675 248461 1104629
15794 1104629 1116822 351011 -412446 -782278 -747590 -552113 -554219 -752282 -545698 -322614
15784 -322614 -251535 -90364 -98428 -166813 -233395 -256588 -285781 -577865 -742457 -367269 213472
15773 213472 455920 233304 294657 230024 -176432 408075 903338 580046 237804 199419
15763 199419 314141 253504 430364 338193 59542 -243181 -760367 -894749 -442223 -254272
15753 -254272 -280190 -141399 26585 195655 128007 142730 406620 534832 252744 63367
15743 63367 131284 65319 -414366 -601103 -744522 -1052341 -925593 -715966 -661755 -485643
15733 -485643 -271354 -245290 -139415 72790 121089 141826 80166 248258 514830 826658
15723 826658 816894 806406 702556 709562 580751 -57944 -669224 -720168 -589525 -522527 -389751
15712 -389751 -288610 -174787 -97932 2307 57566 203073 244927 -151967 -594269 -662175
15702 -662175 -531253 -309463 -80106 98712 491632 543500 227546 129748 -127462 -187414
15692 -187414 -81309 -83321 -76609 -67948 -161904 -304468 -505240 -647024 -562670 -363549 -274642
15681 -274642 -405836 -556573 -846387 -1018578 -784057 -279433 329937 695081 619765 543982
15671 543982 492978 565383 652762 565543 427913 379676 174059 -301962 -705881 -860934
15661 -860934 -497939 -383142 -464213 -653627 -991782 -704927 -231756 -209129 -159112 -47916
15651 -47916 154613 352094 302353 28688 -309397 -751509 -732719 -549334 -559311 -200163
15641 -200163 272450 576890 572728 282873 -272661 -936291 -1191398 -1210769 -974027 -488041
15631 -488041 -210222 -129540 163664 600981 538620 473061 512146 301691 -107585 -553479
15621 -553479 -94669 490050 533295 403486 419742 419069 -105761 -320195 104208 633344
15611 633344 660197 611235 700043 479126 234190 165660 176437 355862 418822 277218 -141384
15600 -141384 -443258 -364640 61459 293896 410434 496066 384183 228348 -173273 -60135
15590 -60135 187696 50291 -226677 -400643 -615815 -794223 -890832 -844262 -696265 -530081
15580 -530081 -909350 -1188829 -1285112 -1269816 -749913 -74381 127500 -212208 -411656 -442718
15570 -442718 -901423 -1278442 -1419738 -1378391 -851971 -500555 -409416 -376267 -445537 -452334 -422904
15559 -422904 -372388 -402280 -347338 -195881 -336795 -452631 -252644 -192085 -48657 312093
15549 312093 406690 322263 356952 389050 532884 779400 635767 278070 109020 132070
15539 132070 18596 -13580 -98212 -337266 -479116 -462749 -257674 163095 764892 842132
15529 842132 503627 462670 663311 334813 -28784 -138331 -231835 -64255 307691 658250
15519 658250 541558 122777 -19188 -218647 -166362 58541 158687 144699 -102178 -310943
15509 -310943 -225731 -275145 -550486 -1047558 -1554509 -1486592 -986801 -329503 -41953 250754
15499 250754 591615 536236 551917 280712 -336869 -474187 -520303 -718388 -436087 -121404
15489 -121404 -93982 -220448 -590598 -961182 -1338375 -1387747 -997922 -490388 -456596 -766186
15479 -766186 -999887 -769792 -748826 -869328 -660411 -201985 247555 362053 3568 -278382
15469 -278382 -517984 -1070727 -1489054 -1298080 -631909 281117 480192 372821 147184 -63242
15459 -63242 80643 148017 -24213 -259635 -416282 -402735 -65597 209071 250778 77457
15449 77457 75454 291492 563908 511521 330829 228540 125586 357407 689052 1039333
15439 1039333 935459 327547 -90843 186308 446152 395329 139106 -317969 -291918 56898
15429 56898 121452 -31752 -71804 -381329 -757374 -1041774 -753861 -202387 -118633 206354
15419 206354 641762 273698 -213759 -495120 -588680 -718758 -775554 -752900 -472733 -638331
15409 -638331 -766970 -682162 -658135 -671169 -913569 -863262 -743091 -455964 -74276 95644
15399 95644 6310 -153723 -344780 -467777 -194011 -37805 -152898 -135117 -295740 -518394
15389 -518394 -301327 9267 222441 424754 505700 116557 -418928 -763801 -867728 -718433
15379 -718433 -181900 -202137 -802658 -887347 -455274 -12348 -53661 -89932 8788 -123363
15369 -123363 -400467 -696430 -423691 48236 333457 443560 -42048 -718035 -996266 -991348
15359 -991348 -784895 -341488 -61392 516784 800838 529587 342614 560872 914135 1510247
15349 1510247 1667332 1281225 943024 531049 -23809 -444424 -247574 553170 940418
15340 940418 1095440 1197622 1305317 1046338 608721 471008 194151 -241222 -399295 -450438
15330 -450438 -273798 16398 -9923 -9318 55555 -70445 -413410 -541473 -179970 62498
15320 62498 -228611 -555196 -580930 -465555 -496496 -339753 167299 575039 509617 6205
15310 6205 -195714 -262372 -316341 -430182 -549947 -693522 -897036 -1119823 -1223144 -1250513
15300 -1250513 -1451020 -1209151 -771227 -750624 -633575 -304847 -86124 19199 207189 242639
15290 242639 187797 99561 67750 438020 641607 306488 112651 -11360 -630364 -1199104
15280 -1199104 -1149998 -761432 -470934 -237898 804 374273 478857 199724 -489964 -1158137
15270 -1158137 -960271 -430255 -100490 -137507 -233042 -300757 -126847 299644 358923 434724
15260 434724 356342 13370 -355014 -348505 -370510 -370361 -298316 -530213 -718564 -785360 -943584
15249 -943584 -776765 -785513 -744471 -632879 47423 699449 672698 244621 -611451 -1289863
15239 -1289863 -1277423 -839982 -525110 -429517 -576557 -454026 119740 461442 329801 270302
15229 270302 91920 -23637 130018 329422 391617 484743 388602 -42697 -891643 -1430730
15219 -1430730 -1274449 -1181910 -1080825 -713368 -420091 -24291 -14083 -410731 -563908 -144128
15209 -144128 418135 744238 728446 453879 169613 -153514 -586533 -447205 7071 243610
15199 243610 74867 -21183 63023 443466 410545 1899 -231760 -375783 -693317 -648350
15189 -648350 -90056 530677 1013313 1051909 943828 379510 -342190 -635036 -338550 -249302
15179 -249302 -375424 -405946 -285513 -223062 5896 554707 1168589 1451910 1270139 1029456
15169 1029456 945818 610391 305922 13155 232128 509414 177533 -105821 4519 270197
15159 270197 600481 175925 -444231 -860575 -611104 -264723 -492724 -1153998 -1412297 -729461
15149 -729461 159615 895645 1087710 1122376 960862 523235 146269 -496667 -425965 80700
15139 80700 11747 249780 209216 -214791 -442954 -593146 -605581 -533629 -537947 -509278 -273295
15128 -273295 -564551 -1287791 -1508425 -1220835 -796250 -31929 501534 267295 -192892 -485028
15118 -485028 -390185 283126 477021 188914 328313 560292 419881 -66661 -96598 311361
15108 311361 701916 1019668 1151327 767924 304037 82052 -40632 -396401 -187869 214468
15098 214468 462698 635676 954085 1122600 706625 638198 907278 1052949 1053321 1219684
15088 1219684 1159911 838092 151841 -118194 86880 333715 86005 -305276 -769161 -977553
15078 -977553 -1014695 -1146733 -1518405 -1908706 -1817739 -1654624 -979320 -275231 -70089 -481715
15068 -481715 -782199 -464190 13544 -21553 -388189 -578488 -419789 17131 588709 1238831
15058 1238831 1449182 931298 558375 596421 280056 -39315 -156052 -194128 -110970 -129674
15048 -129674 -87226 -34597 149203 -26134 -431469 -719331 -739863 -748438 -414717 -128734
15038 -128734 -123291 -340001 -581500 -751208 -694204 -396483 -106043 166205 122435 182093
15028 182093 294397 218887 117269 173546 181357 18992 173343 472937 298192 36911
15018 36911 -44574 -501900 -815665 -782175 -944179 -912841 -706594 -657566 -358391 -376736 -809489
15007 -809489 -1192845 -1687153 -1849681 -1569108 -1449349 -1474615 -1469646 -1525360 -1691406 -1431634
14997 -1431634 -917775 -323641 107833 -294670 -716193 -638797 -327529 66957 300594 237535
14987 237535 167312 60627 -23045 -139951 -208417 109795 289260 247452 122326 -42951
14977 -42951 33994 27408 88605 625205 1179051 1324998 1273737 1230654 955181 809777 451026
14966 451026 60914 -37336 -279991 -641384 -844940 -815405 -685325 -671522 -810249 -1047665
14956 -1047665 -1143785 -1028058 -687155 -515362 -704288 -1049332 -1012785 -788008 -943598 -1233154
14946 -1233154 -1492167 -1070756 -364046 -68854 -87991 -138252 -103269 -102297 -415306 -682849
14936 -682849 -568013 -485314 -371217 -486959 -754795 -739306 -509071 -220556 -129672 -99482
14926 -99482 -103893 -131856 -139686 -78326 -182125 -402120 -304478 64843 -8539 -208730 -402408
14915 -402408 -328978 -145595 26359 399104 734738 1091154 1163782 890329 408805 166988
14905 166988 -258016 -723748 -742295 -339164 104490 -113294 -211756 -162644 -32355 31995
14895 31995 -94878 -434692 -431649 -128198 59537 404817 565244 415057 170503 -121251
14885 -121251 -579485 -805972 -387016 -322786 -737348 -898870 -489473 -378079 -651016 -793832
14875 -793832 -647239 -411433 -611813 -945688 -1142648 -1040519 -539921 -222055 -190908 -202466
14865 -202466 -260571 -218236 -255541 -386611 -529594 -488692 -102148 41431 110207 -57798
14855 -57798 -682857 -952986 -681802 -162111 80235 -113558 118545 282805 26924 -310506
14845 -310506 -537903 -415196 -180579 -137426 -321004 -241044 65023 162664 -58445 -317344
14835 -317344 -104154 88568 -156563 -565135 -704759 -786189 -856548 -786736 -1024435 -1218344
14825 -1218344 -1061630 -806110 -422993 291276 705396 582110 456224 188096 80594
14816 80594 171449 -54368 -327278 -547413 -537124 -197708 -207595 -540448 -820412 -543363
14806 -543363 -69487 79065 -57104 -415798 -631245 -340350 137189 439810 142687 -209498
14796 -209498 -265665 -538285 -490981 -118085 112555 -324436 -1019258 -1303969 -1238325 -1050169
14786 -1050169 -739539 -290276 76281 156333 158709 -54185 -357768 -425644 -306691 -315570
14776 -315570 112806 200890 -175174 -58154 85202 -332258 -582017 -478379 -13077 111704
14766 111704 53745 295704 420921 762188 789201 359697 -29451 -102598 -261469 -609765
14756 -609765 -1122699 -1409519 -934557 -737548 -811972 -684230 -561055 -861504 -1194220 -1113796
14746 -1113796 -815371 -407290 -268253 -216652 11428 123871 213679 65816 -231353 -498606
14736 -498606 -547215 -279361 32355 408578 570227 498017 406443 400851 446181 726011 1151638
14725 1151638 1035295 726223 677443 630324 718006 797901 1147729 1294462 1320690 973633
14715 973633 580573 759134 1103057 1277719 1178238 704881 526048 874463 751657 383483
14705 383483 525445 609304 192842 -4837 -164829 144391 538541 887575 743841 64540
14695 64540 -654938 -627485 -451388 -793213 -1073754 -1047593 -1144537 -1283528 -1260982 -920198
14685 -920198 -732583 -725774 -990070 -1074127 -882352 -473609 156477 596036 632437 502812
14675 502812 282348 -294276 -676695 -1000907 -1054684 -920983 -1016996 -1201081 -1334526 -1244056
14665 -1244056 -711888 67689 451370 36578 -46528 184613 301833 476037 353771 156610
14655 156610 51508 104732 -70917 16388 425480 396828 390721 725779 878946 657494
14645 657494 464700 282704 -242183 -681531 -921041 -1212076 -1500661 -1673124 -1706379 -1133922
14635 -1133922 -283926 151904 359686 255559 48925 32777 -37859 -295597 -642128 -754689
14625 -754689 -522612 -218651 -81543 -125161 -188628 -335886 -130200 -102055 -377657 -458000
14615 -458000 -192207 -777 -139888 -228834 -226326 -106712 340619 -6862 -378044 -415236
14605 -415236 -340206 -205337 -615754 -990919 -1114521 -936615 -1065135 -1412336 -999775 -487866
14595 -487866 -41752 528466 728233 551138 247122 -162379 -563002 -656912 -555944 -804215
14585 -804215 -916894 -749137 -121299 204448 389608 236433 131365 194393 -194578 -633559
14575 -633559 -622217 -430327 -376940 -360745 -292117 -76060 63562 -79109 -420374 -503251
14565 -503251 78167 758358 1073249 1094450 1029234 895347 741518 613572 235744 -280171
14555 -280171 -486584 -349282 -346713 -163481 -76641 171831 454969 230373 -99832 -15520
14545 -15520 30846 98636 281385 411441 453663 105917 -375690 -864057 -1360538 -1194897
14535 -1194897 -560073 -412969 -403375 -151413 -155018 -417440 -774963 -618473 -378990 -195326
14525 -195326 -52918 -492910 -940090 -894726 -805443 -576212 -339648 -549493 -886384 -885576
14515 -885576 -734836 -400527 -95970 208142 799408 869978 18909 -620089 -449174 -508567
14505 -508567 -925769 -922579 -581633 -198603 315908 670379 742743 379400 171659 366583
14495 366583 366362 -33054 -489966 -578364 -309613 -250526 -346995 -252396 -391792 -618758 -696052
14484 -696052 -967527 -994671 -340013 51865 165763 222457 148787 -13065 -359441 -955434
14474 -955434 -973539 -1067069 -1241364 -1084068 -935025 -1073709 -1247881 -1357722 -1668904 -1802767
14464 -1802767 -1107949 -216144 659249 1179141 763064 590451 580200 332756 -85259 -338407
14454 -338407 -374975 -317471 -301833 -193056 -438901 -845015 -959001 -839984 -859903 -718929
14444 -718929 -519222 -427659 -101102 385685 594185 340863 -82437 -349402 -569238 -530786
14434 -530786 -602642 -970168 -1153750 -1158185 -865035 -367080 177623 604128 724155 752658
14424 752658 700732 339957 -464088 -789240 -805656 -662893 -591495 -747973 -739159 -614785
14414 -614785 -367074 -256513 -54561 439716 670232 15746 -363245 -301734 -137182 228211
14404 228211 533247 642902 360395 -100349 -180580 71192 49501 -130404 -208968 -197469
14394 -197469 -113134 -101822 -57054 88967 356092 379709 269490 277266 -118544 -640607 -744021
14383 -744021 -569406 -934876 -1221841 -1083024 -784295 -710511 -732623 -622667 -74109 372440
14373 372440 -192256 -845578 -577049 211440 335788 132529 -169147 -680174 -1152929 -1205691
14363 -1205691 -1114028 -986842 -998837 -1169809 -1001321 -635065 -430158 -398734 -415310 -423691
14353 -423691 -205194 118119 443823 367790 45279 -310504 -665969 -1106392 -803326 104635
14343 104635 663156 448956 159003 335956 325418 -11124 33996 354718 368580 354761
14333 354761 242567 115081 -16943 -22803 252369 456600 329930 245725 463406 544707
14323 544707 574718 612356 640082 345920 228390 378375 68730 -407815 -586000 -271853
14313 -271853 148789 344263 445956 791596 895022 773581 418477 1933 -12044 46528
14303 46528 69875 77294 117260 184383 41865 -111693 6003 144919 123080 319094 335431
14292 335431 274911 285609 -22733 -663828 -1044866 -856171 -535863 -627933 -658196 -405326
14282 -405326 -234341 -687885 -955128 -511487 -158207 -59781 1287 63098 204493 -46724
14272 -46724 -169772 -49741 -80100 48141 555239 818237 454122 7349 -48440 275119
14262 275119 378845 176831 -213460 -376064 -476837 -745899 -688218 -310688 -225983 -197956
14252 -197956 -56171 -72483 -183462 -187624 -326918 -321571 -458810 -696916 -1057622 -1075600 -956529
14241 -956529 -1015078 -914909 -1164606 -1680180 -1937094 -1625103 -1248058 -766216 -543042 -213330
14231 -213330 278181 242630 19259 100578 112596 136245 199596 48893 -316538 -534695
14221 -534695 -455774 -77218 339520 899151 1332398 1341696 1068555 484365 89514 252101
14211 252101 382019 388346 463174 307668 115565 120925 52278 -25199 -3011 168511 331006
14200 331006 126485 -112167 53432 391543 270395 -441598 -1204592 -1298053 -838136 -368329
14190 -368329 -53976 -158573 -337407 -703173 -929448 -643937 -172225 223563 228537 1770
14180 1770 -198358 -676168 -963419 -824553 -581442 -336664 -201068 -280015 -276866 -220617 -103254
14169 -103254 69779 172739 102186 -195118 -104466 63196 457141 520452 360315 254657
14159 254657 -15064 -529188 -835786 -797021 -871565 -879886 -668466 -513304 -280197 77561
14149 77561 30638 -474221 -792519 -765590 -1001503 -1054483 -685401 106502 929733 1389218
14139 1389218 1503471 1224713 649752 -7201 -249217 -133114 -233724 -561184 -772751
14130 -772751 -735325 -735258 -634927 -168019 138196 -79413 -450766 -609308 -427453 -200856
14120 -200856 50596 68100 -159457 -87238 -48756 -209664 -562986 -849413 -997643 -1066460
14110 -1066460 -1199068 -1591462 -1700054 -1428603 -854677 -262954 315656 376988 516827 572590
14100 572590 464804 445139 -158452 -688024 -326819 -218464 -361674 -779163 -868652 -469364
14090 -469364 -426376 -545038 -484756 -121941 62083 -17052 -324673 -528173 -552788 -399510
14080 -399510 102458 380970 -210163 -542963 -367866 -279053 -491549 -500817 -39412 318676
14070 318676 345670 531103 525522 427064 261655 197235 673047 989398 773109 365540
14060 365540 125429 208670 169210 61926 -175535 -378043 -344491 -660965 -857656 -690787
14050 -690787 -862688 -960718 -591045 -515680 -842870 -837421 -564378 -75002 44558 12289
14040 12289 -39443 -426262 -489160 -439817 -477194 -534420 -816883 -1029774 -951873 -1244506 -1386527
14029 -1386527 -635648 -16585 378364 160787 -239130 -393930 -730557 -833919 -616916
14020 -616916 -565126 -768335 -676994 -527119 -745054 -708379 -340950 -245449 -183037 -35054
14010 -35054 61435 194395 163695 120671 133726 237500 376686 305475 -350547 -895787 -820235
13999 -820235 -541127 -745905 -830899 -586806 -419974 -765144 -1159465 -1000113 -1187019 -1287734
13989 -1287734 -1010882 -888984 -713233 -853130 -870388 -633945 -629807 -675155 -444898 -138558
13979 -138558 -439842 -858671 -888418 -564883 -353653 -359758 -642853 -936396 -1161299 -1065488
13969 -1065488 -436402 -18572 179525 156985 158651 197611 212518 -186377 -294742 235383
13959 235383 557627 488803 638263 532031 201336 62993 109312 45501 -107300 -425164
13949 -425164 -649861 -737456 -837505 -747567 -714220 -702417 -711424 -664229 -540627 -415008 -397256
13938 -397256 -664757 -842253 -581461 -259596 -125527 -258468 -617178 -879671 -1044032 -1209345
13928 -1209345 -1118837 -545029 -116356 55931 116853 -254160 -602042 -595723 -766561 -692308
13918 -692308 -123289 81657 -61935 -265641 -367607 -302568 -31052 106659 14275 -200681
13908 -200681 -453438 -466322 -66214 167100 608251 1098498 940747 42797 -249156 31679
13898 31679 81530 116330 -6989 -413671 -868592 -1071912 -1099091 -911714 -758156 -635084
13888 -635084 -423491 -155326 115913 129151 200208 22012 -203509 -269841 -202427 185547
13878 185547 88901 -326351 -451786 -225721 217240 586179 813231 947398 721671 460461
13868 460461 688807 1045545 1220675 945130 813155 577249 421967 609278 855370 1120932
13858 1120932 1106561 1217185 1575603 2010903 2321380 2980455 4085519 5399098 6650149
13849 6650149 7314604 6979026 5692719 4740694 4199171 3532324 2736077 1443277 494951
13840 494951 280766 291556 369944 229920 210018 366885 561754 742114 755196 699997
13830 699997 707296 511279 123457 -166457 -347217 -206311 222139 341174 77266 -569459
13820 -569459 -966474 -919653 -819432 -679467 -365494 -270152 -568811 -1092129 -1453211 -1378374
13810 -1378374 -1220950 -1151300 -1086546 -1083277 -935730 -690127 -271185 93973 -130281 -312001
13800 -312001 -199070 257888 586426 666033 478930 236734 831016 1317447 1307448 1498875
13790 1498875 1685656 1580293 1566623 1419723 947291 269767 -186861 -93604 222095 297413
13780 297413 247809 355411 438827 379572 75190 -78882 -50511 -173263 -209956 -445113
13770 -445113 -925299 -811661 -472347 -325871 -406876 -332297 -151078 -301038 -265304 -73225
13760 -73225 182778 240215 40268 9648 -60943 -79474 -172162 -106684 80089 -69812 -126310
13749 -126310 108602 277970 412780 416510 201362 -36863 -179018 -270310 -192108 -521111
13739 -521111 -929413 -804039 -749048 -464102 60770 78405 -37261 44952 19962 157269
13729 157269 106639 -35113 3667 -191956 -443620 -475375 104511 598748 720514 789047
13719 789047 377470 269738 505047 616744 600465 521550 114851 -500916 -608431 -375649
13709 -375649 -473501 -215429 -6799 49040 -57849 -288448 -365529 -203702 -152348 -195512
13699 -195512 -683839 -975392 -418749 254557 595989 931039 893555 521688 -5139 -304701
13689 -304701 -156035 -5484 -208800 -178855 224043 330128 49845 29423 592272 809453
13679 809453 821672 652078 429761 357361 503172 424857 264651 -85135 -499480 -297466
13669 -297466 -4181 366615 665951 814442 553845 260823 521514 566890 324317 -94458
13659 -94458 -191964 -42201 -304785 -416228 -162879 -58386 20834 325265 590996 839016
13649 839016 810975 418695 235760 237525 -79727 -409284 -548301 -370588 -90806 299545
13639 299545 323646 475348 1015481 1050465 558579 399758 720413 681969 580138 632089
13629 632089 272759 -9223 132890 28704 -113903 31564 -110130 -196918 67292 161803
13619 161803 187390 393570 451650 379682 839008 1120589 1009080 937345 852473 517093
13609 517093 -50203 -443887 -538609 -233934 384728 412526 326963 380202 604284 845580
13599 845580 811699 180611 -459783 -715198 -458904 13891 332125 596109 486290 309008
13589 309008 -95726 -341896 -123406 -254363 -56215 -69636 -723485 -1198401 -977352 -861525
13579 -861525 -740967 -287308 26044 -251065 -292027 -451719 -821532 -1111743 -1077588 -936868
13569 -936868 -706673 -656833 -713879 -704898 -455065 -52226 -121034 -136463 76216 -51357 -218229
13558 -218229 -437527 -644253 -732118 -712182 -947577 -1160811 -599880 -199370 -233983 -553453
13548 -553453 -1094000 -1484973 -1713171 -1635856 -1491400 -1411435 -963634 -483110 -58222 281126
13538 281126 236100 -196071 -582884 -847098 -834523 -780158 -798699 -563623 -88100 142140
13528 142140 192822 -33164 -315742 -319625 -400447 -573116 -268918 -57903 268645 317760
13518 317760 -25560 -390955 -797778 -702409 -434402 -168578 -84861 -143244 -56684 304352
13508 304352 353876 317042 317982 270113 143689 473322 713236 514920 178321 -3221 24152
13497 24152 78977 219986 228192 117518 185562 324559 511608 457186 547100 1137495 1605570
13486 1605570 1569728 1404086 987507 439436 84454 -218117 -288841 -300557 22291 249850
13476 249850 281676 147565 401951 804863 731064 734096 695392 463804 648893 990081
13466 990081 715282 62633 -361987 -317115 -318648 -352318 -51034 -18791 -468460 -537227 -272952
13455 -272952 -395575 -1005734 -1695972 -1386229 -533019 88926 327319 230292 371882 391977
13445 391977 414370 298724 102119 153554 124714 180690 390209 30329 -656110 -857528
13435 -857528 -823407 -974377 -1117776 -1090284 -1002940 -1085403 -876149 -358199 -17866 -176118
13425 -176118 -479416 -586159 -654564 -524236 -396562 -425116 -549274 -573482 -752660 -765492
13415 -765492 -719017 -913160 -968422 -500491 -148915 -144336 -331634 -568882 -487404 -472404 -355557
13404 -355557 39189 68352 -14815 173299 66656 -217489 -146511 -206542 -412000 -248710
13394 -248710 -70307 25879 72842 243991 515918 286364 213296 304210 202695 -95550
13384 -95550 -222469 -73470 379511 346124 90957 43972 112458 -50610 -369309 -480937
13374 -480937 -455678 -538270 -683612 -515614 -821340 -1014211 -631652 -303598 36275 549044
13364 549044 991525 1039911 1174218 1194835 887786 376379 -104617 -202386 -77171 -164821
13354 -164821 -369843 -386501 47219 632121 771022 671049 449363 51730 -287838 -610793
13344 -610793 -602189 -600188 -687425 -651909 -426037 -264592 -464663 -985856 -1189429 -856368 -574244
13333 -574244 -745639 -545768 -425275 -190689 58051 223330 222214 107247 111045 -137222
13323 -137222 -439267 -775105 -1006028 -801153 -685828 -511039 -43187 328621 60285 -175414
13313 -175414 58252 -36976 -293401 195887 910182 959356 941525 1104353 1151805 926567
13303 926567 760408 888085 1049571 978624 786650 772860 791253 597113 645046 492464
13293 492464 499930 1177309 1678692 1654750 1288247 1077574 1310469 1480077 1107931 551389
13283 551389 457412 405216 289269 314329 366449 349304 467988 646857 616675 312313 191759
13272 191759 107160 41400 115006 -79234 -308579 67683 698444 656238 178977 -203616
13262 -203616 -352612 -338151 -261451 148742 442708 -20457 -623160 -606386 -493182 -133931
13252 -133931 206696 511445 858593 616959 -79687 -61105 702145 904288 586215 665411
13242 665411 1114010 1386413 1211624 805366 433661 172555 406190 924624 1345251 1724919
13232 1724919 1797020 1480900 1161159 1134176 1324840 1323564 1335852 1401616 1418155 1473971 1171973
13221 1171973 1133527 1120516 1065892 1067328 1102274 1122881 973370 909307 665299 293829 259650
13210 259650 403850 488624 705722 1008843 957701 1085675 969870 617874 199979 -147468
13200 -147468 -70810 502399 1285107 1685405 1591645 1492532 1668732 1796050 1772835 1437125
13190 1437125 1046822 1060042 956892 1035948 1145026 1064649 756602 371078 113585 336858
13180 336858 992512 1216989 1155887 1119899 1017007 776655 591152 197094 -152274 -264902
13170 -264902 78359 640895 1181246 1308121 871053 635078 476961 425329 283315 209254
13160 209254 129943 288891 434902 175606 -97652 -74159 168125 497733 563887 280345
13150 280345 167339 523664 897056 763945 45029 -244152 105344 261268 350572 100330
13140 100330 -338119 -904748 -868312 -536292 87525 790692 814337 707539 760953 693823
13130 693823 963705 1263698 1398957 1514973 1499738 1265237 1220316 1253625 1162025 656123
13120 656123 314924 490587 1000999 1020922 1137932 1618160 1346527 948711 858936 1093063
13110 1093063 1381717 1642557 1611582 1476741 1253016 1360119 1687003 1836473 1946808 2053288
13100 2053288 1783373 1470510 1505896 1808503 2039163 1945814 1877147 2085515 2021036 1863640
13090 1863640 1797768 1507168 1201959 914704 664699 663492 827499 875689 388764 134297
13080 134297 158316 626316 1054802 1248902 1353653 1480745 1823304 2275045 2397951 2063877
13070 2063877 2023280 2342878 2284413 2241413 2442990 2446849 2251839 2391719 2525949 2512938
13060 2512938 2688951 2833954 2924676 2762635 2763375 3045711 3146924 3046832 3220069 3203341
13050 3203341 3148654 2838053 2519684 2353101 2342771 2652836 2663083 2511999 2382877 2404308
13040 2404308 2471982 2181429 2210727 2866989 3555010 3560628 3304192 3117072 2881194 2454714
13030 2454714 2485044 3219099 3999984 4256839 4182352 4304224 4434113 4023685 3942076 4281538
13020 4281538 4364574 4265267 4132137 3999146 4362212 5044200 5396375 5259857 5626503 6129504
13010 6129504 6201626 6446479 6537737 6643770 7003158 6964393 7060142 7444788 7895594 8348492
13000 8348492 9189426 9975537 10334286 10724786 11722069 12894191 13874854 14765572 16188947
12991 16188947 17802095 19454636 21519456 24006222 26937861 30341649 34576684 39797869
12983 39797869 46444880 54863572 65391390 78558266 95221577 116047971 142629150
12976 142629150 177869024 225094122 286331858 355689332 412253202 425544348 387312190
12969 387312190 322813417 259261463 207236459 166809706 135992141 112555415 94411813
12962 94411813 79898523 68354179 59513425 52452044 46376746 40881669 36006352 31816923
12954 31816923 28623182 26192003 24327999 22558854 20558046 18773377 17512620 16464726
12946 16464726 15226564 14320250 13955531 13727814 12999407 12181045 11635175 11484592 10940062
12937 10940062 10397422 10568647 10783527 10933138 10718519 10301109 10035004 9887801 9575446
12928 9575446 9456314 9790182 9949548 10130331 10540417 10978434 11216539 11422903 11954805
12919 11954805 12791024 13479610 14472220 16135090 18071592 20169195 22360939 23488819
12911 23488819 22870536 21570583 20944905 20627165 20481228 20938001 21737555 22439855 23500527
12902 23500527 24823754 26834744 29647290 33378387 37837108 43255514 50267015 59021625
12894 59021625 69796779 83279714 100359013 122619297 151996248 191615154 244093477
12887 244093477 310042271 380723925 429148199 425907053 374551889 305801235 242946751
12880 242946751 193436590 156077172 127947732 106183005 89378762 76016399 65277330
12873 65277330 56671134 49420476 43567426 38397628 34216068 30970467 28227517 25913093
12865 25913093 24374486 23719923 23288692 23248863 23933555 25326635 26215003 24148789 20543375
12856 20543375 17823523 15818891 14218165 13337733 12621574 11936857 11493425 11002466 10610811
12847 10610811 10198289 10366281 10665221 10253257 9706974 9682589 9831608 9510826 9188313
12838 9188313 9276234 9265645 9103339 9062189 8900415 8898398 9493003 10143011 10603168 11114161
12828 11114161 11500489 11489009 11646625 11939954 12215030 12826191 13850119 14756121 15911580
12819 15911580 17202533 18682259 20398501 22407915 24718287 27436497 30745825 34659551
12811 34659551 39626544 45824577 53470809 62635829 74020334 88623150 107139681 131233135
12803 131233135 163270857 205894487 261560127 328789289 393312591 426486915 406981194
12796 406981194 348780615 282214701 224517499 179276294 144983917 119035594 98745809
12789 98745809 82754281 69992650 60141235 52388047 45628795 39968012 35562434 31738325
12781 31738325 28413501 25247577 22411764 20488322 18801184 17371033 16559732 15480142
12773 15480142 13752803 12484415 11807315 11329539 10393813 9669640 8967605 8166397 7606430
12764 7606430 7440946 7439243 7668939 7401798 6750711 6128747 5344627 4621975 4288925 4532166
12754 4532166 4737613 4431707 4076560 3638217 3224211 3293623 3158082 2782896 2323553 2183846
12744 2183846 2229101 2384119 2722270 3302518 3169290 2587704 2386081 2297382 2306512 2052243
12734 2052243 1806170 2210933 2246760 1902989 1658746 1286559 869844 820774 666559 444374
12724 444374 581956 754099 606328 686065 1440841 2086641 2103395 1724717 1373557 1165701
12714 1165701 1260970 1926956 2182810 1980734 1915838 1896779 1578008 1227906 1169917 1451856
12704 1451856 1554139 1352819 914694 641085 1020472 1374119 857209 26282 -269578
12695 -269578 -315043 -336961 357119 1523933 2288112 2225557 2061567 1772470 1324113 1006843
12685 1006843 726399 891387 1203215 1363000 1227488 1069768 1029358 770278 318654 32456
12675 32456 416860 694872 650238 678125 648482 804396 1075736 1187354 791420 548203
12665 548203 669171 766026 846846 907069 1043166 959923 618220 261410 182287 130693 30879
12654 30879 -99120 -300881 -196443 109462 167945 158547 280853 269715 206754 149396 85201
12643 85201 82659 -14009 -151694 -272240 -389409 -224003 131079 254622 543240 605063
12633 605063 -75311 -477086 -343635 -271627 14521 653089 1072608 1408120 1451310 1260425
12623 1260425 1138060 997521 1166091 1115187 564788 157962 -134327 -182291 498709 1075667
12613 1075667 764521 528407 625290 724514 428900 252328 481007 670712 571105 591621
12603 591621 647730 670489 687534 646744 489132 452977 688312 664464 225510 -292915 -598022
12592 -598022 -452885 -175707 -243008 27489 429894 560222 251020 95560 392137 420561
12582 420561 336325 292989 392149 631794 855815 657256 146308 -386122 -411666 -84350
12572 -84350 44194 104493 528133 831047 905752 665102 772300 1300622 1555941 983634
12562 983634 491165 397534 650557 1128662 1014452 536097 174336 195728 316355 397293
12552 397293 411643 441478 223137 -77690 -61327 -176647 -229769 -246474 -376712 -266025
12542 -266025 188127 478869 521940 778039 923757 832867 413445 171904 491288 857280
12532 857280 694454 567622 432010 -132835 -241460 -36746 -76303 -163347 129245 399449
12522 399449 397505 498676 496138 -32216 -138645 120298 176429 593347 713264 228690
12512 228690 -342611 -541189 -466933 -510945 -813487 -726343 -303757 19687 381332 517430
12502 517430 326437 453960 493258 496273 227141 -105568 -12941 174327 444936 765503
12492 765503 1038254 1111464 1202472 1127450 1008686 810795 581337 593859 749572 712794
12482 712794 81493 -41189 474596 532604 283945 -84243 -698243 -836951 -204266 238499
12472 238499 294455 49312 -340541 -435363 -469475 -379072 -39642 328935 140056 43697
12462 43697 332231 494995 505457 511645 503893 600923 727893 585756 327387 111591 277469
12451 277469 319224 481253 301008 91355 236700 254068 75851 -129146 -188413 -290284
12441 -290284 -371991 -305485 -396281 -326269 -76858 160009 352237 305439 231303 -121283 -58955
12430 -58955 159237 157570 -11528 -165984 -183759 22532 129909 258884 615456 1138737
12420 1138737 1230786 737792 181486 328118 390265 483170 411041 24308 33217 46230 27979
12409 27979 -44386 55970 245625 179420 420617 505651 141132 -155100 -439064 -620033
12399 -620033 -609607 -73381 303737 365749 833404 978586 965690 1055801 1138654 1040657 672793
12388 672793 570204 628158 704083 776035 617781 190245 33318 -1882 343146 351576 152457
12377 152457 189747 313499 524294 537875 602485 580321 191563 -102015 568091 1538395
12367 1538395 1675473 928483 282359 135655 69383 127975 -102317 -379284 -590237 -596967
12357 -596967 -826234 -932830 -401823 -4460 52020 106085 144078 -396046 -824694 -1119501
12347 -1119501 -1280987 -1058719 -679971 -349624 80314 212060 267991 266718 398910 506212
12337 506212 656510 901264 1191797 1299817 1031785 677310 410366 289845 220913 308249
12327 308249 303560 132132 -77865 -448895 -483915 -83884 -14777 -249588 -568710 -736076
12317 -736076 -715864 -505500 -671382 -948780 -704366 -488152 -150441 46765 -98340 -273947
12307 -273947 -606745 -655750 -1008897 -1206452 -919653 -423844 -253765 -591523 -1015602 -1066837
12297 -1066837 -688165 -232231 19970 596185 914983 482015 140469 179129 -49063 -223406
12287 -223406 -81566 -326078 -677962 -940808 -533967 -87634 -159429 -370457 -365795 -132796
12277 -132796 -218368 -47164 360385 492785 653386 790876 847036 825462 857814 657309
12267 657309 370852 186628 113790 588043 826168 695922 527766 391405 208547 265696
12257 265696 608642 663206 264945 -56719 -135597 -376009 -664754 -781823 -317634 433262
12247 433262 986492 1258784 1356686 802392 194763 -167831 -327998 -444332 -261156 -184326
12237 -184326 -335466 -358885 -272918 -102192 -104945 483 180629 -142333 -842045 -857450
12227 -857450 -189578 259263 41677 102208 131142 -66893 -281080 -729132 -1284874 -1513557
12217 -1513557 -1437749 -925283 -564794 -530417 -572328 -327582 -253029 -499688 -366604 -99059
12207 -99059 -126890 -482381 -906929 -1144290 -1330174 -1281222 -905788 -695725 -536538 -214298
12197 -214298 -282097 -302043 -84518 -58172 -221793 -113265 8937 -34449 49359 498903
12187 498903 886015 958672 793918 555607 552667 574428 313843 114898 148409 188826 -233405
12176 -233405 -907959 -1207227 -809580 -497345 -478482 -318931 -624424 -809460 -553958 -110032
12166 -110032 101976 159492 180023 186798 380354 577543 923418 1205832 1098135 409158
12156 409158 -385179 -699589 -480132 -487908 -411625 -184925 -57847 211531 500571 1027330
12146 1027330 919706 739681 632252 498887 612630 1018606 1271318 1138846 1172841 1037026
12136 1037026 474852 -16580 -190450 -219843 -278057 -33314 142532 222357 -81234 -184073
12126 -184073 -364897 -504382 -252907 165297 599653 893485 1314280 1633396 1537989 1141183
12116 1141183 764866 774143 714853 240005 -307862 -854195 -1247157 -584923 293024 343637
12106 343637 641205 960423 776834 626376 789811 420261 -89524 137046 380499 432963
12096 432963 675961 507119 140796 -27241 171085 430249 590326 401688 238403 -82523
12086 -82523 -232511 -101699 99058 514043 646388 752678 1030820 1048693 754295 414935
12076 414935 550572 688496 505014 432496 233691 -152924 -80001 85092 131162 181450
12066 181450 -90862 -362040 -680941 -311402 51568 102140 314115 680779 1070662 1088612
12056 1088612 683418 369277 328495 363591 631253 631132 358020 232197 -37678 -325852
12046 -325852 -593478 -462389 -425255 -507658 -463551 -151493 -74172 -315547 -382255 -385776 -432873
12035 -432873 -274189 4787 150148 172230 199350 16026 -89216 -193858 -518120 -739506
12025 -739506 -967506 -1108324 -1145682 -1244316 -1080775 -871365 -1027709 -880387 -170087 175565
12015 175565 29473 -34891 -15778 95680 129432 15489 -14821 143590 234833 430875
12005 430875 582052 676503 687227 800232 616220 217295 -11975 -401611 -566582 -640277
11995 -640277 -662263 -632238 -580929 -346564 -11410 355535 643507 785498 861734 1122048
11985 1122048 1194944 1247802 887554 269450 155572 435902 470552 522362 874620 823380
11975 823380 622163 486531 352849 371425 315032 433557 486877 467913 235719 51874
11965 51874 43747 54978 70395 263398 710063 844145 475835 57943 121799 199585 -233530
11954 -233530 -460152 -57614 636533 1028077 678026 -82075 -26451 252262 99464 99693
11944 99693 379282 589590 381012 60835 54254 360883 794669 1590284 2103706 2201162
11934 2201162 1998092 2177766 2459763 2893986 3950062 4835252 6357719 7524449 7635713
11925 7635713 6990108 5731049 4411150 3149650 2686267 2454369 1846375 1170107 588385
11916 588385 467544 543481 426426 434537 410936 511557 505802 95667 -168555 87709 250039
11905 250039 244484 391610 414765 687188 793023 617234 143356 29618 378603 464882
11895 464882 421084 -821 -414987 -591684 -425999 -18619 286994 325724 62643 -263938
11885 -263938 -484201 -676491 -576433 -182173 354366 521691 401709 397484 465779 674639
11875 674639 819141 957705 895843 575894 401832 549752 731486 761525 941960 1127443
11865 1127443 974431 700982 610907 252810 48508 -118033 -279645 189471 740441 800177
11855 800177 1098025 1120328 478063 128561 226656 78920 -71544 -137317 -322484 -775024
11845 -775024 -820612 -495393 19737 437119 398150 94550 -483137 -899507 -952240 -641250
11835 -641250 -368061 -427430 -511381 -224725 5840 408709 762265 724834 299661 148633
11825 148633 774360 1307722 1143921 1001988 674494 226479 225496 367005 332663 -77791
11815 -77791 -164732 -182323 -391432 -437332 39763 427597 312420 -30870 -49128 -291297
11805 -291297 -848150 -777941 -498332 -749788 -640039 95340 596529 724789 491841 355217
11795 355217 173033 81689 -8836 13950 -133429 -139771 -47555 -171740 -94397 28100 207819
11784 207819 333669 368114 368562 -7271 -144155 -218804 -67543 283184 604896 939454
11774 939454 834072 448979 70139 14266 217520 254036 -56617 -272688 -459605 -687557
11764 -687557 -996429 -968927 -375525 216680 578344 436134 -73800 -559563 -443147 -255567
11754 -255567 -322541 -608914 -598130 -329980 -491054 -956257 -1362224 -1515658 -1106725 -356216
11744 -356216 -14577 170408 409157 284498 -216887 -354219 -485669 -758076 -452698 -49043
11734 -49043 -77898 -428710 -338555 -55416 -36776 -253840 -573964 -918847 -1336017 -1478505
11724 -1478505 -1351158 -1284703 -1366211 -932431 -367681 72869 122708 733573 1108642 959033
11714 959033 1263266 1427155 1233667 925447 804787 729144 900412 1044259 1211519 999558
11704 999558 191284 -646422 -818646 -550247 -415623 7839 398331 820284 1007942 422262
11694 422262 -104652 104541 270157 237680 210070 91085 492817 1123777 1263311 1341603
11684 1341603 1287795 977689 384067 174995 167893 92855 7477 -390077 -649635 -436875
11674 -436875 -41952 -29699 -416494 -924318 -1400105 -1188987 -397560 191094 486502 404341
11664 404341 112756 -254753 -229792 -109729 -106478 87843 395193 455116 287802 160056
11654 160056 181629 132760 -61050 -564402 -858297 -834790 -646857 -583059 -515552 -444164 -653125
11643 -653125 -377998 296119 514543 227570 349393 547107 400784 206132 -76963 -185269
11633 -185269 -122965 130000 135164 -122741 6843 432575 958978 1052067 908071 1018113
11623 1018113 709794 163496 -525574 -838523 -753371 -647782 -263971 151336 583707 507666
11613 507666 447382 1003039 1306886 1277338 845158 304028 385136 709719 908020 599610
11603 599610 379908 557900 821243 810540 712447 402782 198547 347142 195730 -213825
11593 -213825 -225852 -60212 397764 1008094 1366381 1701536 2066921 2572815 3683064 4571622
11583 4571622 5165466 5855666 6312334 6679689 6332332 5717037 5055577 4072954 3146755
11574 3146755 2533764 2196677 2204048 2326933 2363804 2207713 2066256 1799246 1284861 811392
11564 811392 344562 7206 94652 414703 597433 565345 179726 -461873 -651354 -505564
11554 -505564 -335966 78237 655309 619985 403313 339323 551525 991328 1270110 1168041
11544 1168041 1327485 1618244 1939430 2287044 2385884 2087914 1983302 1890009 1732127 1617959
11534 1617959 1762583 1840171 1851581 1940969 1708813 1738236 2082584 2533015 3254708 4214998
11524 4214998 4998500 5663316 6853324 7707308 7820595 6997118 5526125 4180370 3227459
11515 3227459 2734586 2576233 2485046 2047593 1587844 1405679 1698189 1716700 1235548 782197
11505 782197 691038 792598 1072089 1386404 1284200 783838 591685 682939 309307 -272482
11495 -272482 -454557 -388155 -371049 -299122 -3348 -74315 -396297 -391723 -497530 -628904 -580415
11484 -580415 -171938 7012 -124564 -185719 -314577 -219972 -48973 -141205 -269473 -348715
11474 -348715 -147893 -266303 -703491 -1061322 -1051257 -774922 -846888 -898594 -858303 -435443
11464 -435443 -81837 -12916 121634 521697 759655 498308 131823 -171571 -341499 -404146
11454 -404146 -586428 -638921 -851464 -872188 -851005 -720971 -675206 -733151 -558177 -432643
11444 -432643 -417679 -717934 -1280515 -1421590 -985556 -417565 -257014 36999 -95926 -526868
11434 -526868 -921330 -684704 -237587 -195890 -346408 -518175 -359915 -152990 192170 692953
11424 692953 809467 208047 -343224 -143579 396251 594051 495217 601024 565856 438562
11414 438562 126552 -26105 293020 605406 570796 -204035 -1101082 -1451915 -1645024 -1584319
11404 -1584319 -696628 -151073 -510633 -1224008 -1355137 -929832 -396518 -194142 -22500
11395 -22500 694566 854767 417404 147675 -5388 -314006 -472005 -361899 -29403 -86775
11385 -86775 -479343 -558118 -87657 420216 519230 -217944 -793793 -436753 61119 -137889
11375 -137889 -320446 -102687 277706 624020 872050 983579 857289 812737 581101 518105
11365 518105 455702 328124 -31223 -326411 -261785 -102269 -213295 -231883 -162207 11736
11355 11736 159062 439180 552763 221709 65656 312861 613649 545870 255715 50219
11345 50219 62079 11222 98007 246201 407951 271239 -215207 -421540 -154406 414742
11335 414742 707187 303986 -62388 241760 413248 -62914 -523647 -604714 -344110 -208921
11325 -208921 -160262 -62708 -19199 9595 -6708 -337857 -523584 -744447 -1362850 -1637307
11315 -1637307 -1557130 -1575844 -1403595 -1005832 -512321 -195584 -193162 -111642 -310913 -855850
11305 -855850 -1111705 -1062816 -932986 -349401 23520 -304802 -764612 -849728 -938041 -1094046
11295 -1094046 -1050592 -1286611 -1762110 -1527270 -1336814 -1306010 -1073078 -810458 -699124 -553618
11285 -553618 -302206 -180890 -142690 -121047 -498495 -373562 177699 161665 181998 152814
11275 152814 74413 70169 -158909 -486218 -498159 -200940 -167468 -34872 627272 713662 450318
11264 450318 422063 400919 280762 207114 -46439 -240824 -202613 961 354996 113425
11254 113425 -120379 127982 387350 309294 305910 424490 216075 -363901 -485688 -183032
11244 -183032 -26660 108595 361927 475235 444002 462071 620279 600967 262731 248275
11234 248275 348897 216383 -29128 -62996 -399693 -535829 -182469 154658 525109 772290
11224 772290 360362 -425635 -1039883 -1032765 -699258 -452611 -370641 -318807 -274071 -337290 -303293
11213 -303293 -238688 -185708 86916 660873 878743 527032 202126 167104 180412 138371
11203 138371 411475 684759 315110 -446720 -907658 -817389 -896780 -873387 -620304 -362507
11193 -362507 -101176 -88480 -77768 758914 982587 608177 448311 417143 295900 -108987
11183 -108987 -576606 -850885 -827641 -684837 -755316 -634369 -238755 69756 -32513 -464231
11173 -464231 -798209 -639279 -284825 -490767 -660172 -430308 -98095 205344 147714 126833
11163 126833 590230 835131 738072 711236 724848 491063 538286 640910 468037 399830
11153 399830 381814 631343 947533 1203954 1675616 1770201 1589782 1712674 2523248 3634810
11143 3634810 4809065 6700383 9118930 9366603 7132914 5156219 3787554 2819739
11135 2819739 2168863 2014833 1819589 1373960 993218 931615 444404 181539 191819 613327
11125 613327 1012858 814231 926905 954744 530275 71870 101812 304621 242303 49420
11115 49420 -58814 -20319 361546 673781 997959 1447982 1981091 2559933 3187963 4188487
11105 4188487 5769222 6972250 7424656 6973569 5894815 4900850 4073769 3636795 3301225
11096 3301225 2674702 1950526 1145864 1012039 1281799 1243986 1333324 1583715 1685290 1687150
11086 1687150 1353915 964462 662413 571200 803914 853083 465503 286618 654078 427295
11076 427295 -1058 -52483 502700 872953 438586 -304392 -727128 -721532 -597754 -226861
11066 -226861 16684 149397 219619 86222 -93696 -271573 -289306 -255639 -508012 -495519
11056 -495519 -208577 128097 110847 -400679 -496219 -386136 -171815 -155632 -344872 -700036
11046 -700036 -1025848 -727775 -305679 -79953 158508 392261 206909 211075 400484 168501
11036 168501 -116174 6510 194511 96468 -141072 -322275 -446167 -245841 -78228 -408405
11026 -408405 -651744 -932536 -1058844 -702244 -176553 504895 662100 158435 -52146 147849
11016 147849 -105831 -503592 -372775 187853 308794 291723 249704 20596 237018 550377
11006 550377 497771 54039 -23756 344808 624744 452603 -99230 -331188 -268010 -195138
10996 -195138 -273541 -483911 -55877 515404 360240 -75150 -568001 -898546 -1436347 -1449494
10986 -1449494 -1157273 -993692 -672531 -450190 -441934 98387 656564 1023289 904326 576071
10976 576071 137954 -171206 -54711 349380 429765 353626 258559 213225 371862 320060
10966 320060 -142087 -504323 -518088 -496481 -401723 -84136 390540 438124 742926 892220
10956 892220 616741 473545 652792 823780 586694 540018 642043 381717 170816 412211
10946 412211 581869 96956 -67251 81548 157235 144942 395287 582687 332868 -16258
10936 -16258 -140234 50714 215369 253765 72180 -282411 -158672 13615 -51716 -240800
10926 -240800 -110111 295553 750949 1024665 1089011 626238 95688 -261346 -417651 -162765
10916 -162765 85010 266334 151369 26670 231746 350828 -214004 -698511 -614204 -295595
10906 -295595 -513552 -937001 -1171237 -1268597 -1112304 -651167 -34337 100453 -31194 -60314
10896 -60314 163345 386609 340880 384810 97374 45339 156559 -162327 -268573 9074
10886 9074 146533 -40402 -77038 21813 -70292 -73158 183357 498916 480574 38703 -537727
10875 -537727 -977202 -1081095 -729863 -314696 31765 411830 705522 1133986 1514742 1496332
10865 1496332 1320687 1102294 811586 360637 138183 -75446 -274753 -494204 -491442 -408838
10855 -408838 118153 432894 231353 723693 1138898 1056873 874167 368409 -457726 -833694
10845 -833694 -679753 -560288 -800698 -805458 -298160 145649 194141 298711 299525 -51200 -504161
10834 -504161 -969673 -928665 -618453 -411805 -206399 -332535 -605138 -663785 -646448 -913292
10824 -913292 -1069130 -982754 -802089 -546346 -335405 -253071 -89755 85527 127263 -87678
10814 -87678 -219899 79686 338409 147874 409376 546153 245449 287744 269168 -112059
10804 -112059 -370046 -453316 -126588 64298 64148 182282 181287 329539 327813 -65265 -117917
10793 -117917 -355215 -1179244 -1646199 -1691680 -1250494 -631449 -471552 -194406 2683 -134917
10783 -134917 -289140 -226964 114507 332524 54581 -101986 -79765 109376 -66223 -102967
10773 -102967 -281483 -738802 -860628 -972489 -1257699 -1414638 -1068905 -623764 -756202 -895533
10763 -895533 -514761 -123481 200925 208381 -28416 237256 347447 175341 300123 364961
10753 364961 -221069 -550679 -268606 122300 47942 -309697 -317333 -244904 -511210 -480102
10743 -480102 -424032 -477784 -593854 -409685 -160978 105180 311101 2526 -182379 -432795
10733 -432795 -565268 -619745 -537931 -280758 -111249 -518296 -1276271 -1599686 -1204830 -720286
10723 -720286 -319245 -252505 -348042 -394709 -294426 -305016 -509551 -626108 -563626 -543761 -751786
10712 -751786 -663530 -309972 -445231 -719492 -648397 -417204 -251002 -25703 10923 -79775
10702 -79775 -481529 -677489 -22516 466158 257868 -67036 -373557 -520798 -251712 163149
10692 163149 477189 411286 62290 -91351 8624 88109 13265 -111983 -429500 -534377
10682 -534377 -590258 -476607 68595 312094 116191 238109 184713 66820 -109862 -243075
10672 -243075 -560648 -683229 -502187 -343321 -519639 -724660 -1028587 -1279654 -1163342 -804631
10662 -804631 -116052 127484 -190494 -292691 -43768 13921 -14877 153944 178554 -198201
10652 -198201 -395434 -198451 200418 157916 -371604 -628750 -932301 -1228287 -979064 -606192
10642 -606192 -324602 342364 752413 761249 426787 -32737 -366223 -303933 66045 243486
10632 243486 500075 745489 907861 1052365 915727 250914 -58366 -203480 -148494 158796
10622 158796 598266 381403 151060 -144241 -657752 -713468 -420918 -374484 -472556 -282449
10612 -282449 40267 58537 -112107 -232890 -415168 -534072 -910850 -1197884 -1119263 -627302
10602 -627302 -466435 -509555 -40447 246894 183085 119757 -51346 60735 257243 223508
10592 223508 66993 -179871 -347774 -444465 -361153 -208837 -491387 -373207 -73509 -184314
10582 -184314 -338086 2274 209740 77684 96122 311229 466715 370244 -111272 -145255
10572 -145255 -78399 -478977 -636654 -661803 -541517 -502633 -662131 -655422 -680428 -464195 -94165
10561 -94165 99987 -209716 -278989 166383 454966 -95664 -896173 -1061013 -1180212 -1468629
10551 -1468629 -1583560 -1294155 -630326 -49844 -87982 -123397 -267479 -573828 -463783 85482
10541 85482 493937 536456 499801 356253 431792 611444 443009 90901 -208843 -301591
10531 -301591 164981 585239 623259 281288 -171647 -554177 -541116 -374459 -318611 -217938
10521 -217938 -116821 -221858 -500814 -348737 140611 615198 580208 -11677 -513412 -586416
10511 -586416 -567084 -378103 -223989 -392090 -267697 -301902 -78230 246645 24081 -87757
10501 -87757 -82133 -138757 -100669 -199527 -207658 -281498 -537600 -665301 -416987 -324089 -222710
10490 -222710 250465 367986 210521 94201 234256 275187 123856 -442432 -715698 -291518
10480 -291518 -89865 -292182 -514968 -510025 -366718 -482934 -441056 -216593 228389 345563
10470 345563 185720 -476520 -714277 -559381 -657557 -982735 -1134258 -1046389 -580632 -88892
10460 -88892 239819 125833 92368 370963 397789 256354 92766 -38506 -105306 213291
10450 213291 860553 1120321 1102634 805183 329881 -267265 -782010 -884442 -949440 -990699
10440 -990699 -710338 -377045 -182156 -194255 -271483 -283197 -314238 -217168 75144 -146469
10430 -146469 -95219 485978 967240 1344515 1325449 761276 263060 -44569 -638824 -1185705
10420 -1185705 -1401386 -1023104 -683115 -518138 -309145 -637292 -1050084 -1042115 -841488 -622604
10410 -622604 -411421 -201225 279078 723380 763471 427795 319238 224969 151376 307193
10400 307193 545956 729120 935414 850628 653308 248696 36124 83933 259906 486130
10390 486130 609217 603591 211159 -75627 -44811 28711 -45159 -110741 -107373 116782 558121
10379 558121 522749 218247 19450 161072 484962 529815 736031 907657 878134 1115282
10369 1115282 1198871 1053785 1545075 1870965 1711628 1475437 1129431 771470 793081 835776
10359 835776 1286054 1848680 2501068 3167571 3626586 3943348 4809248 6360642 7886096
10350 7886096 8174148 7269832 5853890 4170966 2877406 1989171 1513797 1333391 962340
10341 962340 610622 384035 122053 103245 254496 43389 180191 639124 1046717 1004290
10331 1004290 727592 569686 591837 963123 813071 120889 -61463 147333 360176 256614
10321 256614 145708 187793 382915 690972 902580 358127 -209692 -586391 -545586 -209499
10311 -209499 114493 34435 -36396 -68218 -52561 -42798 -4592 33149 74286 166411 295518
10300 295518 -163498 -268520 272138 382581 410936 85651 -227066 -410805 -358704 -159928
10290 -159928 -296207 -448412 -575197 -600990 -98482 118441 175027 406175 653558 233505
10280 233505 -274584 -201511 72991 404272 825610 1466006 2053621 1532699 500653 -1965
10270 -1965 -19884 217924 326661 -80229 -345204 -482459 -624562 -737280 -321521 36578
10260 36578 12213 115261 491502 453187 359018 648681 948905 1185870 1258298 951239
10250 951239 406486 198624 240583 143033 -36106 -99135 -77632 -23591 -146493 -437055
10240 -437055 -411329 -467953 -823296 -1088311 -934330 -823172 -1000001 -1209059 -1274594 -574004
10230 -574004 65494 154799 217879 166112 33329 -121222 -373630 -604148 -220895 212627
10220 212627 492210 463167 239772 421406 407359 9692 -454170 -412630 -287382 -487042
10210 -487042 -631404 -435614 -605348 -1044831 -938096 -116609 498515 921714 910390 610999
10200 610999 414420 23817 -242276 -136614 48626 -23708 -60264 -327931 -382693 -239618
10190 -239618 -99997 -170800 -164886 194389 151732 232185 627650 859920 636628 735660 955054
10179 955054 1131243 885508 795305 960601 1142328 1266718 1384646 1535608 1374769 841492
10169 841492 257467 -123778 -222558 -26397 156543 -84467 -405797 -691608 -559804 -111800
10159 -111800 38931 5475 -48595 -13096 -19809 -79906 -130509 -448236 -599398 -689175 -497037
10148 -497037 -69195 -160525 -391890 -708313 -774120 -711298 -533158 -315078 -235905 -308285
10138 -308285 -426449 -143315 80960 116343 -9541 -182087 -48020 281797 561482 719090
10128 719090 879408 750240 862370 856949 701595 668339 960363 486433 -149674 -54725
10118 -54725 257454 1018440 1430099 1800330 3021340 4590003 6617970 9455105 11504201
10109 11504201 11234833 8896390 6637430 5147819 4144287 3128546 2352044 1786040
10101 1786040 1495380 1545749 1980939 2267002 1987731 1452613 1102228 750928 306546 458372
10091 458372 545357 702084 1245469 1284187 758490 443239 558774 986078 1085955 1187629
10081 1187629 1174883 970526 839599 893120 637519 263565 114937 -12857 -429152 -652947
10071 -652947 -494805 -58920 -280586 -850944 -803618 -882549 -1181613 -1454408 -1427781 -1749425
10061 -1749425 -2128706 -1570722 -989190 -574374 -416906 -399984 -429080 23234 255205 123341
10051 123341 -14263 77253 183966 306666 677141 776103 451325 469889 662505 909879
10041 909879 972815 636910 212132 -118513 -505072 -469819 -450448 -664853 -609117 -539884
10031 -539884 -175605 -22200 31411 -63530 -217032 131605 661681 1172544 1318963 967095
10021 967095 808766 991942 857937 607049 308308 85653 -368901 -1061637 -1307166 -1185355
10011 -1185355 -713942 -343477 -188850 -128505 17842 158543 405631 396231 157875 -69130
10001 -69130 -531078 -780607 -771582 -587925 -433851 -374210 -368632 -471983 -284309 200693 353618
9990 353618 230977 -240154 -712384 -809743 -644120 -217019 179492 135992 31786 -155337
9980 -155337 -433157 -518685 -587958 -727691 -1004206 -1066867 -627191 -269377 -330466 -688215
9970 -688215 -736577 -111109 233455 -13395 -249751 -303084 -218221 -151675 -215283 -369978 -709575
9959 -709575 -771712 -281841 259061 372737 154890 65025 -107887 -264093 -116331 -44005
9949 -44005 223759 311474 -155679 -550347 -295799 -338794 -511826 -289594 -246341 -384511
9939 -384511 -745406 -798628 -626882 -667463 -772004 -737203 -355781 -80393 290051 -35699
9929 -35699 -428225 -697019 -919318 -943776 -775861 -643830 -536110 -132710 369553 248891
9919 248891 316327 780735 938105 924984 885507 730404 242483 -85295 188561 727454
9909 727454 1056816 1054976 952872 1024389 456811 -356717 -988793 -584342 349362 679701
9899 679701 558521 492269 824691 922700 660432 466207 519833 667217 401833 -74504
9889 -74504 -99800 -48306 12310 83022 18445 -124282 -230285 -64245 -50640 -59228 220370
9878 220370 639836 465303 -64426 111785 369309 220409 -457530 -823068 -464634 -125595
9868 -125595 -356543 -680618 -739957 -728641 -524808 32715 281437 244697 -109081 -527471
9858 -527471 -683302 -808118 -1217841 -1165762 -708439 -264504 -77008 -523303 -1040460 -1285660
9848 -1285660 -1604725 -1704572 -1564573 -1366884 -1462724 -1413714 -1015015 -483595 -253346 -186790
9838 -186790 -317134 -287935 -246971 -562057 -1035590 -1129185 -1159479 -1220991 -793337 -514150 -585513
9827 -585513 -492539 5766 150172 -135183 -381579 -323878 -276568 -421962 -426161 -80515 315328
9816 315328 691067 519311 59837 -61010 64632 -355746 -749104 -876665 -1138003 -1269362
9806 -1269362 -1311815 -1032950 -406970 18847 439777 122538 -316842 -422758 -802455 -1294425
9796 -1294425 -799712 -75233 -220292 -671449 -649230 -351882 -41727 -87158 -405475 -419913
9786 -419913 -257535 -90746 -234346 -413726 -400906 -242235 -40367 -121165 -450956 -576983
9776 -576983 -242495 372886 839442 548538 -4491 -199834 185357 611417 664671 320143
9766 320143 167223 178289 108101 125248 -8985 -150461 86213 169939 -310402 -478346
9756 -478346 -340969 -406083 -389924 -309133 -353372 -384847 -754274 -868443 -425760 153603 379531
9745 379531 239783 -87306 -378682 -388615 -351193 -601639 -929813 -1163064 -1369815 -845691
9735 -845691 -467063 -425085 -354138 -127109 175351 280363 619861 964838 918708 791478
9725 791478 842096 647079 770793 784632 644252 441946 214685 243574 182211 541620
9715 541620 1287048 1519433 1156272 884128 1053774 1114354 966613 585715 92035 -6096
9705 -6096 -72202 -295850 -540081 -418721 -305689 -305249 -409440 -544309 -759187 -791177 -505342
9694 -505342 -328263 -459289 -575717 -357904 -118227 -152093 166066 605916 699044 763986
9684 763986 475355 246260 -182269 -259739 203853 688402 874736 715080 591466 389355
9674 389355 268921 172954 222518 213394 94062 366605 508904 275917 -63360 -198133
9664 -198133 117905 805447 1127355 913517 655901 481146 238845 -278516 -373283 171667
9654 171667 889235 1299774 1567493 2084465 2393808 2057118 1752099 1806184 2271146 2812494
9644 2812494 3330393 3966784 5006961 6588193 7452774 7157740 6450894 5649674 4602252
9635 4602252 3477762 2574411 1920621 1434624 1172299 920426 1087094 1182395 1204446 1298978
9625 1298978 1277854 820691 113094 -100610 15652 -107160 122387 671090 998541 786235
9615 786235 382926 -110719 -645202 -559126 -259547 -43006 186084 371506 222940 -341818
9605 -341818 -754301 -795566 -911703 -957166 -670088 -240346 469550 621734 -63412 -774160
9595 -774160 -1253447 -1078780 -455587 158635 87558 34161 113463 -248710 -758771 -949179
9585 -949179 -819945 -547063 -415997 -584946 -591940 -524705 -553510 -682878 -548176 -474772 -145424
9574 -145424 -150472 -366476 -163563 -95749 106034 290945 754742 1221270 1016167 461521
9564 461521 111455 -320505 -781058 -1064914 -829123 -497094 -553931 -972949 -953989 -460095
9554 -460095 29207 -13682 -397908 -548746 -474987 -489719 -547585 -475698 -445649 -612836 -554673
9543 -554673 -461698 -429903 -239781 -176978 -52962 135937 316893 43011 -396074 -487440
9533 -487440 -356020 -219994 -118709 108524 121225 -177135 -339407 -311135 -495260 -523868
9523 -523868 -353010 -296532 -303338 -343308 -470666 -646888 -894889 -746674 -716992 -672927 -545085
9512 -545085 -546315 -910163 -1054178 -649088 -175345 8819 3264 -489908 -713366 -212409
9502 -212409 173935 -143951 -472866 -182156 -249618 -461445 -531128 -389791 -340700 -211064
9492 -211064 -45802 -162284 -410267 -842748 -1025237 -940193 -879998 -835823 -719864 -694190
9482 -694190 -637670 -398349 -535423 -673804 -970834 -1103313 -962077 -961592 -1431811 -1675137
9472 -1675137 -1728647 -1450049 -908283 -675202 -694370 -652237 -566280 -286793 16628 116539
9462 116539 80794 423994 595839 863888 982177 1007182 737583 255249 -129424 -333541
9452 -333541 -581063 -947889 -996438 -946594 -935741 -694064 -51844 415575 635770 903110
9442 903110 957207 1108763 1696147 1587617 1053407 925866 1025429 956535 677538 224177
9432 224177 79854 364166 865114 1358948 1246985 922684 407216 158725 373280 750020
9422 750020 858711 786360 612410 449571 292846 -169980 -786621 -975588 -762211 -679178
9412 -679178 -930596 -905590 -513134 -81257 325917 528568 669019 622746 90241 -48568
9402 -48568 338180 421726 244194 30034 27712 62805 22495 -22415 18982 -40280 -170988
9391 -170988 -315043 -225130 -233943 -441634 -465767 250018 1147073 1390758 943385 513843
9381 513843 412727 721063 1156154 1317029 1396498 1280048 1003640 646446 135299 -273073
9371 -273073 -265935 -261673 -209470 325295 146998 -511349 -660485 -494426 -266558 24269 601046
9360 601046 1046118 532963 -133116 -388837 -556004 -435164 -415117 -468096 -383396 -514215
9350 -514215 -683717 -589057 -231001 202344 563203 179568 -118955 -21782 -124177 -156381
9340 -156381 -96877 -84420 320232 693007 851326 946583 622765 221423 90556 187415
9330 187415 457916 200561 -267757 -515526 -127098 443766 641056 512717 475793 651407
9320 651407 747068 591719 256340 145587 -21437 -90359 41976 6782 2181 -33991 -309485
9309 -309485 -101828 422044 498666 614098 771537 479152 145350 -105012 -383808 -266563
9299 -266563 -211372 -63470 121619 68545 61560 115208 -41588 26571 159247 161953 32722
9288 32722 23750 -77919 109404 156682 -420419 -534518 -92564 136198 104190 31467 -28819
9277 -28819 251442 71963 -99647 -384788 -1029292 -1371775 -1184793 -864394 -789249 -672181
9267 -672181 -161136 108046 133000 171158 297473 938893 971182 627679 599735 308401
9257 308401 96478 50913 127048 271172 510224 338822 -192310 -567575 -560086 -493407 -402447
9246 -402447 -173006 57200 224483 419011 425678 261648 169801 -93665 -469789 -402297
9236 -402297 -491371 -610013 -163693 444119 552095 363801 88356 167785 277425 136271
9226 136271 -26554 197127 565450 444216 451040 373065 -15820 -261264 -278301 -364537 -251485
9215 -251485 -199150 -183488 -219721 11468 504315 803729 649962 161041 -36368 -298672
9205 -298672 -184229 332858 607566 734835 901791 1043759 669544 -60235 -540602 -751600
9195 -751600 -428267 -197225 -209574 -264399 -151126 -81008 -154693 -326483 -52183 356639
9185 356639 606699 556285 765217 1018657 1408758 1989668 2543247 3244057 4264137 5267963
9175 5267963 6240524 7326131 7822984 7328662 6027270 4628819 3961885 3497213 2668559
9166 2668559 1992448 1564906 1307523 1097637 1018802 888708 675739 450305 546657 638518
9156 638518 744264 742429 240512 -279180 -494486 -346466 297062 1116926 1541142 1297875
9146 1297875 1280150 1193636 1125495 938838 812487 893370 1018289 1578936 1965560 1701148
9136 1701148 1252198 1068963 436188 -243771 -554311 -623968 -464223 -49569 353836 417888
9126 417888 197081 283215 560430 429029 285419 205189 87648 -123186 -397769 -277456
9116 -277456 43651 57676 -69839 -39244 11820 57923 82592 -128730 -410910 -392628 -248754
9105 -248754 -101546 33416 -243085 -804576 -801217 -428700 -380967 -402115 -752312 -331590
9095 -331590 289177 243938 -306003 -654987 -308776 145351 373373 476496 175078 -418899
9085 -418899 -832808 -560068 -264434 -654654 -820522 -902889 -1020467 -953490 -709227 -50591
9075 -50591 520351 544823 341024 372420 256529 -43244 -398272 -795033 -1034309 -858588
9065 -858588 -592535 -243276 -257066 -710020 -852795 -643311 -237459 -74772 -312864 -625718
9055 -625718 -783900 -657492 -255714 175084 411854 606960 957874 1422334 1699305 1523297
9045 1523297 873989 476099 -23018 -230604 172126 239876 -117791 -442641 -615018 -292092
9035 -292092 497145 923324 913162 523275 436370 577124 584834 778648 714139 307885 -46905
9024 -46905 -127608 240267 489510 227502 16036 208070 647360 831585 720496 1046326
9014 1046326 798741 343205 160743 17964 -237819 -768409 -964561 -908928 -1004087 -1300208
9004 -1300208 -1400610 -1030361 -938061 -801782 -654905 -772198 -711304 -374230 59813 352991
8994 352991 443355 643535 533492 328777 401565 413479 375061 205627 235106 554419 904629
8983 904629 927964 897620 752648 384069 182774 38574 -96351 -272499 -185749 -156859
8973 -156859 -414625 -312631 -208066 -54237 -249154 -498767 -425351 -212875 214094 824822
8963 824822 1347271 1378948 940015 307834 12002 65294 -119813 -410058 -535334 -489210
8953 -489210 -482757 -614509 -287835 -17708 -367685 -781678 -735808 -491155 -511463 -604256 -768793
8942 -768793 -783838 -613999 -392923 -17707 -92687 -274181 4173 602908 934336 762600
8932 762600 621967 653279 847281 1462955 2120830 2551632 3034396 3744021 4344407 4298932
8922 4298932 4242202 4499624 4446894 4104840 3535624 2883178 2192569 1577775 1411755 1149429
8912 1149429 881614 954828 1022785 866208 607484 384159 604894 885588 874528 927263
8902 927263 914119 610707 166382 -180032 -377106 -332659 -550980 -782748 -892900 -926652
8892 -926652 -1070194 -1095256 -1114081 -1090599 -1072973 -728377 -297769 107830 360732 383004 480600
8881 480600 608390 836174 1105040 1372128 1109927 272302 -518353 -770441 -491448 9805
8871 9805 293149 204522 29018 76650 37474 -91648 -271707 -188404 -385708 -323727 136145
8860 136145 352554 564513 280366 -299568 -439662 -236088 -500030 -992675 -1352198 -1249770
8850 -1249770 -736961 -386470 -220491 -293804 -264836 -561153 -1098487 -1120335 -1051358 -1469268
8840 -1469268 -1091651 -605591 -480682 -51783 358240 296686 212062 137339 72475 285581
8830 285581 187496 149326 181451 166245 409494 438495 249001 194338 393037 427168 579496
8819 579496 737684 580355 475053 90188 -236317 -74446 134637 157859 5410 80264
8809 80264 264491 153403 -52814 -38068 -156435 -315975 -8692 664486 863518 854716
8799 854716 1036715 1125849 1149785 943875 588978 51392 -375977 -724927 -958487 -1054330
8789 -1054330 -982476 -778469 -335620 -68403 -340409 -452016 -797872 -976344 -463456 -259112
8779 -259112 -287944 -195110 -129668 438765 1116000 1138431 675887 -84373 -491283 -381096
8769 -381096 -263240 -434857 -571569 -614464 -175232 224188 442557 323801 227673 130875
8759 130875 151527 121191 -424841 -752047 -426071 -130605 -253060 -247772 128176 350365
8749 350365 423356 538573 642355 950023 940509 524583 378031 237742 21830 -77273
8739 -77273 193461 571318 378702 75433 -196221 -221336 -242445 -460631 -658016 -703446
8729 -703446 -315686 12362 301308 510413 19406 -641881 -1046622 -1112500 -637284 -165188
8719 -165188 12487 321562 918668 1205734 1080132 970576 793061 304915 -195133 -774508
8709 -774508 -1347624 -1644378 -1436381 -943971 -475877 -246751 -201784 -70502 -210112 -496341
8699 -496341 -389693 -384942 -682813 -363314 7633 -201566 -444990 -759746 -823863 -683235
8689 -683235 -1080918 -1672828 -1758784 -1672783 -1681461 -1969829 -1643757 -767799 -86098 14801
8679 14801 -50312 192055 209597 13187 39467 293023 8160 -411750 -269688 -290225 -482174
8668 -482174 -476195 -557336 -707999 -978649 -742297 -116866 237371 77839 -379654 -444415
8658 -444415 -320739 75433 687984 802458 639828 334853 238739 -105374 -203541 120124
8648 120124 195853 208538 -88243 -421109 -27683 -102403 -248889 10809 39824 49808 -78168
8637 -78168 -79640 225350 339147 554401 631765 326282 96817 377935 983574 1108301
8627 1108301 642874 221341 120722 122699 -158445 -419733 -267771 285771 858789 1001829
8617 1001829 1027971 934064 538511 163618 -47583 202324 515889 857572 1050356 1054110
8607 1054110 1118684 1137698 1289377 1279790 1337836 1315908 841207 676196 478322 -143850 -68681
8596 -68681 294921 100510 -335395 -563883 -274349 -105692 -206076 61611 624664 1000745
8586 1000745 647512 -157345 -193424 271985 435332 201067 103005 -8489 -232895 -516163
8576 -516163 -872415 -1030344 -747976 -347439 -86176 -4881 -121476 83126 188639 223178
8566 223178 -214866 -385366 -448431 -175004 -341 88312 320526 439574 235586 -129255
8556 -129255 -593078 -995716 -798815 -570508 -428982 -133458 447321 462441 -106442 -514884
8546 -514884 -727433 -813043 -380808 118663 185479 -54516 -191583 -171400 -146969 -356457
8536 -356457 32260 784645 926492 847294 628188 5443 -508330 -758644 -663691 -223830
8526 -223830 -58326 138609 512231 670342 645686 514864 462850 45595 -620303 -633893
8516 -633893 -106205 238074 493350 622646 802130 911878 944408 835437 397176 315226
8506 315226 345314 322650 412762 370346 -209916 -151505 137836 -134753 -362549 -169980 -225358
8495 -225358 -236384 138238 319980 -48395 -760977 -1159025 -968931 -687069 -471751 -378193
8485 -378193 -77555 24565 -186576 -186246 -225242 -163130 -404883 -757793 -907225 -1050743 -1110047
8474 -1110047 -866344 -567492 -243959 124584 280966 -22731 -597919 -568211 -438939 -661440
8464 -661440 -550126 -272531 -327388 -504881 -294749 42633 1773 -37619 -36391 346807 790390
8453 790390 876129 768885 987295 1116658 732081 -90561 -739619 -718599 -382407 -316758
8443 -316758 -275889 47957 523180 976684 703247 524174 639172 525856 439999 417635
8433 417635 -92928 -489462 -355260 114679 297971 -92846 -619348 -678763 -469004 -253985
8423 -253985 11107 166240 313507 362202 -185675 -457070 -337682 -205008 66508 384682
8413 384682 721177 989553 852012 240654 -390621 -715042 -895692 -724203 -436521 -371220
8403 -371220 -409451 -572718 -392908 -170335 -488869 -967406 -1029522 -890427 -609139 -338440
8393 -338440 -437696 -265245 -90100 123829 282745 99285 250683 443335 428209 -26452
8383 -26452 -650835 -595107 -354856 -504218 -345037 176544 634751 415773 -77722 -526296
8373 -526296 -891051 -971623 -853395 -511487 -485952 -886804 -888721 -619126 -527762 -230267 -220034
8362 -220034 -352980 -522744 -791033 -1137496 -1344207 -1142935 -1134963 -1366700 -1442904 -1371465
8352 -1371465 -1322694 -1483026 -1456102 -951060 -249977 195752 122276 128235 356201 167554
8342 167554 183300 559967 737973 633007 270803 -9073 -96748 -486792 -708077 -486263
8332 -486263 -715669 -607709 -148100 -105332 -163787 1533 240048 104031 -22322 96336
8322 96336 148350 41668 -227317 -667161 -567758 -98487 162994 111972 262300 370146
8312 370146 27888 -288147 -423568 -34776 771958 1190879 1187761 879147 855292 1010442
8302 1010442 971747 446624 -76096 38275 404900 839936 1004286 1220882 1179536 973949
8292 973949 744124 319933 -85529 -303359 -298766 103153 678631 955737 792687 476374
8282 476374 335092 227245 22473 -213396 -420369 -468624 -475911 -86192 582850 901152
8272 901152 986677 840860 461709 -196637 -511871 -270078 27456 -91993 -328375 -283354
8262 -283354 -327094 -544114 -580885 -568082 -286683 -440085 -794269 -997821 -1091266 -1317329
8252 -1317329 -1355815 -1101366 -840334 -310075 -176012 -163015 416078 846783 768304 576490
8242 576490 523836 624400 606126 445217 -45918 -253639 -143013 -150155 -128744 -373550 -248765
8231 -248765 203931 272234 203885 317171 507506 435233 422620 429400 138581 12047 593410
8220 593410 726285 129383 -588146 -920901 -992482 -904576 -1138511 -952849 -604403 -145953
8210 -145953 43009 -160044 -201425 79126 704927 1189599 1426267 1503242 1681536 2016631
8200 2016631 1814952 1582956 1489634 1398137 1388820 1471533 1349994 1138153 1034226 803431
8190 803431 1053439 1491271 2084053 3144206 4316605 5675531 6740436 6949762 6552981
8181 6552981 5830603 4923160 4024262 3448860 2756721 2133867 1848197 1412271 1010230 904571
8171 904571 797574 544583 200520 -41222 -403626 -795005 -1008536 -1201093 -1180163 -1335816
8161 -1335816 -1476694 -1134447 -943332 -821969 -708459 -844456 -782878 -325026 -373461 -943081
8151 -943081 -1130686 -768935 -224324 216327 287182 -90987 -372459 -137966 121574 409197
8141 409197 576062 625226 655149 834433 815922 925028 579128 92257 112542 196886 355024
8130 355024 625885 988183 1083228 912823 562099 307469 -132225 -81965 -18261 -232124
8120 -232124 -97337 49203 -119465 -227461 -313918 -122793 356224 761124 491268 229421
8110 229421 -177799 -313079 -123945 -119261 -315135 -225487 -18415 116893 89825 -101276
8100 -101276 -235699 -273442 -420230 -669379 -737730 -509226 -3110 488005 553908 787164
8090 787164 991039 839724 560294 178042 -265351 -90910 556414 992487 885514 524557
8080 524557 618504 387360 -342071 -721650 -338407 234323 746515 562480 458360 246284
8070 246284 -352369 -828812 -827512 -526634 -377993 -522926 -451901 -523740 -566647 -550601 -577723
8059 -577723 -675103 -1003143 -1283254 -1154820 -698442 -261412 -211832 -420913 -477141 -459777
8049 -459777 -510569 -758617 -737164 -335176 -84670 -77454 -54563 59399 -143644 -564668 -767751
8038 -767751 -517617 -403203 -531518 -722513 -542435 -159596 -126803 73862 657883 880192
8028 880192 554364 379088 628594 1017666 790481 450378 457402 375886 469019 766552
8018 766552 922025 496108 24921 -108630 -276352 -402384 -227834 -48965 236013 549103
8008 549103 672465 685366 673290 742539 673252 345686 -102655 -404864 -525113 -523502 -473833
7997 -473833 -662438 -708962 -636129 -1152994 -1388384 -858489 -395642 -524731 -492267 -295598
7987 -295598 -360615 -241005 241585 489718 366114 345852 193829 -12389 -293664 -777662
7977 -777662 -1041862 -1001432 -704803 -342069 -322746 -477795 -693279 -650519 -494486 -557754
7967 -557754 -685945 -557338 -350214 -239689 -239311 -61910 77244 146324 -24043 -280846
7957 -280846 -496932 -785145 -905360 -869823 -697141 -323062 28987 172865 200789 294878
7947 294878 31164 -201669 -240526 -577491 -416904 191551 665679 922174 1018143 668777
7937 668777 7217 -191856 50173 188362 -65144 -210217 -353777 -443202 -521367 -332519
7927 -332519 268870 258875 83874 325009 465658 269368 -256749 -649052 -916338 -982605
7917 -982605 -620401 -272731 203140 883686 1005052 868709 809101 599025 446284 550990
7907 550990 497484 290001 282131 498445 893801 1588380 2281908 3395747 4326743 5663539
7897 5663539 8050207 10799912 10872262 8007100 5165292 3370864 2568123 2108493 1731680
7888 1731680 1660300 1945686 1874350 1758633 1585587 1159741 410081 65286 -41676 -382996
7878 -382996 -533253 -206296 -27275 43251 -178004 -539860 -778963 -839240 -881377 -947008
7868 -947008 -567615 211718 690831 744078 682652 365797 -87071 -60375 462223 989333
7858 989333 1046938 1489273 1560666 882544 241536 115773 399392 408240 246441 394925
7848 394925 654391 572297 273147 197289 596593 959945 1323476 1607988 1429738 1162332
7838 1162332 1061858 895803 821602 688947 337223 101787 -74467 84951 377360 441077
7828 441077 483210 493243 638324 786871 822283 795436 633299 258356 287299 512199 141791
7817 141791 -216686 -197232 -152188 -101627 -255666 -240522 -177645 -330845 -519649 -597471 -716032
7806 -716032 -923514 -1028430 -900240 -636420 -434015 -268226 -285042 -97928 181527 179593
7796 179593 -395911 -746767 -561208 -269216 -185674 -241261 263989 548616 197745 -109125
7786 -109125 -110446 332446 562222 685746 727157 1135680 1497583 1749161 1409246 546034
7776 546034 295420 567960 557221 238565 -90241 -378818 -559196 -658912 -506290 -78126
7766 -78126 214413 266381 439881 720574 753553 457173 282581 397849 289184 -116900
7756 -116900 39081 516635 945651 1221695 1161977 899367 465906 14692 -225344 55086
7746 55086 383435 138974 42314 267776 161722 220552 363223 207910 52813 278561
7736 278561 610747 521315 76693 -201796 -475396 -406240 -376444 -783259 -1058613 -1280023
7726 -1280023 -1427397 -1518553 -1507917 -1112610 -1007624 -1355598 -1402580 -1010195 -577695 -411194
7716 -411194 -529611 -583485 -514282 -313734 103163 203122 404256 577736 510801 498792 370352
7705 370352 213144 -14665 -275107 -648752 -751227 -712821 -363385 90027 135873 210432
7695 210432 480112 502617 476904 511609 662050 686381 832889 1269287 1281352 1064600 434571
7684 434571 91980 71249 -11418 -166296 -281172 -47643 163939 165213 321349 330751 499252
7673 499252 896577 1245642 1308798 1069009 1205696 1338345 1163482 796911 653940 572043
7663 572043 429096 539329 364768 206339 177206 -27092 -243797 -379605 -494903 -235642
7653 -235642 29117 47670 -37963 155688 488056 427030 -27338 -370587 -303247 -303169 -489287
7642 -489287 -397139 -226602 -484176 -918871 -1182040 -1098784 -1033902 -875541 -783117 -608032
7632 -608032 160809 513852 450330 507082 484326 257159 -147175 -687962 -785746 -645647
7622 -645647 -401430 131261 560279 424787 -174502 -848318 -1024315 -715176 -572659 -405486
7612 -405486 -379749 -516800 -435635 -263799 -483354 -837417 -921646 -1097628 -934961 -281079
7602 -281079 138874 11575 -335184 -882312 -1219211 -1073592 -714481 -356728 -13560 -44247
7592 -44247 -319339 -293428 194456 522576 505340 476073 400375 126497 -584843 -1188474 -994110
7581 -994110 -751851 -697159 -674967 -807247 -763046 -853586 -836014 -577944 -214116 135778 48848
7570 48848 -234777 -324940 -538970 -656310 -531206 -526823 -604122 -570719 -544700 -744335 -1167379
7559 -1167379 -1272601 -1017039 -814348 -995690 -826298 -60252 515986 553999 101675 -340058
7549 -340058 -633851 -786620 -712176 -511250 -624215 -860453 -834430 -257377 376484 360127
7539 360127 65365 -290046 -502845 -278944 -451496 -736482 -829843 -833004 -572115 -440514
7529 -440514 -536964 -778042 -841320 -667902 -625894 -538156 -496184 -106985 386046 698455 592123
7518 592123 717118 1129583 1182167 929490 415710 32738 -483854 -572490 -424195 -413299
7508 -413299 -111558 198231 -16889 -625503 -658106 -199193 -383960 -868375 -1086950 -921038
7498 -921038 -665928 -749533 -875536 -1016646 -1095793 -778663 -550595 -496123 -323077 -327575 -388755
7487 -388755 -298871 -58876 191751 131893 -351244 -668687 -406485 22959 -18877 -140639
7477 -140639 -426411 -808950 -1024049 -703613 167143 594591 372640 573481 963098 538203
7467 538203 -347143 -846143 -525572 347499 778383 807391 518236 248313 181509 -100158
$$ [...]
##END NTUPLES=NMR SPECTRUM
##END=
