##TITLE=C13_SL32-Dau(A)
 CDCl3, 20300 sc

 8.2.2022
##JCAMPDX= 6.0         $$ Bruker NMR JCAMP-DX V2.0
##DATA TYPE= NMR SPECTRUM
##DATA CLASS= NTUPLES
##ORIGIN= UXNMR, Bruker Analytische Messtechnik GmbH
##OWNER= root
$$ XWIN-NMR		Version 3.5
$$ Wed Feb  9 09:37:51 2022 Russian Standard Time (UT+4h)  she@DPX200
##.OBSERVE FREQUENCY= 50.327896
##.OBSERVE NUCLEUS= ^13C
##.ACQUISITION MODE= SIMULTANEOUS
##.ACQUISITION SCHEME= undefined
##.AVERAGES= 20300
##.DIGITISER RES= 17
##SPECTROMETER/DATA SYSTEM= spect
##.PULSE SEQUENCE= zgpg30
##.SOLVENT NAME= CDCl3
##.SHIFT REFERENCE= (INTERNAL, CDCl3, 0, 222.961)
##AUDIT TRAIL= $$ (NUMBER, WHEN, WHO, WHERE, WHAT)
$$ ##TITLE= Audit trail, XWIN-NMR		Version 3.5
$$ ##JCAMPDX= 5.01
$$ ##ORIGIN= Bruker BioSpin GmbH
$$ ##OWNER= she
$$ F:/spectra/data/she/nmr/c13/1/pdata/1/auditp.txt
$$ ##AUDIT TRAIL=  $$ (NUMBER, WHEN, WHO, WHERE, WHAT)
(   1,<2022-02-09 09:33:52.39 +0400>,<she>,<DPX200>,
      <created by zg, POWCHK disabled, PULCHK disabled
       terminated by command 'halt'
       configuration hash MD5:
       00 E9 B6 7A A2 85 ED C7 34 08 36 98 17 FE 4E 26
       data hash MD5: 32K
       CC FE 4B 0B 0B 55 58 4E 9A C0 9B CC 64 E5 4B 71>)
(   2,<2022-02-09 09:35:00.32 +0400>,<she>,<DPX200>,
      <Start of raw data processing
       efp BC_mod = 2 LB = 1 FT_mod = 6 PKNL = 1 PHC0 = -331.2094 PHC1 = 35.76232 SI = 32K 
       data hash MD5: 32K
       17 A8 E0 14 A8 B4 4B 00 4E 24 38 93 F6 E8 EB 61>)
(   3,<2022-02-09 09:35:15.40 +0400>,<she>,<DPX200>,
      <abs ABSG = 5 
       data hash MD5: 32K
       49 FE 6B B5 E1 55 B3 43 A9 A2 45 95 AE A2 B3 FF>)
(   4,<2022-02-09 09:35:44.95 +0400>,<she>,<DPX200>,
      <pk PHC0 = 2.634731 PHC1 = 0 
       data hash MD5: 32K
       F1 94 A3 90 91 91 FB AA 52 CB 4E 11 70 B8 A6 5C>)
(   5,<2022-02-09 09:35:49.51 +0400>,<she>,<DPX200>,
      <abs ABSG = 5 
       data hash MD5: 32K
       49 2E 6C 40 F0 52 70 61 85 D8 2C 48 DB 65 38 5C>)
(   6,<2022-02-09 09:36:23.95 +0400>,<she>,<DPX200>,
      <pk PHC0 = 0 PHC1 = 0 
       data hash MD5: 32K
       49 2E 6C 40 F0 52 70 61 85 D8 2C 48 DB 65 38 5C>)
$$ ##END=
$$ 
$$ hash MD5
$$ BB 2C AD 12 C4 1A BC E6 2D D2 51 0A 08 E6 54 87
##$RELAX= 
##$RELAX= 
##$RELAX= 
##$RELAX= 
##$RELAX= 
##$RELAX= 
##$RELAX= 
##$RELAX= 
$$ Bruker specific parameters
$$ --------------------------
##$DU= <F:/spectra>
##$EXPNO= 1
##$NAME= <c13>
##$PROCNO= 1
##$TYPE= <nmr>
##$USER= <she>
##$AMP= (0..31)
100 100 100 100 100 100 100 100 100 100 100 100 100 100 100 100 100 100 
100 100 100 100 100 100 100 100 100 100 100 100 100 100 
##$AQSEQ= 0
##$AQ_mod= 1
##$AUNM= <au_zg>
##$AUTOPOS= <>
##$BF1= 50.322709
##$BF2= 200.13
##$BF3= 50.322709
##$BF4= 500.13
##$BF5= 500.13
##$BF6= 500.13
##$BF7= 500.13
##$BF8= 500.13
##$BYTORDA= 1
##$CFDGTYP= 0
##$CFRGTYP= 5
##$CHEMSTR= <none>
##$CNST= (0..31)
1 1 145 1 1 1 1 1 1 1 1 1 1 1 1 1 1 1 1 1 1 1 1 1 1 1 1 1 1 1 1 1 
##$CPDPRG= <waltz16>
##$CPDPRG1= <>
##$CPDPRG2= <waltz16>
##$CPDPRG3= <>
##$CPDPRG4= <mlev>
$$ [...]
##$SUBNAM4= <"">
##$SUBNAM5= <"">
##$SUBNAM6= <"">
##$SUBNAM7= <"">
##$SUBNAM8= <"">
##$SUBNAM9= <"">
##$SW= 239.972175391363
##$SWIBOX= (0..15)
0 1 3 0 0 0 0 0 0 0 0 0 0 0 0 0 
##$SW_h= 12077.2946859903
##$TD= 32768
##$TD0= 1
##$TE= 0
##$TE2= 300
##$TE3= 300
##$TEG= 300
##$TL= (0..7)
120 120 120 120 120 120 120 120 
##$TP= (0..7)
150 150 150 150 150 150 150 150 
##$TP07= 0
##$TPNAME0= <>
##$TPNAME1= <>
##$TPNAME2= <>
##$TPNAME3= <>
##$TPNAME4= <>
##$TPNAME5= <>
##$TPNAME6= <>
##$TPNAME7= <>
##$TPOAL= (0..7)
0.5 0.5 0.5 0.5 0.5 0.5 0.5 0.5 
##$TPOFFS= (0..7)
0 0 0 0 0 0 0 0 
##$TUNHIN= 0
##$TUNHOUT= 0
##$TUNXOUT= 0
##$USERA1= <user>
##$USERA2= <user>
##$USERA3= <user>
##$USERA4= <user>
##$USERA5= <user>
##$V9= 5
##$VALIST= <valist>
##$VCLIST= <CCCCCCCCCCCCCCC>
##$VD= 0
##$VDLIST= <DDDDDDDDDDDDDDD>
##$VPLIST= <PPPPPPPPPPPPPPP>
##$VTLIST= <TTTTTTTTTTTTTTT>
##$WBST= 1024
##$WBSW= 4
##$XGAIN= (0..3)
0 0 0 0 
##$XL= 0
##$YL= 0
##$YMAX_a= 135077104
##$YMIN_a= -32908459
##$ZGOPTNS= <>
##$ZL1= 120
##$ZL2= 120
##$ZL3= 120
##$ZL4= 120
##$ABSF1= 222.961
##$ABSF2= -17.03589
##$ABSG= 5
##$ABSL= 3
##$ALPHA= 0
##$AQORDER= 0
##$ASSFAC= 0
##$ASSFACI= 0
##$ASSFACX= 0
##$ASSWID= 0
##$AUNMP= <proc_1d>
##$AZFE= 0.1
##$AZFW= 0.5
##$BCFW= 0
##$BC_mod= 2
##$BYTORDP= 0
##$COROFFS= 0
##$CY= -3
##$DATMOD= 1
##$DC= 0
##$DFILT= <>
##$DTYPP= 0
##$F1P= 0
##$F2P= 0
##$FCOR= 0.5
##$FTSIZE= 32768
##$FT_mod= 6
##$GAMMA= 0
##$GB= 0
##$INTBC= 1
##$INTSCL= 4.134877e-10
##$ISEN= 128
##$LB= 1
##$LEV0= 0
##$LPBIN= 0
##$MAXI= 10000
##$MC2= 0
##$MEAN= 0
##$ME_mod= 0
##$MI= 0.1934396
##$NCOEF= 0
##$NC_proc= 2
##$NLEV= 6
##$NOISF1= 120.0001
##$NOISF2= 80.00006
##$NSP= 0
##$NTH_PI= 0
##$NZP= 0
##$OFFSET= 222.961
##$PC= 1.4
##$PHC0= -328.5747
##$PHC1= 35.76232
##$PH_mod= 1
##$PKNL= yes
##$PPARMOD= 0
##$PSCAL= 0
##$PSIGN= 0
##$REVERSE= no
##$SF= 50.3227146458226
##$SI= 32768
##$SIGF1= 140
##$SIGF2= 120
##$SINO= 11.81781
##$SIOLD= 32768
##$SREGLST= <13C.CDCl3>
##$SSB= 0
##$STSI= 32768
##$STSR= 0
##$SW_p= 12077.2946859903
##$SYMM= 0
##$S_DEV= 0
##$TDeff= 32768
##$TDoff= 0
##$TI= <>
##$TILT= no
##$TM1= 0
##$TM2= 0
##$TOPLEV= 0
##$USERP1= <user>
##$USERP2= <user>
##$USERP3= <user>
##$USERP4= <user>
##$USERP5= <user>
##$WDW= 1
##$XDIM= 32768
##$YMAX_p= 267419709
##$YMIN_p= -2829159
$$ End of Bruker specific parameters
$$ ---------------------------------
##NTUPLES= NMR SPECTRUM
##VAR_NAME=  FREQUENCY,     SPECTRUM/REAL,   SPECTRUM/IMAG
##SYMBOL=    X,             R,               I
##VAR_TYPE=  INDEPENDENT,   DEPENDENT,       DEPENDENT
##VAR_FORM=  AFFN,          ASDF,            ASDF
##VAR_DIM=   32768,         32768,           32768
##UNITS=     HZ,            ARBITRARY UNITS, ARBITRARY UNITS
##FACTOR=    0.368581032318806, 1,           1
##FIRST=     11220.0027064323, 0,            0
##LAST=      -857.291979557962, 0,           0
##MIN=       -857.291979557962, -2829159,    0
##MAX=       11220.0027064323, 267419709,    0
$$ Real data points
##PAGE= N=1
##DATA TABLE= (X++(R..R)), XYDATA
$$ [...]
$$ plain form
15858 -25678 -525431 -715276 -573858 -456725 -751937 -914338 -356885 -116591 -78154 -81054
15848 -81054 -312925 -455241 -440593 -642879 -706539 -531436 -266463 -404925 -696655 -693092
15838 -693092 -834035 -466186 53801 151356 -24090 179575 565756 331281 -63742 -84650
15828 -84650 -68666 -406794 -702692 -689531 -797070 -907537 -525317 -65118 282528 337382
15818 337382 -18700 -167443 24160 38757 -239712 -209392 346695 894238 1455850 1406649
15808 1406649 990912 773615 694975 677418 820805 913763 786331 445598 371010 462025
15798 462025 435009 155903 409077 503553 488069 418346 458133 668179 154916 -332385
15788 -332385 -475335 -632748 -1022288 -778507 -438501 -548556 -763056 -1037086 -1190406 -839203
$$ packed form
15858b5678m99753j89845J41418J17133k95212j62401N57453K40294L8437k900
15848h1054k31871j42316J4648k02286o3660J75103K64973j38462k91730L563
15838f93092j40943L67849N19987R7555j75446K03665L86181k34475l95023k0908
15828h4650J5984l38128k95898J3161j07539j10467L82220M60199L47646N4854
15818C37382l56082j48743J91603J4597k78469L0320N56087N47543N61612m9201
15808A406649m15737k17297p8640j7557J43387R2958j27432l40733p4588R1015
15798D62025k7016k79106K53174R4476j5484o9723L9787K10046n13263m87301
15788c32385j42950j57413l89540K43781L40006j10055k14500k74030j53320L51203
$$ plain form
15778 -839203 -538717 -368864 -97801 251850 445522 796569 1012224 960538 843478 597230
15768 597230 4496 -331886 -419435 -357836 -425997 -820456 -556582 -233441 -365141 -444288
15758 -444288 -320940 -237135 -44171 217723 357019 461127 514204 337457 -20749 -511755
15748 -511755 -645396 -717131 -577649 -658475 -483834 -210046 -275933 -56189 184602 354268
15738 354268 312392 500000 683243 583512 303274 301910 166190 304917 510253 106343
15728 106343 -321621 -522372 -669053 -729689 -571865 -418893 -77784 129607 199109 21266
15718 21266 -297277 -351821 -228313 -436632 -764369 -1044283 -1139211 -1120303 -968528 -1030183
15708 -1030183 -1226638 -1115726 -970249 -670145 -340331 -321693 -481216 -837739 -1037653 -640655
$$ packed form
15778h39203L00486J69853K71063L49651J93672L51047K15655n1686j17060k46248
15768E97230n92734l36382q7549O1599o8161l94459K63874L23141j31700p9147
15758d44288J23348Q3805J92964K61894J39296J04108N3077j76747l58206m91006
15748e11755j33641p1735J39482q0826J74641K73788o5887K19744K40791J69666
15738C54268m1876J87608J83243r9731k80238j364j35720J38727K05336m03910
15728A06343m27964k00751j46681o0636J57824J52972L41109K07391O9502j77843
15718B1266l18543n4544J23508k08319l27737k79914r4928J8908J51775o1655
15708a030183j96455J10912J45477L00104L29814J8638j59523l56523j99914L96998
$$ plain form
15698 -640655 -437354 -643837 -563198 -694534 -1199241 -1660290 -1786802 -1399561 -811721 -358756
15688 -358756 -27399 28990 2562 195753 411242 506216 491706 300461 15526 -171396
15678 -171396 -168434 -232169 -528460 -724370 -942900 -817546 -552923 -320596 -95900 229560
15668 229560 85594 -115293 -212970 -243965 -179418 -210267 -231835 -49408 -78806 -305358 -171283
15657 -171283 233032 570219 344604 222955 20397 -67665 -17972 -254605 -790458 -1124998
15647 -1124998 -1242896 -1156314 -717625 -18043 351344 313273 250591 492422 622711 672820
15637 672820 568365 219924 236379 400217 210417 78779 23174 -53206 -240210 -30183
15627 -30183 303310 633333 870723 569794 43673 -266203 -643139 -885299 -651953 -342333
$$ packed form
15698f40655K03301k06483Q0639j31336n04707m61049j26512L87241N87840M52965
15688c58756L31357N6389k6428J93191K15489R4974j4510j91245k84935j86922
15678a71396K962o3735k96291j95910k18530J25354K64623K32327K24696L25460
15668B29560j43966k00887r7677l0995O4547l0849k1568J82427k9398k26552J34075
15657a71283M04315L37187k25615j21649k02558q8062M9693k36633n35853l34540
15647a124998j17898Q6582M38689O99582L69387l8071o2682K41831J30289N0109
15637F72820j04455l48441J6455J63838j89800j31638n5605p6380j87004K10027
15627c0183L33493L30023K37390l00929n26121l09876l76936k42160K33346L09620
$$ plain form
15617 -342333 -203448 -519641 -668272 -642480 -852159 -1029240 -891990 -616790 -569197 -274695
15607 -274695 234509 350141 -13475 -323724 -521145 -414598 -267592 -229878 -205989 -539796
15597 -539796 -627328 -632617 -344077 -119389 17932 153239 81877 -27854 -200820 -250501
15587 -250501 86288 203182 111131 122965 90247 -369314 -709163 -407541 -1145 259160
15577 259160 665997 553096 183651 -21697 -407682 -1065028 -1371684 -652456 151997 202749
15567 202749 193751 680954 856085 543576 210773 -115989 -322730 -195677 -491761 -802446
15557 -802446 -746505 -652420 -460972 -350808 -222992 -194801 -51596 243751 301572 -94977
15547 -94977 -622016 -679523 -602256 -378639 -69482 -126744 185174 813563 908115 491438
$$ packed form
15617c42333J38885l16193j48631K5792k09679j77081J37250K75200M7593K94502
15607b74695N09204J15632l63616l10249j97421J06547J47006L7714K3889l33807
15597e39796q7532n289K88540K24688J37321J35307p1362j09731j72966m9681
15587b50501L36789J16894r2051J1834l2718m59561l39849L01622M06396K60305
15577B59160M06837j12901l69445k05348l85985o57346l06656P19228Q04453N0752
15567B02749q998M87203J75131l12509l32803l26762k06741J27053k96084l10685
15557h02446N5941R4085J91448J10164J27816K8191J43205K95347N7821l96549
15547i4977n27039n7507P7267K23617L09157n7262L11918O28389R4552m16677
$$ plain form
15537 491438 39368 -111828 6727 443 1403 29929 -28154 -181679 -152804 62295 326576
15526 326576 354909 86265 -328260 -685419 -736885 -762961 -609436 -436513 -580903 -525671
15516 -525671 -398433 -344451 -260560 -100388 -387491 -670572 -646833 -579124 -851813 -1372577
15506 -1372577 -1603622 -1480388 -1427038 -1285660 -706958 -284888 -584393 -557889 -372042 -271002
15496 -271002 -14054 159770 158001 193016 104813 87776 5497 -240453 -562532 -740997 -701265
15485 -701265 -231931 204598 183733 215342 -193497 -752977 -865639 -430971 -266971 -229963
15475 -229963 112563 8640 -107149 38478 81257 -104533 -216319 -181833 -270154 -540616
15465 -540616 -833678 -1033589 -789863 -574535 -723376 -787641 -780806 -608791 -590891 -600587 -149323
$$ packed form
15537D91438m52070j51196J18555o284R60K8526n8083j53525K8875K15099K64281
15526C26576K8333k68644m14525l57159n1466k6076J53525J72923j44390N5232
15516e25671J27238N3982Q3891J60172k87103k83081K3739O7709k72689n20764
15506a372577k31045J23234N3350J41378N78702M22070k99505K6504J85847J01040
15496b71002K56948J73824j769L5015q8203j7037q2279k45950l22079j78465L9732
15485g01265M69334M36529k0865L1609m08839n59480j12662M34668J64000L7008
15475b29963L42526j03923j15789J45627M2779j85790j11786L4486q8321k70462
15465e40616k93062j99911K43726K15328j48841o4265O835J72015J7900r696M51264
$$ plain form
15454 -149323 273269 189577 187555 234162 -237469 -735694 -748106 -729116 -541932 -576282 -585190
15443 -585190 -539563 -622792 -707270 -384279 -370220 -518945 -466103 -321126 -280110 -271302 -76135
15432 -76135 377505 266090 22845 263 98109 195328 239474 205693 194845 -42433 -44322
15421 -44322 7344 367135 387877 -124316 -586671 -318053 -56833 -172972 -211255 -253
15411 -253 531449 279876 -137447 -195984 -353809 -738120 -1074776 -919254 -492663 -437470
15401 -437470 -599005 -518025 -298405 -487623 -679850 -636682 -915734 -970907 -728203 -592613
15391 -592613 -532567 -596145 -430527 170330 345586 -94360 -486267 -544580 13838 396240
15381 396240 356345 337827 265362 259099 209309 457473 748405 830075 428660 -156599 106643
$$ packed form
15454a49323M22592q3692k022M6607m71631m98225j2412J8990J87184l4350q908
15443e85190M5627q3229q4478L22991J4059j48725N2842J44977M1016Q808J95167
15432g6135M53640j11415k43245k2582R7846R7219M4146l3781j0848k37278j889
15421d4322N1666L59791K0742n12193m62355K68618K61220j16139l8283K11002
15411b53N31702k51573m17323n8537j57825l84311l36656J55522M26591N5193
15401d37470j61535Q0980K19620j89218j92227M3168k79052n5173K42704J35590
15391e92613O0046o3578J65618O00857J75256m39946l91907n8313N58418L82402
15381C96240l9895j8518p2465o263m9790K48164K90932Q1670m01415n85259K63242
$$ plain form
15370 106643 431647 311689 128909 140259 12277 -86224 -221617 -261914 -229562 -335390
15360 -335390 -266415 -280406 -274122 -458462 -802335 -895578 -926117 -1028655 -1338272 -1283912 -1031013
15349 -1031013 -1060712 -665723 24815 170469 -125719 -492157 -663035 -514000 -563334 -788575
15339 -788575 -834713 -543979 -240723 -158253 -289685 -421390 -579259 -539042 -539217 -327342 -184270
15328 -184270 -231617 -747602 -773594 -310333 -341344 -375733 -499800 -554175 -521734 -283095 -145474
15317 -145474 -186347 -330687 -642329 -769270 -556690 -297688 -476143 -723344 -1026514 -1151179
15307 -1151179 -977757 -1147199 -1361148 -1049060 -483661 -510442 -740923 -710317 -157663 67887
15297 67887 -97549 -232713 -179451 -115239 577 430371 759039 773318 537257 382170
$$ packed form
15370A06643L25004j19958j82780J1350j27982r8501j35393m0297L2352j05828
15360c35390O8975j3991O284j84340l43873r3243l0539j02538l09617N4360K52899
15349a031013k9699L94989O90538J45654k96188l66438j70878J49035m9334k25241
15339g88575m6138K90734L03256Q2470j31432j31705j57869M0217j75K11875J43072
15328a84270m7347n15985k5992M63261l1011l4389j24067n4375L2441K38639J37621
15317a45474m0873j44340l11642j26941K12580K59002j78455k47201l03170j24665
15307a151179J73422j69442k13949L12088N65399k6781k30481L0606N52654K25550
15297F7887j65436j35164N3262O4212J15816M29794L28668J4279k36061j55087
$$ plain form
15287 382170 338416 109009 76361 141675 -66893 -143515 -298077 -572905 -603932 -289171
15277 -289171 9768 -266158 -851177 -1005681 -953170 -1130386 -900919 -273046 324814 497372
15267 497372 267425 -109635 -309518 -458395 -231307 151090 168329 32750 519770 655895
15257 655895 128564 123441 268276 356298 650671 774924 524122 -46118 -420707 -285925
15247 -285925 873 -141859 -493823 -586264 -607706 -443384 -407729 -452101 -694689 -1037272
15237 -1037272 -944111 -845834 -615717 -702366 -773575 -519726 -314480 -262871 -378480 -214427
15227 -214427 -265126 -590750 -942466 -879574 -461166 8818 17045 64061 264061 -32979
15217 -32979 -766389 -1361937 -1293903 -800949 -226570 -142744 -220799 -288558 -29885 359799
$$ packed form
15287C82170m3754k29407l2648O5314k08568p6622j54562k74828l1027L14761
15277b89171K98939k75926n85019j54504N2511j77216K29467O27873N97860J72558
15267D97372k29947l77060j99883j48877K27088L82397J7239j35579M87020J36125
15257F55895n27331n123J44835Q8022K94373J24253k50802n70240l74589J34782
15247b85925K86798j42732l51964r2441k1442J64322L5655m4372k42588l42583
15237a037272R3161R8277K30117q6649p1209K53849K05246N1609j15609J64053
15227b14427n0699l25624l51716O2892M18408M69984Q227M7016K00000k97040
15217c2979p33410n95548O8034M92954N74379Q3826p8055o7759K58673L89684
$$ plain form
15207 359799 537500 567007 431661 242204 372205 463982 451495 225408 316576 230029
15197 230029 -134 -272046 -540942 -589865 -338185 -177150 -291417 -525918 -471734 -299706
15187 -299706 -237357 323465 674769 592137 497553 281200 231849 593936 686604 326523
15177 326523 237282 -83914 -483179 -190380 70316 -289539 -656550 -387688 -72846 158450
15167 158450 402084 309620 36914 -108656 213787 93913 -265559 -481093 -151025 -123120
15157 -123120 -304387 -395114 -349252 21505 119238 -399944 -856522 -925302 -597195 -174976
15147 -174976 -121402 -350295 -436055 -422711 -585800 -643827 -724987 -794799 -789846 -735076 -266853
15136 -266853 174150 477090 733092 516574 198367 -252450 -544608 -324621 -320541 -590442
$$ packed form
15207C59799J77701K9507j35346j89457J30001R1777j2487k26087R1168q6547
15197B30029k30163k71912k68896m8923K51680J61035j14267k34501N4184J72028
15187b99706O2349N60822L51304q2632r4584k16353m9351L62087R2668l60081
15177C26523q9241l21196l99265K92799K60696l59855l67011K68862L14842K31296
15167A58450K43634r2464k72706j45570L22443j19874l59472k15534L30068K7905
15157a23120j81267r0727M5862L70757R7733n19182m56578o8780L28107M22219
15147a74976N3574k28893q5760J3344j63089n8027q1160o9812M953N4770M68223
15136b66853M41003L02940K56002k16518l18207m50817k92158K19987M080k69901
$$ plain form
15126 -590442 -708880 -727256 -414368 -179057 -230151 -32790 284361 397188 535925 752841
15116 752841 796630 913454 874027 555871 672492 897998 675587 574901 609112 325876
15106 325876 -82303 20270 268982 350507 229513 194608 13312 -171682 -103243 -164227
15096 -164227 -642202 -761211 -448908 -201782 117622 161080 212111 -106599 -105612 -234980
15086 -234980 -324715 -62057 196017 454318 471621 324922 -176254 -243852 210750 202883
15076 202883 231946 297474 208868 77992 109184 131981 -18834 -463187 -743566 -525056
15066 -525056 -28470 506117 605316 -6928 -402251 -691721 -481590 -32 351609 425700
15056 425700 431547 477284 455192 119354 -349516 -721700 -779716 -459274 15234 -2519 -238476
$$ packed form
15126e90442j18438j8376L12888K35311n1094J97361L17151J12827J38737K16916
15116G52841M3789J16824l9427l18156J16621K25506k22411j00686L4211k83236
15106C25876m08179J02573K48712Q1525j20994l4905j81296j84994O8439o0984
15096a64227m77975j19009L12303K47126L19404M3458N1031l18710R87j29368
15086b34980q9735K62658K58074K58301J7303j46699n01176o7598M54602p867
15076B02883K9063O5528q8606j30876L1192K2797j50815m44353k80379K18510
15066e25056M96586N34587R9199o12244l95323k89470K10131M81558L51641P4091
15056D25700N847M5737k2092l35838m68870l72184n8016L20442M74508j7753k35957
$$ plain form
15045 -238476 -503749 -448743 -134288 -184750 -580247 -678745 -566422 -700090 -922867 -1160274
15035 -1160274 -1025665 -730890 -439135 -361461 -228981 -67467 -80970 118202 257517 328458
15025 328458 380850 218706 154012 74421 -72599 412652 840204 889607 890203 1187137 1263656
15014 1263656 967984 490275 173382 325157 -38075 -515995 -814218 -875219 -1237845 -1643148
15004 -1643148 -1300917 -583747 -579450 -521482 -440130 -853511 -815629 -549715 -257034 -89862
14994 -89862 -200808 -441410 -321033 -84151 -157769 -368997 -464253 -783281 -959731 -1029762
14984 -1029762 -794485 -535714 -372367 -292653 -380583 -207507 143934 156161 -275543 -393071
14974 -393071 -368318 -569236 -905587 -1140151 -1339243 -1615276 -1478261 -1299830 -1447012 -1347204
$$ packed form
15045b38476k65273N5006L14455n0462l95497r8498J12323j33668k22777k37407
15035a160274J34609K94775K91755P7674J32480J61514j3503J99172J39315P0941
15025C28458N2392j62144o4694p9591j47020M85251M27552M9403N96K96934P6519
15014A263656k95672m77709l16893J51775l63232m77920k98223o1001l62626m05303
15004a643148L42231P17170M297N7968Q1352m13381L7882K65914K92681J67172
14994h9862j10946k40602J20377K36882p3618k11228r5256l19028j76450p0031
14984a029762K35277K58771J63347P9714q7930J73076L51441J2227m31704j17528
14974c93071K4753k00918l36351k34564j99092k76033J37015J78431j47182R9808
$$ plain form
14964 -1347204 -855133 -430373 -116494 -71115 -181890 -605660 -961411 -1089738 -781917 -605425
14954 -605425 -362255 -472718 -937048 -731836 -383757 -411529 -509418 -662054 -664659 -531038
14944 -531038 -359113 -208506 -135770 72582 240843 139698 220747 253024 14154 152506
14934 152506 87967 -445545 -726475 -541833 -143646 389480 607959 355423 91861 39361
14924 39361 -63927 238967 590555 682765 821209 1060732 1058075 597076 687205 1050498
14914 1050498 1014576 818823 596837 652981 791973 450210 -11125 -144663 -121528 -510401
14904 -510401 -751793 -701576 -720725 -1016179 -1346971 -1324468 -1208036 -1306009 -1181726 -917734
14894 -917734 -606206 -366778 -258160 -234509 -233655 -223808 -86454 79225 113219 203143 370638
$$ packed form
14964a347204M92071M24760L13879M5379j10775m23770l55751j28327L07821J76492
14954f05425K43170j10463m64330K05212L48079k7772r7889j52636k605J33621
14944e31038J71925J50607P2736K08352J68261j01145Q1049L2277k38870J38352
14934A52506o4539n33512k80930J84642L98187N33126K18479k52536k63562n2500
14924C9361j03288L02894L51588R2210J38444K39523k657m60999R0129L63293
14914A050498l5922j95753k21986N6144J38992l41763m61335j33538K3135l88873
14904e10401k41392N0217j9149k95454l30792K2503J16432r7973J24283K63992
14894i17734L11528K39428J08618K3651Q54R847J37354J65679L3994Q9924J67495
$$ plain form
14883 370638 620650 783726 767710 887242 785604 463042 312903 316390 141077 -276926
14873 -276926 -487298 -609914 -426381 -298868 -211216 -73871 -386973 -826787 -498719 -110111
14863 -110111 -191957 -284574 -184956 -375750 -632795 -398000 -126857 -168155 43639 -3352
14853 -3352 -405257 -563688 -751294 -1011520 -1303583 -1402882 -1188486 -1308286 -1270308 -909669
14843 -909669 -584899 -619161 -1015641 -1111792 -749473 -703982 -725561 -560015 -441884 -483645
14833 -483645 -350244 154615 191423 -232638 -497416 -488852 -190063 192658 105388 -215196
14823 -215196 -544042 -507490 -170254 -82770 320179 706890 904945 950047 595897 202439
14813 202439 46071 229183 707808 610680 503800 336944 506660 421034 272660 346255
$$ packed form
14883C70638K50012J63076j6016J19532j01638l22562j50139L487j75313m18003
14873b76926k10372j22616J83533J27513Q7652J37345l13102m39814L28068L88608
14863a10111q1846r2617R9618j90794k57045K34795K71143m1298K11794m6991
14853c352m01905j58431j87606k60226k92063r9299K14396j19800L7978L60639
14843i09669L24770l4262l96480r6151L62319M5491k1579J65546J18131m1761
14833d83645J33401N04859L6808m24061k64778Q564K98789L82721q7270l20584
14823b15196l28846L6552L37236Q7484M02949L86711J98055M5102l54150l93458
14813B02439j56368J83112M78625r7128j06880j66856J69716q5626j48374P3595
$$ plain form
14803 346255 378071 472273 335504 236379 272773 40323 -339072 -501891 -297566 -260624
14793 -260624 -248129 -170633 -437649 -331760 -102940 -174017 -300173 -379551 -501847 -861448
14783 -861448 -1007881 -1191723 -1339807 -672306 113853 336785 46206 111230 324579 518481
14773 518481 756994 713917 544421 243234 -14737 -191715 -177071 41680 587941 691662
14763 691662 481822 198830 -171227 -167814 -85984 -406554 -461941 -318519 -113295 97033
14753 97033 -62098 -153339 535974 858341 427539 86292 -203912 -584077 -733249 -778025
14743 -778025 -800984 -1081034 -1220108 -823867 -584508 -590359 -181399 440155 811750 812593 554864
14732 554864 232990 -157549 -189118 -176939 -49040 39260 78721 204045 190260 41662
$$ packed form
14803C46255L1816R4202j36769r9125L6394k32450l79395j62819K04325L6942
14793b60624J2495P7496k67016J05889K28820p1077j26156p9378j22296l59601
14783h61448j46433j83842j48084O67501P86159K22932k90579O5024K13349J93902
14773E18481K38513m3077j69496l01187k57971j76978J4644K18751N46261J03721
14763F91662k09840k82992l70057L413Q1830l20570n5387J43422K05224K10328
14753I7033j59131r1241O89313L22367m30802l41247k90204l80165j49172m4776
14743g78025k2959k80050j39074L96241K39359n851M08960O21554L71595Q43k57729
14732E54864l21874l90539l1569J2179J27899Q8300L9461J25324j3785j48598
$$ plain form
14722 41662 165932 366122 286839 321968 449635 317862 125596 -67409 -448362 -455325
14712 -455325 -417414 -386937 -342264 -552800 -816043 -559354 -564727 -835294 -615216 -322172
14702 -322172 -406107 -405063 -406318 -317627 -608227 -860412 -978540 -959246 -625605 -319472 -483837
14691 -483837 -959617 -828862 -534221 -385267 -394177 -224435 -72993 5880 328809 492274
14681 492274 41870 -435183 -428443 -355394 -505400 -556874 -302070 76282 264153 727657
14671 727657 774412 446584 127024 -102364 -94001 -317194 -626592 -634462 -483201 -358185
14661 -358185 -461750 -458458 -756910 -839914 -457513 -205437 9630 318583 483284 -8466
14651 -8466 -338146 43533 341433 537075 852162 1033726 837411 456488 -37280 -189248
$$ packed form
14722D1662J24270K00190p9283L5129J27667j31773j92266j93005l80953o963
14712d55325L7911L0477M4673k10536k63243K56689n373k70567K20078K93044
14702c22172q3935J044j255Q8691k90600k52185j18128J9294L33641L06133j64365
14691d83837m75780J30755K94641J48954q910J69742J51442P8873L22929J63465
14681D92274m50404m77053O740P3049j50006n1474K54804L78352J87871M63504
14671G27657M6755l27828l19560k29388Q363k23193l09398p870J51261J25016
14661c58185j03565L292k98452q3004L82401K52076K15067L08953J64701m91750
14651h466l29680L81679K97900J95642L15087J81564j96315l80923m93768j51968
$$ plain form
14641 -189248 11178 349731 341444 292177 345704 605496 758154 690489 750334 975115 1056753
14630 1056753 497254 71405 295742 293947 193603 502569 542405 238702 153470 434648
14620 434648 451722 423501 594579 652139 410047 337332 192441 101679 153916 -159038 -748963
14609 -748963 -1241455 -1400257 -1060858 -426909 71119 558951 834126 951113 862988 171187
14599 171187 77465 465576 265718 262200 18902 -456334 -216544 355989 547136 700822
14589 700822 464741 -46374 -602983 -633953 -317381 -87604 -361370 -470026 20343 559807
14579 559807 593043 127739 -279585 -469101 -138827 -19121 -321619 -436643 -174259 112052
14569 112052 -67620 -22929 -81794 -321706 -658608 -964327 -902210 -667460 -404946 -79046
$$ packed form
14641a89248K00426L38553q287m9267N3527K59792J52658o7665N9845K24781Q1638
14630A056753n59499m25849K24337j795j00344L08966L9836l03703q5232K81178
14620D34648J7074k8221J71078N7560k42092p2715j44891r0762N2237l12954n89925
14609g48963m92492j58802L39399O33949M98028M87832K75175J16987q8125o91801
14599A71187r3722L88111j99858l518k43298m75236K39790N72533J91147J53686
14589G00822k36081n11115n56609l0970L16572K29777k73766j08656M90369N39464
14579E59807L3236m65304m07324j89516L30274J19706l02498j15024K62384K86311
14569A12052j79672M4691n8865k39912l36902l05719O2117K34750K62514L25900
$$ plain form
14559 -79046 199250 416248 301305 -217376 -774163 -703733 -412727 -610336 -807291 -585406
14549 -585406 -365504 52399 614139 1053469 899294 445675 201486 45548 -301640 -343115
14539 -343115 -54216 256304 -22678 -403147 -197172 -161395 -118085 25758 64272 -22335
14529 -22335 -420885 -953470 -954975 -811617 -1051604 -1185552 -1034507 -667116 -643126 -1188696
14519 -1188696 -1103652 -679015 -512607 -308045 -98883 60328 135142 351495 544569 778538
14509 778538 455265 -156392 -29009 537979 769945 295463 -452120 -969867 -756408 -243860
14499 -243860 -61324 253263 648216 396778 -324902 -629060 -564403 -615372 -553305 -603287
14489 -603287 -396916 -81109 197289 353102 519452 1004536 1201990 1055936 988336 858114
$$ packed form
14559g9046K78296K16998j14943n18681n56787P0430K91006j97609j96955K21885
14549e85406K19902M17903N61740M39330j54175m53619k44189j55938l47188m1475
14539c43115K88899L10520k78982l80469K05975L5777M3310J43843L8514q6607
14529b2335l98550n32585j505J43358k39987j33948J51045L67391K3990n45570
14519a188696Q5044M24637J66408K04562K09162J59211P4814K16353J93074K33969
14509G78538l23273o11657J27383N66988K31966m74482p47583n17747K13459N12548
14499b43860J82536L14587L94953k51438p21680l04158O4657n0969O2067m9982
14489f03287K06371L15807K78398J55813J66350M85084J97454j46054o7600j30222
$$ plain form
14479 858114 726527 524124 169141 -188618 -226864 104879 456980 515461 570163 877091
14469 877091 1143903 775976 402255 413122 300933 82449 -445439 -778128 -505645 -562807
14459 -562807 -598441 -604227 -497357 -141747 161014 173898 -209992 -90276 215833 169372
14449 169372 353000 439040 766 -555694 -830442 -507243 -448239 -586515 -471763 -422028
14439 -422028 -426514 -120953 182231 313244 244797 25817 -12731 -99306 -65041 -73042 25106
14428 25106 335557 1081393 1216561 483123 -143470 -270033 -245549 -86309 454236 929373
14418 929373 955963 728287 311310 -160596 -365435 -507853 -652345 -666755 -431625 -506591
14408 -506591 -889144 -1254096 -1281821 -1134488 -799294 -179582 303343 250884 98793 240262
$$ packed form
14479H58114j31587k02403l54983l57759l8246L31743L52101N8481N4702L06928
14469H77091K66812l67927l73721J0867j12189k18484n27888l32689K72483n7162
14459e62807l5634n786J06870L55610L02761J2884l83890J19716L06109m6461
14449A69372J83628Q6040m38274n56460k74748L23199N9004j38276J14752M9735
14439d22028m486L05561L03184J31013o8447k18980l8548q6575L4265q001R8148
14428B5106L10451P45836J35168p33438o26593j26563K4484J59240N40545M75137
14418I29373K6590k27676m16977m71906k04839j42418j44492j4410K35130p4966
14408e06591l82553l64952k7725J47333L35194O19712M82925n2459j52091J41469
$$ plain form
14398 240262 338510 598608 500746 126455 -30497 198690 239219 35055 -199854 -349302
14388 -349302 -332838 -504338 -894889 -912241 -662028 -535294 -397845 -296755 -277287 -90119
14378 -90119 211482 398974 333618 185524 -94181 -183692 -291369 -424929 -442742 -79666
14368 -79666 404567 899338 1212561 1051692 783747 948339 1168398 604236 -91074 18079
14358 18079 267320 294786 190538 125501 -216514 -303258 -340618 -311262 -113807 -54223 109406
14347 109406 155383 -53940 -198778 -253988 -351173 -444583 -513710 -189750 -91770 -302567 -356183
14336 -356183 -167527 40022 -179963 -308920 -131088 78531 352519 636052 262940 -209156
14326 -209156 -272188 -42854 350900 300902 77327 75778 65633 216129 370966 159104
$$ packed form
14398B40262R8248K60098r7862l74291j56952K29187M0529k04164k34909j49448
14388c49302J6464j71500l90551j7352K50213J26734J37449J01090J9468J87168
14378i0119L01601J87492o5356j48094k79705q9511j07677j33560j7813L63076
14368g9666M84233M94771L13223j60869k67945J64592K20059n64162o95310J09153
14358A8079K49241K7466j04248o5037l42015q6744l7360K9356J97455N9584J63629
14347A09406M5977k09323j44838n5210r7185r3410o9127L23960R7980k10797n3616
14336c56183J88656K07549k19985j28957J77832K09619K73988K83533l73112m72096
14326b09156o3032K29334L93754m9998k23575j549j0145J50496J54837k11862
$$ plain form
14316 159104 -332698 -1125955 -1375468 -1114625 -624363 -693032 -704322 -999264 -1407575 -1420973
14306 -1420973 -1369185 -1202783 -1173625 -1329684 -1347311 -1218034 -1231289 -1055790 -272464 174304
14296 174304 244240 518841 428677 -190639 -788734 -731664 -563885 -660797 -461894 117141
14286 117141 661622 1011906 1081030 793441 454745 140403 188634 847529 1369667 1213925
14276 1213925 875350 715607 415295 181702 20503 -109702 -44449 -274341 -97959 450452
14266 450452 762141 951527 774299 163528 -33070 -147930 86171 507885 983730 800595
14256 800595 296611 230889 313618 78585 1854 47021 143162 111177 192878 346469 634035
14245 634035 940528 1151136 1422057 1398511 1318413 1220488 963307 619171 399731 313946
$$ packed form
14316A59104m91802p93257k49513K60843M90262o8669j1290k94942m08311j3398
14306a420973N1788J66402K9158j56059j7627J29277j3255J75499P83326M46768
14296A74304O9936K74601r0164o19316n98095N7070J67779r6912J98903N79035
14286A17141N44481L50284O9124k87589l38696l14342M8231O58895N22138j55742
14276A213925l38575j59743l00312k33593j61199j30205O5253k29892J76382N48411
14266D50452L11689J89386j77228o10771j96598j14860K34101M21714M75845j83135
14256H00595n03984o5722Q2729k35033p6731M5167R6141l1985Q1701J53591K87566
14245F34035L06493K10608K70921k3546q0098r7925k57181l44136k19440q5785
$$ plain form
14235 313946 116306 114702 22400 -148324 -10620 15091 -18714 -22984 299238 703306 579709
14224 579709 79186 -188298 -435832 -441198 -666655 -680940 -90584 241507 -2003 -205796
14214 -205796 -59754 -382112 -705747 -689757 -856359 -785289 -465879 -111147 387596 474093
14204 474093 129313 26506 102569 2489 -339060 -402358 -352442 -312978 -119889 -71270
14194 -71270 -66369 10146 -12266 -179462 -730930 -921339 -511952 -143857 51863 -99698
14184 -99698 -529166 -687096 -493614 -583668 -616523 -134082 -95161 -94990 519410 778781 584138
14173 584138 236740 -128957 -541403 -911394 -915239 -595126 -370572 -203998 -13718 -152315
14163 -152315 -246006 -429181 -256109 -420903 -540661 -665125 -675915 -545561 -572419 -686831
$$ packed form
14235C13946j97640j604r2302j70724J37704K5711l3805m270L22222M04068j23597
14224E79709n00523k67484k47534n366k25457j4285N90356L32091k43510k03793
14214b05796J46042l22358l23635J5990j66602P1070L19410L54732M98743Q6497
14204D74093l44780j02807P6063j00080l41549o3298M9916L9464J93089M8619
14194g1270M901P6515k2412j67196n51468j90409M09387L68095J95720j51561
14184i9698m29468j57930J93482r0054l2855M82441L8921J71O14400K59371j94643
14173E84138l47398l65697m12446l69991l845L20113K24554J66574J90280j38597
14163a52315r3691j83175J73072j64794j19758j24464j0790J30354k6858j14412
$$ plain form
14153 -686831 -892764 -831605 -917844 -854408 -487152 -44026 -72969 -218019 -243909 -632384
14143 -632384 -839791 -730659 -498099 -187075 173859 -135356 -260677 118515 114843 79312
14133 79312 130154 109618 -11841 -145347 -38792 -41807 -291072 -290792 -185947 -496895 -708882
14122 -708882 -800851 -463841 -145655 24585 472992 435216 169267 -75109 -347786 -371234
14112 -371234 4846 252308 41222 -351465 -349753 -408968 -356480 -209995 281942 586626
14102 586626 470538 320379 146324 125379 456269 575370 440636 554592 502911 411309
14092 411309 503606 366374 323388 364323 132306 -133799 -333578 -243230 -9505 193808
14082 193808 27485 -345938 -310132 150321 312401 426951 123351 -546772 -725100 -485806
$$ packed form
14153f86831k05933O1159q6239O3436L67256M43126k8943j45050k5890l88475
14143f32384k07407J09132K32560L11024L60934l09215j25321L79192l672l5531
14133G9312N0842k0536j21459j33506J06555l015k49265K80J04845l10948k11987
14122g08882r1969L37010L18186J70240M48407l7776k65949k44376k72677k3448
14112c71234L76080K47462k11086l92687J712n9215N2488J46485M91937L04684
14102E86626j16088j50159j74055k0945L30890J19101j34734J13956n1681r1602
14092D11309R2297j37232m2986M0935k32017k66105j99779R0348K33725K03313
14082A93808j66323l73423L5806M60453J62080J14550l03600o70123j78328K39294
$$ plain form
14072 -485806 -347110 -318940 -531287 -708963 -1340915 -1573030 -1521114 -1344829 -962209 -662806
14062 -662806 -663646 -716720 -521350 -81398 371862 458948 108834 -24337 -48605 90964 563417
14051 563417 378696 -210491 -122584 20696 -70034 -349079 -749920 -699709 -779443 -804330
14041 -804330 -878934 -776582 -411308 1353 194295 508108 594695 516962 195878 -22727
14031 -22727 89596 104838 211818 544897 471909 265832 191706 -267165 -636511 -1010138
14021 -1010138 -1326750 -1256351 -793576 -518272 -528836 -539252 -672588 -689252 -699751 -1013802
14011 -1013802 -1138254 -801700 -488361 -81071 27888 32356 -17954 -404727 -556218 -201677
14001 -201677 116038 96267 146599 28531 -125031 -458947 -537052 -89221 238680 458627
$$ packed form
14072d85806J38696K8170k12347j77676o31952k32115N1916J76285L82620K99403
14062f62806q40n3074J95370M39952M53260Q7086l50114j33171k4268J39569M72453
14051E63417j84721n89187Q7907J43280r0730k79045m00841N0211p9734k4887
14041h04330p4604J02352L65274M12661J92942L13813Q6587p7733l21084k18605
14031b2727J12323J5242J06980L33079p2988k06077p4126m58871l69346l73627
14021a010138l16612P0399M62775K75304j0564j0416j33336j6664j0499l14051
14011a013802j24452L36554L13339M07290J08959M468n0310l86773j51491L54541
14001b01677L17715j9771N0332j18068j53562l33916p8105M47831L27901K19947
$$ plain form
13991 458627 516635 341448 -378392 -577930 -272733 -166543 -326935 -416107 -94548 582626
13981 582626 769679 569528 114390 -63436 52182 57294 168261 218162 313107 229172
13971 229172 280691 145297 -164014 -291816 -447205 -626074 -494245 -32556 -345058 -777596
13961 -777596 -446323 -304842 -482005 -213756 136458 268618 344049 144121 -41156 249739
13951 249739 390801 -263365 -913511 -740880 -279305 -258108 -680745 -929368 -641524 -118941
13941 -118941 220070 333378 257067 -212135 -913644 -1307383 -1384412 -1167484 -917350 -762071
13931 -762071 -372436 94223 453391 389239 -104442 -390044 -675271 -515980 -32090 274786
13921 274786 337575 234621 242852 362473 386123 201647 184627 -54841 -214554 -47259
$$ packed form
13991D58627N8008j75187p19840j99538L05197J06190j60392q9172L21559O77174
13981E82626J87053k00151m55138j77826J15618N112J10967M9901R4945q3935
13971B29172N1519j35394l09311j27802j55389j78869J31829M61689l12502m32538
13961g77596L31273J41481j77163K68249L50214J32160P5431j99928j85277K90895
13951B49739J41062o54166o50146J72631M61575K1197m22637k48623K87844N22583
13941a18941L39011J13308p6311m69202p01509l93739p7029K16928K50134J55279
13931g62071L89635M66659L59168o4152m93681k85602k85227J59291M83890L06876
13921B74786O2789j02954Q231J19621K3650j84476j7020k39468j59713J67295
$$ plain form
13911 -47259 81599 43654 -28543 32567 -44175 -14694 81021 105239 136259 655915 951017
13900 951017 761975 957316 1274190 1426020 1540558 1591953 1359180 1088428 1029355 862272
13890 862272 636891 442144 196746 65601 -299999 -961401 -1474043 -1651153 -1466156 -1221626
13880 -1221626 -1331838 -1293020 -1006730 -574828 -415594 -425680 -326526 -370746 -264321 -714426
13870 -714426 -1170465 -825944 -414140 -351379 -347395 25210 396250 420674 -41091 -523800
13860 -523800 -785873 -912483 -783768 -318736 129094 307981 16544 -269347 -361019 -83725
13850 -83725 227974 -136878 -433446 -447421 -340389 -143260 29760 73404 -22075 39817
13840 39817 -227579 -282808 -559975 -983200 -882429 -665903 -592083 -191000 237502 281830
$$ packed form
13911d7259J28858l7945p2197O1110p6742K9481R5715K4218L1020N19656K95102
13900I51017j89042J95341L16874J51830J14538N1395k32773k70752n9073j67083
13890H62272k25381j94747k45398j31145l65600o61402n12642j77110J84997K44530
13880a221626j10212L8818K86290M31902J59234j0086R9154m4220J06425m50105
13870g14426m56039L44521M11804O2761L984L72605L71040K4424m61765m82709
13860e23800k62073j26610J28715M65032M47830J78887k91437k85891r1672K77294
13850h3725L11699l64852k96568j3975J07032J97129J73020M3644r5479O1892
13840C9817k67396n5229k77167m23225J00771K16526P3820M01083M28502M4328
$$ plain form
13830 281830 403135 612601 663626 223040 172217 237961 158453 277945 160747 -41949
13820 -41949 -292573 -711704 -893331 -954977 -626702 -581947 -879218 -882188 -224450 353034
13810 353034 457419 416678 244736 -96904 -340388 -672303 -975681 -751034 -700112 -1017843
13800 -1017843 -430912 199131 -118977 -710628 -1006287 -768793 -860540 -1034829 -616838 -56453
13790 -56453 153011 73825 160402 185611 355387 350694 -8307 -303712 -442158 -374813 -136338
13779 -136338 -38970 212622 400343 314505 399577 495606 497843 131451 -449824 -745092 -982717
13768 -982717 -681207 -391943 -338080 -29377 612421 873441 354844 -368786 -1127359 -1277819
13758 -1277819 -852169 -438658 -221149 -311147 -299519 -226600 -318516 -477327 -415812 -343788
$$ packed form
13830B81830J21305K09466N1025m40586n0823O5744p9508J19492j17198k02696
13820d1949k50624m19131j81627o1646L28275M4755k97271k970O57738N77484
13810C53034J04385m0741j71942l41640k43484l31915l03378K24647N0922l17731
13800a017843N86931O30043l18108n91651k95659K37494r1747j74289M17991N60385
13790e6453K09464p9186Q6577K5209J69776m693l59001k95405j38446O7345K38475
13779a36338R7368K51592J87721q5838Q5072R6029K237l66392n81275k95268k37625
13768i82717L01510K89264N3863L08703O41798K61020n18597p23630p58573j50460
13758a277819M25650M13511K17509q9998J1628P2919r1916j58811O1515P2024
$$ plain form
13748 -343788 -330948 -92062 -22727 -249000 -511066 -557274 -534646 -377818 -307575 -323323 -452679
13737 -452679 -674320 -761188 -552767 -307045 -209584 42065 250633 11990 -331586 -389883
13727 -389883 -249103 -73269 469441 930908 1063514 1077067 866830 324348 115022 87552
13717 87552 35479 260375 415663 458287 615185 699000 902572 976065 763947 613975
13707 613975 721935 585886 -200203 -992684 -909780 -875722 -1135703 -1440937 -1370867 -1184737
13697 -1184737 -1165796 -1262112 -1153055 -541324 -100847 -233886 -211239 -177767 -559431 -692339
13687 -692339 -675975 -958566 -1056165 -757999 -363332 -173323 -22533 391146 683516 619145
13677 619145 513901 666089 1232243 1554101 1524705 1091845 905337 610481 279892 -36899
$$ packed form
13748c43788J2840K38886O9335k26273k62066m6208K2628J56828P0243j5748j29356
13737d52679k21641q6868K08421K45722R7461K51649K08568k38643l43576n8297
13727c89883J40780J75834N42710M61467J32606J3553k10237n42482k09326k7470
13717H7552n2073K24896J55288M2624J56898Q3815K03572P3493k12118j49972
13707F13975J07960j36049p86089p92481Q2904L4058k59981l05234P0070J86130
13697a184737J8941r6316J09057O11731M40477j33039K2647L3472l81664j32908
13687f92339J6364k82591r7599K98166L94667J90009J50790M13679K92370o4371
13677F19145j05244J52188N66154L21858k9396m32860j86508k94856l30589l16791
$$ plain form
13667 -36899 -197780 -8979 370226 545786 388948 515684 266334 -385890 -836559 -889456
13657 -889456 -824893 -894192 -849159 -429400 -200332 -58676 187957 533052 839189 1090050
13647 1090050 1356359 1417484 1315969 1182314 1172876 1145431 978964 1100855 1548059 1418746
13637 1418746 1010298 553407 170835 260666 485190 340801 -58036 -295509 -286003 -264232
13627 -264232 -139478 65295 -253615 -700203 -587527 -351679 -101901 -153047 -265279 -267377
13617 -267377 -361212 -684919 -777333 -681072 -580474 -461252 -632245 -486243 -240155 -395693
13607 -395693 -310928 -74421 55519 227859 354603 217168 -72394 -75043 2772 474012
13597 474012 690222 461927 453870 717835 1095894 1127850 1141239 1304135 1507924 1416620
$$ packed form
13667c6899j60881J88801L79205J75560j56838J26736k49350o52224m50669n2897
13657h89456O4563o9299M5033M19759K29068J41656K46633L45095L06137K50861
13647A090050K66309O1125j01515j33655r438k7445j66467J21891M47204j29313
13637A418746m08448m56891l82572Q9831K24524j44389l98837k37473R506K1771
13627b64232J24754K04773l18910m46588J12676K35848K49778n1146j12232k098
13617b67377r3835l23707r2414R6261J00598J19222j70993J46002K46088j55538
13607c95693Q4765K36507J29940J72340J26744j37435k89562k649P7815M71240
13597D74012K16210k28295q057K63965L78059L1956J3389J62896K03789r1304
$$ plain form
13587 1416620 877964 570231 506671 651858 887998 596242 317906 135963 3166 289292
13577 289292 722660 1108789 956410 535960 371715 329661 112938 -192029 -260288 -113591
13567 -113591 -106288 274585 414291 -14054 -520128 -412716 145864 608243 274302 -16125
13557 -16125 128972 340551 47128 -244408 -184037 -172237 -271955 -342979 -347902 -468032 -506337
13546 -506337 -567937 -471929 -332555 -605134 -858008 -887855 -544618 -284290 -783076 -1126053
13536 -1126053 -719009 -323705 -10086 -9267 -99711 -240896 -508727 -483759 -208321 -118338
13526 -118338 -467125 -90921 291923 94654 13801 14663 40900 301581 444685 159978
13516 159978 -236294 -411980 -659677 -782528 -846015 -568690 -247175 104784 378430 -174332
$$ packed form
13587A416620n38656l07733o3560J45187K36140k91756k78336j81943j32797K86126
13577B89292M33368L86129j52379m20450j64245m2054k16723l04967o8259J46697
13567a13591P303L80873J39706m28345n06074J07412N58580M62379l33941k90427
13557a6125J45097K11579k93423k91536O0371J1800r9718p1024m923j20130l8305
13546e06337o1600R6008J39374k72579k52874k9847L43237K60328m98786l42977
13536a126053M07044L95304L13619Q19r0444j41185k67831K4968K75438Q9983
13526a18338l48787L76204L82844j97269q0853Q62K6237K60681J43104k84707
13516A59978l96272j75686k47697j22851o3487K77325L21515L51959K73646n52762
$$ plain form
13506 -174332 -586603 -810519 -762301 -871518 -994668 -489749 143025 342406 78879 -400187
13496 -400187 -839852 -716343 -613263 -453973 -159012 114860 59136 205910 316565 451163
13486 451163 521398 208839 41242 -184285 -352187 -411576 -151453 113157 325628 -134373
13476 -134373 -609022 -774393 -529744 -215485 318150 802263 923137 719524 31088 -146151
13466 -146151 -24959 122766 371027 652904 818095 944435 1193337 949638 584296 13623
13456 13623 -217710 -247960 -353003 -210422 30097 144467 -158335 -583176 -834164 -823623
13446 -823623 -582461 -274114 -253037 -381696 -345969 -24836 274836 261122 -118656 -498437
13436 -498437 -417404 -72901 -103039 -260222 -243367 -321430 -405310 -256898 -181462 -333418 -333823
$$ packed form
13506a74332m12271k23916M8218j09217j23150N04919O32774J99381k63527m79066
13496d00187m39665J23509J03080J59290K94961K73872n5724J46774J10655J34598
13486D51163P0235l12559j67597k25527j67902n9389K60123K64610K12471m60001
13476a34373m74649j65371K44649L14259N33635M84113J20874k03613o88436j77239
13466a46151J21192J47725K48261K81877J65191J26340K48902k43699l65342n70673
13456A3623k31333l0250j05043J42581K40519J14370l02802m24841k50988J0541
13446h23623K41162L08347K1077j28659L5727L21133K99672j3714l79778l79781
13436d98437Q1033L44503l0138j57183J6855p8063q3880J48412P5436j51956m05
$$ plain form
13425 -333823 -303444 -345109 -147615 89671 70894 -112981 -423037 -820193 -868221 -583592
13415 -583592 -684071 -819158 -908526 -964477 -1087176 -933392 -793485 -742988 -427254 -305116
13405 -305116 -367213 -461039 -437043 -185378 -338874 -756349 -826833 -1048031 -1459824 -1541948
13395 -1541948 -1428069 -977387 -292554 148425 442478 499159 274481 -555492 -1384143 -1437991
13385 -1437991 -1169038 -811585 -553277 -389623 -292261 197620 578103 383513 301465 431345
13375 431345 240110 267597 316909 -6515 -205528 -41452 367511 592160 452931 365328
13365 365328 113632 -30723 44396 -34566 177795 51881 -61387 338517 500744 183148
13355 183148 -247921 -682318 -900608 -577703 72045 38311 -128793 78103 -71326 -228552
$$ packed form
13425c33823L0379m1665J97494K37286j8777j83875l10056l97156m8028K84629
13415e83592j00479j35087q9368n5951j22699J53784J39907N0497L15734J22138
13405c05116o2097r3826K3996K51665j53496m17475p0484k21198m11793q2124
13395a541948J13879M50682O84833M40979K94053N6681k24678q29973q28651n3848
13385a437991K68953L57453K58308J63654R7362M89881L80483j94590q2048J29880
13375D31345j91235K7487M9312l23424j99013J64076M08963K24649j39229q7603
13365C65328k51696j44355P5119p8962K12361j25914j13268L99904J62227l17596
13355A83148m31069m34397k18290L22905O49748l3734j67104K06896j49429j57226
$$ plain form
13345 -228552 -372123 -484796 -385585 -279943 -223120 -357630 -531822 -896072 -1098969 -974598
13335 -974598 -758408 -778091 -978311 -988237 -838224 -891863 -1047917 -1014406 -514121 -156541
13325 -156541 5075 -239847 -365366 -286776 -416208 -441785 -383748 -520249 -705868 -595580
13315 -595580 -86943 126116 -124134 -239440 27173 147347 12435 -479001 -757138 -691600
13305 -691600 -370893 -346136 -332194 -318940 -425987 -356493 -12787 7606 -63074 -112664 -103674
13294 -103674 -43697 68312 249881 255830 49639 -231997 -391976 -195702 -73803 -158654
13284 -158654 -182896 35451 287468 365369 355695 160542 -70203 -71718 390768 608450 278568
13273 278568 52077 57403 -180351 -83761 -13818 -218560 -381357 -230321 45082 165279
$$ packed form
13345b28552j43571j12673R9211J05642N6823j34510j74192l64250k02897J24371
13335i74598K16190j9683k00220r926J50013n3639j56054L3511N00285L57580
13325a56541J61616k44922j25519P8590j29432k5577N8037j36501j85619J10288
13315e95580N08637K13059k50250j15306K66613J20174j34912m91436k78137O5538
13305f91600L20707K4757J3942J3254j07047O9494L43706K0393p0680m9590Q990
13294a03674N9977J12009J81569N949k06191k81636j59979J96274J21899q4851
13284a58654k4242K18347K52017P7901r674j95153k30745j515M62486K17682l29882
13273B78568k26491N326k37754R6590O9943k04742j62797J51036K75403J20197
$$ plain form
13263 165279 530872 762904 543693 603539 835813 775438 872626 837196 389253 806171
13253 806171 1556034 1807483 1453476 628260 118526 240164 741833 1013799 854650 140891
13243 140891 -526482 -296387 91083 -283183 -979508 -938402 -121590 434479 728108 1100165
13233 1100165 1333995 1385193 1085179 718187 357268 24111 -12539 478767 760678 666553
13223 666553 298442 30050 -67758 73162 280833 360501 515395 688606 911655 969160
13213 969160 983886 933298 655481 502899 383846 414246 317503 532577 1033047 1542728
13203 1542728 1631037 1232873 1014057 1142193 1127577 991086 1183621 1561569 1517690 925078
13193 925078 656396 764913 605503 532789 392278 262354 655204 1086032 961328 559651
$$ packed form
13263A65279L65593K32032k19211N9846K32274o0375R7188l5430m47943M16918
13253H06171P49863K51449l54007q25216n09734J21638N01669K71966j59149p13759
13243A40891o67373K30095L87470l74266o96325M1106Q16812N56069K93629L72057
13233A100165K33830N1198l00014l66992l60919l33157l6650M91306K81911r4125
13223F66553l68111k68392r7808J40920K07671P9668J54894J73211K23049N7505
13213I69160J4726n0588k77817j52582j19053L0400r6743K15074N00470N09681
13203A542728Q8309l98164k18816J28136j4616j36491J92535L77948m3879n92612
13193I25078k68682J08517j59410p2714j40511j29924L92850M30828j24704m01677
$$ plain form
13183 559651 142078 14791 426602 873076 1297292 1652781 1706624 1720762 1462739 1272550
13173 1272550 1223167 1038522 664946 545132 557401 639955 822016 995902 1008319 1094769
13163 1094769 1542152 1800524 1895605 1561172 756125 391070 578987 548723 622924 1187631
13153 1187631 1656443 1588362 1205972 1207625 1529004 1592279 1271872 1191449 1686543 1967199
13143 1967199 1551494 958122 1013844 1155847 874624 951094 1260715 1550286 1484919 1196561
13133 1196561 918206 729336 578101 390065 481298 536791 792582 1089913 1465767 2222900
13123 2222900 2779865 2579245 2304164 2136088 1789225 1403255 1323313 1326553 1885940 2418104
13113 2418104 2619041 2460952 1907555 1697096 1836006 2062431 2281932 2084599 2136913 2925761
$$ packed form
13183E59651m17573j27287M11811M46474M24216L55489N3843J4138k58023j90189
13173A272550m9383j84645l73576j19814J2269Q2554J82061J73886J2417Q6450
13163A094769M47383K58372R5081l34433q05047l65055J87917l0264P4201N64707
13153A187631M68812o8081l82390J653L21379O3275l20407q0423M95094K80656
13143A967199m15705n93372N5722J42003k81223P6470L09621K89571o5367k88358
13133A196561k78355j88870j51235j88036R1233N5493K55791K97331L75854P57133
13123B222900N56965k00620k75081j68076l46863l85970p9942L240N59387N32164
13113B418104K00937j58089n53397k10459J38910K26425K19501j97333N2314P88848
$$ plain form
13103 2925761 3402732 3533052 3604757 3609851 3833283 3260308 2124336 1597121 1492188 1974084
13093 1974084 2627783 2663826 2523874 2658057 2511215 1960489 1973307 2458593 2587623 2524295
13083 2524295 2541672 2522946 2550942 2766944 3108702 3330144 3166034 2758268 2457829 2353208
13073 2353208 2653503 2544408 2199265 2385765 2633051 2525893 2430742 2397893 2475003 2954366
13063 2954366 3262328 3498204 3504944 3420490 3530537 3336849 3389225 3627787 3576361 3731255
13053 3731255 4057274 4247374 4145820 3704487 3427151 3764248 4389209 4833459 4936953
13044 4936953 4287255 3888200 3972751 4288365 4612565 4638323 4827649 5155919 4886146 4815098
13034 4815098 5144994 5191512 5118849 5082058 5181732 5330536 5713639 6381006 6961243 7213790
$$ packed form
13103B925761M76971J30320P1705N094K23432n72975j135972n27215j04933M81896
13093A974084O53699L6043j39952J34183j46842n50726J2818M85286J29030o3328
13083B524295J7377j8726K7996K16002L41758K21442j64110m07766l00439j04621
13073B353208L00295j09095l45143J86500K47286j07158r5151l2849P7110M79363
13063B954366L07962K35876O740q4454J10047j93688N2376K38562n1426J54894
13053C731255L26019J90100j01554m41333k77336L37097O24961M44250J03494
13044D936953o49698l99055Q4551L15614L24200K5758J89326L28270k69773p1048
13034D815098L29896M6518p2663l6791R9674J48804L83103O67367N80237K52547
$$ plain form
13024 7213790 7699199 8046050 8224780 9014163 9379914 9344058 9764475 10262356 10691653 11139129
13014 11139129 11464132 12087207 12950571 13944316 15041152 16081123 17305839 19255710 21588737
13005 21588737 23858239 26457072 29757828 33805166 38772263 45386221 53962829 65048987
12997 65048987 79006798 96584169 119169493 147794408 181794121 217238015 246442302
12990 246442302 261331732 261458026 251196623 235246459 217946578 201716468 187719516
12983 187719516 175786184 165451756 156607349 150331183 146152902 143323314 141352280 139111404
12975 139111404 136733757 133326174 127449181 118502789 107657061 96574218 86409747
12968 86409747 78099457 70786745 63797620 57887870 53018213 48552507 44855078 41544717
$$ packed form
13024G213790M85409L46851J78730P89383L65751l5856M20417M97881M29297M47476
13014A1139129L25003O23075Q63364R93745J096836J039971J224716J949871K333027
13005B1588737K269502K598833L300756M047338M967097O613958Q576608J1086158
12997F5048987J3957811J7577371K2585324K8624915L3999713L5443894K9204287
12990B46442302J4889430J26294j0261403j5950164j7299881j6230110j3996952
12983A87719516j1933332j0334428q844407o276166m178281k829588j971034k240876
12975A39111404k377647l407583n876993q946392j0845728j1082843j0164471
12968H6409747q310290p312712o989125n909750m869657m465706l697429l310361
$$ plain form
12960 41544717 38411155 35526547 32794946 30426043 28127887 25546671 23378122 22307799
12952 22307799 21501224 20207899 18669285 17122166 15949608 15224002 14697039 13886723 13320805
12943 13320805 13103217 13007723 13165396 13843177 14443581 14944190 15482037 15732911 16106622
12934 16106622 16633899 17232284 18184958 18814046 19299057 19439693 19570805 19891994 20091277
12925 20091277 20174841 20574554 21775228 22792734 23966018 25126363 26747316 29158909
12917 29158909 32092201 35499939 39645906 44851136 51797538 61119681 72646549 87244358
12909 87244358 105831534 129423765 159581786 195137939 230386938 256644247 267419709
12902 267419709 263128556 249721977 232891304 215719490 200020544 186732678 175714234
$$ packed form
12960D1544717l133562k884608k731601k368903k298156k581216k168549j070323
12952B2307799q06575j293325j538614j547119j172558p25606n26963q10316n65918
12943A3320805k17588r5494J57673O77781O00404N00609N37847K50874L73711
12934A6106622N27277N98385R52674O29088M85011J40636J31112L21189J99283
12925B0091277Q3564L99713J200674J017506J173284J160345J620953K411593
12917B9158909K933292L407738M145967N205230O946402R322143J1526868J4597809
12909H7244358J8587176K3592231L0158021L5556153L5248999K6257309J0775462
12902B67419709m291153j3406579j6830673j7171814j5698946j3287866j1018444
$$ plain form
12895 175714234 166028917 157592313 150927563 146376177 143590109 142379354 142114951 141185323
12887 141185323 137967730 131887852 123637720 114337127 104437884 94617179 85546574 77245556
12879 77245556 69686141 63105109 57570511 53024552 49009244 45344985 42337111 39561603
12871 39561603 36896361 34511391 31972772 29346318 27235316 25682560 24279878 22958556
12863 22958556 21851304 20104204 18104629 16422159 15574640 15137949 14336192 13583339 13153114
12854 13153114 12990097 13051443 12746985 12423085 12362468 12284217 12674746 13359860 13719933 14155084
12844 14155084 14124625 13989286 13982764 13988608 14441369 15370210 16302499 17083953 18060473 19001236
12834 19001236 20398270 21933537 23717027 26349537 29958298 34163752 38999098 44842186
$$ packed form
12895A75714234r685317q436604o664750m551386k786068j210755k64403r29628
12887A41185323l217593o079878q250132r300593r899243r820705r070605q301018
12879G7245556p559415o581032n534598m545959m015308l664259l007874k775508
12871C9561603k665242k384970k538619k626454k111002j552756j402682j321322
12863B2958556j107252j747100j999575j682470q47519m36691q01757p52853m30225
12854A3153114j63017O1346l04458l23900o0617p8251L90529O85114L60073M35151
12844A4155084l0459j35339o522N844M52761R28841R32289P81454R76520R40763
12834A9001236J397034J535267J783490K632510L608761M205454M835346N843088
$$ plain form
12826 44842186 52519974 62257801 74988235 91472092 112330641 138403773 170329865
12819 170329865 205647500 238142470 259609489 265829799 258629171 243848673 226719903
12812 226719903 210142610 195463739 182637476 170964310 160777572 153123419 147915268
12805 147915268 144279096 141689787 140135956 138573909 135895300 131132928 123204120 112704172
12797 112704172 101289669 90245783 80677702 72115116 64576520 58544601 53069724 48142017
12789 48142017 43437787 39142140 35783147 32990025 30366724 28157499 26185153 24303093
12781 24303093 22111197 19876379 17972280 16323084 14884946 13145703 11487819 10154081
12773 10154081 9117063 8380469 7997011 7620192 7216432 6686583 5962378 5297167 4733727
$$ packed form
12826D4842186P677788R737827J2730434J6483857K0858549K6073132L1926092
12819A70329865L5317635L2494970K1467019O220310p200628j4780498j7128770
12812B26719903j6577293j4678871j2826263j1673166j0186738p654153n208151
12805A47915268l636172k589309j553831j562047k678609m762372p928808j0499948
12797A12704172j1414503j1043886r568081q562586p538596o031919n474877m927707
12789D8142017m704230m295647l358993k793122k623301k209225j972346j882060
12781B4303093k191896k234818j904099j649196j438138j739243j657884j333738
12773A0154081j037018p36594l83458l76819m03760n29849p24205o65211n63440
$$ plain form
12764 4733727 4721956 4774342 4606159 4374973 3969785 3677858 3449475 3469861 3229119 3180063
12754 3180063 3074956 2507508 2331216 2511294 2410263 1896541 1551959 1833848 1782330 1466906
12744 1466906 1795350 1728292 1249647 1024708 803933 993749 1355037 1345163 1263133 1369074
12734 1369074 1530011 1801652 1895616 1554574 872189 278836 198905 453787 1109758 1293775
12724 1293775 1017487 806452 417289 311966 755740 961483 1321036 1502871 1227926
12715 1227926 1318094 1480541 1398569 1557705 2095012 2397561 2008662 1913851 2308239 2674366
12705 2674366 2963417 3013398 3064158 2975923 3070515 3260778 3249106 3014529 2405297 2127267
12695 2127267 2474636 2943814 3396304 3353547 3055957 2467740 2266644 1930474 1633864 1678983
$$ packed form
12764D733727j1771N2386j68183k31186m05188k91927k28383K0386k40742m9056
12754C180063j05107n67448j76292J80078j01031n13722l44582K81889n1518l15424
12744A466906L28444o7058m78645k24939k20775J89816L61288r874q2030J05941
12734A369074J60937K71641R3964l41042o82385n93353p9931K54882O55971J84017
12724A293775k76288k11035l89163j05323M43774K05743L59553J81835k74945
12715A227926R0168J62447q1972J59136N37307L02549l88899r4811L94388L66127
12705B674366K89051M9981N0760q8235R4592J90263j1672k34577o09232k78030
12695B127267L47369M69178M52490m2757k97590n88217k01096l36170k96610M5119
$$ plain form
12685 1678983 1642531 1454346 1537509 1563051 1193489 599047 5422 -35562 507978 1174307
12675 1174307 1434820 1358361 1219461 1231812 1383922 1353643 1478990 1299006 685117 97539
12665 97539 129092 270183 497305 383316 89647 80166 69818 -167168 -202941 244260 529055
12654 529055 206010 -233193 -215257 -540307 -704014 -471911 -394763 -85479 17133 -158916
12644 -158916 -75386 294909 506936 153546 145515 170832 561203 1083771 862598 815291
12634 815291 692995 281286 253513 555955 409244 124704 -215413 -418040 -161330 343529
12624 343529 416105 95527 -130368 246051 703879 611247 95795 -550212 -544035 -383181
12614 -383181 -164726 -328294 -151809 200833 -43354 -801 45883 -149069 -634865 -767398
$$ packed form
12685A678983l6452j88185Q3163K5542l69562n94442n93625m0984N43540O66329
12675A174307K60513p6459j38900J2351J52110l0279J25347j79984o13889n87578
12665I7539L1553J41091K27122j13989k93669r481j0348k36986l5773M47201K84795
12654E29055l23045m39203J7936l25050j63707K32103P7148L09284J02612j76049
12644a58916Q3530L70295K12027l53390q031K5317L90371N22568k21173m7307
12634H15291j22296m11709k7773L02442j46711k84540l40117k02627K56710N04859
12624C43529P2576l20578k25895L76419M57828r2632n15452o46007O177J60854
12614c83181K18455j63568J76485L52642k44187M2553M6684j94952m85796j32533
$$ plain form
12604 -767398 -429583 -143011 108702 213305 338578 658221 1041445 1001811 807284 718233
12594 718233 809689 927385 816825 397159 246435 332162 342852 423098 4450 -802623
12584 -802623 -777867 -272025 28115 61366 84388 -37216 -245384 -573667 -1125716 -1332654
12574 -1332654 -1340704 -1135590 -1137648 -1070661 -905318 -467449 103293 466408 723951 663193
12564 663193 518275 300717 -310139 -560180 -667597 -673119 -492111 -434678 -418312 -136188
12554 -136188 375059 696110 858163 791710 755389 554099 305871 106935 155265 271556
12544 271556 142350 -65687 -547966 -750561 -550777 -545512 -572772 -338140 -65859 192489
12534 192489 301441 203336 -150332 -393725 -514495 -523292 -191763 232560 503152 534578
$$ packed form
12604g67398L37815K86572K51713J04603J25273L19643L83224l9634j94527q9051
12594G18233R1456J17696j10560m19666j50724Q5727J0690Q0246m18648q07073
12584h02623K4756N05842L00140L3251K3022j21604k08168l28283n52049k06938
12574a332654q050K05114k058O6987J65343M37869N70742L63115K57543o0758
12564F63193j44918k17558o10856k50041j07417n522J81008N7433J6366K82124
12554a36188N11247L21051J62053o6453l6321k01290k48228j98936M8330J16291
12544B71556j29206k08037m82279k02595J99784N265k7260K34632K72281K58348
12534A92489J08952r8105l53668k43393j20770q797L31529M24323K70592L1426
$$ plain form
12524 534578 597166 795731 827413 318673 -216056 -851535 -924893 -207240 340307 360197
12514 360197 144445 13082 425276 275638 -200826 -410346 -358314 -118443 -31677 -274804
12504 -274804 -465071 -336831 296503 718991 657821 374683 456938 400404 139317 102865
12494 102865 110514 -121158 -234648 38127 69064 16243 -48998 -92045 69606 15280 -472182
12483 -472182 -508488 -110923 194165 384454 219842 -40419 -16205 -108805 232057 419554
12473 419554 211688 180794 115934 212380 282074 139510 -88376 -187915 -184779 -47592 34987
12462 34987 -338367 -639973 -776411 -354688 337619 695388 603351 493357 346144 199719
12452 199719 269343 543479 556871 383244 344918 463177 938389 1340978 1149273 728646
$$ packed form
12524E34578O2588J98565L1682n08740n34729o35479p3358P17653N47547J9890
12514C60197k15752j31363M12194j49638m76464k09520N2032K39871Q6766k43127
12504b74804j90267J28240O33334M22488o1170k83138Q2255n6534k61087l6452
12494A02865P649k31672j13490K72775L0937n2821o5241m3047J61651n4326m87462
12483d72182l6306L97565L05088J90289j64612k60261K4214r2600L40862J87497
12473D19554k07866l0894o4860R6446O9694j42564k27886r9539L136J37187Q2579
12462C4987l73354l01606j36438M21723O92307L57769r2037j09994j47213j46425
12452A99719O9624K74136J3392j73627l8326J18259M75212M02589j91705m20627
$$ plain form
12442 728646 483203 31955 -587212 -797610 -1002510 -977139 -603990 -172834 -31618 58246
12432 58246 346230 453291 492615 458143 256370 69939 57190 299993 495746 147211
12422 147211 -313464 -555103 -591013 -663722 -635533 -497880 -889772 -1170511 -1216356 -1000464
12412 -1000464 -485605 -354101 -197988 368257 926195 865374 654075 600982 319110 -296102
12402 -296102 -347658 -131395 137619 -1152 -295932 -256256 -353514 -790723 -767061 -443425
12392 -443425 -377581 -269105 -299217 -178666 8619 110945 117783 340097 556032 534349
12382 534349 535595 487413 585668 597053 423572 199718 -29154 -17494 373853 267519 -285547
12371 -285547 -707096 -589828 -67398 -92275 -538590 -466977 -17381 -76519 -225350 -394
$$ packed form
12442G28646k45443m51248o19167k10398k04900K5371L73149M31156J41216Q9864
12432E8246K87984J07061L9324l4472k01773j86431j2749K42803J95753l48535
12422A47211m60675k41639l5910p2709K8189J37653l91892k80739m5845K15892
12412a000464N14859J31504J56113N66245N57938o0821k11299n3093k81872o15212
12402b96102n1556K16263K69014j38771k94780L9676r7258m37209K3662L23636
12392d43425O5844J08476l0112J20551J87285J02326O838K22314K15935k1683
12382E34349J246m8182R8255J1385j73481k23854k28872J1660L91347j06334n53066
12371b85547m21549J17268N22430k4877m46315P1613M49596n9138j48831K24956
$$ plain form
12361 -394 267534 241591 288067 343720 58857 -102002 -144674 -449094 -592981 -565635 -294730
12350 -294730 -81656 -100649 -123230 -245466 -236321 -181531 283472 794491 547449 150073
12340 150073 -30992 -215657 -407778 -635862 -732000 -837650 -601470 -372801 -289867 -108453
12330 -108453 -66965 -194545 -66601 143924 38864 -95142 -240389 -265412 -142095 -39548
12320 -39548 347966 430425 195187 -209944 -437298 -592611 -464741 -121349 -253796 -322170
12310 -322170 -158359 134251 533024 732447 839380 931943 1160310 1184481 663443 -140498
12300 -140498 -262946 259180 944672 1471125 1219395 576819 57789 -278317 -371054 -13758
12290 -13758 415184 585653 94156 -332787 -653298 -833266 -730645 -467787 -656340 -858443
$$ packed form
12361c94K67928k5943M6476N5653k84863j60859m2672l04420j43887K7346K70905
12350b94730K13074j8993k2581j22236R145N4790M65003N11019k47042l97376
12340A50073j81065j84665j92121k28084r6138j05650K36180K28669Q2934J81414
12330a08453M1488j27580J27944K10525j05060j34006j45247k5023J23317J02547
12320c9548L87514Q2459k35238m05131k27354j55313J27870L43392j32447o8374
12310c22170J63811K92610L98773J99423J06933R2563K28367K4171n21038q03941
12300a40498j22448N22126O85492N26453k51730o42576n19030l36106r2737L57296
12290a3758M28942J70469m91497m26943l20511j79968J02621K62858j88553k02103
$$ plain form
12280 -858443 -980664 -1207740 -1319107 -1164554 -794631 -577007 -464239 -639872 -987497 -1229206
12270 -1229206 -1226283 -1101067 -800357 -726008 -1008685 -1165634 -1369031 -1490606 -1437619 -1175733
12260 -1175733 -965835 -702789 -487656 -948200 -1525351 -1499041 -836743 -686355 -807724 -741466
12250 -741466 -819424 -987411 -748820 -822754 -1127121 -1045492 -816633 -510478 -420247 -362611
12240 -362611 -468667 -403159 -248711 -486167 -849230 -868033 -673665 -357982 -231296 -311534
12230 -311534 -252637 -204205 -360370 -234419 -115058 -55970 104118 188892 205851 91654
12220 91654 -202696 -780464 -1352269 -1570397 -1656329 -1726549 -1314631 -461274 -130054 -617567
12210 -617567 -1066940 -985129 -856014 -726546 -349391 20245 141538 138426 246461 388676
$$ packed form
12280h58443j22221k27076j11367J54553L69923K17624J12768j75633l47625k41709
12270a229206K923J25216L00710P4349k82677j56949k03397j21575N2987K61886
12260a175733K09898K63046K15133m60544n77151K6310O62298J50388j21369O6258
12250g41466p7958j67987K38591p3934l04367Q1629K28859L06155R0231N7636
12240c62611j06056O5508J54448k37456l63063j8803J94368L15683J26686q0238
12230c11534N8897M8432j56165J25951J19361N9088J60088Q4774J6959j14197
12220I1654k94350n77768n71805k18128q5932p0220M11918Q53357L31220m87513
12210f17567m49373Q1811J29115J29468L77155L69636J21293l112J08035J42215
$$ plain form
12200 388676 362372 161413 -373930 -588137 -705927 -639670 -475918 -556962 -620357 -248507
12190 -248507 -119081 -324086 -451692 -328598 -14350 -32426 -429409 -315865 384941 482658
12180 482658 54443 128958 327382 157185 -34927 -248485 1923 577671 804557 181765
12170 181765 -120073 -59592 -237570 -127637 352810 482067 153171 -186771 -257670 -11054
12160 -11054 339952 646886 866660 767407 536230 59323 -267310 -429159 -481162 -133340
12150 -133340 12752 -30290 -268662 -448476 -710759 -548742 -181158 230889 383281 13724
12140 13724 -617189 -818632 -697964 -330425 69576 171385 390599 654824 845596 740078
12130 740078 309167 -273702 -162705 57600 53286 190869 343368 600408 996745 1174411
$$ packed form
12200C88676k6304k00959n35343k14207j17790O6257J63752q1044o3395L71850
12190b48507J29426k05005j27606J23094L14248j8076l96983J13544P00806R7717
12180D82658m28215P4515J98424j70197j92112k13558K50408N75748K26886o22792
12170A81765l01838O0481j77978J09933M80447J29257l28896l39942p0899K46616
12160a1054L51006L06934K19774r9253k31177m76907l26633j61849n2003L47822
12150a33340J46092m3042k38372j79814k62283J62017L67584M12047J52392l69557
12140A3724o30913k01443J20668L67539M00001J01809K19214K64225J90772j05518
12130G40078m30911n82869J10997K20305m314J37583J52499K57040L96337J77666
$$ plain form
12120 1174411 865152 403377 393430 762110 474255 -3838 -423635 -814853 -1048969 -1289367
12110 -1289367 -1157703 -884766 -865867 -597239 -397983 -102249 318355 271940 419502 418967
12100 418967 254211 308660 374645 543054 418759 -39084 -220989 44600 726899 1116881
12090 1116881 831454 254064 -316948 -763254 -775490 -343248 115884 201298 -59781 -401965
12080 -401965 -363765 -378859 -528680 -545822 -6011 624609 559035 410975 188904 -149138
12070 -149138 -288800 -440320 -632248 -728217 -490485 -489364 -685353 -579722 -507279 -467471
12060 -467471 -125431 -327270 -431955 -61675 -416751 -714252 -376810 176834 566456 865327
12050 865327 1141363 1114856 796169 224796 -188187 -338258 -308414 -154776 -200896 -330474
$$ packed form
12120A174411l09259m61775r947L68680k87855m78093m19797l91218k34116k40398
12110a289367J31664K72937J8899K68628J99256K95734M20604m6415J47562n35
12100D18967j64756N4449O5985J68409j24295m57843j81905K65589O82299L89982
12090A116881k85427n77390n71012m46306j2236M32242M59132Q5414k61079l42184
12080d01965L8200j5094j49821j7142N39811O30620o5574j48060k22071l38042
12070a49138j39662j51520j91928r5969K37732J121j95989J05631P2443L9808
12060d67471L42040k01839j04685L70280l55076k97501L37442N53644L89622K98871
12050H65327K76036k6507l18687n71373m12983j50071K9844J53638m6120j29578
$$ plain form
12040 -330474 -512360 -700613 -605123 -741117 -759339 -533363 -335168 -244203 -185339 -63110
12030 -63110 104111 344905 436132 245692 86528 -221880 -435330 -492755 -339909 -60268
12020 -60268 27720 360806 547361 338140 67846 -180634 -326853 -147654 597607 1002225
12010 1002225 873221 651804 343106 18898 -472523 -429889 -1328 14510 19750 -34602
12000 -34602 -268207 -424930 -308886 57027 139364 358736 762296 566395 -92869 -550456
11990 -550456 -397628 -159172 -320821 -299404 -81956 290472 501877 241640 163201 227448
11980 227448 302496 397948 727827 1012352 809955 637721 681871 676254 733315 841390 685356
11969 685356 418709 172119 206558 -31146 -434527 -554538 -189414 -28170 -217672 -598869
$$ packed form
12040c30474j81886j88253R5490j35994j8222K25976J98195R0965N8864J22229
12030f3110J67221K40794R1227j90440j59164l08408k13450n7425J52846K79641
12020f0268Q7988L33086J86555k09221k70294k48480j46219J79199P45261M04618
12010A002225j29004k21417l08698l24208m91421M2634M28561J5838N240n4352
12000c4602k33605j56723J16044L65913Q2337K19372M03560j95901o59264m57587
11990e50456J52828K38456j61649K1417K17448L72428K11405k60237p8439O4247
11980B27448P5048R5452L29879K84525k02397j72234M4150n617N7061J08075j56034
11969F85356k66647k46590L4439k37704m03381j20011L65124J61244j89502l81197
$$ plain form
11959 -598869 -685335 -122302 556489 956933 1066058 1100759 1022073 941151 887351 996184
11949 996184 1134205 952262 971275 984017 826804 663207 714547 577383 549203 744543
11939 744543 1007315 1068405 1117509 1383143 1823599 1789298 1500864 1727168 2534006 3760527
11929 3760527 5081708 6102090 6496068 6210672 5830984 5568300 5646390 5844235 5867765
11920 5867765 5512438 4618594 3796457 3701680 4148195 4240173 4480403 4357327 4018246 3824484
11910 3824484 3693776 3640016 3268393 2744230 2263526 1601160 1061460 491646 336811 440505
11900 440505 560927 842070 1003012 958020 864148 791649 1057601 1336112 1243818 873122
11890 873122 541435 565689 816524 1004622 860270 593689 802378 1047601 977092 911496
$$ packed form
11959e98869q6466N63033O78791M00444J09125L4701p8686q0922n3800J08833
11949I96184J38021j81943J9013J2742j57213j63597N1340j37164k8180J95340
11939G44543K62772O1090M9104K65634M40456l4301k88434K26304Q06838J226521
11929C760527J321181J020382L93978k85396l79688k62684P8090J97845K3530
11920E867765l55327q93844q22137r4777M46515R1978K40230j23076l39081j93762
11910C824484j30708n3760l71623n24163m80704o62366n39700n69814j54835J03694
11900D40505J20422K81143J60942m4992r3872p2499K65952K78511r2294l70696
11890H73122l31687K4254K50835J88098j44352k66581K08689K45223p0509o5596
$$ plain form
11880 911496 795745 633701 721906 992906 1012804 778589 544181 266682 629930 649295
11870 649295 289294 90364 370922 881606 1112728 1092956 1001583 1045791 1236736 1130249
11860 1130249 778004 410135 84984 76514 376718 826668 943221 560553 23600 -36344
11850 -36344 229074 465990 367218 189954 56554 65897 -73385 -614859 -857176 -762680
11840 -762680 -798441 -672827 -643674 -799301 -831867 -723644 -825749 -1096645 -783400 -233458
11830 -233458 14445 -253012 -497051 -408414 -443393 -444915 -631148 -769103 -543509 -106696
11820 -106696 30045 478832 1056155 1019871 737914 487477 158899 -10334 -83640 145935
11810 145935 601233 885060 884628 563718 506526 314823 -162634 -155406 59889 -69715 -126114
$$ packed form
11880I11496j15751j62044Q8205K71000J9898k34215k34408k77499L63248J9365
11870F49295l60001j98930K80558N10684K31122j9772r1373M4208J90945j06487
11860A130249l52245l67869l25151q470L00204M49950J16553l82668n36953n9944
11850c6344K65418K36916r8772j77264j33400R343j39282n41474k42317R4496
11840g62680l5761J25614K9153j55627l2566J08223j02105k70896L13245N49942
11830b33458K47903k67457k44039Q8637l4979j522j86233j37955K25594M36813
11820a06696J36741M48787N77323l6284k81957k50437l28578j69233p3306K29575
11810A45935M55298K83827m32l20910n7192j91703m77457P228K15295j29604n6399
$$ plain form
11799 -126114 9980 -91333 -125998 -117337 18037 -60453 -366706 -654179 -897418 -706084
11789 -706084 -484589 -348205 -89916 461411 928216 938930 838287 365560 252705 245761
11779 245761 185011 250231 391331 625193 454255 -110863 -698196 -988541 -1149057 -828272
11769 -828272 -110686 157988 -93385 -382628 -528618 -462483 -709595 -871847 -832944 -854087
11759 -854087 -914324 -1000163 -954566 -141490 239866 -25402 -230636 -554139 -394607 254719
11749 254719 716349 997867 1219223 1247055 1119226 847953 551495 355712 431079 403743
11739 403743 471404 436502 218941 222867 119361 285958 755098 985170 796286 781461
11729 781461 981213 867807 792952 906508 925977 702058 141233 -65894 34914 13736
$$ packed form
11799a26114J36094j01313l4665Q661J35374p8490l06253k87473k43239J91334
11789g06084K21495J36384K58289N51327M66805J0714j00643m72727j12855o944
11779B45761o0750O5220J41100K33862j70938n65118n87333k90345j60516L20785
11769h28272P17586K68674k51373k89243j45990O6135k47112j62252L8903k1143
11759h54087o0237q5839M5597Q13076L81356k65268k05234l23503J59532O49326
11749B54719M61630K81518K21356K7832j27829k71273k96458j95783P5367k7336
11739D03743O7661l4902k17561L926j03506J66597M69140K30072j88884j4825
11729G81461J99752j13406p4855J13556J9469k23919n60825k07127J00808k1178
$$ plain form
11719 13736 267441 460993 -187645 -766227 -963063 -743702 -673114 -758462 -430657 -308691
11709 -308691 -522967 -1009042 -1363307 -1541880 -1160561 -565075 51906 230540 -55574 -99387
11699 -99387 -27483 -252990 -208672 278391 70821 -289972 -29386 357121 457957 546292
11689 546292 566917 199951 -219711 -668428 -827003 -873510 -1068019 -1135500 -780957 -342471
11679 -342471 -325039 -196500 200225 437699 531812 435403 65252 329624 705691 760404
11669 760404 525292 346185 608595 764957 870865 858968 1244307 1578614 1448271 1377997
11659 1377997 1457920 1516425 1276116 635860 133308 -190355 -557170 -615667 -475595 -508800
11649 -508800 -595716 -685927 -305299 399379 604366 293148 256531 132216 -94287 -277905
$$ packed form
11719A3736K53705J93552o48638n78582j96836K19361P0588q5348L27805J21966
11709c08691k14276m86075l54265j78573L81319N95486O16981J78634k86114m3813
11699i9387P1904k25507M4318M87063k07570l60793K60586L86507J00836Q8335
11689E46292K0625l66966m19662m48717j58575m6507j94509o7481L54543M38486
11679c42471J7432J28539L96725K37474R4113r6409l70151K64372L76067N4713
11669G60404k35112j79107K62410J56362J05908j1897L85339L34307j30343p0274
11659A377997P9923N8505k40309o40256n02552l23663l66815n8497J40072l3205
11649e08800q6916r0211L80628P04678K04987l11218l6617j24315k26503j83618
$$ plain form
11639 -277905 -267775 -248829 -269964 -218573 -85028 274629 354581 299723 118295 -49343 89398
11628 89398 477920 520201 -73596 -187218 -36252 -408513 -944870 -964503 -639779 -585368
11618 -585368 -1243016 -1631897 -1405769 -1067111 -779946 -1049397 -1211983 -719208 -647425 -832682
11608 -832682 -728486 -677539 -564529 -316697 7282 29860 116812 223340 423260 325173
11598 325173 231329 186259 454922 576421 544040 489303 476733 741027 841407 512676
11588 512676 431339 365341 211475 196820 679615 951878 655398 391493 490595 1084957
11578 1084957 1682755 2106650 1879516 1462259 1570663 1803619 1846099 1781992 1230980 445444
11568 445444 -214938 -248337 296198 805770 1082060 1100232 1035468 1341947 1584175 1410834
$$ packed form
11639b77905J0130J8946k1135N1391J33545L59657P9952n4858j81428j67638J38741
11628H9398L88522M2281n93797j13622J50966l72261n36357j9633L24724N4411
11618e85368o57648l88881K26128L38658K87165k69451j62586M92775P1783j85257
11608h32682J04196N0947J13010K47832L23979K2578Q6952J06528J99920r8087
11598C25173r3844m5070K68663J21499l2381n4737j2570K64294J00380l28731
11588E12676q1337o5998j53866j4655M82795K72263k96480k63905R9102N94362
11578A084957N97798M23895k27134m17257J08404K32956M2480o4107n51012p85536
11568D45444o60382l3399N44535N09572K76290J8172o4764L06479K42228j73341
$$ plain form
11558 1410834 908183 671372 857684 977337 1394407 1873207 1945248 2026513 2193836 1831596
11548 1831596 1045306 808146 999262 811866 549373 798360 1339157 1642783 1713343 1586795
11538 1586795 1289809 1065265 742632 606210 829198 614747 586937 946365 1141736 1208891
11528 1208891 1278907 1147169 1034496 790141 517530 549098 779456 1128274 1279039 1680107
11518 1680107 2193689 2706555 3093096 3425916 3906330 4555936 4589036 4429842 4479014 4452297
11508 4452297 4457817 4406581 4567083 5229085 5923371 5907450 5658254 5726259 6122560 6619028
11498 6619028 7068927 7532662 8197961 8940617 9459282 9336533 8845187 8411774 7815734
11489 7815734 6935165 6236149 5900671 5457208 4756421 4421169 4365839 3906199 3448762 3423802
$$ packed form
11558A410834n02651k36811J86312J19653M17070M78800P2041Q1265J67323l62240
11548A831596p86290k37160J91116j87396k62493K48987N40797L03626P0560j26548
11538A586795k96986k24544l22633j36422K22988k14451k7810L59428J95371O7155
11528A208891P0016j31738j12673k44355k72611L1568K30358L48818J50765M01068
11518A680107N13582N12866L86541L32820M80414O49606L3100j59194M9172k6717
11508D452297N520n1236J60502O62002O94286j5921k49196O8005L96301M96468
11498F619028M49899M63735O65299P42656N18665j22749m91346m33413n96040
11489G815734q80569o99016l35478m43463p00787l35252n5330m59640m57437k4960
$$ plain form
11479 3423802 3823808 4197629 4019732 3458972 3226699 3042759 3003568 3039326 2889449 2365877
11469 2365877 2095218 2095463 2080938 1986002 1892392 1545920 833307 689296 936102 1177083
11459 1177083 1209066 1189760 1060610 678840 185668 44336 496745 944279 1061824 657519
11449 657519 593186 827205 858647 998683 1091760 1074410 1064428 1342936 1291915 1012106 659155
11438 659155 40472 -429105 -907135 -1056730 -972696 -634567 -327988 453936 1323154 1601308
11428 1601308 1368937 1228897 1518106 1272566 1239775 1117360 594499 426684 690586 1046165
11418 1046165 1217152 1330066 1404349 1402612 1733167 2071591 2094832 1799215 1779848 2169100
11408 2169100 2188377 1807214 1117432 640518 914914 1102797 1103400 1033417 860863 1212688
$$ packed form
11479C423802M00006L73821j77897n60760k32273j83940l9191L5758j49877n23572
11469B365877k70659K45j4525r4936r3610l46472p12613j44011K46806K40981
11459A177083L1983j9306j29150l81770m93172j41332M52409M47534J17545m04305
11449F57519o4333K34019L1442J40036R3077j7350r982K78508n1021k79809l52951
11438F59155o18683m69577m78030j49595Q4034L38129L06579P81924Q69218K78154
11428A601308k32371j40040K89209k45540l2791j22415n22861j67815K63902L55579
11418A046165J70987J12914P4283j737L30555L38424K3241k95617j9367L89252
11408B169100J9277l81163o89782m76914K74396J87883O03o9983j72554L51825
$$ plain form
11398 1212688 1485121 1664565 1739016 1946162 2057134 1951460 1810274 1806137 1738657 1302812
11388 1302812 985073 1183076 1214400 1171169 1469629 1540255 1475007 1216333 783088 345746
11378 345746 90628 17594 58171 230594 285859 20001 -147575 -393399 -640532 -658481
11368 -658481 -239605 137386 -77875 -111486 69113 543367 975091 841633 413358 184589
11358 184589 -237460 -396452 -300834 -304214 109656 404416 204308 -202972 -405712 -206664
11348 -206664 413046 710935 928663 828920 190225 -327176 -568553 -441157 -143399 -236464
11338 -236464 -657350 -819475 -367263 -268429 -452435 -585581 -828821 -1035662 -1103966 -1054463
11328 -1054463 -507146 15929 57100 -226948 -527091 -808861 -1133658 -1276474 -1183655 -1115318
$$ packed form
11398A212688K72433J79444P4451K07146J10972j05674j41186m137o7480m35845
11388A302812l17739J98003L1324m3231K98460P0626o5248k58674m33245m37342
11378C45746k55118p3034M0577J72423N5265k65858j67576k45824k47133j7949
11368f58481M18876L76991k15261l3611J80599M74254M31724j33458m28275k28769
11358A84589m22049j58992R5618l380M13870K94760k00108m07280k02740J99048
11348b06664O19710K97889K17728r9743o38695n17401k41377J27396K97758r3065
11338b36464m20886j62125M52212R8834j84006j33146k43240k06841o8304M9503
11328a054463N47317N23075M1171k84048l00143k81770l24797j42816R2819O8337
$$ plain form
11318 -1115318 -834619 -553573 -62293 342930 163291 69599 286515 564566 514080 337180
11308 337180 217688 -39255 -478587 -215238 322797 392818 236763 290065 607146 870398
11298 870398 681386 236804 96494 -254327 -727096 -956310 -657374 -253173 208545 513672
11288 513672 599543 902759 914415 277652 -239004 -261495 -471295 -597617 -725864 -944585
11278 -944585 -906457 -840520 -447317 -70200 182879 809221 1125147 1005647 1187372 1468917
11268 1468917 1053357 789177 906779 857049 632710 184555 -5170 86657 364067 448757
11258 448757 286203 185672 -51268 65162 249847 269550 311778 430442 636299 703578
11248 703578 690332 583313 577654 705042 882042 835209 818725 695508 361620 160180
$$ packed form
11318a115318K80699K81046M91280M05223j79639r3692K16916K78051n0486j76900
11308C37180j19492k56943m39332K63349N38035P0021j56055N3302L17081K63252
11298H70398j89012m44582j40310l50821m72769k29214K98936M04201M61718L05127
11288E13672Q5871L03216J1656o36763n16656k2491k09800j26322j28247k18721
11278i44585L8128O5937L93203L77117K53079O26342L15926j19500J81725K81545
11268A468917m15560k64180J17602m9730k24339m48155j89725R1827K77410Q4690
11258D48757j62554j00531k36940J16430J84685J9703M2228J18664K05857O7279
11248G03578j3246j07019n659J27388J77000m6833j6484j23217l33888k01440
$$ plain form
11238 160180 267764 536018 553029 283028 333658 544384 528801 553406 -20707 -529223
11228 -529223 -803350 -901835 -519459 -271142 -249972 -606780 -680598 -315049 -301620 -547243
11218 -547243 -331518 -67114 -65790 -113251 -622183 -1066500 -668672 -203686 197005 410954
11208 410954 449170 508030 497860 562136 497863 551838 831275 830084 918309 1095070 881099
11197 881099 729916 741938 972647 1005675 898038 1135761 1316401 561883 191794 622232
11187 622232 470109 19856 -162707 -395864 40222 820449 1127745 780455 506760 384411
11177 384411 315399 125179 -211044 -319533 -205620 141170 221990 522720 701885 592854
11167 592854 450309 256748 306971 609413 129847 -533966 -713232 -777689 -451142 51609
$$ packed form
11238A60180J07584K68254J7011k70001N0630K10726j5583K4605n74113n08516
11228e29223k74127r8485L82376K48317K1170l56808p3818L65549J3429k45623
11218e47243K15725K64404J324m7461n08932m44317L97828M64986M00691K13949
11208D10954L8216N8860j0170O4276o4273N3975K79437j191Q8225J76761k13971
11197H81099j51183J2022K30709L3028j07637K37723J80640p54518l70089M30438
11187F22232j52123m50253j82563k33157M36086P80227L07296l47290k73695j22349
11177C84411o9012j90220l36223j08489J13913L46790Q0820L00730J79165j09031
11167E92854j42545j93561N0223L02442m79566o63813j79266o4457L26547N02751
$$ plain form
11157 51609 152124 69166 -183382 -463887 -552597 -590708 -301910 -257603 -71791 109155
11147 109155 165415 90657 -26928 180453 346480 193344 -168749 -350142 -287156 -458209
11137 -458209 -518335 -123710 392200 824793 1086289 677772 16907 -213898 -98741 -8975
11127 -8975 -40010 12630 371381 547333 38483 -534112 -924096 -958049 -933837 -1037480 -1221059
11116 -1221059 -1211698 -1107367 -1286682 -1592637 -1522460 -1226311 -876610 -593660 -648372 -631692
11106 -631692 -479841 -474693 -521515 -415114 -485150 -269350 91640 36307 -285711 -460927
11096 -460927 -581777 -479103 -325612 -371642 -499160 -811577 -997398 -860130 -1003538 -877998
11086 -877998 -570589 -443190 -488890 -638986 -524433 -237133 93288 36985 -49657 9351
$$ packed form
11157E1609J00515q2958k52548k80505q8710l8111K88798M4307J85812J80946
11147A09155N6260p4758j17585K07381J66027j53136l62093j81393O2986j71053
11137d58209o0126L94625N15910M32593K61496m08517o60865k30805J15157Q9766
11127h975l1035N2640L58751J75952n08850n72595l89984l3953K4212j03643j83579
11116a221059R361J04331j79315l05955P0177K96149L49701K82950n4712J6680
11106f31692J51851N148m6822J06401p0036K15800L60990n5333l22018j75216
11096d60927j20850J02674J53491m6030j27518l12417j85821J37268j43408J25540
11086h77998L07409J27399m5700j50096J14553K87300L30421n6303q6642N9008
$$ plain form
11076 9351 -183054 -612007 -998826 -1057018 -545901 -54327 -44 -12215 -92544 -404431 -757920
11065 -757920 -598477 -154538 16617 -30390 -204866 -282488 -286463 -312715 -148969 -66256 -107713
11054 -107713 -19884 67631 124852 -490427 -1197491 -1526964 -1420003 -1306943 -1473324 -1140254
11044 -1140254 -466990 -471607 -873089 -851542 -331637 282192 489134 407096 328417 -30931
11034 -30931 -229307 -431211 -619792 -811471 -851276 -460405 56364 353715 172531 -118503
11024 -118503 -195318 -83695 -246946 -422316 -96866 342886 288243 258468 80144 -75449
11014 -75449 17158 -57987 -131577 11422 -293408 -1230960 -1517772 -1022468 -728626 -672906
11004 -672906 -165638 184914 151090 -84258 -329323 -560807 -528125 -633230 -750017 -683323
$$ packed form
11076I351j92405m28953l86819n8192N11117M91574N4283j2171q0329l11887l53489
11065g57920J59443M43939J71155m7007j74476p7622l975k6252J63746Q2713m1457
11054a07713Q7829Q7515N7221o15279p07064l29473J06961J13060j66381L33070
11044a140254O73264m617m01482K1547N19905O13829K06942q2038p8679l59348
11034c0931j98376k01904j88581j91679l9805L90871N16769K97351j81184k91034
11024a18503p6815J11623j63251j75370L25450M39752n4643k9775j78324j55593
11014g5449R2607p5145p3590J42999l04830r37552k86812M95304K93842N5720
11004f72906N07268L50552l3824k35348k45065k31484L2682j05105j16787O6694
$$ plain form
10994 -683323 -647209 -262603 269848 575778 648067 360580 -5739 -281207 -520245 -886472
10984 -886472 -987238 -977762 -1064360 -699592 -311362 -290008 -533036 -736258 -613424 -26784
10974 -26784 158507 19207 -52874 -109461 176165 498642 513825 277423 169096 109246
10964 109246 248543 679600 876735 809385 770929 753814 538924 249309 -11076 -449993
10954 -449993 -1016969 -1113018 -861446 -724477 -541668 -207838 215992 472812 649124 827743
10944 827743 1476368 2094395 2295172 2117987 1848701 1430994 1032356 961896 1039447 1224460
10934 1224460 1462627 1873740 2254929 2151620 1616218 1174288 1158041 1301194 1270410 1208045
10924 1208045 1031496 1028340 1256061 1275404 732311 271892 304580 175948 -177672 -163081
$$ packed form
10994f83323L6114L84606N32451L05930P2289k87487l66319k75468k39038l66227
10984h86472j00766R476q6598L64768L88230K1354k43028k03222J22834N86640
10974b6784J85291j39300p2081n6587K85626L22477J5183k36402j08327n9850
10964A09246J39297M31057J97135o7350l8456j7115k14890k89615k60385m38917
10954d49993n66976r6049K51572J36969J82809L33830M23830K56820J76312J78619
10944H27743O48625O18027K00777j77185k69286m17707l98638p0460P7551J85013
10934A224460K38167M11113L81189j03309n35402m41930j6247J43153l0784o2365
10924A208045j76549l156K27721J9343n43093m60419L2688j28632l53620J4591
$$ plain form
10914 -163081 -247307 -4970 377559 706155 962522 808325 543662 196494 -369269 -570848
10904 -570848 -474451 -226750 -49337 -88004 -375112 -560904 -558747 -338512 -32163 165527
10894 165527 -74160 -638781 -1217497 -1451828 -1364333 -1162863 -800296 -476572 -436394 -192221
10884 -192221 133634 113974 -48671 -256930 -108628 -265579 -376534 -91499 -102389 -508382
10874 -508382 -702127 -226768 393844 404060 255346 82356 5392 319462 479841 698097
10864 698097 432294 145564 -239760 -959268 -1101595 -880355 -445514 -73501 -31478 -150626
10854 -150626 200169 905631 1168726 1048777 890856 651936 1029713 1497899 1688620 1746133
10844 1746133 1792818 1776886 1421914 804904 408000 169723 -53187 -388349 -281788 56978
$$ packed form
10914a63081q4226K42337L82529L28596K56367j54197k64663l47168n65763k01579
10904e70848R6397K47701J77413l8667k87108j85792K157K20235L06349J97690
10894A65527k39687n64621n78716k34331Q7495K01470L62567L23724M0178K44173
10884a92221L25855j9660j62645k08259J48302j56951j10955K85035j0890m05993
10874e08382j93745M75359O20612J0216j48714j72990p6964L14070J60379K18256
10864F98097k65803k86730l85324p19508j42327K21240M34841L72013M2023j19148
10854a50626L50795P05462K63095j19949j57921k38920L77777M68186J90721N7513
10844A746133M6685j5932l54972o17010l96904k38277k22910l35162J06561L38766
$$ plain form
10834 56978 295615 800551 1181488 1259732 820788 213019 135723 120006 -340959 -496747
10824 -496747 -644914 -485462 298261 742480 471399 159282 -142897 -557137 -814042 -559737
10814 -559737 -383062 -521729 -552774 -645742 -499761 -391078 -481167 -764589 -815472 -401789
10804 -401789 -172788 -262424 -596497 -412607 -48556 -80356 46392 93367 -439644 -1006014
10794 -1006014 -918433 -514931 -205735 -78947 -100192 -363472 -558142 -579096 -580204 -539225
10784 -539225 -206361 -108286 -359305 -493377 -938720 -1059248 -824081 -872276 -713913 -626238
10774 -626238 -756813 -556184 156302 611140 646511 644860 431025 29136 71637 110504
10764 110504 -148706 39068 33449 -470779 -561553 -91750 -280708 -788353 -774580 -813776
$$ packed form
10834E6978K38637N04936L80937P8244m38944o07769p7296j5717m60965j55788
10824d96747j48167J59452P83723M44219k71081l12117l02179m14240k56905K54305
10814e59737J76675j38667l1045r2968J45981J08683r0089k83422n0883M13683
10804d01789K29001q9636l34073J83890L64051l1800J26748M6975n33011n66370
10794a006014Q7581M03502L09196J26788k1245k63280j94670k0954j108M0979
10784e39225L32864R8075k51019j34072m45343j20528K35167m8195J58363Q7675
10774f26238j30575K00629P12486M54838L5371j651k13835m01889M2501L8867
10764A10504k59210J87774n619n04228r0774M69803j88958n07645J3773l9196
$$ plain form
10754 -813776 -758420 -229887 -52895 -194503 -490333 -844453 -890971 -387178 350839 442624
10744 442624 131313 47697 342484 413869 565439 914026 505968 100175 -44595 -29385
10734 -29385 -93365 -194029 -166005 -198152 -322122 -477535 -835158 -974695 -823193 -836809
10724 -836809 -964779 -875410 -698010 -793951 -831643 -938159 -1093335 -830895 -927649 -1001475
10714 -1001475 -570420 -552456 -558031 -598774 -302940 86495 463261 755010 722440 709719
10704 709719 145514 -462575 -674390 -826659 -638171 -409551 -527756 -920432 -1231376 -1199359
10694 -1199359 -1409933 -1617520 -1712692 -1549779 -993507 -501425 -455616 -535489 -447407 -76413
10684 -76413 2390 -443063 -549754 -481967 -337249 -353251 -429269 -387597 -541689 -745109 -613548
$$ packed form
10754h13776N5356N28533J76992j41608k95830l54120m6518N03793P38017R1785
10744D42624l11311q3616K94787P1385J51570L48587m08058m05793j44770J5210
10734b9385o3980j00664K8024l2147j23970j55413l57623j39537J51502j3616
10724h36809j27970Q9369J77400r5941l7692j06516j55176K62440r6754p3826
10714a001475M31055J7964n575m0743K95834L89435L76766K91749l2570j2721
10704G09719n64205o08089k11815j52269J88488K28620j18205l92676l10944L2017
10694a199359k10574k07587r5172J62913N56272M92082M5809p9873Q8082L70994
10684g6413P8803m45453j06691O7787J44718j6002p6018M1672j54092k03420J31561
$$ plain form
10673 -613548 -97137 294724 334921 233221 461819 955837 890839 354182 -10840 187473
10663 187473 355278 335696 158787 -158392 -606042 -952796 -940068 -702596 -855264 -1046405
10653 -1046405 -920072 -507781 124716 328490 -37331 -307425 -508203 -287235 72087
10644 72087 -377673 -437579 -109443 15644 164915 -52704 -140604 -26063 -130960 -394643
10634 -394643 -390560 -203860 -194864 -265790 -328388 -635911 -586946 143700 542067 527674 243595
10623 243595 1325 -227401 -365907 -503967 -551598 -262039 -119755 -211723 61281 344830
10613 344830 -13372 -251870 -303893 -260512 -60063 525931 645274 59371 -436658 -683287
10603 -683287 -959781 -1200492 -924991 -494659 -110178 -341761 -663092 -1064998 -1883467 -2251696
$$ packed form
10673f13548N16411L91861M0197j01700K28598M94018o4998n36657l65022J98313
10663A87473J67805j9582j76909l17179m47650l46754J2728K37472j52668j91141
10653a046405J26333M12291O32497K03774l65821k70094k00778K20968L59322
10644G2087m49760n9906L28136J25087J49271k17619q7900J14541j04897k63683
10634c94643M083J86700Q996p0926o2598l07523M8965P30646L98367j4393k84079
10623B43595k42270k28726j38506j38060m7631K89559J42284r1968K73004K83549
10613C44830l58202k38498n2023M3381K00449N85994J19343n85903m96029k46629
10603f83287k76494k40711K75501M30332L84481k31583l21331m01906q18469l68229
$$ plain form
10593 -2251696 -2076337 -1944927 -1674610 -1328342 -1242918 -1138608 -839009 -698370 -778504 -655610
10583 -655610 -450427 -424783 -6661 410468 183222 96219 127269 76378 -111903 -199359
10573 -199359 -278960 -515482 -609167 -733167 -728713 -399955 -560642 -708170 -510251 -402025
10563 -402025 -425847 -487284 -458272 -46138 117960 -446526 -983914 -975808 -630497 -328375
10553 -328375 -287193 -413748 -520769 -330148 -249747 -361334 -168247 112238 128547 5792
10543 5792 -307480 -505251 -411059 -119536 98955 131635 191402 360612 358670 98805 -101926
10532 -101926 -401804 -696424 -618587 -199836 719267 1287154 1266799 1634343 1957512 2429004
10522 2429004 3170255 3600105 3862013 4168262 3991209 3450392 3175485 3145526 2983310 2691486
$$ packed form
10593b251696J75359J31410K70317L46268Q5424J04310K99599J40639q0134J22894
10583f55610K05183K5644M18122M17129k27246q7003L1050n0891j88281q7456
10573a99359p9601k36522r3685j24000M454L28758j60687j47528J97919J08226
10563d02025k3822o1437K9012M12134J64098n64486n37388Q106L45311L02122
10553c28375M1182j26555j07021J90621Q0401j11587J93087K80485J6309j22755
10543E792l13272j97771R4192K91523K18491L2680N9767J69210j942k59865k00731
10532a01926k99878k94620P7837M18751R19103N67887k0355L67544L23169M71492
10522B429004P41251M29850K61908L06249j77053n40817k74907k9959j62216k91824
$$ plain form
10512 2691486 2647809 2304142 1754523 1700619 1679649 1080218 697598 980594 1172976 959005
10502 959005 957099 1553660 2074917 2099537 1655697 1284554 1282271 1649327 1987904 1933589 1375339
10491 1375339 1006494 961597 1014188 1008603 1256398 1179937 786200 564588 430187 368859
10481 368859 291653 603457 511014 -75751 58108 236431 -63574 26421 262590 565110
10471 565110 460737 -114980 -115290 161618 181686 31849 168019 496042 599657 357776
10461 357776 144440 257439 -14412 -240994 -102668 254885 734582 1025023 1209853 1083586
10451 1083586 975393 936860 756132 544139 199323 86162 338755 403761 239490 411526
10441 411526 636227 802292 824645 707537 459031 304504 568263 532590 -16958 172741
$$ packed form
10512B691486m3677l43667n49619n3904k0970n99431l82620K82996J92382k13971
10502I59005j906N96561N21257K4620m43840l71143k283L67056L38577n4315n58250
10491A375339l68845m4897N2591n585K47795p6461l93737k21612j34401o1328
10481C68859p7206L11804r2443n86765J33859J78323l00005Q9995K36169L02520
10471E65110j04373n75717l10K76908K0068j49837J36170L28023J03615k41881
10461C57776k13336J12999k71851k26582J38326L57553M79697K90441J84830j26267
10451A083586j08193l8533j80728k11993l44816j13161K52593O5006j64271J72036
10441D11526K24701J66065K2353j17108k48506j54527K63759l5673n49548J89699
$$ plain form
10431 172741 726901 704361 525834 512837 617103 484521 271924 587443 1081168 1393082
10421 1393082 1317541 1533952 1909697 1913391 1356258 1014619 1478453 2061117 2622246 3274243
10411 3274243 4042256 4482262 4412317 3931180 3452652 3302405 3202061 2732734 2418318 2261117
10401 2261117 2413573 2702461 2909353 2597051 1872458 1210620 1037264 1296476 1520376
10392 1520376 1428188 1440598 1702628 1753216 1584793 1210890 1141245 1353108 1536959 1714889
10382 1714889 1918998 1727335 1078395 233564 -222633 -221305 -63496 1010 -172128 -441147
10372 -441147 -534517 -596565 -752631 -652054 -359350 109491 596993 618342 683227 813570
10362 813570 519814 190577 -245403 -400963 -533889 -883347 -910447 -562570 -525943 -653631
$$ packed form
10431A72741N54160k2540j78527j2997J04266j32582k12597L15519M93725L11914
10421A393082p5541K16411L75745L694n57133l41639M63834N82664N61129O51997
10411C274243P68013M40006o9945m81137m78528j50247j00344m69327l14416j57201
10401B261117J52456K88888K06892l12302p24593o61838j73356K59212K23900
10392A520376r2188J2410K62030N0588j68423l73903o9645K11863J83851J77930
10382A714889K04109j91663o48940q44831m56197J328J57809O4506j73138k69019
10372d41147r3370o2048j56066J00577K92704M68841M87502K1349O4885J30343
10362H13570k93756l29237m35980j55560j32926l49458k7100L47877L6627j27688
$$ plain form
10352 -653631 -541451 -206428 -11435 178725 263304 503137 414269 123457 -143397 -46386
10342 -46386 124785 188231 98335 -24748 153107 702667 703618 251363 122742 399961 870285
10331 870285 1140852 703964 -101405 -426803 -603054 -876406 -673558 -535860 -770522 -859802
10321 -859802 -583866 -618672 -674140 -564997 -583045 -638542 -607622 -469121 -331690 -145726
10311 -145726 44968 244521 204999 23142 90989 98930 4208 257821 825599 1241613
10301 1241613 964211 680132 613460 454726 438177 287538 50767 -219271 -301434 80731
10291 80731 553335 685431 441703 174791 197972 404968 228452 -117244 -327660 -612330
10281 -612330 -813207 -837735 -788641 -402340 -84230 5217 368600 921053 764987 150757
$$ packed form
10352f53631J12180L35023J94993J90160Q4579K39833q8868k90812k66854R7011
10342d6386J71171O3446q9896j23083J77855N49560R51m52255j28621K77219M70324
10331H70285K70567m36888q05369l25398j76251k73352K02848J37698k34662q9280
10321h59802K75936l4806n5468J09143j8048n5497L0920J38501J37431J85964
10311a45726J90694J99553l9522j81857O7847P941r4722K53613N67778M16014
10301A241613k77402k84079o6672j58734j6549j50639k36771k70038q2163L82165
10291H0731M72604J32096k43728k66912K3181K06996j76516l45696k10416k84670
10281f12330k00877k4528M9094L86301L18110Q9447L63383N52453j56066o14230
$$ plain form
10271 150757 -265440 -671530 -949390 -665346 -203781 -58864 -183850 -682499 -1208780 -1266986
10261 -1266986 -1116602 -1111258 -1269974 -1362589 -904949 -223220 171345 416163 158224 -314287
10251 -314287 -553114 -529690 -537857 -704981 -537452 85811 354613 166167 -91071 -351887
10241 -351887 -753602 -892922 -675353 -709775 -878956 -1355274 -1582344 -1385847 -1112826 -839391
10231 -839391 -530503 -507512 -525756 -277814 -371776 -618193 -471786 -579475 -1150225 -1255064
10221 -1255064 -1013550 -655061 -443881 -262385 118414 245475 -82717 10868 395770 603128
10211 603128 430902 64554 -366352 -307947 -32703 200475 217454 377366 321218 -94069
10201 -94069 -754096 -1202296 -1530701 -1817377 -1591612 -1215862 -1449098 -1482985 -1308099 -1178144
$$ packed form
10271A50757m16197m06090k77860K84044M61565J44917j24986m98649n26281n8206
10261a266986J50384N344j58716r2615M57640O81729L94565K44818k57939m72511
10251c14287k38827K3424q167j67124J67529O23263K68802j88446k57238k60816
10241c51887m01715j39320K17569l4422j69181m76318k27070J96497K73021K73435
10231h39391L08888K2991j8244K47942r3962k46417J46407j07689n70750j04839
10221a255064K41514L58489K11180J81496L80799J27061l28192R3585L84902K07358
10211F03128j72226l66348m30906N8405K75244K33178J6979J59912n6148m15287
10201i4069o60027m48200l28405k86676K25765L75750k33236l3887J74886J29955
$$ plain form
10191 -1178144 -878668 -394796 147141 499191 864762 854555 257402 230755 97850 -232821
10181 -232821 -629698 -848261 -349932 234800 581828 597202 137275 -529624 -483508 146002
10171 146002 440571 107872 7592 -157335 -285847 -352485 -321840 -103846 -202356 -371407
10161 -371407 -446317 -866730 -1066253 -959489 -748532 -518344 -279467 86008 414952 487164
10151 487164 343477 258399 46172 -320475 -479386 -362893 -550476 -997040 -1487677 -1570073
10141 -1570073 -1138751 -925982 -710308 -657836 -614429 -230488 78815 663014 1285804 1751769
10131 1751769 2223988 2554644 3242354 4587701 5773523 7156430 8839792 10234832 11046050
10122 11046050 11232252 10793721 10382492 9759465 9211775 8704898 8356806 8002619 7378630
$$ packed form
10191a178144K99476M83872N41937L52050L65571j0207n97153k6647j32905l30671
10181b32821l96877k18563M98329N84732L47028J5374m59927o66899M6116O29510
10171A46002K94569l32699j00280j64927j28512o6638L0645K17994r8510j69051
10161c71407p4910m20413j99523J06764K10957K30188K38877L65475L28944P2212
10151D87164j43687q5078k12227l66647j58911J16493j87583m46564m90637q2396
10141a570073M31322K12769K15674N2472M3407L83941L09303N84199O22790M65965
10131A751769M72219L30656O87710J345347J185822J382907J683362J395040Q11218
10122A1046050J86202m38531m11229o23027n47690n06877l48092l54187o23989
$$ plain form
10113 7378630 6895566 6780261 6479568 6132713 5940648 5599187 5403323 5258051 4839352
10104 4839352 4304086 4001236 3500114 3002121 2586876 2133906 1850850 1829423 1716835 1444866
10094 1444866 1143427 824284 656696 234176 5400 49327 295948 375384 420523 644850
10084 644850 769434 523612 416641 565594 561138 454576 371560 38879 -192948 86454
10074 86454 444953 792321 945308 775270 580397 97353 -320563 -67366 527636 598473
10064 598473 13249 -626057 -1138076 -1322243 -911865 -491704 -567638 -382737 -246057 -253134
10054 -253134 53015 372229 673606 1372165 1754917 1578254 1139375 878384 543157 361882
10044 361882 217929 -227269 -256870 -281194 -317299 -100594 171919 36411 -46909 42608
$$ packed form
10113G378630m83064j15305l00693l46855j92065l41461j95864j45272m18699
10104D839352n35266l02850n01122m97993m15245m52970k83056k1427j12588k71969
10094A444866l01439l19143j67588m22520k28776M3927K46621P9436M5139K24327
10084F44850J24584k45822j06971J48953m456j06562q3016l32681k31827K79402
10074H6454L58499L47368J52987j70038j94873m83044m17916K53197N95002P0837
10064E98473n85224o39306n12019j84167M10378M20161p5934J84901J36680p077
10054b53134L06149L19214L01377O98559L82752j76663m38879k60991l35227j81275
10044C61882j43953m45198k9601k4324l6105K16705K72513j35508q3320Q9517
$$ plain form
10034 42608 -153747 -388626 -347740 132306 303377 489980 377498 133820 -129960 -537335
10024 -537335 -633806 -253943 -28209 134155 172352 70835 -7416 -501062 -799953 -480083
10014 -480083 -572958 -1015644 -1098459 -1276205 -1381733 -1194978 -1085658 -1149168 -1107901 -714896
10004 -714896 -696777 -998252 -1150668 -712601 -289720 -410416 -568373 -377097 -408697 -664204
9994 -664204 -686382 -708167 -513567 -205239 -398563 -453911 -72436 210126 -322998 -385672
9984 -385672 123445 375339 88700 -302721 -537560 -704143 -277519 341716 274733 -111065
9974 -111065 -271051 -203152 -178952 -307631 -503832 -327635 -202966 -198270 -365008 -221334
$$ packed form
10034D2608j96355k34879M0886M80046J71071J86603j12482k43678k63780m07375
10024e37335r6471L79863K25734J62364L8197j01517p8251m93646k98891L19870
10014d80083r2875m42686q2815j77746j05528J86755J09320o3510M1267L93005
10004g14896J8119l01475j52416M38067M22881j20696j57957J91276l1600k55507
9994f64204k2178k1785J94600L08328j93324n5348L81475K82562n33124o2674
9984c85672N09117K51894k86639l91421k34839j66583M26624O19235o6983l85798
9974a11065j59986O7899K4200j28679j96201J76197J24669M696j66738J43674
$$ [...]
##END NTUPLES=NMR SPECTRUM
##END=
