##TITLE=C13_SL31(SL30-mCPBA)-f9
 CDCl3, 21800sc

 7.12.2021
##JCAMPDX= 6.0         $$ Bruker NMR JCAMP-DX V2.0
##DATA TYPE= NMR SPECTRUM
##DATA CLASS= NTUPLES
##ORIGIN= UXNMR, Bruker Analytische Messtechnik GmbH
##OWNER= root
$$ XWIN-NMR		Version 3.5
$$ Wed Dec  8 10:23:46 2021 Russian Standard Time (UT+4h)  she@DPX200
##.OBSERVE FREQUENCY= 50.327896
##.OBSERVE NUCLEUS= ^13C
##.ACQUISITION MODE= SIMULTANEOUS
##.ACQUISITION SCHEME= undefined
##.AVERAGES= 21801
##.DIGITISER RES= 17
##SPECTROMETER/DATA SYSTEM= spect
##.PULSE SEQUENCE= zgpg30
##.SOLVENT NAME= CDCl3
##.SHIFT REFERENCE= (INTERNAL, CDCl3, 0, 223.62)
##AUDIT TRAIL= $$ (NUMBER, WHEN, WHO, WHERE, WHAT)
$$ ##TITLE= Audit trail, XWIN-NMR		Version 3.5
$$ ##JCAMPDX= 5.01
$$ ##ORIGIN= Bruker BioSpin GmbH
$$ ##OWNER= she
$$ F:/spectra/data/she/nmr/c13/1/pdata/1/auditp.txt
$$ ##AUDIT TRAIL=  $$ (NUMBER, WHEN, WHO, WHERE, WHAT)
(   1,<2021-12-08 10:20:55.28 +0400>,<she>,<DPX200>,
      <created by zg, POWCHK disabled, PULCHK disabled
       terminated by command 'halt'
       configuration hash MD5:
       00 E9 B6 7A A2 85 ED C7 34 08 36 98 17 FE 4E 26
       data hash MD5: 32K
       56 65 3B C9 6C 1A 09 62 27 C6 A6 ED 89 B8 EC 53>)
(   2,<2021-12-08 10:20:58.07 +0400>,<she>,<DPX200>,
      <Start of raw data processing
       efp BC_mod = 2 LB = 1 FT_mod = 6 PKNL = 1 PHC0 = -301.7744 PHC1 = -7.037634 SI = 32K 
       data hash MD5: 32K
       C9 69 AD 69 AF 25 11 BA 9E 4D 17 B2 74 DA 77 2F>)
(   3,<2021-12-08 10:21:01.06 +0400>,<she>,<DPX200>,
      <abs ABSG = 5 
       data hash MD5: 32K
       DD EF 63 D7 4B 8B 64 45 AA F5 71 CB 05 DC 9A 1B>)
(   4,<2021-12-08 10:21:34.93 +0400>,<she>,<DPX200>,
      <abs ABSG = 5 
       data hash MD5: 32K
       D4 37 9C 51 53 E4 86 A4 57 B3 04 3E A0 0B 74 5A>)
(   5,<2021-12-08 10:22:17.81 +0400>,<she>,<DPX200>,
      <pk PHC0 = 1.08997 PHC1 = 0 
       data hash MD5: 32K
       E0 9D ED 75 06 7C 93 1D F4 8D A2 84 4C A3 AB 67>)
(   6,<2021-12-08 10:22:21.00 +0400>,<she>,<DPX200>,
      <abs ABSG = 5 
       data hash MD5: 32K
       96 08 DA B0 9E 29 69 62 D6 6F E6 E9 63 E6 12 D3>)
$$ ##END=
$$ 
$$ hash MD5
$$ 06 30 71 88 6C EF CE 8E 04 98 F1 E2 97 34 FE A4
##$RELAX= 
##$RELAX= 
##$RELAX= 
##$RELAX= 
##$RELAX= 
##$RELAX= 
##$RELAX= 
##$RELAX= 
$$ Bruker specific parameters
$$ --------------------------
##$DU= <F:/spectra>
##$EXPNO= 1
##$NAME= <c13>
##$PROCNO= 1
##$TYPE= <nmr>
##$USER= <she>
##$AMP= (0..31)
100 100 100 100 100 100 100 100 100 100 100 100 100 100 100 100 100 100 
100 100 100 100 100 100 100 100 100 100 100 100 100 100 
##$AQSEQ= 0
##$AQ_mod= 1
##$AUNM= <au_zg>
##$AUTOPOS= <>
##$BF1= 50.322709
##$BF2= 200.13
##$BF3= 50.322709
##$BF4= 500.13
##$BF5= 500.13
##$BF6= 500.13
##$BF7= 500.13
##$BF8= 500.13
##$BYTORDA= 1
##$CFDGTYP= 0
##$CFRGTYP= 5
##$CHEMSTR= <none>
##$CNST= (0..31)
1 1 145 1 1 1 1 1 1 1 1 1 1 1 1 1 1 1 1 1 1 1 1 1 1 1 1 1 1 1 1 1 
##$CPDPRG= <waltz16>
##$CPDPRG1= <>
##$CPDPRG2= <waltz16>
##$CPDPRG3= <>
##$CPDPRG4= <mlev>
$$ [...]
##$SUBNAM4= <"">
##$SUBNAM5= <"">
##$SUBNAM6= <"">
##$SUBNAM7= <"">
##$SUBNAM8= <"">
##$SUBNAM9= <"">
##$SW= 239.972175391363
##$SWIBOX= (0..15)
0 1 3 0 0 0 0 0 0 0 0 0 0 0 0 0 
##$SW_h= 12077.2946859903
##$TD= 32768
##$TD0= 1
##$TE= 0
##$TE2= 300
##$TE3= 300
##$TEG= 300
##$TL= (0..7)
120 120 120 120 120 120 120 120 
##$TP= (0..7)
150 150 150 150 150 150 150 150 
##$TP07= 0
##$TPNAME0= <>
##$TPNAME1= <>
##$TPNAME2= <>
##$TPNAME3= <>
##$TPNAME4= <>
##$TPNAME5= <>
##$TPNAME6= <>
##$TPNAME7= <>
##$TPOAL= (0..7)
0.5 0.5 0.5 0.5 0.5 0.5 0.5 0.5 
##$TPOFFS= (0..7)
0 0 0 0 0 0 0 0 
##$TUNHIN= 0
##$TUNHOUT= 0
##$TUNXOUT= 0
##$USERA1= <user>
##$USERA2= <user>
##$USERA3= <user>
##$USERA4= <user>
##$USERA5= <user>
##$V9= 5
##$VALIST= <valist>
##$VCLIST= <CCCCCCCCCCCCCCC>
##$VD= 0
##$VDLIST= <DDDDDDDDDDDDDDD>
##$VPLIST= <PPPPPPPPPPPPPPP>
##$VTLIST= <TTTTTTTTTTTTTTT>
##$WBST= 1024
##$WBSW= 4
##$XGAIN= (0..3)
0 0 0 0 
##$XL= 0
##$YL= 0
##$YMAX_a= 129689990
##$YMIN_a= -30457251
##$ZGOPTNS= <>
##$ZL1= 120
##$ZL2= 120
##$ZL3= 120
##$ZL4= 120
##$ABSF1= 223.6203
##$ABSF2= -16.37674
##$ABSG= 5
##$ABSL= 3
##$ALPHA= 0
##$AQORDER= 0
##$ASSFAC= 0
##$ASSFACI= 0
##$ASSFACX= 0
##$ASSWID= 0
##$AUNMP= <proc_1d>
##$AZFE= 0.1
##$AZFW= 0.5
##$BCFW= 0
##$BC_mod= 2
##$BYTORDP= 0
##$COROFFS= 0
##$CY= -3
##$DATMOD= 1
##$DC= 0
##$DFILT= <>
##$DTYPP= 0
##$F1P= 0
##$F2P= 0
##$FCOR= 0.5
##$FTSIZE= 32768
##$FT_mod= 6
##$GAMMA= 0
##$GB= 0
##$INTBC= 1
##$INTSCL= 4.134877e-10
##$ISEN= 128
##$LB= 1
##$LEV0= 0
##$LPBIN= 0
##$MAXI= 10000
##$MC2= 0
##$MEAN= 0
##$ME_mod= 0
##$MI= 0.1934396
##$NCOEF= 0
##$NC_proc= 2
##$NLEV= 6
##$NOISF1= 120.0001
##$NOISF2= 80.00006
##$NSP= 0
##$NTH_PI= 0
##$NZP= 0
##$OFFSET= 223.6203
##$PC= 1.4
##$PHC0= -300.6844
##$PHC1= -7.037634
##$PH_mod= 1
##$PKNL= yes
##$PPARMOD= 0
##$PSCAL= 0
##$PSIGN= 0
##$REVERSE= no
##$SF= 50.3226814732359
##$SI= 32768
##$SIGF1= 140
##$SIGF2= 120
##$SINO= 11.81781
##$SIOLD= 32768
##$SREGLST= <13C.CDCl3>
##$SSB= 0
##$STSI= 32768
##$STSR= 0
##$SW_p= 12077.2946859903
##$SYMM= 0
##$S_DEV= 0
##$TDeff= 32768
##$TDoff= 0
##$TI= <>
##$TILT= no
##$TM1= 0
##$TM2= 0
##$TOPLEV= 0
##$USERP1= <user>
##$USERP2= <user>
##$USERP3= <user>
##$USERP4= <user>
##$USERP5= <user>
##$WDW= 1
##$XDIM= 32768
##$YMAX_p= 494430249
##$YMIN_p= -3410685
$$ End of Bruker specific parameters
$$ ---------------------------------
##NTUPLES= NMR SPECTRUM
##VAR_NAME=  FREQUENCY,     SPECTRUM/REAL,   SPECTRUM/IMAG
##SYMBOL=    X,             R,               I
##VAR_TYPE=  INDEPENDENT,   DEPENDENT,       DEPENDENT
##VAR_FORM=  AFFN,          ASDF,            ASDF
##VAR_DIM=   32768,         32768,           32768
##UNITS=     HZ,            ARBITRARY UNITS, ARBITRARY UNITS
##FACTOR=    0.368581032318806, 1,           1
##FIRST=     11253.1731425924, 0,            0
##LAST=      -824.121543397872, 0,           0
##MIN=       -824.121543397872, -3410685,    0
##MAX=       11253.1731425924, 494430249,    0
$$ Real data points
##PAGE= N=1
##DATA TABLE= (X++(R..R)), XYDATA
$$ [...]
15720d97114p5967p2435k38336l36387K88602O87534N59967N75068J89948o76295
15710D04585p82928n06666J53226K76326K85362J88885N8606J74197L41977k96051
15700B97519m94501j71448P9706N07971J79423m60946k64468K95536M10286L89917
15690G68995O8867r7133J73070L50606J22163o5387j25837m0466k69526n18153
15680C67199j41418Q3832J89396J8020j00703Q8306j90907k69629n1763J05585
15670I7918L12170N4388m44188n74814Q6422L46203p9535j08569j56242j04145
15660e70392k69103J14598M61255J67373P5234J65913L9822p3890l51214l15081
15650e55485O8200P1740M6006j59037r9779j52174k90795j23622K76214N76105
$$ y = [-497114, -573081, -645516, -883852, -1220239, -931637, -244103, 315864, 890932, 1080880, 404585, -378343, -885009, -731783, -455457, -170095, 18790, 77396, 251593, 593570, 297519, -196982, -368430, -288724, 219247, 398670, -62276, -326744, -31208, 379078, 768995, 837862, 740729, 913799, 1264405, 1386568, 1321181, 1195344, 1154878, 885352, 367199, 225781, 309613, 499009, 517029, 416326, 504632, 313725, 44096, -7667, 97918, 410088, 464476, 20288, -554526, -468104, -121901, -201436, -310005, -466247, -570392, -839495, -724897, -263642, -96269, -21035, 144878, 184700, 110810, -240404, -555485, -487285, -415545, -369539, -528576, -628355, -780529, -1071324, -1194946, -918732, -342627]
15640c42627N39263L28792p0417k50263m733k28663k47483Q7571J20161J19491
15630E1092J42662j2178l72196l73492l15517k897o6351N3648L43869L56679L27882
15619A33201j59300j52017l20776N1360M11659K3671O9465L02770M12721o5013
15609G07741n66155k51848J83192l6664M2599m8636k77728k63310L17277K17908
15599B4376p7314N1281L88351L38788j58567m98628k20993j30667j36520j73000
15589e92893k2330R1526J05673M62298K64951J29001L13203N5108j59295K75135
15579I22377K80157k80017l64502l50643m52767k456L87862N48175N22770J70468
15569A381424k12322K13271P2345o93389k3224J53669p8446k24230j76340Q4263
$$ y = [-342627, 196636, 525428, 455011, 204748, 200015, -28648, -276131, -188560, -68399, 51092, 193754, 181576, -190620, -564112, -879629, -882526, -948877, -895229, -551360, -194681, 133201, -26099, -178116, -498892, -447532, -35873, -12202, 57263, 360033, 772754, 707741, 141586, -110262, 72930, 36266, 78865, 30229, -247499, -510809, -193532, 24376, -52938, -1657, 386694, 725482, 566915, 68287, -152706, -283373, -419893, -592893, -615223, -523697, -418024, 44274, 309225, 438226, 751429, 806537, 647242, 922377, 1202534, 922517, 558015, 207372, -245395, -247851, 140011, 688186, 1210956, 1381424, 1169102, 1382373, 1454718, 761329, 738105, 891774, 813328, 589098, 412758, 497021]
15559D97021J18402M54661K22026l66215l50627k45775k00316K0391J32222L29897
15549F11687R0742k27289j14541N6306j29784r2772J58878J76944r1082J81637
15539F20726P7096p3245k88424k29139l40570j18088K42035j22782k98412j6674
15529e47477j46100r1774M91661L29452o3287l12129k32900O394L44053L91175
15519A69068N968K34442L37403l01927l08171m4110O70279N73989N4141k99646
15509A091436n88054l30367q940k13569n04291l24292j04891m3294L28017N00250
15499a97995O3219P4840J27986P9108M5215J12489J38656l3565l07058J24018
15489B26913K14168k70284n87137l55364K89731N3237K7353J80913J45596k38748
$$ y = [497021, 615423, 1070084, 1292110, 925895, 575268, 329493, 129177, 149568, 281790, 611687, 702429, 475140, 360599, 416905, 287121, 194349, 353227, 530171, 439089, 620726, 697822, 624577, 336153, 107014, -233556, -351644, -109609, -232391, -530803, -547477, -693577, -785351, -293690, 35762, -27525, -339654, -572554, -566160, -222107, 169068, 175036, 409478, 746881, 444954, 136783, 92673, 762952, 1336941, 1391082, 1091436, 503382, 173015, 164075, -49494, -553785, -878077, -982968, -1026262, -698245, -197995, -134776, -59936, 68050, 147158, 192373, 304862, 443518, 409953, 102895, 226913, 441081, 170797, -416340, -771704, -481973, -428736, -401383, -220470, -74874, -313622]
15479c13622j33515j88439j37189j15231n03461M7493L75243O16527P76302K81241
15469G05349m12782j04366k73058m16351K9227R8641K6536J14079J59517j63596
15459b36804k67108Q0481Q1612k46271K1049L2335q7339R2064Q4017k47435m9500
15448g42899K12332M27561K09989M0201J58486k47062m7730j02956j94532k29421
15438e16031k70097j06766l07794j38705K30101J75350k11317j42938K508p774
15428a293463L30003P69488M92179K54969j18183k07535o40678o11569J37401
15419h87388L53648K70003K51235M2777l62515j22025K43958J37886j72394j51252
15409c96067k1234k1859J93236L09646K5530J55987M17674K18947J44559l1785
$$ y = [-313622, -447137, -635576, -772765, -887996, -1391457, -1343964, -968721, -352194, 424108, 705349, 292567, 188201, -84857, -501208, -471981, -373340, -346804, -232725, -73208, -236804, -503912, -423431, -341819, -588090, -567041, -534706, -622045, -529981, -445964, -693399, -742899, -530567, -103006, 106983, 147184, 305670, 58608, 10878, -92078, -286610, -516031, -786128, -892894, -1200688, -1339393, -1109292, -933942, -1145259, -1288197, -1285689, -1293463, -963460, -193972, 298207, 553176, 434993, 227458, -413220, -1024789, -887388, -533740, -263737, -12502, 30275, -332240, -454265, -210307, -72421, -244815, -396067, -417301, -439160, -245924, 63722, 89252, 245239, 662913, 881860, 1026419, 994634]
15399I94634m50720o56584m82511q4917Q2735K44229K30263L22557j08758n10757
15389d19829k60824J63187J41113q2203P5274J10494q7849K7348K73798M26036
15379C66545J07581j24213J00004K82113j89394n39789m74827p1040O53738L50697
15369D61415k4807o9537k72027Q1995k6749l32471m51578k23658k01350J31989
15359i26778N23970J82767o6513j82802k45087N7079N4l97303l24417J22353L72347
15348h84330L44233R2807j50865J22548M91800J02136M6355r8075k34367j63229
15338c30987J7760J84821J08950r0394k78624K21900K92502k44888k76856l44767
15328g40583l68836k0809O37931M92659m17512l55494N01260L55419j8799K54527
$$ y = [994634, 543914, -112670, -595181, -680098, -597363, -353134, -122871, 199686, 90928, -419829, -680653, -517466, -376353, -458556, -383282, -272788, -360637, -333289, -59491, 366545, 474126, 349913, 449917, 732030, 542636, 2847, -471980, -543020, 110718, 461415, 436608, 367071, 95044, 177039, 150290, -182181, -633759, -857417, -1058767, -926778, -402808, -220041, -286554, -469356, -714443, -657364, -657310, -1054613, -1379030, -1256677, -884330, -540097, -447290, -598155, -475607, 16193, 118329, 164684, 66609, -167758, -330987, -313227, -128406, -19456, -109850, -388474, -166574, 125928, -118960, -395816, -740583, -1109419, -1130228, -492297, 362, -417150, -772644, -271384, 84035, 65236, 319763]
15318C19763K42052J9582N0552K11678j43885l18722m76538J76742J61124L12886
15308E55234l4523o86572o42153n192M49243M40172M43843K96778m1150j96401
15298E79279j52291p3761p7974l36374l11515j08333J60160N98903L49833J94341
15288H22268k35399l63290l37381l98771R4063K21436k00707k46581P0211L80507
15278a93644L35033m08124n37533J11951J57046J62415M05300L85980J62885L8134
15268F19443M0311J8929p8213l53458k64211j3279j77676o40080m40439J69900
15258a118773N07017M96059N52466J07921p49545R0311P36949K99712l06826l69533
15248B45758j97626j41241l6040K29585l1435j54562m7787j32814J76427K13193
$$ y = [319763, 561815, 581397, 631949, 843627, 699742, 381020, -95518, 81224, 242348, 555234, 520711, -165861, -808014, -813206, -363963, 76209, 520052, 816830, 775680, 579279, 426988, 353227, 275253, -61121, -372636, -480969, -320809, 278094, 627927, 822268, 586869, 223579, -113802, -512573, -418510, -197074, -397781, -644362, -574151, -193644, 141389, -266735, -804268, -692317, -535271, -372856, 32444, 418424, 581309, 619443, 659754, 678683, 600470, 247012, -17199, -30478, -208154, -848234, -1288673, -1118773, -611756, -115697, 436769, 544690, -204855, -114544, 622405, 922117, 615291, 245758, 48132, -93109, -129149, 100436, 69001, -85561, -133348, -266162, -89735, 123458]
15238A23458O05800L74092j7228k40264J6381q3185j90114J6699O7325l65054
15228C07910n64767l49358M1467J05713J07987M24633K69642o4621Q6743K28891
15218E94240J70706J80597j29117m19873j66686O223P86j00852k71284l08650
15208d43910J03031M79210r6021l19186k34128j88377j80439j0989J82471m9130
15198g57468k66793L655M32166Q5443k91108k1373K82302J82642K590l72555k63380
15187i83879L22358L44685J43476K25237P8460k61116k19069k2051K08350K65750
15177A02201J93977M73713j82425n29371k60778j53607O71597N33417k23445k49066
15167C76213k51593J7337L84868k8397l07319o0272L8000j06486o24667l00723
$$ y = [123458, 729258, 1103350, 1086122, 845858, 862239, 779054, 588940, 605639, 672964, 307910, -256857, -606215, -564748, -459035, -351048, 73585, 343227, 278606, 365349, 594240, 764946, 945543, 816426, 396553, 229867, 236090, 236876, 136024, -135260, -443910, -340879, 138331, 42310, -276876, -511004, -699381, -879820, -890809, -708338, -757468, -1024261, -1020606, -588440, -502997, -794105, -815478, -533176, -350534, -347944, -720499, -983879, -661521, -316836, -173360, 51877, 130337, -130779, -349848, -371899, -163549, 102201, 296178, 769891, 587466, 58095, -202683, -356290, 315307, 848724, 625279, 376213, 124620, 141957, 526825, 498428, 191109, 130837, 168837, 62351, -562316, -863039]
15157h63039J51518K8974J12718K45640M45706L55554L52235K65312k12655k24175
15147F57788q0260P3415j57511M4205J64063k59110l16741N0217L27050J17131
15137F20247J14021n868l11576l56252l5666M3255J39214L42589M8153p38221
15127a40104q07400j65077j44743j8366Q97769J081456L54557o28247j096471
15118f66626n43351j238J13641j06775L45739P19410O55899K58960l49898n13330
15108h7569k23995m3737O0387J05065j04526O6854L08619m7521J96560K94687
15098E24824J0476l24124k70773j01642J0588N8796p149L0644J2648l33829m37057
15087h26598p6676L20249P3048p5207L67321J92142J21493J6757j70698n04536
$$ y = [-863039, -711521, -682547, -569829, -324189, 121517, 477071, 829306, 1094618, 881963, 657788, 577528, 650943, 493432, 537637, 701700, 442590, 125849, 176066, 503116, 620247, 734268, 728400, 416824, 60572, 24906, 68161, 207375, 549964, 598117, -140104, -947504, -1112581, -1257324, -1275690, -377921, 703535, 1058092, 429845, -666626, -1209977, -1211215, -1097574, -1204349, -858610, -139200, 516699, 775659, 425761, -87569, -311564, -355301, -294914, -189849, -294375, -227521, 81098, 33577, 230137, 524824, 535300, 211176, -59597, -161239, -150651, -91855, -99004, -68360, -55712, -389541, -826598, -903274, -583025, -509977, -585184, -217863, -25721, 95772, 112529, -58169, -562705]
15077e62705m17119j33443J0384l2251k4632q0435J70555O23387M18910j24283
15067a51632k07609k03026m60894m75560L3337J91997K58040M06894J00042K47188
15057b61223L09499r0799l52488m04523r2057k42001L78462K79125k39194k96338
15047a011537p9327k0119Q5213L40668J54371j86113k6880M78957M63273K10638
15037D09144p5540O265J91809J030k61000r3558p2415J5886j40822q4276K71648
15026A68171N8510K88287K95262j87248n26874k97730j65886j92378j9418J52235
15016d27069O2657m8811q2583L706l0632k12031p6586M05134N33965L73007N30429
15005A031186R6292k70555j95467r0577j98903k72879k31064L41078O57789M66615
$$ y = [-562705, -979824, -1113267, -1102883, -1135134, -1159766, -1240201, -1069646, -446259, -27349, -151632, -359241, -562267, -1023161, -1498721, -1465384, -1273387, -1015347, -608453, -508411, -261223, 48276, -42523, -395011, -799534, -891591, -1133592, -755130, -476005, -715199, -1011537, -1090864, -1110983, -1025770, -685102, -530731, -716844, -743724, -264767, 198506, 409144, 333604, 339869, 531678, 532708, 271708, 178150, 105735, 121621, -19201, -103477, 168171, 226681, 514968, 810230, 622982, 96108, -201622, -367508, -559886, -579304, -427069, -364412, -413223, -495806, -492100, -522732, -734763, -811349, -406215, 127750, 500757, 1031186, 1127478, 856923, 661456, 570879, 371976, 99097, -131967, 209111, 866900, 1333515]
14995A333515j19545l70710m35258n01704m2958O39357J12901l86809k59847M4790
14985A3732J72987K47994k4351k54007l3053M0107K171K02550O6081p918J6591
14974D42884k66940Q9492L17147n6620m48511j81523L6036K4662j85360P4140
14964a54593R3467o7866j35356l49960J55895M17904m8642m3726K5657k70111
14954c77331l73753O2726K31993J69038m7734m46824l48905j47027P5983P1860
14944a129974M0482K90267Q256j64355J41638L40164J45722K15579M68581J42392
14934D98752J8298j26950M2047p4002k20623k14036k40406j98316j00801L63271
14924b52766Q16753N73298J60754Q1054L1287j66278l56692l00073j93458k93701
$$ y = [1333515, 1213970, 843260, 408002, -93702, -136660, 502697, 615598, 228789, -31058, 13732, 186719, 434713, 410362, 156355, 123302, 163409, 165580, 368130, 434211, 426293, 442884, 175944, 265436, 582583, 525963, 77452, -104071, -68035, -43373, -228733, -154593, -61126, -128992, -264348, -614308, -458413, -40509, -89151, -132877, -107220, -377331, -751084, -688358, -456365, -287327, -335061, -781885, -1130790, -1277817, -1201834, -1129974, -1089492, -799225, -790969, -955324, -813686, -473522, -327800, -112221, 356360, 498752, 517050, 390100, 432147, 358145, 137522, -76514, -316920, -515236, -616037, -252766, 563987, 1137285, 1298039, 1379093, 1410380, 1244102, 887410, 587337, 393879, 100178]
14914A00178m12384q1616J26936K30254M2961J07587L83562n0979l04784j96849
14904e5134k42180M48021N98059k00252l99571n0169J9766J09778m423p4904N345
14893A54336J80810J13954K04847J49691j21789J28598K8995K1836j05114l59079
14883C97085j83553O1292j22230k68321J31623J6666l82799J18699J17406j88116
14873c02248L11330K34976J2505K44265j11250o27596k21396p6730p3160k3236
14863f32540J8963P8808J01448J87821O3160j46898j45154M59564L07857p03053
14853d10024m96100J38678J6826N2421J55288L81188M31254j86796k35710m3782
14843a96757j41077K02786K59675J1996L51617J08767K19233M58323k57323o03220
$$ y = [100178, -312206, -393822, -266886, -36632, 6329, 113916, 497478, 446499, 141715, -55134, -297314, 150707, 748766, 548514, 148943, 98774, 118540, 228318, 223895, 148991, 154336, 335146, 449100, 653947, 803638, 681849, 810447, 839442, 861278, 756164, 397085, 213532, 274824, 152594, -115727, 15896, 32562, -350237, -231538, -114132, -302248, 9082, 244058, 256563, 500828, 389578, -238018, -459414, -536144, -609304, -632540, -613577, -534769, -433321, -245500, -182340, -329238, -474392, -14828, 293029, -410024, -906124, -767446, -750620, -698199, -542911, -161723, 269531, 82735, -152975, -196757, -337834, -135048, 124627, 136623, 488240, 597007, 816240, 1274563, 1017240, 414020]
14833D14020n82342l18066l35884l38433M2252N6738K95468M45331j15987j97527
14823f34430J53288l9708R9968l3328K01154M31581O9362j49708J1234J23187
14813B32600j55673j70285J52037n5045l24388j5624L42203J77591l63904l34881
14803e15369J31441K82654R3534k30472O381J08067J69732m249P4995N22075M96000
14792A134789L63210j38096o02124m51742j81393l51280l71336n8810L2818k8728
14782f52692p5606n843J52152j18576k91567q7836j79553K25090M21470J97657
14772d15304P9923K06987K12918K9229J26672R2510k5490n49561p68029r0206
14762a100351K02709J94054n3750q3077K37922o4289j06136K98149M71429N7315
$$ y = [414020, -168322, -486388, -822272, -1160705, -1118453, -1061715, -766247, -320916, -436903, -634430, -481142, -520850, -420882, -454210, -253056, 178525, 247887, 98179, 109413, 232600, 76927, -93358, 58679, 3634, -320754, -336378, 5825, 183416, -180488, -515369, -383928, -101274, -7740, -238212, -231831, -123764, 45968, 41719, 116714, 638789, 1134789, 1497999, 1359903, 757779, 306037, 124644, -226636, -597972, -656782, -623964, -652692, -728298, -734141, -581989, -700565, -992132, -1079968, -1259521, -1034431, -612961, -415304, -335381, -128394, 84524, 113753, 240425, 332935, 307445, -242116, -1010145, -1100351, -897642, -703588, -757338, -840415, -602493, -666782, -772918, -474769, -3340, 53975]
14752E3975J07381j33j19846m09309n83954l68899K44755J55819j36628m692o688
14741a068219Q5235L48850M47804M76877K1037j14592l0153l44607o5157p8527
14731c21452k64120j44149l40974m49535L3898N85839O99013M51703J76308K24664
14721F51195L5782m55448j51672K35227j42619l71441j45380o4077j18574Q786
14711e18221J59077K86330M9343k18258k22994j70793P5221N34062J49188l11538
14701a88583L43401M67155J95171M88500K34817N8759m59886l22427j28692Q1671
14691G69886P1844j24153j29227j59268j85721m02963k97039M66268M57060J50826
14681F17513l72986m85176k82771j64959J19024P4353J23543J0792k45474q9962
$$ y = [53975, 161356, 161223, 41377, -367932, -951886, -1320785, -1076030, -920211, -1056839, -1061531, -1068219, -982984, -634134, -186330, 290547, 311584, 196992, 166839, -177768, -242925, -321452, -585572, -729721, -1070695, -1520230, -1486332, -900493, -201480, 250223, 426531, 651195, 686977, 231529, 79857, 315084, 172465, -198976, -344356, -408433, -527007, -518221, -359144, -72814, -23471, -241729, -464723, -635516, -560295, -26233, 122955, -188583, 154818, 621973, 817144, 1305644, 1540461, 1599220, 1139334, 816907, 688215, 769886, 841730, 717577, 588350, 429082, 243361, -159602, -456641, 9627, 466687, 617513, 244527, -240649, -523420, -688379, -569355, -495002, -371459, -360667, -606141, -696103]
14671f96103M28282M98333p6062l54700m16561j6872M14766P4597n2967K97240
14661I9953J13364n14364l65950j51564l14305l40364M31810O24872M75694J85153
14651B44299k07149J29810O55231J05986l27521l24879j16738J56964n1219k66810
14641b026p84748p83637K31950N55210M92234K05919K78828K61256l04576l07193
14631a56783j93137k94508q5496J89487L53994J99979R1801j8622o9976J86449
14621B03188q4545k15189Q2938p9540p52008M1682K38966J15478P11492L13698
14611E76160j05085l4084J95960O907N3832J00680k01922K82290K79913o36525
14601E18126n47914M1279K56072P8796j27176j86294j62502J86367k20042m76204
$$ y = [-696103, -267821, 230512, 154450, -200250, -616811, -633683, -218917, -144320, -197287, 99953, 213317, -301047, -666997, -818561, -1132866, -1473230, -1041420, -416548, 59146, 244299, 37150, 166960, 822191, 928177, 600656, 275777, 159039, 316003, 264784, -2026, -786774, -1570411, -1338461, -783251, -291017, -85098, 193730, 454986, 150410, -156783, -349920, -644428, -729924, -540437, -186443, 13536, 105337, 86715, 16739, 203188, 118643, -96546, -13608, -93148, -845156, -803474, -564508, -449030, 262462, 576160, 471075, 436991, 632951, 639858, 693690, 794370, 592448, 874738, 1154651, 518126, -29788, 11491, 267563, 346359, 219183, 32889, -129613, 56754, -163288, -639492]
14591f39492o35406m94193k0743O5727O81627Q44564K55036j74504m4320K32727
14581G1023J061k38566k17933M08521M02501k33753K86038o4675k52893J46065
14571C07389K23821L3233k4834J50886R1541l3434j00849k48656m04390k67782
14561b73075J54425L06449m7082J7006J82831K20088J99191j17335m09616k40366
14551g484J92805j499j91872M051m679J45069L4716o4977k31264l7036k18430
14540c80600j86400k34816m38223K09451K76918Q8846K22163K54613l29260o68693
14530a186001l00364K49610O46675M43713M6690L1242J15431L3402l77511k73518
14520e70631J55426J35754J7220L06449P02735O10288M3943k88831m41209n87130
$$ y = [-639492, -1274898, -1769091, -1789834, -1724107, -1042480, -197916, 57120, -117384, -161704, 71023, 72084, -166482, -384415, 24106, 426607, 192854, 478892, 414217, 161324, 307389, 531210, 564443, 539609, 690495, 782036, 748602, 647753, 399097, -5293, -273075, -118650, 187799, 140717, 157723, 340554, 560642, 759833, 642498, 232882, -7484, 185321, 183822, -8050, -3999, -8678, 136391, 171107, 106130, -125134, -162170, -380600, -567000, -801816, -1240039, -1030588, -753670, -664824, -442661, -188048, -517308, -1186001, -1486365, -1236755, -590080, -146367, -99677, -68435, 46996, 80398, -297113, -570631, -415205, -279451, -262231, 44218, 746953, 1357241, 1401184, 1112353, 671144, 84014]
14510H4014k24297K75628n1873l08148Q888L33923J41813n5087J41585L04642
14500F51088N16693j5890j61302r7952m6450j58499j28418M41634k24867p74236
14490A801m05712o368n0914j84719J02483J72856k6948o3269j66084j62878r7447
14479h87199R2723p2253q047J51195L1075L0610L77649P43290L70013M03009N23297
14468A755362k00188n18885m94698k95521J44158J40970Q2226l98830p08378l43844
14458h37628K42134J93193j79127k77955k54555K42301L20368K4824l69686k78702
14448a174833N8601K1097o0387J34173K46627K26952J85528n85470m63405L31846
14438a079271K44898r4157k48141l48078L18295Q38631K18117K910P5644k54954
$$ y = [84014, -140283, 135345, 83472, -224676, -215788, 118135, 259948, 204861, 346446, 651088, 1167781, 1151891, 990589, 892637, 846187, 687688, 559270, 1000904, 776037, 1801, -403911, -410279, -461193, -645912, -543429, -370573, -397521, -460790, -626874, -789752, -887199, -794476, -866729, -874776, -723581, -692506, -661896, -284247, 459043, 829056, 1232065, 1755362, 1555174, 1036289, 541591, 246070, 390228, 531198, 613424, 214594, -493784, -837628, -595494, -402301, -581428, -859383, -1113938, -871637, -551269, -526445, -896131, -1174833, -1116232, -1095135, -1155522, -1021349, -774722, -547770, -362242, -947712, -1411117, -1079271, -834373, -928530, -1176671, -1524749, -1206454, -367823, -149706, -146796, -71152, -326106]
14428c26106j55917J19760K77481j28829l78263k50738J20880Q5095J16711J35630
14418c84296j04796R2154L36417M12682j38149k62234J06645M07571L14954Q2233
14408H63181k06198l79320j51743O394k3082k48977l20608j26540Q7051q4446
14398e84288N4373K00008m3470M91197K33432O2413J59403m3663o3491k47515
14388B18399n88643l14361K90654K23429m06689l62438P6837K57769M60674J15574
14378b8795K03623J43652k58300k01087j00206j15698m2854L78935L50032J68820
14368D98122n26851k10285K84382K05259j21208j85553n7277M07417K08460O2359
14358E64825m40748p34791m14507J96223J70268L84280M71337N3359J23953L5920
$$ y = [-326106, -482023, -362263, -84782, -213611, -591874, -842612, -721732, -636637, -519926, -384296, -489092, -396938, -60521, 352161, 214012, -48222, 58423, 465994, 780948, 863181, 656983, 277663, 125920, 132314, 109232, -139745, -460353, -586893, -499842, -584288, -529915, -329907, -373377, 117820, 351252, 413665, 573068, 529405, 465914, 218399, -370244, -684605, -393951, -170522, -577211, -939649, -862812, -605043, -144369, -28795, 174828, 318480, 60180, -140907, -241113, -356811, -399665, -20730, 329302, 498122, -28729, -239014, 45368, 250627, 129419, -56134, -113411, 294006, 502466, 564825, 124077, -610714, -1025221, -828998, -658730, -274450, 196887, 250246, 374199, 410119]
14348D10119r3786j42614k8974K0292l18603l00420k89423r4864M70306J61253
14338b06714k13824o414K12331N77968N55532k06436l12780j14877j43670j16224
14328B4892M11162M15937J01919m65439n03108j38958J12556q1977l9539Q0847
14318h1708l44786l50882n5560M51372N64982L8620l7584L13725n5826k14533
14308B27820k79525J13330J70450l92405l50284j02389j14260n1095j5616k5352
14298h19326m56136m22591J54070L56369M46011L13830p3574k64739l45136k89071
14288a400293L46638P49999N90715J07273J13651j10620j30177l00453l35318
14279c68585l13473q4593l502K17961K96570j60750k68604k96612k13308K01976
$$ y = [410119, 316333, 173719, 144745, 165037, -153566, -453986, -743409, -838273, -367967, -206714, -420538, -426952, -214621, 363347, 918879, 712443, 399663, 284786, 141116, 24892, 436054, 851991, 953910, 488471, -14637, -153595, -41039, -123016, -162555, -81708, -426494, -777376, -832936, -381564, 183418, 222038, 184454, 498179, 442353, 227820, -51705, 61625, 232075, -160330, -510614, -613003, -727263, -778358, -793974, -819326, -1275462, -1698053, -1543983, -1187614, -741603, -427773, -501347, -766086, -1111222, -1400293, -1053655, -303656, 287059, 394332, 507983, 397363, 267186, -33267, -368585, -682058, -766651, -770153, -552192, -255622, -416372, -684976, -981588, -1194896, -992920]
14269i92920K52460J57630J85715J81738k57576j20530K08323R1626j78705o43394
14259a115633l15091J35565K88538M37203J55673l60046l05358N33801M38781
14250a06567k4355K4845L86552K29991M1663l13693k21491J56062L25073K74894
14240G72974j24506P397m8616k35385l81359n27561J23090N92135M12020K495
14230E92684r774n806l18413k93132j17027L4401J60770o365J29852P4504j13377
14219A28317k4308J46728m5929l2816J5719M5944q9535J5717j50810m88308j33193
14208f12474M49690L13282L24825Q0521p3013k78416j15140Q3999m3645L76926
14198E06555K77813K71583K20218j27339M1046J01356l39651o35969n87891M7022
$$ y = [-992920, -740460, -582830, -397115, -215377, -472953, -593483, -385160, -293534, -472239, -1115633, -1430724, -1295159, -1006621, -569418, -413745, -773791, -1079149, -545348, -106567, -130922, -106077, 280475, 510466, 552129, 238436, 16945, 173007, 498080, 772974, 648468, 655865, 607249, 371864, -9495, -537056, -413966, 178169, 590189, 592684, 582910, 577104, 258691, -34441, -151468, -117067, 43703, 37338, 167190, 241694, 128317, 104009, 250737, 204808, 171992, 187711, 233655, 144120, 159837, 9027, -479281, -612474, -162784, 150498, 475323, 555844, 482831, 204415, 89275, 173274, 129629, 506555, 784368, 1055951, 1276169, 1148830, 1189876, 1291232, 951581, 315612, -272279, -225257]
14188b25257P4091j65936M07014N79618J81383R4302K51009o4404n18152p9338
14178E34330k32789k34222l6634J19176J78750K5132r6702k9376J93706P7406
14168D98777j30570l19571o7863n2013k54278j49426m7408O2020L3514N1329J74171
14157b01318p5745k57402k24668K00539J74546j3313J04112j35632l11588j41462
14147h81931N03711J71991j75538K73315K26733j62214m0349N7563L58451M46988
14137G78720J17678k56312m76969m34505o1816J00802J86846M01950o4028k69034
14127B3332m50023m31766J25152M48677K33794l8075m32282O993n0487j15030
14117f79715K13117M65452L37972J02357J68305j82505m08659m95429k27229l41079
$$ y = [-225257, -151166, -317102, 89912, 669530, 850913, 945215, 1196224, 1131820, 613668, 534330, 301541, 67319, 30685, 149861, 328611, 353743, 257041, 227665, 421371, 498777, 368207, 48636, -19227, -71240, -325518, -474944, -522352, -460332, -426818, -375489, -201318, -277063, -534465, -759133, -558594, -384048, -397361, -293249, -428881, -740469, -881931, -378220, -206229, -381767, -108452, 118281, -43933, -84282, -26719, 331732, 778720, 896398, 640086, 163117, -271388, -333204, -232402, -45556, 356394, 292366, 23332, -426691, -858457, -733305, -284628, -50834, -88909, -521191, -514198, -564685, -679715, -466598, -1146, 336826, 439183, 607488, 424983, 16324, -479105, -706334, -1047413]
14107a047413r9717J42412J50033N07057L27336M3660p4827k11730j22805l0267
14097d16261k84157j89384K43586J73698J97986L89667K8896k43164j82051M8240
14087b32944r9136j14222O6563n7756L63809J74669J84703K58950l9240r8119
14077D07277j6301J18261p1751l68563m89260j84858L65436J82721n35225r4905
14067f87168L23156j36995k15593k9333L03281M48814J11359J75076j85895n55338
14057d48636k59999J78318j0448Q8303M21138K15268l65916m03994M9925N36539
14047D98O72654M08049K02707L6208l16574m93308K71594M27528m32866p77718
14037a228l55618M1129L20386L25644j72070k34838j34498l26727r813n0229k08210
$$ y = [-1047413, -1147130, -1004718, -854685, -347628, -20292, 23368, -51459, -263189, -385994, -416261, -700418, -889802, -646216, -472518, -274532, 115135, 144031, -99133, -281184, -232944, -332080, -446302, -379739, -437495, -73686, 100983, 285686, 544636, 505396, 407277, 390976, 509237, 437486, 68923, -420337, -605195, -239759, -57038, -592263, -687168, -364012, -501007, -716600, -745933, -442652, 6162, 117521, 292597, 106702, -448636, -708635, -530317, -540765, -452462, -31324, 183944, -181972, -585966, -536041, 498, 673152, 1081201, 1283908, 1320116, 1003542, 510234, 781828, 1209356, 776490, -1228, -356846, -315717, 4669, 330313, 158243, -76595, -211093, -537820, -547633, -597862, -806072]
14026h06072j07311J4656Q1671J5473M14058N13156J14225J13320M2273j39975
14016B55474J62368M29114k65260k92188j608K32820j018r1894r8166k87107k23275
14005a80740J35348K76697Q3064k13880j79788J02628J16551K10722Q4816l27277
13995A08141q1588m1519k56883j44191J59839M2665k92554k79102j89893J70954
13985h04131M59047L22819K12767L08907m623L0001M5319r4940l49547p19988
13975e94369k83558r2887L17469N57780r3416n92471m29910P779J10908J16299
13965i76376K14486P64759N63555j6261j77953L4296P9679l10839k3325j75031
13955b3010p986q3144m4080K17107J09690r2316k02257k0583l19165k98035M69224
$$ y = [-806072, -913383, -898727, -817056, -801583, -387525, 125631, 239856, 353176, 395449, 255474, 417842, 846956, 581696, 289508, 287900, 520720, 519702, 427808, 329642, 42535, -180740, -45392, 231305, 314369, 100489, -79299, 23329, 139880, 350602, 435418, 108141, 26553, -14966, -271849, -416040, -256201, -213536, -506090, -785192, -975085, -804131, -345084, -22265, 190502, 499409, 494786, 524787, 570106, 475166, 125619, -594369, -877927, -970814, -653345, -95565, -188981, -781452, -1211362, -1203583, -1092675, -976376, -761890, 2869, 566424, 550163, 372210, 406506, 486185, 175346, 152021, -23010, -30996, -114140, -158220, 58887, 168577, 76261, -125996, -146579, -465744, -763779, -294555]
13944b94555M66964P2174j62277R4045L74785K70333k84671l62964o8271r0693
13934A4870j47180m4966M7971Q1394J25844L57465L31857n3738k90635j959m7617
13923C73306j33298l17637M8972L34696r7822q2903j49791o2008N4192L1326j16399
13912a17366K66164K95200n2286p2433k41749q5222p1593j56136l41524k11216
13902g88161P9026K17659N0317l51022n69461M6549O8336P6694M8426j60318p8942
13891a360897m7901J34419O13820J95936n24167m07110j89555J41132J23197j22172
13881a443298j1140J01003J19618L77777K3876K02247J45083J75269N82462L85941
13871F58838Q5417k28881l58468j43061K13276K30722k05801K9512p4719J90674
$$ y = [-294555, 172409, 244583, 82306, 176351, 551136, 821469, 536798, 173834, 105563, 14870, -132310, -177276, -129305, -47911, 77933, 435398, 767255, 713517, 422882, 420923, 373306, 240008, -77629, -28657, 306039, 208217, 125314, -24477, -86485, -32293, -967, -117366, 148798, 443998, 391712, 319279, 77530, -7692, -79285, -235421, -576945, -788161, -709135, -491476, -441159, -792181, -1361642, -1315093, -1246757, -1170063, -1121637, -1281955, -1360897, -1408798, -1274379, -660559, -464623, -988790, -1395900, -1585455, -1444323, -1321126, -1443298, -1454438, -1353435, -1233817, -856040, -832164, -629917, -484834, -309565, 272897, 658838, 744255, 515374, 156906, 13845, 227121, 457843, 252042, 281554, 206835, 397509]
13861C97509P6548o3564l35297q56812m60788M0720K42081L62388J68179j48489
13851e77525J14085L05883J63249k36983q6414K74845k77512m29769M5863P6352
13841f27926l2286j32462k5201K73106M79112L11671k68705m64389j11485o3567
13831f62132Q3845L48225M24909J64641l46301k54685k77307L9569M41282K59753
13821B21799n0710j54927j08280k54754l80491m57444k70415P17702O61127L14522
13811B38129m1377j63270J89823O3296m23457l89461j0354k14225j76433K81067
13801f46262O13379Q2584k64196l30987l07443M0200O0287J32232N33639M01903
13791C15336K63878R3638k11853j37012n62550K5955L86317J94857J21459o3861
$$ y = [397509, 474057, 410493, 75196, -781616, -1242404, -1201684, -959603, -597215, -429036, -577525, -463440, -157557, 5692, -231291, -317705, -42860, -320372, -750141, -704278, -627926, -660212, -792674, -817875, -544769, -65657, 246014, -22691, -487080, -598565, -662132, -578287, -230062, 194847, 359488, 13187, -241498, -518805, -479236, -37954, 221799, 171089, 16162, -92118, -346872, -727363, -1184807, -1455222, -737520, -76393, 238129, 196752, 33482, 223305, 286601, -136856, -526317, -536671, -750896, -927329, -646262, -32883, 49701, -214495, -545482, -852925, -812725, -752438, -620206, -86567, 315336, 579214, 672852, 460999, 323987, -238563, -212608, 173709, 368566, 490025, 426164]
13781D26164n22411k27625J14298O421n0921m9878J92287K25526J37688l4970
13771B16579k34032j88412n1188K58112K49048j01241J58577J07043j38730n1971
13761B23785k33206r0581l1997j06917p0225j41469q6719M0375J43593O809n2849
13750c99401N4067J23611K44648R4750M2510m56252l24833J57397L20882K33102
13740I0481j87316J38705K97518L06295O6326o9727n864k0332l88615k12703J19226
13729A33994K77665p2540m12101j70502M8277M64735O72162L60941J0238n99191
13719G13678q59149j92644K72556Q1895j61026k42918M0519p9082Q6319M46505
13709A06653K16535J50924k94893p7883n1300q6365l06150j76545N42613M94028
$$ y = [426164, -96247, -323872, -209574, -203153, -254074, -303952, -111665, 113861, 251549, 216579, -17453, -205865, -257053, 1059, 250107, 148866, 307443, 414486, 275756, 223785, -9421, -100002, -131999, -238916, -309141, -450610, -537329, -496954, -353361, -346552, -399401, -345334, -221723, 22925, 117675, 160185, -296067, -620900, -463503, -142621, 90481, -96835, 41870, 339388, 645683, 712009, 642282, 636418, 616086, 227471, 14768, 133994, 411659, 339119, -72982, -243484, -195207, 269528, 941690, 1302631, 1312869, 713678, -145471, -338115, -65559, 16336, -144690, -387608, -347089, -426171, -339852, 106653, 323188, 474112, 179219, 101336, 50036, -36329, -342479, -519024, 23589, 517617]
13699E17617l9446m03264n28624j89161L03936l4690j49020O0456L93748J25119
13689E6671k14382o5273J93721Q2663L3293l77417l08472K57847J62578L45306
13679A66535J16322k72965j858N12790K43011l72509j75075R392n22092l83777
13669f80226J18723j93403j69716J1960J80772K97265J75450L05559M08598j04523
13659C50459q60563k08299J5715J3211J61023r162J61570L13948K26208j59234
13649D876j93323J560j68987r4884J79611K51930K83925l91839m97868L3349q6147
13638f77797k5220J45211k01734M06827M30786o4957J73308m6594k40907j18783
13628b19860l2823K94955L6960R7140j26532o22484l23549j10315j09381J77762
$$ y = [517617, 478171, 74907, -453717, -642878, -338942, -373632, -522652, -462196, -68448, 56671, -157711, -222984, -29263, 53400, 86693, -290724, -599196, -341349, -178771, 166535, 282857, 9892, 8034, 520824, 763835, 391326, 216251, 225643, -296449, -680226, -561503, -754906, -924622, -912662, -731890, -434625, -259175, 46384, 454982, 350459, -510104, -718403, -702688, -689477, -528454, -537616, -376046, -62098, 164110, 4876, -188447, -186887, -355874, -450758, -271147, -19217, 264708, -127131, -624999, -591650, -677797, -703017, -557806, -759540, -352713, 78073, 13116, 186424, 139830, -101077, -219860, -252683, 42272, 79232, 176372, 49840, -572644, -896193, -1006508, -1115889, -938127]
13618i38127K48296k71573k11624L2328Q0021n7866j71946L8541O52018M77353
13608a22579j48440Q6260J72768Q5384J63959K91896J08329j20287J69629m96963
13598A89956o80740m47454l0514P5472J61753j99661k88510j58494L08892M47194
13588f22106L93387J64421j59898J00505P7690J55979J02754j23161J14364N29163
13578G33098M00034o8778m2534N4663m62225p27701n14121k39275L05079N8074
13568e03686j50314P1373K79178L15482R6811m77133k42635K15970P4646l80378
13558g00686m88210J52118P62922L13883k89911m20308n58708j89817l4391M19360
13548a033748O29487J21147o629J20172M50088P14729J19148p61088p78123j19934
$$ y = [-938127, -689831, -961404, -1173028, -1140700, -1060679, -1118545, -1290491, -1251950, -599932, -122579, -271019, -184759, -11991, 73393, 237352, 529248, 637577, 517290, 686919, 189956, -490784, -938238, -968752, -893280, -731527, -931188, -1219698, -1378192, -1069300, -622106, -228719, -64298, -224196, -123691, -46001, 109978, 212732, 89571, 203935, 733098, 1133132, 1064354, 1021820, 1076483, 614258, -113443, -627564, -866839, -561760, -503686, -654000, -582627, -303449, 12033, 108844, -368289, -610924, -394954, -320308, -700686, -1188896, -1036778, -273856, 40027, -249884, -670192, -1228900, -1418717, -1453108, -1033748, -404261, -283114, -289743, -169571, 280517, 995246, 1114394, 353306, -424817, -544751]
13538e44751L77659K64k52170J16083J35361K9462R8071M6708k0147J48402K21483
13527C56425p9351k73258k6945O4523r3725k59017Q6530K41283J34186j45129
13517E522M81215J90429j48008j18237k763j048m82479k90888K95769N85373K30870
13506G45755l0213r3687o35204n85571j03350L19902L37432O23782K77248l59117
13496D96977l93591k19350j09794K24330K31483K09948m85923n30903j25236K6463
13486f75596K53703L14923M31853K72579m5476m28321n46869K98796K20679k92500
13476a96229j48505j95968O4816J34751l772r2036K35506O55597Q3550m91143
13466D6567l78839k58775j32602P1866M97924L13393K03555r3925m89945k96161
$$ y = [-544751, -167092, -166828, -418998, -302915, -167554, -138092, -40021, 6687, -13460, 134942, 356425, 277074, 3816, -23129, 41394, -52331, -311348, -224818, 16465, 150651, 5522, 486737, 677166, 529158, 410921, 408158, 407110, -75369, -366257, -70488, 514885, 745755, 715542, 621855, -13349, -598920, -702270, -382368, -44936, 578846, 856094, 496977, 103386, -115964, -225758, -1428, 230055, 440003, -45920, -576823, -702059, -675596, -421893, -106970, 324883, 597462, 551986, 123665, -423204, -124408, 96271, -196229, -344734, -540702, -475886, -341135, -344907, -436943, -201437, 454160, 537710, 46567, -332272, -591047, -723649, -651783, -153859, 159534, 363089, 269164, -220781, -516942]
13456e16942k60784l95789m03599N2189K24348J0721J13407L32321K79397q848
13446e73579O7490K79817L71256N539l6567J73988k63056q2682j69729l27286
13436e54809j0546M6706R0762J40886Q1477K36482K59493J88343j5598K27817
13426F91013K12462K4352k25896j32136K73498K06261m18552l83497J2149J11990
13416C71644J01004J70054J9257l87846m37933k3276K98306K41153O10436K75428
13406A238227l76584j11895q5404l62862J44888L92822j63451m32422j16905j0486
13396A15928j05932j3899J57891K56541L19929L8365j75465N3971j35621m65983
13386D5725n84701j73025L04857N26555K84332R2056L9426j0234k5809P9816p0881
$$ y = [-516942, -777726, -1173515, -1577114, -1524925, -1300577, -1289856, -1176449, -844128, -564731, -573579, -506089, -226272, 144984, 150523, 113956, 287944, 24888, -57794, -227523, -554809, -565355, -518649, -427887, -287001, -205524, 30958, 290451, 478794, 463196, 691013, 903475, 927827, 701931, 569795, 843293, 1049554, 631002, 247505, 259654, 371644, 472648, 642702, 661959, 274113, -163820, -187096, 111210, 352363, 962799, 1238227, 861643, 749748, 664344, 301482, 446370, 839192, 675741, 243319, 126414, 115928, 9996, -3903, 153988, 410529, 730458, 768823, 593358, 647329, 511708, 45725, -538976, -712001, -407144, 119411, 403743, 495799, 535225, 524991, 499182, 578998, 508117]
13375E08117m45254K47279K52279j94227k47081m70533j63398L04638r3559j94439
13365d96178J38678J03606K10089L61998L91426J3408m29450n11625k55675J0430
13355d63293R1410J30406L86240J47065l75313j63524r3884J14613J21924o9854
13345a74210K45216O04762l9627k86987l54395m07145R6972K07882r5047k88242
13335d90821o1404r6420O7464N56505M28823R6164R4689M1189k05946l6040J81324
13324E75527o6665l57633l06190M16427Q97085N08267j00257p1967k89917l84980
13314H19697k40590j47673K4173j74646l95125Q6509K480l57633m76042k01893
13304a060743K12448p839L62492M59274j51088j98565P1027N5338L2824j08080
$$ y = [508117, 62863, 310142, 562421, 368194, 121113, -349420, -512818, -208180, -301739, -496178, -357500, -253894, -43805, 318193, 709619, 723027, 293577, -218048, -473723, -463293, -371883, -241477, 144763, 291828, -83485, -247009, -340893, -226280, -104356, -174210, 71006, 675768, 636141, 349154, -5241, -412386, -315414, -107532, -202579, -490821, -552225, -648645, -581181, -24676, 404147, 500311, 595000, 636189, 430243, 394203, 575527, 508862, 151229, -154961, 261466, 1158551, 1666818, 1566561, 1494594, 1204677, 819697, 579107, 431434, 455607, 280961, -114164, -27655, -25175, -382808, -858850, -1060743, -848295, -856134, -493642, -34368, -185456, -384021, -312994, -257656, -224832, -332912]
13294c32912O0871J55741J83076L77810L15190L09332L73159M0922k31191k55207
13284I96791N3772K17885o0330l39064R0375J37039J90434k7434k06475J53840
13274A206833J37946q8697k36461l18658R1188L26977M96870K34922l39914l85432
13264A125574N5284j50960k65647l01030k21547N3264J36630N5287L3337j23904
13254C96288k66364L11438J47280l3144L97854J87576K64536N09901j47186m44769
13244A323410q3269k14305k96449N8830o0094j38855L39226L51130O5975k5452
13234A320147k48869n35878m59143n5661J07048L34942N59547P2539K2907J06994
13224A224573q718n047l28056l81304j5636J00516N0047k21346j56317J06435
$$ y = [-332912, -272041, -116300, 66776, 444586, 759776, 1069108, 1442267, 1483189, 1251998, 996791, 1050563, 1268448, 1208118, 869054, 959429, 1096468, 1286902, 1259468, 1052993, 1206833, 1344779, 1256082, 1019621, 700963, 792151, 1119128, 1615998, 1850920, 1511006, 1125574, 1180858, 1029898, 764251, 463221, 241674, 294938, 431568, 486855, 520192, 396288, 129924, 441362, 588642, 555498, 953352, 1140928, 1405464, 1915365, 1768179, 1323410, 1240141, 1025836, 729387, 788217, 728123, 589268, 928494, 1279624, 1345599, 1320147, 1071278, 535400, 76257, 20596, 127644, 462586, 1022133, 1094672, 1117579, 1224573, 1215855, 1210808, 882752, 501448, 485812, 586328, 636375, 415029, 258712, 365147]
13214C65147M94128Q6050j40079n9912p4782l08820q3786L2237m16240j79549
13204b85606L49861N21246L97285Q5642K13168R8505l13616m02372n25382k20651
13194h1920J32343j41289p4252M91093L47157L08552K28685l3666k21877k48428
13184G06398j8644j07435m10388n17784k30829Q04754N73616Q7139J61059N0226
13174A098112m68873j91573N39987J85127k46090j98378J51699P9263M6579p9785
13164I16068L43011L52836k4055m54809k06860J12556p2465K05853k95122m94688
13154C82325M5399J24109J91911M47232K53468q7058N18L29651K40427J21874
13144B049856j38283l63586O9520K88340K66366n8272l09745m21189j07292N03460
$$ y = [365147, 859275, 945325, 805246, 745334, 670552, 361732, 277946, 310183, -106057, -285606, 64255, 585501, 982786, 1068428, 1281596, 1380101, 1066485, 664113, 138731, -81920, 50423, -90866, -165118, 325975, 673132, 981684, 1210369, 1176703, 954826, 706398, 687754, 580319, 169931, -347853, -578682, 226072, 799688, 886827, 1047886, 1098112, 629239, 437666, 977653, 1162780, 916690, 718312, 870011, 949274, 995853, 916068, 1259079, 1611915, 1587860, 1133051, 926191, 1038747, 966282, 1172135, 877013, 382325, 427724, 551833, 743744, 1190976, 1444444, 1357386, 1357904, 1687555, 1927982, 2049856, 1911573, 1547987, 1617507, 1905847, 2172213, 2113941, 1804196, 1383007, 1275715, 1779175]
13134A779175N58310n8974k23931P5352k63449k81081m5594P1545k74902m47950
13124H88501k17819j7901K07753L97518M15621O64242O52171K90237n1503k55314
13114B973506o62027m11461j44373K85552L61432l27962m80085k09683J35486
13105A520385M31046N70720k67718n82076j38249K09337J64140j02962j77802
13096A626821l30642k70952L2594J82352o5734J44526M04909k76636n93677m3748
13086H09813L13462K67768P6906Q2421L65355L16605K32625K64432N2404k22192
13076B559599k86644k33366r5727J9851J70011J52150j12466J48893L18187L00349
13066B940837O7244J68089L45288O34322P9462n22568l05542m94232p65269l75551
$$ y = [1779175, 2337485, 2278511, 2054580, 2129932, 1866483, 1585402, 1539808, 1611353, 1336451, 888501, 670682, 652781, 860534, 1258052, 1673673, 2337915, 2990086, 3280323, 3228820, 2973506, 2311479, 1900018, 1755645, 2041197, 2402629, 2074667, 1594582, 1384899, 1520385, 1951431, 2522151, 2254433, 1672357, 1534108, 1743445, 1907585, 1804623, 1626821, 1296179, 1025227, 1057821, 1240173, 1174439, 1318965, 1723874, 1447238, 853561, 809813, 1123275, 1391043, 1467949, 1550370, 1915725, 2232330, 2464955, 2729387, 2781791, 2559599, 2272955, 2039589, 1943862, 1963713, 2133724, 2285874, 2173408, 2322301, 2640488, 2940837, 3008081, 3176170, 3521458, 4155780, 4235242, 3712674, 3407132, 2912900, 2147631, 1772080]
13056A772080M01434O35374M66319p805k27766R4065j51956k30987L32641L89002
13046C472401J53575j21811l71632k38956J13764L06312N10506J97502K7536l5476
13036D013721R4079K95117j75670m43281N0364L58195K76460L16800N47583K81993
13026E615361k80346k50209j8670L75621J46816r1929L155J31523k42941o4534
13016E323847N48046N23762O83486N71518L47414p3233q3023P5644L03366M98902
13006H719729N21925P16498N86728L17552K94252O24335L65853J83683Q31267
12997A3161822J094443P46787J040467J369503J492842J712158J806967J927751
12989B4352740K429302K680967L311318L860723M518503O313793Q487841J0679626
$$ y = [1772080, 2173514, 2808888, 3275207, 3267402, 3039636, 3133701, 2981745, 2750758, 3083399, 3472401, 3625976, 3504165, 3132533, 2893577, 3007341, 3313653, 3824159, 4021661, 4049197, 4013721, 4107800, 4402917, 4227247, 3783966, 3834330, 4192525, 4468985, 4785785, 5333368, 5615361, 5335015, 5084806, 5066136, 5441757, 5588573, 5496644, 5499799, 5631322, 5388381, 5323847, 5871893, 6395655, 7079141, 7650659, 7998073, 7924840, 7841817, 7917461, 8220827, 8719729, 9241654, 9958152, 10544880, 10862432, 11156684, 11781019, 12146872, 12330555, 13161822, 14256265, 15003052, 16043519, 17413022, 18905864, 20618022, 22424989, 24352740, 26782042, 29463009, 32774327, 36635050, 41153553, 47467346, 55955187, 66634813]
12981F6634813J2677990J5768036J9724963K5166564L3153621M3977131N7888214
12974B74991332P2756812P8063984N4104459j526676n5109104p5932319p0398202
12967B76950286n6195046m3200952l2688417k4289497j8907902j5300682j2522125
12960G3845665j0423910p943620o568748n914412n199336l984220l173083k762299
12952B7876037k557910k011115j459382j311336r34827j037459p84828q16734
12944A6962446j117015r23275p48486q79602m85710o9044m01190m99513k56393
12935A1582218m35192l19105L0908J89924J17729n4571m69381j00952M28292L54902
12925A1324772K01921J78384L47820L75513P45573J041168J103605J054987J420391
$$ y = [66634813, 79312803, 95080839, 114805802, 139972366, 173125987, 217103118, 274991332, 347748144, 425812128, 479916587, 478389911, 423280807, 347348488, 276950286, 220755240, 177554288, 144865871, 120576374, 101668472, 86367790, 73845665, 63421755, 55478135, 48909387, 42994975, 37795639, 33811419, 30638336, 27876037, 25318127, 23307012, 21847630, 20536294, 19601467, 18564008, 17779180, 16962446, 15845431, 14922156, 14173670, 13294068, 12808358, 12739314, 12338124, 11838611, 11582218, 11147026, 10827921, 10858829, 11048753, 11166482, 11111911, 10642530, 10541578, 10969870, 11324772, 11526693, 11705077, 12052897, 12428410, 13173983, 14215151, 15318756, 16373743, 17794134]
12916A7794134J898893K383088L153961K345456L59957o80048j530606j955964
12908B3768871j252719j01421K23511Q19451J635965J903564K261319K697275
12900C1955816L448794L987162N320697P261306Q625633R994847J2810021J6605364
12892A00009640K1349400K7780358L6092909M8412236O4020653P8439717P7225357
12885D53330270M1099979k1368973o7715048p8330646o7770532n2531184l9781045
12878A66932821l0467952k3038048j7939096j3956323j1108517r373759p535932
12871E3513194o072658m950591m206443l535078k952871k519530j915231j098174
12863B6262618n97996j45255R1141R67068K442920M635745P128975N957176l356541
$$ y = [17794134, 19693027, 22076115, 25230076, 27575532, 27935489, 27255441, 25724835, 23768871, 22516152, 22414731, 22638242, 23457693, 25093658, 26997222, 29258541, 31955816, 35404610, 39391772, 44712469, 51973775, 60599408, 70594255, 83404276, 100009640, 121359040, 149139398, 185232307, 233644543, 297665196, 376104913, 453330270, 494430249, 473061276, 405346228, 327015582, 259245050, 206713866, 166932821, 136464869, 113426821, 95487725, 81531402, 70422885, 61049126, 53513194, 47440536, 42489945, 38283502, 34748424, 31795553, 29276023, 27360792, 26262618, 25664622, 25519367, 25610508, 26577576, 29020496, 33656241, 40785216, 46742392, 43385851]
12854D3385851q794620o243343l545376k063605k468311k955479j730012j476978
12846A4108127j164529o51181o36944n49903r7387j55122l79993l54711k58250
12837I860107L67760N93413L85652j48416j85026L17076L05162N37779P60377
12828A2793884N98078j91359J16386P20145P89067J056618J012597Q11920J164790
12819A8872126J537327J332473J629926K330571K916938L395112L819794M511659
12811D0345926N836527P419984R325958J1269177J3745756J7511959K3073483
12804A28528770K9996400L9017412N2016683O7536244P7868920O7491117K2473995
12797D84929541l7544968p2294675p4659612o2278785m8285751l6658876k7869770
$$ y = [43385851, 34591231, 28347888, 24802512, 22738907, 20270596, 17315117, 15585105, 14108127, 12943598, 12292417, 11655473, 11105570, 11008183, 10853061, 10473068, 10118357, 9860107, 10227867, 10821280, 11206932, 11058516, 10873490, 11190566, 11495728, 12033507, 12793884, 13391962, 13200603, 13316989, 14037134, 14826201, 15882819, 16895416, 17707336, 18872126, 20409453, 21741926, 23371852, 25702423, 28619361, 32014473, 35834267, 40345926, 46182453, 53602437, 62928395, 74197572, 87943328, 105455287, 128528770, 158525170, 197542582, 249559265, 317095509, 394964429, 462455546, 484929541, 447384573, 375089898, 300430286, 238151501, 189865750, 153206874, 125337104]
12790A25337104k1532248j6669269j2932669j0578537q596420p150266o053861
12783D1823834n173971m384130l384239k730446k699502k422808k149793k141851
12775A6737094j408440j236957r15361m07765n68855q79649j036982j378165j247226
12766G657694n74161L8972J18970l72006l16216n63160o33432k23659l67691n60973
12756D204338n33263j79436l35652l89493Q3169j08050l58691k85402K19005J91128
12746B507653K06559M31666k1828l36213l42789j90954p7042o641R9113q59j13942
12735B154723l23302p42692o43162k78864q0922M76424M56223J02552p1320L71833
12725A421493P25973K80627n44650k91535k84676k73593j22110J83513L86978
$$ y = [125337104, 103804856, 87135587, 74202918, 63624381, 55027961, 47877695, 41823834, 36649863, 32265733, 28881494, 26151048, 23451546, 21028738, 18878945, 16737094, 15328654, 14091697, 13176336, 12768571, 12199716, 11320067, 10283085, 8904920, 7657694, 7083533, 7122505, 7241475, 6869469, 6553253, 5990093, 5356661, 5133002, 4765311, 4204338, 3671075, 3491639, 3155987, 2766494, 2849663, 2741613, 2382922, 2097520, 2316525, 2507653, 2714212, 3145878, 3124050, 2787837, 2445048, 2254094, 2177052, 2170411, 2269524, 2268665, 2154723, 1831421, 1088729, 445567, 166703, 85781, 562205, 1018428, 1120980, 1049660, 1421493, 2147466, 2428093, 1883443, 1591908, 1307232, 1033639, 911529, 1095042, 1482020]
12716A482020P9043j20709j77775p9771j38596j91385k21369o2834m59921l10814
12706b02111K07N88224O21020j91431l15485J19665l79518p39102j87228L172
12696f82587J86822O22356L51012j43155m95967k39012m3096k44150K69218M92574
12686G4015J06418K91047k3397m66831p1462L75102K70613N7777J84126j79721
12676F17687k44961r3973j07561q1253j07020J64559J21629J85302K07817l3698
12666F28528l03059j91535l49902k71202K89931L90225q6859j3153j38814j3320
12656e9160K54249L15097l3483q9594K7445k63208p6296J72647l84333k15986
12646c52622K66536K17004K81710J48775K85751K55985n9420l28998l68316l81595
$$ y = [1482020, 1561063, 1440354, 1262579, 1182808, 1044212, 852827, 631458, 568624, 108703, -202111, -201904, 386320, 1007340, 815909, 500424, 620089, 240571, -498531, -685759, -682587, -495765, 126591, 477603, 334448, -161519, -400531, -443627, -687777, -418559, 74015, 180433, 471480, 448083, -18748, -90210, 284892, 555505, 613282, 797408, 617687, 372726, 278753, 171192, 89939, -17081, 147478, 269107, 454409, 662226, 628528, 325469, 133934, -215968, -487170, -197239, 192986, 106127, 92974, -45840, -59160, 195089, 510186, 476703, 387109, 414554, 151346, 75050, 247697, -136636, -352622, -86086, 130918, 412628, 561403, 847154, 1103139, 1043719, 714721, 346405, -35190]
12636c5190l62932k77358J00533J96003p3748j03976J27135N13457M33613L0119
12626E47656j73416N7944J62914k4002J85992J26790k53680m56518j71874j27969
12616a26163J14104R2588J00200Q4134P7289K6381J77753M66847j38110k45404
12606F29619k21662m03096k52665J737P5481L4780J1262k50326m26347p4721N27185
12595c48753O78142O28308J8567p43392l43687R3586K34042L79614K33068N3576
12585H83071k13152j76894p6995j3863K54060m22894l61197L20236Q2756p5765
12575A99363J580K52845m5003l39958j93528M0555k9250L14105M95457Q97145
12565A593311N01283k87278m83002m43992j18190j12967q4445J30875K9386q3441
$$ y = [-35190, -398122, -675480, -574947, -378944, -452692, -556668, -429533, 83924, 517537, 547656, 374240, 432184, 595098, 571096, 757088, 883878, 630198, 173680, 1806, -126163, -12059, 80529, 180729, 264863, 342152, 368533, 546286, 1013133, 875023, 629619, 407957, 4861, -247804, -246067, -170586, -135806, -124544, -374870, -801217, -875938, -348753, 329389, 957697, 976264, 232872, -110815, -17229, 216813, 596427, 829495, 883071, 669919, 493025, 416030, 402167, 656227, 233333, -127864, 192372, 275128, 199363, 200943, 453788, 408785, 68827, -124701, -84146, -113396, 200709, 696166, 1593311, 2094594, 1807316, 1324314, 880322, 762132, 649165, 564720, 695595, 724981, 641540]
12555F41540k08575q4312k63245j55309o7910k97542m58977l56023K9189L51750
12545h69414L54607L52384M70507j08285n21474j90496K22489p1370q7842K41454
12535b07440J06614j63256j28384j75728Q9896N7000o9734p4371J35958k044m5134
12524d76623K93879J32399M8794L06733M71335K14366j25778k51350l12353l80821
12514g9419K60677L54762J45949m0089J39632p8644k84328j85740Q1070m6408
12504B67462j41987R8410k35171l78751k07946J62899Q9750k69874k66272J70644
12494g10836k2534l11857J9742M51163N34346N44127J31326k74633p0232p097
12484B83515n22198j77706N4288k07445r4059J30091K18356L24343m158n25822
$$ y = [641540, 432965, 348653, 85408, -69901, -137811, -435353, -894330, -1250353, -1221164, -869414, -514807, -162423, 308084, 199799, -321675, -512171, -289682, -361052, -448894, -207440, -100826, -264082, -392466, -568194, -478298, -421298, -491032, -565403, -429445, -431489, -476623, -182744, -50345, -1551, 305182, 776517, 990883, 865105, 613755, 301402, -79419, 181258, 536020, 681969, 641880, 781512, 702868, 418540, 232800, 313870, 267462, 125475, 223885, -11286, -390037, -597983, -435084, -345334, -615208, -881480, -710836, -733370, -1045227, -1025485, -574322, -39976, 504151, 635477, 360844, 290612, 283515, -238683, -416389, -362101, -569546, -663605, -533514, -315158, 9185, 5027, -520795]
12474e20795n95511P509K97785O42184M98167j8219p6127j58893k46883K54638
12464H3855M84286k1085n28420j66209N57447P16891p4479l46027m16153k79160
12454A0946l24889j64727q4807L08140L62687Q4420p7796J87447N2254r4959k912
12443B55804j53540j74479k41938K7053j9910J96361J48061K15997J4644j52098
12433A15955j13395j080O6654j3182j87092k28229R6902L0163j05329J5190o9832
12422c93275r4444L27479M86012K2314j41964o0130n3769p7091j2466J91211J76591
12411C70468k5660K1619j94621j16247J84471M34248j77127n64307k19186J15093
12401a71249L46243j02850j91866K035j45056l10115j29907N4820j74909n7618
$$ y = [-520795, -1116306, -1108797, -811012, -168828, 329339, 311120, 234993, 76100, -170783, 83855, 568141, 547056, 18636, -147573, 409874, 1126765, 1052286, 706259, 290106, 10946, -313943, -478670, -563477, -255337, 107350, 191770, 113974, 301421, 353675, 258716, 255804, 102264, -72215, -314153, -287100, -307010, -110649, 37412, 253409, 268053, 115955, 2560, 1480, 68134, 54952, -132140, -360369, -263467, -233304, -338633, -323443, -393275, -487719, -160240, 325772, 348086, 206122, 145992, 92223, 15132, 2666, 193877, 370468, 344808, 366427, 171806, 55559, 240030, 674278, 497151, -67156, -286342, -171249, 174994, 72144, -119722, -117687, -262743, -572858, -702765, -647945, -822854, -880472]
12391h80472K24531m2199J27123N29196p6102l61680L47186K56830l70031l65851
12381f11469J64882O21609K00741j99375k60041k14693j90019l37644l44884J86262
12371i84631L77388O0667O5255J92324K98208N5401N0354L57889r9327n17587
12361a44059l79273K12799Q6792J58848L88932L3178j44543j22512k5503J45480
12351B10139M46510R9115p17915q04964k43499J20373K6823K68788L23254l6069
12341c07445L78231J74226k22853m69258l74236K09508J87703j15952q2887L17792
12331c05171j89066n58634L0781O35850O55301k62154k23548M77372L99340k01199
12321D58872l70095m16837k92039J46107N23506N12533J49346J28514J97619r3549
$$ y = [-880472, -655941, -698140, -571017, -41821, -117923, -479603, -132417, 124413, -245618, -611469, -446587, 175022, 375763, 176388, -83653, -298346, -488365, -826009, -1170893, -984631, -607243, -546576, -481321, -288997, 9211, 64612, 114966, 472855, 373528, -144059, -523332, -310533, -223741, -64893, 324039, 357217, 212674, 90162, 64659, 210139, 656649, 755764, 37849, -767115, -1010614, -890241, -863418, -594630, -271376, -307445, 70786, 245012, 22159, -447099, -821335, -611827, -424124, -540076, -622963, -305171, -494237, -1052871, -1022090, -386240, 269061, 6907, -216641, 260731, 660071, 458872, 88777, -328060, -620099, -473992, 49514, 562047, 711393, 839907, 1037526, 943977]
12311I43977j53417k34494l59040l07419j73476j35158k35017O7888l40267o48801
12301a575224l56536J12924O3888N3142M26580O46646K92186K12806O7575m29297
12291d85310j53997N2829j88494J4038J08859L12042K21457k0773m8562j7659
12281b05570k6481q5595r6046j47271J09009k84883m69963K25982L23144L944
12271f53730p9549J6407L38218J74813j63339o7038K62084N78885J75573J52644
12261G34968m7960k2011P7216m95873j83181J39394k89867m21534r8550L02508
12251c04890L26631L450j5513p2561j37254j6068o1470K1166r519J62124M99147
12240C95243N0386n06088k76080K02046K02934k4129j86922L24605J98453l84529
$$ y = [943977, 790560, 556066, 197026, -110393, -283869, -419027, -654044, -586156, -926423, -1575224, -1931760, -1818836, -1754948, -1701806, -1275226, -628580, -336394, -123588, -56013, -485310, -639307, -586478, -774972, -760934, -652075, -340033, -118576, -139349, -187911, -205570, -232051, -317646, -413692, -560963, -451954, -736837, -1206800, -980818, -657674, -653730, -733279, -716872, -378654, -203841, -367180, -434218, -172134, 406751, 582324, 734968, 687008, 664997, 742213, 246340, 63159, 202553, -87314, -508848, -607398, -304890, 21741, 25191, 9678, -62883, -200137, -216205, -277675, -256509, -266028, -103904, 395243, 445629, -60459, -336539, -134493, 68441, 44312, -142610, 181995, 380448, -4081]
12230d081M7549J22617l03154o895l52254l02147J57199p2869K2303M36939J64670
12219i0123q166j46077j16668L47413N07836L15300l5770k02421j9453l4847j34814
12208C82210k88731p7750j56119L42687O71346l76707n64645j81963K11161M0980
12198B469k81522J7035m272n38727n21481m30047M61023J031820M92718j19227
12188A09789n01851k96092K36473K60973J92690K11962r4642K16798K1628j87155
12178A70573j9063p3020l23272j92317K60456l03103o38608l97725P8460K35913
12168a201706M14972M13193J49852J35725J98191N45067k9929n52356p5929L99612
12158C96692J50531l0183k39927m04326k81760p5248l0171Q5629M65355K12014
$$ y = [-4081, 43468, 166085, -137069, -143964, -496218, -798365, -641166, -714035, -691732, -254793, -90123, -98289, -244366, -361034, -13621, 494215, 809515, 773745, 571324, 551871, 517024, 382210, 93479, 15729, -140390, 202297, 873643, 496936, -67709, -249672, -38511, 2469, -279053, -262018, -266290, -805017, -1326498, -1756545, -1295522, -263702, 229016, 109789, -392062, -688154, -451681, -190708, 1982, 213944, 119302, 336100, 357728, 170573, 151510, 78490, -244782, -437099, -176643, -479746, -1118354, -1516079, -1437619, -1201706, -786734, -373541, -223689, -87964, 110227, 655294, 625365, 73009, -2920, 396692, 547223, 517040, 277113, -127213, -408973, -484221, -514392, -428763, 36592, 248606]
12148B48606k15146n5794k73940l35457K65781P77802O18967J65942j07381m59955
12138F29425m47712l28383j62127j70620J48922K40985K99912N7861L7858j18977
12128A87144k53812j17703J70851K58741j29490j71116J12734K66513j34972L4850
12118B23740k51250l86511J83809j4007q7493m7140l12969l87326Q3765K74668
12108g20714j16685n36386k93587K16322L55725M72771Q15547M82703l16764m31687
12098g2755L89Q7333m36644m88047k86523K24478M35106J44928j2223K9155J88367
12087a86436k96586n28602J86484L35083K9441k06509J31620O40008M57825M1253
12077F03581k08819l41617j74143M5871l7576R6345j22378k51534M8258M0509
$$ y = [248606, 33460, -22334, -296274, -631731, -365950, 411852, 1030819, 1196761, 1089380, 629425, 181713, -146670, -308797, -479417, -330495, -89510, 210402, 268263, 306121, 187144, -66668, -184371, -13520, 245221, 115731, -55385, 57349, 323862, 188890, 223740, -27510, -414021, -230212, -244219, -331712, -378852, -691821, -1079147, -995382, -720714, -837399, -1373785, -1667372, -1451050, -1095325, -622554, 192993, 675696, 358932, -72755, -72366, 14967, -421677, -909724, -1196247, -971769, -536663, -391735, -403958, -374803, -186436, -483022, -1011624, -825140, -490057, -460616, -667125, -535505, 104503, 562328, 603581, 394762, 53145, -120998, -75127, -112703, -16358, -138736, -390270, -342012, -301503]
12067c01503P1909l48259j67173M09708J20124l34451k16929J71766R7375n1233
12057e48666P1033K45514L00552Q2221P0015j05159n81310m60293J75197L16405
12047d34491K40776L65267L5855l20640K43849L52179K0507l04025m88253k15254
12037e04230j79813k23558k3874N19670N74829r6571n32640j32909K07373K05296
12027a86427J43404L06977j16372k57110J13319L55406Q0714j56071l86652j13792
12017b16604M36938M65657k10442n61925l63480k73604l49912K69260N19976J16126
12007a68010j2427O6939m37729n72203P6752M5331M6210j52295o5706J42793j18777
11996a149122j62080M32375P88232L80786k24124l56920j21272j4833J10930M90335
$$ y = [-301503, -229594, -577853, -745026, -335318, -215194, -549645, -766574, -594808, -497433, -548666, -477633, -232119, 68433, 150654, 220669, 115510, -465800, -926093, -750896, -434491, -193715, 171552, 207407, -113233, 130616, 482795, 503302, 199277, -288976, -504230, -684043, -907601, -931475, -411805, 163024, 66453, -466187, -599096, -391723, -186427, -43023, 263954, 147582, -109528, 3791, 359197, 439911, 283840, -102812, -216604, 220334, 685991, 475549, -86376, -449856, -723460, -1073372, -804112, -284136, -168010, -180437, -113498, -551227, -1123430, -1046678, -1001347, -955137, -1107432, -1173138, -1030345, -1149122, -1311202, -878827, -90595, 290191, 66067, -290853, -412125, -426958, -316028, 174307]
11986A74307L89408K95246K41294J1906k32570n66742k98555J62490j97783n70475
11976e91474m030J89159j73400P2216N28285L77850K8291o5282P4311J39208J32125
11965G07259L22922K47016J56493L22555j8595l43344j56651N7050J09193p4103
11955A329795n24153n85739n3770L2985l09210n86966n62036j44360M76784N91861
11945c34809K64927K33661j08738l10180q4694l20652n35995k01402L70074L16600
11935g11208l8497J18597M90936R7082k54937R0156Q2362j87081r0555J84022
11925b19123P9966J14584j6944r5425J70015r4633m17509l48097J89174R4605
11915e43387j43143J51332M01105K70416J99581o1216K2133K04547L45873J21892
$$ y = [174307, 563715, 858961, 1100255, 1112161, 879591, 312849, 14294, 176784, -20999, -591474, -595504, -406345, -579745, -507529, 20756, 398606, 426897, 361615, 435926, 575134, 707259, 1030181, 1277197, 1433690, 1756245, 1737650, 1394306, 1237655, 1294705, 1403898, 1329795, 805642, 219903, 166133, 199118, -110092, -697058, -1259094, -1403454, -926670, -334809, -69882, 163779, 55041, -255139, -339833, -660485, -1196480, -1397882, -1027808, -711208, -749705, -631108, -140172, -43090, -298027, -207871, -125509, -312590, -403145, -219123, -139157, -24573, -41517, -136942, 33073, -61560, -479069, -827166, -637992, -543387, -686530, -535198, -134093, 136323, 335904, 274688, 296821, 501368, 847241, 969133]
11905I69133k36266m48846j16204R8022L15044L40117j2709L265j56260L4607
11895G89903n3158n17520r65300m67011L63108K37746N07958M53525K99251O0091
11885G08593k32030R3970M1862j23394l11411m2847j27357j19134J46856K46888
11875B81996p2774o28041m44715K86773L25040K53953M43503j39059m36054r6451
11865b25829m6156k10354qJ6789K48127J1546m006m66639m84456p6358M70884
11854g66460O14408N92296L91946k88829k59226P7657J51033q6261O3307j50921
11844C38950k0928k1576m02205J41638L73143J96788m6670k71911m53203k80485
11834d46459L21480N50879N11250K21254l22310n36275n69952K34523M13446R4461
$$ y = [969133, 732867, 284021, 167817, 265839, 580883, 921000, 908291, 911556, 755296, 789903, 736745, 219225, -746075, -1213086, -849978, -612232, -104274, 349251, 648502, 708593, 476563, 570533, 612395, 489001, 177590, 134743, 7386, -111748, 35108, 281996, 209222, -418819, -863534, -576761, -251721, 2232, 445735, 306676, -129378, -225829, -271985, -482339, -482347, -465558, -217431, -205885, -209891, -676530, -1160986, -1237344, -766460, -152052, 440244, 832190, 543361, 284135, 361792, 512825, 426564, 489871, 338950, 318022, 296446, -105759, 35879, 409022, 605810, 559140, 287229, -165974, -446459, -124979, 425900, 937150, 1158404, 836094, 299819, -270133, -35610, 377836, 472297]
11824D72297K50350o693k80996k77397m08679j05925q6876l72114P8026O6538
11814f71469j449j6618K99951J0948o49681l09177M33926L22558r6411J2725J94984
11803d69713k72531j91707M61146P13149O52974J43603j43323k8107j40676m20116
11793C04699k74383m0734q9777k88914m4233L836r1461J64763p2591l35668R1651
11782f72812M42478J15008k14955k80793P1086K58048J72162q1973j47306j04301
11772d43358K407J17940J62681L40491L58451P4409j41150n31141j06533K0100
11762a45703J81551L01964j65780j97192r1738k24418K7265O85816L47213k80278
11752D38700j29073P8790l56568k45806K05504K04259R3280p6105j31132l3798
$$ y = [472297, 722647, 715954, 434958, 157561, -251118, -357043, -443919, -816033, -738007, -671469, -672918, -689536, -389585, -378637, -1028318, -1337495, -903569, -581011, -677422, -664697, -469713, -742244, -933951, -472805, 240344, 893318, 1036921, 893598, 865491, 724815, 304699, 30316, -10418, -100195, -389109, -433342, -429506, -520967, -356204, -428795, -764463, -672812, -230334, -115326, -330281, -611074, -539988, -281940, -109778, -191751, -339057, -443358, -440951, -323011, -160330, 180161, 538612, 613021, 471871, -59270, -165803, -145703, 35848, 337812, 172032, -25160, -116898, -341316, -314051, 371765, 718978, 438700, 309627, 388417, 31849, -213957, -8453, 195806, 289086, 212981, 81849, 48051]
11742D8051L26395M60047k50262p09700l45606J08894r6548j80184j07336J26395
11732f19854K17465J26043J80455L46984J24538m60068l72925j40305K06464k65466
11722f56669p1184K28253K54714K85759L66898N43603K64491J55813j18045m95076
11712G58557j34976L04886K91253q0627l28793Q2817k14365m63928J7571M68176
11702G00571K83323j83570l81983m05159j09620j56495m99970j13772j74238L85967
11692f54946L90332j25361l64441l02208k17588R7943K35220K45562K78052j88225
11682f05660p8961K20286K01329m1280O1641L99207O09927M7186l11369o2945
11672D39361J71011M053K04766m5753l81489m69515n66864p1523K08648k17372
$$ y = [48051, 374446, 834493, 584231, -125469, -471075, -362181, -458729, -638913, -746249, -619854, -402389, -276346, -95891, 251093, 375631, -84437, -457362, -597667, -391203, -656669, -727853, -499600, -244886, 40873, 407771, 951374, 1215865, 1371678, 1253633, 758557, 623581, 928467, 1219720, 1139093, 810300, 893117, 678752, 214824, 232395, 700571, 983894, 800324, 418341, 13182, -96438, -252933, -752903, -866675, -1040913, -654946, -264614, -389975, -754416, -1056624, -1274212, -1176269, -941049, -695487, -417435, -605660, -684621, -464335, -263006, -304286, -242645, 156562, 766489, 813675, 502306, 439361, 610372, 614425, 819191, 773438, 391949, -77566, -644430, -715953, -507305, -724677]
11662g24677n75973l79395J33643O77782K44640O077J03199N15717M86160k50825
11652B36348l05217j65081J22728N6562k0133r7316M6404l86787j38400N83599
11642f7293M04983j96052l24230l3315j27618o32175J9385J35865J04559M74380
11632b41511L05078j05498k83317j38455p5898j22560j26903J24155m2157k47418
11622i54484o6678J81129J73000N99594N76541M08639O66421M12256n17251q53126
11612F26041n65928r0606j02790j96389j37280J10683J79609P5073J60420K92000
11602C50833K99719j63776j99069N0645P2266N97809J304980P60205n37737j004875
11592A531000j036692p88281k36132J03425J70150n8483M8107Q4315L9256n2014
$$ y = [-724677, -1300650, -1680045, -1546402, -868620, -623980, -617903, -514704, 1013, 487173, 236348, -68869, -233950, -111222, -54660, -74793, -172109, -125705, -512492, -650892, -67293, 337690, 141638, -182592, -215907, -343525, -975700, -956315, -820450, -715891, -241511, 63567, -41931, -325248, -463703, -539601, -662161, -789064, -664909, -707066, -954484, -1021162, -840033, -667033, -67439, 509102, 917741, 1584162, 1996418, 1479167, 626041, 60113, -30493, -133283, -329672, -466952, -356269, -176660, -101587, 58833, 350833, 650552, 486776, 287707, 338352, 410618, 1008427, 2313407, 3073612, 2535875, 1531000, 494308, -293973, -530105, -426680, -256530, -315013, -266906, -182591, -143335, -195349]
11582a95349k87240l4408M0587J4582J8136l16560j09390J08207k427j39357J53362
11571g49857J07705j99796n26490k62470k9852M15126Q83853P93325K64368j36570
11561E59342K37510L63298l0932l17937k15840j03422j29964n7265j5834k67553
11551B1403l42039j00158K12747L22279K29722J41412m3434l69828N2388L18131
11541D42623J35160J69304l75994l87952p7836J3985K9047k07061l32391q7778
11531f78893J18349J21880J212N4884k0010j74978l2218J01356L13159J24491
11521g0768k90077m80283m32376J73340N43547O9814j6148L36384P3818J86882
11511I4133P42827J21273n91099l66880O7826O6696l30104j28049M36682K15553
$$ y = [-195349, -482589, -516997, -476410, -461828, -443692, -760252, -869642, -761435, -763862, -903219, -749857, -642152, -841948, -1368438, -1630908, -1660760, -1245634, -361781, 431544, 695912, 559342, 796852, 1160150, 1129218, 811281, 595441, 492019, 362055, 304790, 288956, 21403, -320636, -420794, -208047, 114232, 343954, 485366, 441932, 72104, 124492, 442623, 577783, 747087, 371093, -16859, -94695, -80710, -51663, -258724, -591115, -678893, -560544, -438664, -437452, -382568, -402578, -577556, -609774, -508418, -195259, -70768, -360845, -841128, -1273504, -1100164, -556617, -486803, -502951, -166567, -92749, 94133, 836960, 958233, 367134, 254, 68080, 134776, -195328, -323377, 113305, 328858]
11501C28858m43405k80314j86495j28134L72525N37155J73664l57315k33125m7964
11491b64550M6310L14114J91073O5038J19729K2439l69147o23017l80889J36317
11481g42583J54776K4423k12851j45032M43015N34166M58134K40664O3073j32695
11471F85090R128k16631j88031Q6478J1711j50605j6452o0194l78600l90054J04182
11460e03978J27539N7769J70130J84434q3581l11130m79186j72955j68955j63935
11450a343848O7750J87649L46767N08985o9044K28194J44636J27028L33568J32653
11440F64338k33678m77092R7087L94608j09121n16347J04474K37996j03452o2461
11430c648J68580O31342N14316o5226l42901l60953k42610m56019l52371k67785
$$ y = [328858, -114547, -394861, -581356, -709490, -336965, 200190, 373854, 16539, -216586, -264550, -218240, 95874, 286947, 351985, 471714, 494153, 125006, -498011, -878900, -742583, -587807, -563384, -776235, -921267, -478252, 55914, 514048, 754712, 817785, 685090, 694218, 477587, 289556, 376034, 387745, 237140, 220688, 160494, -218106, -608160, -503978, -376439, -318670, -148540, 35894, -47687, -358817, -838003, -1010958, -1179913, -1343848, -1276098, -1088449, -741682, -232697, -301741, -73547, 71089, 198117, 531685, 664338, 430660, -46432, 50655, 445263, 336142, -180205, -75731, 162265, 58813, -3648, 164932, 796274, 1310590, 1245364, 902463, 541510, 298900, -157119, -509490, -777275]
11420g77275K3183j44583m9458Q6647Q9659O301p243Q3187l6546K02636J72860
11409c50632k98688k44406J64080N84954L86899k02325m39042m92601j26123J03547
11399i14337L59877m5448N0806N03073M54147J17920K90380j60431n33773K7934
11389A50148O67086K92482j05595l73429j06191k5029n87079q24630l48376j22269
11379a382882L2312K16469M78568L17951k9822k2181m8693L8980q7333J90841
11369b95790K44779k47638m49206j95411L9646J83172J46713L19024O16828K91624
11359F53741J22775k96926q31237j8273M13624J70997M1109k44701M4973L42519
11349C98601P5160k50490k62890J25765L36140K05008K81926N11678l05575m18569
$$ y = [-777275, -754092, -898675, -948133, -861486, -771827, -765526, -772769, -689582, -726128, -523492, -350632, -649320, -893726, -729646, -144692, 242207, 39882, -399160, -891761, -1017884, -914337, -554460, -599908, -549102, -46029, 408118, 526038, 816418, 655987, 122214, 150148, 817234, 1109716, 1004121, 630692, 524501, 499472, -87607, -912237, -1260613, -1382882, -1350570, -1134101, -655533, -337582, -367404, -389585, -438278, -399298, -486631, -295790, -51011, -298649, -747855, -943266, -903620, -720448, -573735, -254711, 362117, 653741, 776516, 479590, -351647, -369920, 43704, 214701, 255810, 11109, 56082, 398601, 473761, 223271, -39619, 86146, 422286, 627294, 909220, 1420898, 1115323, 696754]
11339F96754M13900L47310l08009m45769j83251k18356k88346j24232k37401j23600
11329d71000j34841K40651J72578l6278j44423L20083M69592J51181p0949l81836
11319A14758k48837M23992K37947j27406m97652o08514j12731j33179M4364M25673
11309d81585L70430j600n28001k73520j15669J59141L98925J35269k27957M9542
11299e15025K87477R5027r8798j14559k48558r4224P4945k3433J95384k8291k42526
11288g12581j59049K15463L12675O2006J21653j70866l10650O9287J10796p5993
11278e37259P8800L07248L55736K14058l18259m98204k54991Q982K02789K17624
11268b23476L24390L54107j72668m48545l5361k91072l81128j17675q4451R7717
$$ y = [696754, 1110654, 1457964, 1149955, 704186, 520935, 302579, 14233, -109999, -347400, -471000, -605841, -365190, -192612, -228890, -373313, -53230, 416362, 567543, 496594, 114758, -134079, 289913, 527860, 400454, -97198, -705712, -818443, -951622, -907258, -481585, -111155, -112755, -640756, -914276, -1029945, -870804, -471879, -336610, -564567, -515025, -227548, -132521, -231319, -345878, -594436, -688660, -613715, -637148, -441764, -470055, -712581, -871630, -656167, -343492, -281486, -159833, -330699, -641349, -572062, -461266, -537259, -458459, -151211, 204525, 418583, 100324, -397880, -652871, -643889, -441100, -223476, 100914, 455021, 282353, -166192, -201553, -492625, -873753, -991428, -1075879, -978162]
11258i78162K39101l253O13509O81046l9144k77572k93172p6227Q2523K61537
11248B10186K95162M28032M62125Q5734k05389k74566j54164o7075n6734q5426
11238F37885M2837o3695l45527k12164k45523j49261P1007K85057J39509n77231
11228d17106o16113K87797O13663J79577R8086K96750J56868J29729j6640n27847
11218A84764n57561j33397M5145M0328N002K75683J14658J03785K05577j16373
11208A67611N4118P7124o73784m93412j37410K81454O73446K47341j70037l78075
11198c51624J04372L50606n506K39149J10594n14895k14203Q1163M261M9797J66497
11187B0211p6387q771K25517m1408L74825m29874q41946J1293K04003J76438m4408
$$ y = [-978162, -739061, -742314, -128805, 552241, 513097, 235525, -57647, -133874, -51351, 210186, 505348, 933380, 1395505, 1481239, 1275850, 1001284, 847120, 780045, 723311, 637885, 680722, 617027, 271500, 59336, -186187, -335448, -264441, 20616, 160125, -417106, -1033219, -745422, -131759, 47818, 145904, 442654, 599522, 729251, 712611, 184764, -372797, -506194, -461049, -420721, -415719, -140036, -25378, 78407, 283984, 167611, 221729, 298853, -374931, -868343, -1005753, -724299, -50853, 196488, 26451, -351624, -247252, 103354, 97848, 336997, 447591, -67304, -281507, -200344, -196083, -146286, 20211, -56176, -64947, 160570, 119162, 493987, 64113, -777833, -766540, -562537, -386099, -430507]
11176d30507l58133R2632L17749m0936l73850k84985n3629L57753L68731L2078
11166c73097l17843O4562K44537K23501J47717n41325m97496K7741M65562M60314
11156i5827j38607m42704P9647M42000L45379J75326K64094L07830L51891M15823
11146A704852J9562j6542k1174n27557l04456m3953l09070o8630j93243k12370
11136B7419M94303J87879o25316n02033J94912L15852M42350l6447n09953j55472
11126a66506J70185M54158L31348M45419J61149l70708n57957m35196q5599l0931
11116h4638K43321L55458J15993k69841k48373P2231k03081m62168j6493Q6236
11106d11355N8478r7225j20773O4681J63343j07202l8501J29211M1508j00483
$$ y = [-430507, -788640, -696008, -378259, -419195, -793045, -1078030, -1131659, -773906, -405175, -373097, -690940, -626378, -381841, -158340, -10623, -551948, -1049444, -1021703, -556141, -95827, -234434, -677138, -597491, -155491, 189888, 365214, 629308, 937138, 1289029, 1704852, 1724414, 1707872, 1686698, 1159141, 854685, 810732, 501662, 433032, 239789, 27419, 521722, 709601, 84285, -417748, -222836, 93016, 535366, 498919, -11034, -166506, 3679, 457837, 789185, 1234604, 1395753, 1025045, 467088, 31892, -53707, -84638, 158683, 514141, 630134, 360293, 111920, 184151, -18930, -481098, -497591, -411355, -352877, -450102, -570875, -506194, -342851, -450053, -488554, -359343, -317835, -418318]
11096d18318m976J37448L68577J81828J18401j15228l70267l96215l19615k0227
11086h38592K05152J83189K24599j18591k25960J79149K36534R0585m4347l5958
11076a44240J00315K10083K84117M53945K9328n54531l39057K21263K61059J18188
11066F40470k78332k90824J8510M12987N52813N93131N72432P33435l37192q07155
11056A810275m67953j64662j01689k27975K36631K89262J29479K00103R7358k41191
11046A559638l5125j30309P6862j6928p76610m61258L27128q2139l69099r2274
11036a14K77976J98279k09459l19162k45389k77534L15721Q72205O19613j26227
11026A105909k64644k32939k30417j03198J22828P6257o9410l14207m41081N5209
$$ y = [-418318, -423294, -285846, 82731, 264559, 382960, 267732, -102535, -498750, -818365, -838592, -633440, -450251, -225652, -344243, -570203, -391054, -154520, -63935, -108282, -144240, -43925, 166158, 450275, 904220, 933548, 379017, 39960, 261223, 522282, 640470, 362138, 71314, 89824, 502811, 1055624, 1648755, 2221187, 2954622, 2617430, 1810275, 1342322, 1177660, 1075971, 847996, 1084627, 1373889, 1503368, 1703471, 1800829, 1559638, 1524513, 1394204, 1471066, 1454138, 677528, 216270, 543398, 461259, 92160, -114, 277862, 476141, 266682, -52480, -297869, -575403, -259682, 612523, 1232136, 1105909, 841265, 608326, 377909, 274711, 397539, 473796, 404386, 90179, -350902, -295693]
11016b95693K13063M1339J46075M16102P9032j60549r5158q051l3884k20303o9824
11005A2149j76622l5249K34592J95916j46737l71560q5532j38668j92132L85413
10995c18430j11542o21838o5183j6974L70818L56362j58586m46046L59451P48370
10985I6402P2930n03228l46190m2314P4034K43073J45795J17367j89364m21771
10975g53266n7860j05505l66031P5468N50803K13849l16198k55455j21815K75684
10965h60326L38541P8368j26229m06628j49404J29920K66826J51333q511j40861
10955g26971k41878j45795J53116K27287L56804N5649j96121j85830Q8622K70820
10945c44297K3126j25119l7083N265M8148K25546j41025J6797K2821j85538K43375
$$ y = [-295693, -82630, -41291, 104784, 520886, 599918, 439369, 344211, 336160, 302276, 81973, 12149, -164473, -199722, 34870, 230786, 84049, -287511, -373043, -511711, -703843, -318430, -429972, -1051810, -1116993, -1133967, -763149, -406787, -565373, -1011419, -651968, 96402, 169332, -333896, -680086, -722400, -648366, -405293, -259498, -142131, -331495, -753266, -811126, -916631, -1282662, -1207194, -656391, -442542, -758740, -1014195, -1136010, -860326, -521785, -443417, -569646, -976274, -1125678, -995758, -728932, -577599, -586110, -726971, -968849, -1114644, -961528, -734241, -377437, -321788, -517909, -703739, -615117, -344297, -321171, -446290, -483373, -478108, -429960, -204414, -345439, -328642, -305821, -491359, -247984]
10934b47984j71528n88350Q1055L76313n6094K42335L11669Q9770K11268J95141
10924D43595j03124j37840j90618j18890J34477K74854J92627L02814N63071N61671
10914A922637K00279m54434n26625q5139J79636K51013k54223p54774o07995j6379
10904a46004K53858M5260k41260L43436J68250l4462J20002j60472j86035n0979
10894A11594Q3087K53066P7420j76557q0477j40115q0750K91948L93311J55227
10884H87754L014k10572l54394l79659q8823j70895k74394j28514k17645K3890
10874i10238l6749Q4448K41020K8496j24081L8125M08758L46530K02535N9244
10864C38088K01339L60295J84026m36412m08790j66624k55230L9039N25250R4602
$$ y = [-247984, -419512, -1007862, -926807, -550494, -606588, -364253, -52584, 37186, 248454, 443595, 340471, 202631, 12013, -106877, 27600, 302454, 495081, 797895, 1360966, 1922637, 2122916, 1668482, 1141857, 1056718, 1236354, 1487367, 1233144, 478370, -129625, -146004, 107854, 153114, -88146, 255290, 423540, 389078, 509080, 348608, 162573, 111594, 194681, 447747, 525167, 348610, 268133, 128018, 47268, 339216, 732527, 887754, 890768, 680196, 325802, -53857, -142680, -313575, -587969, -716483, -934128, -910238, -946987, -862539, -621519, -593023, -717104, -678979, -270221, 76309, 278844, 338088, 539427, 899722, 1083748, 647336, 238546, 71922, -183308, -144269, 380981, 475583]
10854D75583l6865n5303m5189K62889J34985k70017m08210n6287L38772J74997
10844E15355k58926l13898j6225K70279R9182l19982n47292j88698K06542M24281
10834a29382M60331K91976L42427L8351m803o8922n17197n42246j58897J19549
10824a68813j59330l37085l70314l2549K04207R5367l9558R6029o3020k41778
10814a016844k55122m89584K13037N99675J35454R389J92174M06336P52787K38093
10804G85395j21599q8463k11516M19861N45956l32265l72978j90374k06071J77610
10794D05556R0508j90596m33400j60275m7368N5433O11260M68407j7070L7195
10784H19650N1692l05464l71698m80772k69426j15991M76208M66000j72526l85818
$$ y = [475583, 438718, 383415, 338226, 601115, 736100, 466083, 57873, 1586, 340358, 515355, 256429, -57469, -73694, 196585, 295767, -24215, -571507, -760205, -553663, -129382, 330949, 622925, 965352, 1003703, 998900, 929978, 412781, -129465, -288362, -168813, -328143, -665228, -1035542, -1068091, -863884, -768517, -808075, -712046, -775066, -1016844, -1271966, -1761550, -1548513, -948838, -813384, -803995, -611821, -205485, 547302, 785395, 663796, 575333, 363817, 783678, 1329634, 997369, 624391, 434017, 227946, 405556, 496064, 305468, -127932, -288207, -335575, -280142, 331118, 799525, 782455, 819650, 871342, 565878, 194180, -286592, -556018, -672009, -195801, 270199, 97673, -288145]
10774b88145n79219n36188P2539K11337J20571K04381M13701l0297j16519k69954
10764g97793l08167j20282J04263K64638k2101L76670N68042K06002j42334j86310
10754e7372j42388j37807N6689K58927M01979M57834k11108L7424O4202m87676
10744B40704j20684L43533L53692O0700l30811j85972R2642k61153o44256k77480
10734g29085L65045K43239k41896j27026N041K35504m2087k18213l54018l57653
10724a221149K56728M48198m6668L09233O25728J93901k93361j059840o72755
10715a459985Q892M09992K87947K23358L41465M47689K33607l07662J57481L715
10705C46499k76393k1296Q7776J68738o0795k42395m17264j78269L62058N60975
$$ y = [-288145, -867364, -1403552, -1331013, -1119676, -999105, -794724, -381023, -411320, -527839, -797793, -1105960, -1226242, -1121979, -857341, -879442, -502772, 65270, 271272, 128938, -57372, -199760, -337567, -280878, -21951, 380028, 837862, 626754, 664178, 728380, 240704, 120020, 463553, 817245, 877945, 547134, 361162, 453804, 192651, -451605, -729085, -364040, -120801, -362697, -489723, -484682, -249178, -291265, -509478, -863496, -1221149, -964421, -516223, -562891, -253658, 372070, 565971, 272610, -787230, -1459985, -1451093, -1041101, -753154, -529796, -188331, 259358, 492965, 185303, 342784, 346499, 70106, 48810, 136586, 305324, 244529, 2134, -415130, -593399, -231341, 329634]
10695C29634K56028R4858M4124j93524J22736K20756J74072N43428O5305m64604
10685A192813o71179m27077L7957K50903m2053m11009m50738k42159k89290K68382
10675g83450N90731J52634l35238k31893J0062Q6352K70709K20803J36357K2548
10665A39615M12011L14480o6083j58964l96945m37588n53212m35695J7595J70280
10655i94506O1397k713Q0896R4870j77008N7473N19036O60840L2405n08366P902
10644a67774k73502n13226k68007K3378K37665K87440K57456N32160M41130o1411
10634D95309l47196K39873J75054l86151k76478L32236L08908J72041R2812R1744
10624H98152m6762j52836m49542J69422P58494Q49245k7639r06026m50987J3719
$$ y = [329634, 585662, 680520, 724644, 531120, 653856, 874612, 1048684, 1592112, 1657417, 1192813, 521634, 94557, 132514, 383417, 341364, -69645, -520383, -762542, -1051832, -783450, -192719, -40085, -375323, -607216, -597154, -510802, -240093, -19290, 117067, 139615, 551626, 866106, 800023, 641059, 244114, -193474, -746686, -1182381, -1164786, -994506, -933109, -935822, -854926, -760056, -937064, -879591, -360555, 300285, 332690, -175676, -167774, -441276, -954502, -1222509, -1199131, -961466, -674026, -416570, 115590, 556720, 495309, 148113, 387986, 563040, 176889, -99589, 232647, 541555, 713596, 806408, 898152, 851390, 698554, 249012, 418434, 1176928, 2026173, 1998534, 1092508, 641521, 655240]
10614F55240k9109M3576k58301m68188r6275k14246m5625k4604L11391J56919
10604C0778p3431J09631J67939J63038k2019k030k52701p07349l77036P0359J90763
10593g02058j44987k54696L12340P6508l0288M54980L77404L86352L74207K14498
10583A064260J28350m2400J51603j16839m74950L6129m0356m23052k30753k11623
10573a59631k09234m6578J40773K58309J02564Q4159k2500j12983O3710J64461
10563B63050J27212K74390K75430J30760j76303m62084l4692J52316l44076l28549
10553a22546K8443j48490l25179J89396J47368L523J08509r2796k60305k93502
10543g65579j66786M08259N84973O05550M54205n5570m86845o07840j20384J62201
$$ y = [655240, 626131, 669707, 411406, -56782, -153057, -367303, -412928, -437532, -126141, 30778, -42653, 66978, 234917, 397955, 375936, 373906, 121205, -586144, -963180, -892821, -702058, -847045, -1101741, -789401, -712893, -743181, -288201, 89203, 475555, 849762, 1064260, 1192610, 1150210, 1301813, 1184974, 710024, 746153, 705797, 282745, 51992, -159631, -368865, -415443, -274670, -16361, 86203, 170362, 147862, 34879, 98589, 263050, 390262, 664652, 940082, 1070842, 894539, 432455, 397763, 550079, 206003, -122546, -94103, -242593, -567772, -378376, -231008, -227485, -118976, -211772, -472077, -765579, -932365, -524106, 60867, 666417, 1120622, 1065052, 578207, -29633, -150017, 12184]
10533A2184J07189J31599j76330N723p0449m5523N1739k98815J34865M91777L92457
10522G36416L49704K80330M0787N17158Q63758O18223J092656J361519J673838
10513G534389K332772L749195N956213Q125367M762439m957762q434504n846873
10505A3221236l480574k306519j691326q65301q78265q37326m57182l70955m44202
10496A889586k38090k53865l47496j94616j24246j67381k96068l55118j57253
10487b44547p5604r797J82668K5800q1105J34345k88107Q1530L4475k05882J40903
10476c05321L26089R5828Q6048K58627L51472K5457l37156k28256j77004k67788
10466a72004l9880M69662K62601j81947o8189r7478K80579M63377O0276O9912
$$ y = [12184, 119373, 250972, 74642, 80365, 9916, -35607, 16132, -282683, -147818, 343959, 736416, 1086120, 1366450, 1407237, 1924395, 2788153, 3406376, 4499032, 5860551, 7534389, 9867161, 13616356, 19572569, 27697936, 32460375, 27502613, 19068109, 13221236, 9740662, 7434143, 5742817, 4877516, 3999251, 3161925, 2704743, 2333788, 1889586, 1651496, 1397631, 1050135, 855519, 731273, 563892, 267824, -87294, -244547, -320151, -329948, -147280, -121480, -202585, -68240, -356347, -274817, -240342, -446224, -305321, 20768, 116596, 202644, 461271, 812743, 838200, 501044, 272788, 95784, -172004, -211884, 257778, 520379, 338432, 270243, 172765, 453344, 916721, 976997, 1046909]
10456A046909O16364L38676j33008m17950n45032m01330j90362K14512M49022
10447I77801K93562O888k53211m65625k8887K76727J09846J68929j6750k10753
10437H58527j58529m03125k38619L8053P8440M5388K01695K69773J77422K09699
10427A078724O682k7185j42522r36395p46962J56886K3239P157K50976J9733j0376
10416c20043J81142J60905J4055J96721J82230j16413L57604P6439n99915k83527
10406a50802K33609N5487l03380j54646J79586P9691L19786L18241j38252j76785
10396B62535l18828j09360Q75968O43310m6269l9560j86784j92604m2722k5524
10386H20162j92335j34328l2641j33093n83093k33200N1659L75425M40638K80144
$$ y = [1046909, 1663273, 2001949, 1868941, 1450991, 905959, 504629, 314267, 528779, 977801, 1271363, 1278251, 1025040, 559415, 530528, 807255, 917101, 1086030, 1069280, 858527, 699998, 296873, 58254, 96307, 174747, 220135, 421830, 691603, 869025, 1078724, 1085406, 1058221, 915699, -20696, -767658, -610772, -587533, -580376, -329400, -309667, -320043, -138901, 22004, 36059, 232780, 415010, 298597, 656201, 732640, 132725, -150802, 82807, 138294, -165086, -319732, -140146, -60455, 259331, 577572, 439320, 262535, -56293, -165653, 710315, 1353625, 1307356, 1267796, 1081012, 888408, 845686, 820162, 627827, 493499, 460858, 327765, -255328, -488528, -436869, -61444, 379194, 659338]
10376F59338k43094k33973k10776k33906J75470M79045N30594J60070p12326p38887
10366c68445j96706n8637L3360K31897L67104J37155K1555l24480l88925j37759
10356f83881K70618K59850K15649N61367L17883q201j00165m49110l77458P9419
10346H5971K40920N55243M75093N7033k14566J62145N3866l57159P3215N37879
10336A669640L83032L87236J097001K138718K899755L670066N278447L915931
10328B1439826m011789o215004l427624j895237r59328q89061q63826k95706l61891
10319B520360m56727R2127R3898j8501J9634p3378m27899r88111j026543r8410
10309c63550J91220J06661K90530j4139j8238K73995J63096j39421m44790k25796
$$ y = [659338, 416244, 182271, -28505, -262411, -86941, 392104, 922698, 1082768, 370442, -368445, -565151, -623788, -590428, -358531, 8573, 145728, 167283, -157197, -546122, -683881, -413263, -153413, 62236, 623603, 941486, 933285, 833120, 384010, 6552, 85971, 326891, 882134, 1357227, 1414260, 1199694, 1361839, 1415705, 1058546, 1131761, 1669640, 2052672, 2439908, 3536909, 5675627, 8575382, 12245448, 17523895, 21439826, 17428037, 11213033, 7785409, 5890172, 4930844, 4041783, 3177957, 2882251, 2520360, 2063633, 2155760, 2249658, 2231157, 2250791, 2177413, 1749514, 761403, -265140, -363550, -172330, -65669, 224861, 210722, 192484, 466479, 629575, 490154, 45364, -180432]
10299a80432J03856n8903l21980k5553p6019J90145K55517j02336j56017J16704
10289b55018J4392J31990M02096M6864k11799j39581l03317p4655J63188M53332
10279B27492M46118j7186j68970p557k05562j00120o5716l51851o1387j7625k87355
10268f09719L7249J96342j2079N7657o594K70258J75664Q3280O7635J17977J81666
10257E59336k20857n22833j36967o0811K71588L10034K58200L10342l9079J45077
10247H74030L2110J30333J54241j61394k73677l29602l57051j85491K60587M60106
10237F04192J65372j36864j02975k0484K47184L3847N7510l425l86642q67804
10227d10089p04572m2913O38000O59864J23895q2047m03361j44062K12023J97232
$$ y = [-180432, -76576, -135479, -457459, -483012, -559031, -368886, -113369, -215705, -371722, -255018, -240626, -108636, 293460, 340324, 128525, -11056, -314373, -389028, -225840, 227492, 673610, 656424, 487454, 479897, 274335, 174215, 108499, -243352, -304739, -322364, -609719, -572470, -376128, -388207, -330550, -337144, -66886, 108778, 192058, 259693, 377670, 559336, 338479, -184354, -321321, -382132, -110544, 199490, 457690, 768032, 728953, 874030, 906140, 1036473, 1190714, 1029320, 755643, 426041, 68990, -116501, 144086, 604192, 769564, 632700, 529725, 509241, 756425, 790272, 847782, 844357, 457715, -410089, -1114661, -1157574, -519574, 140290, 264185, 182138, -221223, -365285, -153262, 43970]
10217D3970J4867j3520k01537k99329j65729r4197n13797k97223M29969J010239
10207h6287M07615l27393m23700K7941J651k35029l75284o3524J69275p1930o7661
10196a044326L32876M47504O1973J1771J4865m50536k94552J91858L15212r7757
10186e11112O8468l3099M57824Q00153K6556k02386j99442o06719k44839k48499
10176f93095j72397O7196K95936K22211J36568K36695L42765r0301j86891J8320
10166A77007k10246k21508j73882J1298n5508j57350K64236L01040K00184M1956
10156A77227n9530j09591k32309L59096P1938l59834p1162J12356L86314N84348
10146H58853L32977k50295k46455j25859k07860k7065k07472N3380J32557l6378
$$ y = [43970, 58837, 45317, -156220, -455549, -621278, -715475, -1229272, -1526495, -1096526, -86287, 321328, -6065, -429765, -401824, -400173, -635202, -1010486, -1074010, -904735, -976665, -1044326, -711450, -263946, -201973, -190202, -175337, -625873, -920425, -728567, -413355, -511112, -442644, -475743, -17919, 782234, 808790, 606404, 406962, -199757, -444596, -693095, -865492, -798296, -502360, -280149, -143581, 93114, 435879, 345578, 158687, 177007, -33239, -254747, -428629, -417331, -472839, -630189, -365953, -64913, 135271, 177227, 117697, 8106, -224203, 134893, 206831, -153003, -224165, -111809, 274505, 858853, 1191830, 941535, 695080, 569221, 361361, 334296, 126824, 180204, 312761, 276383]
10136B76383l34191p26883m31196j58079j0763m9467N9464N07339O03472J75003
10126h8918n41981k96758J80813N27661M3798N573l2186j89958L0329K29787P04557
10115E72717K86477l19039k87307m45852j66499K94326K94707J11640k99200n82500
10105e40530r4662J54467L94272k4813j40074K45695J99294K76734K10739K22052
10095I03174J27062j50228j77031k2646l45303n11478j30636R7549k70960l32004
10085h12501j45133K58909M94636M06281L22758k89506m41502m72306j54546K13018
10075f19892Q5969q6166P3949M56743J58668r6129m3735m65631j82801O59761
10065e9264N91925j58152l83920J14663K24445P6161o0775n4568k79368j14477
$$ y = [276383, -57808, -784691, -1215887, -1373966, -1384729, -1434196, -1374732, -867393, -263921, -88918, -630899, -927657, -746844, -219183, -175385, -169812, -201998, -391956, -361627, -131840, 572717, 859194, 540155, 252848, -193004, -359503, -65177, 229530, 341170, 41970, -540530, -635192, -480725, -86453, -111266, -251340, -5645, 193649, 470383, 681122, 903174, 1030236, 880008, 702977, 680331, 335028, -176450, -307086, -209537, -480497, -812501, -957634, -698725, -204089, 202192, 524950, 235444, -206058, -678364, -832910, -619892, -533923, -620089, -546140, -89397, 69271, -26858, -70593, -536224, -719025, -59264, 532661, 374509, -9411, 105252, 329697, 405858, 345083, 290515, 11147, -103330]
10055a03330J483r0365j23022j89898j18597J12286L99992J63903k71744m63490
10045f82782l82909J76065O72717K8221m42031N8311J33797l11726j61716p6490
10035i88543m61181J02286O18712P0379k92259n01712n83812k57689M29736O35988
10025a228095M38343K51593K52168L74026R7271k5259k4339r4243q6053O2953
10015A8365O7877k43736j23804q6108m24573m64724j60230K47616O37223Q6626
10005d45468m96801l63467j03943K32303L62467L35986R0968M33346M11944l51727
9995A05608k69505l1787K19132K34480k13488k04601r9570n5453J53218k6286
9985a88252l37140p2634o9664l9437L67010M70615N96151L54018q1553l41170
$$ y = [-103330, -101847, -192212, -315234, -505132, -623729, -511443, -111451, 52452, -219292, -682782, -1065691, -889626, -216909, -188688, -630719, -572408, -438611, -750337, -912053, -988543, -1449724, -1347438, -728726, -658347, -950606, -1452318, -2036130, -2293819, -1864083, -1228095, -789752, -538159, -285991, 88035, 185306, 160047, 135708, 41465, -44588, 18365, 86242, -157494, -281298, -367406, -791979, -1256703, -1416933, -1169317, -532094, -445468, -942269, -1305736, -1409679, -1177376, -814909, -478923, -387955, 45391, 457335, 105608, -163897, -195684, 23448, 257928, 44440, -160161, -259731, -315184, -161966, -188252, -525392, -598026, -667690, -707127, -340117, 130498, 726649, 1080667, 999114, 657944]
9975F57944p31941o19187l15031q1776K05588J50818J59821J26495K59663L11943
9965A24337J15206l17961j62196L67315L46575j75251j90000j13283o90297j01546
9955g97101O71709K67623R4023L51958K2139m07066J04873J81016J55513k92946
9945C51741k70415J407n0482K66869Q3680m04849j96253j21035l42459J84696
9935d97100M44679J35807J0489k25816l87805L06485M73354K49827O3858o4494
9925E09284j54256k92621Q8820K26659r2290k16074j96726k84986j95333N1927
9915e55596K27915K62554j89023k90023K26974K16900J33746K67955J74422j70514
9905C05310k01921M16810j3496k63837j11788N32J49000j87749k08554J54521
$$ y = [657944, -73997, -693184, -1008215, -1089991, -884403, -733585, -573764, -447269, -187606, 124337, 239543, -78418, -240614, 126701, 473276, 298025, 108025, -5258, -695555, -797101, -125392, 142231, 236254, 588212, 610351, 203285, 308158, 489174, 644687, 351741, 81326, 82733, 32251, 299120, 382800, -22049, -218302, -339337, -681796, -497100, -52421, 83386, 93875, -131941, -519746, -213261, 260093, 509920, 573778, 509284, 355028, 62407, 151227, 377886, 285596, 69522, -127204, -412190, -607523, -555596, -327681, -65127, -254150, -544173, -317199, -100299, 33447, 301402, 475824, 305310, 103389, 520199, 506703, 242866, 131078, 131610, 280610, 92861, -115693, 38828]
9895C8828K85243Q2059j13558l34210k31486L7117J22514k4749n8978J85111J61637
9884A49528K42002M23924J51068l10323j71715j12575j52944j63436l08671O1727
9874a91415M70050M42114J23660r7881R69j40250R4418M57064J52513K1258J53455
9863A485955j85279j94973k02296m42575m08077l14117J28222M58465K91275j41975
9853D74625N8237O4857P8533j56572m37770k58024l1105n8701k07157K5037j68035
9842f16075j49431m1758K83223M74257J77527k68558j50463l6177r5940o43k95006
9831g19044l61340j74373P8356L78386L94156J59850j934J49797L02352l83188
9821a76982p41114j96817K0994J20513K01667o7794j36933l37857k85838K91749
$$ y = [38828, 324071, 406130, 292572, -41638, -273124, -236007, -113493, -138242, -197220, -12109, 149528, 391530, 815454, 966522, 656199, 484484, 371909, 218965, 55529, -253142, -191415, 278635, 720749, 844409, 746528, 747497, 607247, 701665, 1158729, 1311242, 1332500, 1485955, 1300676, 1105703, 903407, 460832, 52755, -261362, -133140, 325325, 616600, 474625, 532862, 597719, 676252, 519680, 81910, -176114, -207219, -265920, -473077, -448040, -616075, -765506, -807264, -524041, -49784, 127743, -140815, -291278, -327455, -423395, -424038, -719044, -1080384, -1254757, -1176401, -798015, -403859, -244009, -245943, -96146, 206206, -176982, -918096, -1114913, -1093919, -973406, -771739, -839533, -976466, -1314323, -1600161, -1308412]
$$ [...]
##END NTUPLES=NMR SPECTRUM
##END=
